##TITLE=31Pdec_DE-63_P4-pH6
 D2O, 64 sc
 25.12.2024
##JCAMPDX= 6.0         $$ Bruker NMR JCAMP-DX V2.0
##DATA TYPE= NMR SPECTRUM
##DATA CLASS= NTUPLES
##ORIGIN= UXNMR, Bruker Analytische Messtechnik GmbH
##OWNER= root
$$ XWIN-NMR		Version 3.5
$$ Wed Dec 25 12:32:45 2024 Russian Standard Time (UT+4h)  she@DPX200
##.OBSERVE FREQUENCY= 81.013821
##.OBSERVE NUCLEUS= ^31P
##.ACQUISITION MODE= SIMULTANEOUS
##.ACQUISITION SCHEME= undefined
##.AVERAGES= 64
##.DIGITISER RES= 17
##SPECTROMETER/DATA SYSTEM= spect
##.PULSE SEQUENCE= zgpg30
##.SOLVENT NAME= CDCl3
##.SHIFT REFERENCE= (INTERNAL, CDCl3, 0, 198.062)
##AUDIT TRAIL= $$ (NUMBER, WHEN, WHO, WHERE, WHAT)
$$ ##TITLE= Audit trail, XWIN-NMR		Version 3.5
$$ ##JCAMPDX= 5.01
$$ ##ORIGIN= Bruker BioSpin GmbH
$$ ##OWNER= she
$$ F:/spectra/data/she/nmr/P31/2/pdata/1/auditp.txt
$$ ##AUDIT TRAIL=  $$ (NUMBER, WHEN, WHO, WHERE, WHAT)
(   1,<2024-12-25 12:31:45.71 +0400>,<she>,<DPX200>,
      <created by zg, POWCHK disabled, PULCHK disabled
       configuration hash MD5:
       00 E9 B6 7A A2 85 ED C7 34 08 36 98 17 FE 4E 26
       data hash MD5: 32K
       FA 2A 45 71 88 C3 B5 80 65 7B 6D B6 2C C6 1C B3>)
(   2,<2024-12-25 12:31:48.34 +0400>,<she>,<DPX200>,
      <Start of raw data processing
       efp BC_mod = 2 LB = 1.5 FT_mod = 6 PKNL = 1 PHC0 = 2267.933 PHC1 = -320.1141 SI = 64K 
       data hash MD5: 64K
       9A CE 0E 08 85 A2 D9 E9 B4 A0 FB E4 B8 63 C5 7D>)
(   3,<2024-12-25 12:32:08.75 +0400>,<she>,<DPX200>,
      <pk PHC0 = -11.51039 PHC1 = 0 
       data hash MD5: 64K
       D2 F0 2C 37 7F F7 AA 19 CD 52 46 46 6C 1B FA CF>)
(   4,<2024-12-25 12:32:11.75 +0400>,<she>,<DPX200>,
      <abs ABSG = 5 
       data hash MD5: 64K
       05 A6 3C 6A 69 61 08 83 85 9E 6A 0F 6F 40 B2 6E>)
$$ ##END=
$$ 
$$ hash MD5
$$ FA 7B 75 92 32 54 20 32 55 FE 30 A6 B0 C1 AE B5
##$RELAX= 
##$RELAX= 
##$RELAX= 
##$RELAX= 
##$RELAX= 
##$RELAX= 
##$RELAX= 
##$RELAX= 
$$ Bruker specific parameters
$$ --------------------------
##$DU= <F:/spectra>
##$EXPNO= 2
##$NAME= <P31>
##$PROCNO= 1
##$TYPE= <nmr>
##$USER= <she>
##$AMP= (0..31)
100 100 100 100 100 100 100 100 100 100 100 100 100 100 100 100 100 100 
100 100 100 100 100 100 100 100 100 100 100 100 100 100 
##$AQSEQ= 0
##$AQ_mod= 1
##$AUNM= <au_zg>
##$AUTOPOS= <>
##$BF1= 81.014009
##$BF2= 200.13
##$BF3= 200.13
##$BF4= 200.13
##$BF5= 200.13
##$BF6= 200.13
##$BF7= 200.13
##$BF8= 200.13
##$BYTORDA= 1
##$CFDGTYP= 0
##$CFRGTYP= 5
##$CHEMSTR= <none>
##$CNST= (0..31)
1 1 145 1 1 1 1 1 1 1 1 1 1 1 1 1 1 1 1 1 1 1 1 1 1 1 1 1 1 1 1 1 
##$CPDPRG= <waltz16>
##$CPDPRG1= <>
##$CPDPRG2= <waltz16>
##$CPDPRG3= <>
##$CPDPRG4= <mlev>
##$CPDPRG5= <mlev>
##$CPDPRG6= <mlev>
##$CPDPRG7= <mlev>
##$CPDPRG8= <mlev>
##$CPDPRGB= <>
##$CPDPRGT= <>
##$D= (0..31)
0 1 0 0 0 0 0 0 0 0.06 0 0.03 2e-05 3e-06 0 0 0.0002 0 0 0 0 0 0 0 0 0 
0 0 0 0 0 0 
##$DATE= 1735115505
##$DBL= (0..7)
120 120 120 11 120 120 24 19 
##$DBP= (0..7)
150 150 150 150 150 150 150 150 
##$DBP07= 0
##$DBPNAM0= <>
##$DBPNAM1= <>
$$ [...]
##$SUBNAM3= <"">
##$SUBNAM4= <"">
##$SUBNAM5= <"">
##$SUBNAM6= <"">
##$SUBNAM7= <"">
##$SUBNAM8= <"">
##$SUBNAM9= <"">
##$SW= 400.765351723535
##$SWIBOX= (0..15)
0 1 3 0 0 0 0 0 0 0 0 0 0 0 0 0 
##$SW_h= 32467.5324675325
##$TD= 32768
##$TD0= 1
##$TE= 0
##$TE2= 300
##$TE3= 300
##$TEG= 300
##$TL= (0..7)
0 120 53 12 22 120 120 120 
##$TP= (0..7)
150 150 150 150 150 150 150 150 
##$TP07= 0
##$TPNAME0= <>
##$TPNAME1= <>
##$TPNAME2= <>
##$TPNAME3= <>
##$TPNAME4= <>
##$TPNAME5= <>
##$TPNAME6= <>
##$TPNAME7= <>
##$TPOAL= (0..7)
0.5 0.5 0.5 0.5 0.5 0.5 0.5 0.5 
##$TPOFFS= (0..7)
0 0 0 0 0 0 0 0 
##$TUNHIN= 0
##$TUNHOUT= 0
##$TUNXOUT= 0
##$USERA1= <user>
##$USERA2= <user>
##$USERA3= <user>
##$USERA4= <user>
##$USERA5= <user>
##$V9= 5
##$VALIST= <valist>
##$VCLIST= <CCCCCCCCCCCCCCC>
##$VD= 0
##$VDLIST= <DDDDDDDDDDDDDDD>
##$VPLIST= <PPPPPPPPPPPPPPP>
##$VTLIST= <TTTTTTTTTTTTTTT>
##$WBST= 1024
##$WBSW= 4
##$XGAIN= (0..3)
0 0 0 0 
##$XL= 0
##$YL= 0
##$YMAX_a= 5906
##$YMIN_a= -5926
##$ZGOPTNS= <>
##$ZL1= 120
##$ZL2= 120
##$ZL3= 120
##$ZL4= 120
##$ABSF1= 198.0616
##$ABSF2= -202.7028
##$ABSG= 5
##$ABSL= 3
##$ALPHA= 0
##$AQORDER= 0
##$ASSFAC= 0
##$ASSFACI= 0
##$ASSFACX= 0
##$ASSWID= 0
##$AUNMP= <proc_1d>
##$AZFE= 0.1
##$AZFW= 0.5
##$BCFW= 0
##$BC_mod= 2
##$BYTORDP= 0
##$COROFFS= 0
##$CY= -3
##$DATMOD= 1
##$DC= 0
##$DFILT= <>
##$DTYPP= 0
##$F1P= 0
##$F2P= 0
##$FCOR= 1
##$FTSIZE= 65536
##$FT_mod= 6
##$GAMMA= 0
##$GB= 0
##$INTBC= 1
##$INTSCL= 9.790993e-09
##$ISEN= 30
##$LB= 1.5
##$LEV0= 0
##$LPBIN= 0
##$MAXI= 10000
##$MC2= 0
##$MEAN= 0
##$ME_mod= 0
##$MI= 50
##$NCOEF= 0
##$NC_proc= -9
##$NLEV= 6
##$NOISF1= 182.463
##$NOISF2= 159.3651
##$NSP= 0
##$NTH_PI= 0
##$NZP= 0
##$OFFSET= 198.0616
##$PC= 4
##$PHC0= 2256.423
##$PHC1= -320.1141
##$PH_mod= 1
##$PKNL= yes
##$PPARMOD= 0
##$PSCAL= 0
##$PSIGN= 0
##$REVERSE= no
##$SF= 81.0140089999434
##$SI= 65536
##$SIGF1= 159.3651
##$SIGF2= -187.1042
##$SINO= 113.3802
##$SIOLD= 16384
##$SREGLST= <1H.CDCl3>
##$SSB= 0
##$STSI= 65536
##$STSR= 0
##$SW_p= 32467.5324675325
##$SYMM= 0
##$S_DEV= 0
##$TDeff= 32768
##$TDoff= 0
##$TI= <>
##$TILT= no
##$TM1= 0
##$TM2= 0
##$TOPLEV= 0
##$USERP1= <user>
##$USERP2= <user>
##$USERP3= <user>
##$USERP4= <user>
##$USERP5= <user>
##$WDW= 1
##$XDIM= 65536
##$YMAX_p= 307005675
##$YMIN_p= -361952789
$$ End of Bruker specific parameters
$$ ---------------------------------
##NTUPLES= NMR SPECTRUM
##VAR_NAME=  FREQUENCY,     SPECTRUM/REAL,   SPECTRUM/IMAG
##SYMBOL=    X,             R,               I
##VAR_TYPE=  INDEPENDENT,   DEPENDENT,       DEPENDENT
##VAR_FORM=  AFFN,          ASDF,            ASDF
##VAR_DIM=   65536,         65536,           65536
##UNITS=     HZ,            ARBITRARY UNITS, ARBITRARY UNITS
##FACTOR=    0.49542278885378, 1,            1
##FIRST=     16045.7642231865, 0,            0
##LAST=      -16421.768244346, 0,            0
##MIN=       -16421.768244346, -361952789,   0
##MAX=       16045.7642231865, 307005675,    0
$$ Real data points
##PAGE= N=1
##DATA TABLE= (X++(R..R)), XYDATA
$$ [...]
9372 -6015050 -11017694 -14744737 -16332136 -15055048 -11022160 -5191020 1402440 7571512
9364 7571512 11917456 14396991 16947494 20291924 21182513 16184847 7873507 3079407
9356 3079407 4030948 5665981 4077395 3221198 8849761 18630517 23776626 19928058 11614686
9347 11614686 5567421 4036998 5760568 9094033 11846315 11487978 8444333 6878476
9339 6878476 9737536 15133086 19787971 23356757 26402989 26876407 22734384 16323065
9331 16323065 11851696 9597822 6767057 2946165 41185 -2078381 -4171543 -2483360
9323 -2483360 7768966 22447342 29734359 25012636 17652188 17646749 21322658 17316429
9315 17316429 2999200 -12465206 -19762945 -17645597 -10481592 -3645583 -1136200 -2558996
9307 -2558996 -2592034 2131274 6844076 4716860 -2269689 -5363223 -1740656 2398020 2615372
9298 2615372 2070944 3407820 2476790 -4428788 -12857361 -16036804 -14570253 -13954193 -14808244
9289 -14808244 -11921476 -2563353 9294296 17343627 17923495 10909494 -535401 -10458548
9281 -10458548 -13380475 -8444219 482828 8167641 10167959 3561282 -10855769 -26873520
9273 -26873520 -36370237 -36003010 -29476328 -23080622 -20339350 -20929760 -22689314 -23425129 -21958897
9264 -21958897 -19063882 -17320425 -18661238 -21421136 -21117948 -15807775 -9781378 -9112060
9256 -9112060 -13402086 -15740762 -12447206 -8361214 -8748467 -10297316 -6276927 2201714
9248 2201714 7647966 7818258 7486117 7903341 3621789 -6830248 -15511714 -15787695 -11936881
9239 -11936881 -12037013 -16627023 -20682358 -22160047 -21880348 -18898136 -13233487 -10313625
9231 -10313625 -15321063 -24704319 -29756905 -27138820 -20002803 -11137658 -2034599 3370465
9223 3370465 2333850 48417 4461357 13990778 18550801 13849280 6359306 2141791
9215 2141791 -644061 -4579921 -6637749 -4374020 -1856285 -3275931 -5593579 -3628346
9207 -3628346 1378633 4268738 4074499 3786058 4214753 3940548 4177957 8025263 14806806
9198 14806806 19823410 20247344 17489452 13357905 7711421 1009869 -4143148 -5804291
9190 -5804291 -4841508 -2764321 543265 4839931 6761869 2187530 -7917963 -16313273
9182 -16313273 -16200125 -8455697 -315802 2785374 1808043 598119 1056374 3222374 6887828
9173 6887828 10335158 10060931 5263847 660329 867986 3433403 2026974 -3951075 -7843630
9164 -7843630 -4693220 2265403 5608998 1705373 -6099518 -10473736 -6866259 523304
9156 523304 1299245 -9175971 -22589831 -27284818 -22772676 -17971258 -16558063 -13093174
9148 -13093174 -4851989 2024337 2288647 -595613 -1767282 -3088955 -7505969 -11146573
9140 -11146573 -8605707 -2157796 1816015 2905393 5743225 10623239 12650922 10412263
9132 10412263 8573365 10094049 11417713 8284271 2532964 -358980 1117329 2608013
9124 2608013 186588 -3627280 -2773075 3401481 7805142 4916525 -1145995 -2892906
9116 -2892906 -785158 -759445 -1998092 2706483 12604385 15871459 6343838 -5826865
9108 -5826865 -7520080 920438 10386821 16886747 21316732 21364352 14471222 5278016 -82313
9099 -82313 -4080469 -11908106 -18602920 -14204370 -966200 6959205 2493322 -7008771
9091 -7008771 -13562117 -18300630 -23381378 -24823380 -19698142 -12509582 -8261839 -5331946
9083 -5331946 -413082 5110391 8381984 9319014 7678184 1766842 -5779602 -7416449
9075 -7416449 -1170968 4279843 1006976 -6999770 -10473306 -7834402 -4220885 -1273401
9067 -1273401 4006610 11596618 16797464 16431060 11628027 4554037 -3516842 -11295760
9059 -11295760 -17977834 -23518067 -25656841 -19529027 -4658534 10229480 14993039 9451919
9051 9451919 1855358 -2510352 -4913920 -6012849 -2833442 4554326 9770403 8196186
9043 8196186 4471862 6924670 16192927 24012136 23408638 16381007 10135110 8458550
9035 8458550 9291582 9479896 8717146 8182501 7963939 7604999 7393088 7122930 5251832
9026 5251832 1646802 -676631 98815 92209 -5859723 -15777673 -21823689 -21044755 -19553799
9017 -19553799 -23309334 -29049945 -28334227 -18360069 -5390402 1751449 -218636 -6558793
9009 -6558793 -9305860 -5649802 -1068495 -2044589 -7142688 -9474033 -6930299 -4009052
9001 -4009052 -3300541 -2359995 -1011706 -3943426 -11684500 -16050024 -10725480 -1060655 3192407
8992 3192407 595501 -3173080 -5378005 -7530154 -8989633 -6985357 -2557043 -72239
8984 -72239 -711011 -1597511 -1162827 -541851 81007 2030853 5248636 8474127 11370084
8975 11370084 13199044 11602977 6684909 3330194 4343324 4515813 -1950248 -11006379
8967 -11006379 -13671871 -9538990 -6515199 -7701807 -8277395 -6694134 -8806396 -16946448
8959 -16946448 -23829400 -23154961 -19478814 -21101102 -27995604 -33127926 -32394940 -27287838
8951 -27287838 -19922594 -11277861 -3849925 -1166009 -3495346 -6657616 -6347575 -2870008
8943 -2870008 -851473 -3613861 -7917506 -6636366 1602715 8556389 6158040 -2358153
8935 -2358153 -6829010 -4143306 -780906 -1304674 -2202533 526869 5030463 8606736 12592177
8926 12592177 17562081 19240454 14803063 9128945 9025187 13911154 17260959 15214943
8918 15214943 9388721 3091341 -1113071 -1724792 37556 167930 -3694254 -9419738
8910 -9419738 -14083440 -17550707 -19692376 -17813644 -11080592 -4481262 -3620012 -7651759
8902 -7651759 -11665321 -13685190 -14419127 -12244287 -4471408 6726719 14872279 16336425
8894 16336425 13337526 9838682 7741235 6706898 4575397 -1220751 -9536833 -14471283
8886 -14471283 -12466861 -8596048 -10412371 -16654691 -18527806 -12693605 -6223876 -6187445
8878 -6187445 -10223679 -11352762 -7646771 -2453290 1924795 5531693 7010412 3889793
8870 3889793 -2218166 -4684352 941687 10346099 14132771 8529946 55770 -2077539
8862 -2077539 3569332 10365709 12625425 11130936 9367295 8555466 8518722 9794274 11694505
8853 11694505 10916609 5444181 -2106060 -7924393 -11442367 -13151611 -11014622 -3852841
8845 -3852841 3770743 5732618 2831769 1786185 5725618 10857699 13141596 13039123
8837 13039123 12236203 10517313 8052238 6775324 7276865 7662827 7153035 7143204 7096358
8828 7096358 3968284 -1365485 -1679398 7813991 20978985 26267357 19881073 9029456
8820 9029456 2141271 125325 -1243780 -3714185 -4524882 -1309518 3649631 5567830
8812 5567830 2807223 -1402843 -3277355 -2629382 -1443685 -398147 506521 -680110 -6010798
8803 -6010798 -13221645 -17062737 -16058143 -14437070 -15793053 -18165859 -17668790 -14120493
8795 -14120493 -10264526 -7541752 -5642383 -4805401 -5524494 -6585984 -5925709 -3223177 160488
8786 160488 3212881 5303872 4879585 662983 -5497575 -9057725 -7140860 -1523793 3542488
8777 3542488 5976600 7519740 10639321 14548377 15564251 11758704 5652783 809073
8769 809073 -2780140 -7295712 -12030977 -13566109 -11625309 -10719052 -13649087 -16659916 -14541586
8760 -14541586 -8632873 -5802373 -9726748 -16477946 -19535804 -16886750 -11969303 -8938924
8752 -8938924 -8501124 -8598425 -8413227 -10112567 -15229563 -20294049 -19027677 -9836037 1336966
8743 1336966 7198328 6142517 1640762 -2704334 -4755984 -2824050 2869645 8331478
8735 8331478 9217714 6497146 5569905 9164989 14063869 15745585 13404189 9099655 4801372
8726 4801372 2236823 3149470 6940300 9565588 7561251 2336669 -2002623 -4151003
8718 -4151003 -5839262 -7182264 -5991151 -2756372 -1879048 -4906186 -6224531 -304043
8710 -304043 8972785 12400026 8780758 7228166 13488105 20666280 19379287 12333011
8702 12333011 10588640 16857440 21437526 16749880 7930309 4065410 4765359 2391186
8694 2391186 -5011838 -10160180 -6388962 4283088 14545816 19179549 16887554 8361966
8686 8361966 -3459919 -12230253 -11413728 -733271 11957126 17190144 12444023 3436281
8678 3436281 -2478088 -2279347 3276817 12709580 23400277 30116073 28290990 19424569
8670 19424569 10230258 5604320 4943640 5763260 7379419 9337221 9464921 6297519 1658785
8661 1658785 -1228439 -623980 3858963 11309705 17452332 16192829 7101861 -1253045
8653 -1253045 -61321 9016538 16225951 15573761 9385534 1766245 -6293486 -13726720
8645 -13726720 -16978365 -14466141 -10100798 -8772485 -10368483 -11365055 -10791733 -11356663 -15038309
8636 -15038309 -20112008 -22882156 -20980952 -14937357 -7503892 -1463369 2303391 4299381
8628 4299381 4351393 1784773 -1943129 -3179815 -448917 2949085 3233781 1899385 4064966
8619 4064966 11100320 18042948 19570143 16090406 12050458 10038515 9122718 8266363 8511751
8610 8511751 10924171 14104747 14938931 11203767 3146971 -6445621 -13395170 -14821669
8602 -14821669 -11683833 -7542267 -4041427 687446 7742354 13694891 14043908 9402524
8594 9402524 4786337 2612089 -92072 -6192512 -13165417 -15752048 -12580370 -8155230
8586 -8155230 -8529859 -15669585 -25385664 -30532335 -27304905 -18706336 -11043109 -7675762
8578 -7675762 -7737357 -9566009 -12036554 -13035426 -10849191 -7695720 -7710670 -10479446 -11190080
8569 -11190080 -8615655 -7460229 -10109107 -11917835 -9007143 -5290909 -6145958 -9831367
8561 -9831367 -11775919 -13254498 -17942101 -22722301 -20764649 -12858013 -7206114 -7680989
8553 -7680989 -10175758 -11168834 -11649572 -11120416 -6294759 1318913 4520614 913766 -2930061
8544 -2930061 -1847060 658173 425727 656214 5508157 11882845 14856365 16183410 19546941
8535 19546941 21536832 16098357 5495535 -1901358 -3760420 -5350577 -8879387 -9522299
8527 -9522299 -3965608 4051976 9554126 12251292 13745418 13287379 9633855 4364397
8519 4364397 766581 850804 4144601 7512756 6570046 402157 -5458708 -4693701 1179367
8510 1179367 4476607 2276507 307869 3829701 9872283 12218326 9926796 6305315
8502 6305315 2307631 -3684630 -10299237 -12237194 -6084160 5580890 16712844 22551865
8494 22551865 21391907 13821114 2082115 -10179427 -19082725 -22640956 -21991211 -20009821
8486 -20009821 -18447039 -16947843 -14924576 -13057618 -12213140 -12283944 -13083083 -14619072 -15169352
8477 -15169352 -11627873 -4367083 692006 -1448072 -8251145 -13790025 -17562890 -23450391
8469 -23450391 -30945669 -34626987 -33317857 -32287611 -33588130 -31648310 -23245099 -15113514
8461 -15113514 -14799030 -18899325 -18460110 -13179527 -11531372 -17042199 -22546156 -20102459
8453 -20102459 -10416810 385516 8619999 14430800 18423586 20031509 18148987 12305963
8445 12305963 4549625 23015 2964356 11443313 18406041 18589798 12550594 4270735
8437 4270735 -2278708 -4400593 -2212146 393121 -382512 -2985597 -2793300 185373 903537
8428 903537 -2163119 -3811778 -433921 4058904 5164925 5678849 10517501 17183015 18590482
8419 18590482 13955359 9704124 9271654 8592614 3452900 -4160265 -9508201 -10704673
8411 -10704673 -8588655 -4671772 -1483815 -1656152 -4349896 -5488738 -3451877 -1239482
8403 -1239482 -896650 205363 4175172 7428511 5302976 -785194 -5832221 -9039201
8395 -9039201 -13416435 -18225123 -18014428 -10665367 -1291526 4244973 5624701 5289187 3227827
8386 3227827 -1695992 -7665189 -11238615 -11963294 -12480803 -14294572 -15998348 -15778196 -13697285
8377 -13697285 -11278449 -10027662 -10152937 -9978656 -7674792 -4477056 -4210628 -7800052 -10758633
8368 -10758633 -9370115 -6951060 -8915233 -12862899 -10262892 746694 10968287 12015282
8360 12015282 6657836 2309061 -424333 -5325438 -10168721 -7973892 1249990 8587742
8352 8587742 8425420 5288817 5105735 6546086 6087548 5671743 8475551 11194625 8330181
8343 8330181 2200065 844232 5988950 10325520 8116089 2056681 -2683695 -5372221
8335 -5372221 -7294632 -7301029 -4089727 53452 1594881 -90249 -3482245 -7409273 -10210440
8326 -10210440 -9279356 -4880849 -2247468 -6260440 -15402049 -23898067 -28160624 -28134002 -24357674
8317 -24357674 -17603910 -10210677 -4128892 1372129 6880045 9534232 6661480 1052669
8309 1052669 -2394805 -4191941 -8540218 -14145210 -13333769 -2464261 12059645 20814692
8301 20814692 20280649 13006834 4062063 167757 6813985 21200823 31744510 29924262
8293 29924262 20249411 13564854 12793863 11301899 4541221 -3262707 -5871248 -3685285
8285 -3685285 -2678987 -7185222 -16076279 -24663853 -28694332 -27445948 -24179654 -22976609
8277 -22976609 -24340511 -24382636 -18860341 -7687125 4715948 13033581 14820889 11307805
8269 11307805 5383975 -579793 -5150246 -7511734 -7985776 -8154875 -8895735 -8644792 -5248568
8260 -5248568 873473 7299757 12679229 16664344 17559256 13958185 8953164 8073208 11457393
8251 11457393 12632724 7554088 370317 -3146384 -3435856 -3888349 -3810904 -651895 3263948
8242 3263948 2683671 -2685734 -7795902 -9227851 -7315712 -2168025 6137827 13106593
8234 13106593 12290786 4335768 -2000771 -578237 5017983 7840388 6639447 5126948
8226 5126948 5755426 8112050 11244945 14013570 14242420 10148899 2192297 -7414705 -15705979
8217 -15705979 -19236272 -16079307 -8671210 -2078035 1710896 5101460 9687808 13346580
8209 13346580 14250858 14099543 14807282 15156394 13500773 10948996 9075171 7212542 4807959
8200 4807959 3517427 3808051 2534977 -2271315 -6932129 -6760847 -3000172 -675801 -1509029
8191 -1509029 -3855802 -7947456 -15227161 -22778404 -24507445 -19224581 -12585111 -9323837
8183 -9323837 -8147690 -6480269 -5666264 -7746901 -10213515 -8531977 -2996343 839361
8175 839361 -696682 -4453278 -4383385 646615 5103470 3571318 -2458391 -6972489 -7983599
8166 -7983599 -9913277 -15822931 -21000191 -18299154 -8181435 916694 2255037 -2559651
8158 -2559651 -6833299 -5599729 1321230 10131391 15814718 16091249 13390158 11603991
8150 11603991 11358572 10507495 8361468 6273669 4463487 1990249 120048 1716853
8142 1716853 6264124 9331144 8526717 6425458 5870750 6007542 5129961 3868683 2884070
8133 2884070 793760 -2545234 -3997984 -1992406 -259623 -2388046 -5277145 -3100206
8125 -3100206 3941408 10123747 12265524 11540475 7870854 -555402 -10718754 -14494129
8117 -14494129 -8541631 614915 5302465 5869134 6471360 6194167 1285719 -5863786 -7554317
8108 -7554317 -1199215 7513553 13544269 18431746 24076735 26199154 19620377 7282216
8100 7282216 -1716290 -2583305 1020858 3207856 2154289 -560796 -3393091 -5923107
8092 -5923107 -8322044 -10566640 -11087330 -7069855 1429478 8754978 9054353 4352536 2524959
8083 2524959 6258130 9387343 6738256 2127728 2121652 6407004 10204070 12822385 16667522
8074 16667522 19331893 14614411 2512603 -8634909 -12437560 -11329090 -10449153 -10137093
8066 -10137093 -8628627 -7714372 -10207999 -14069738 -14347965 -10370937 -6676640 -6671533 -9033911
8057 -9033911 -11084675 -12540059 -14362368 -15834626 -14535439 -8803732 347906 9345010
8049 9345010 13985691 12127461 5229976 -2612650 -7478699 -8293691 -7420045 -7971186 -9514125
8040 -9514125 -7446667 1141679 11561785 14947845 8698290 204973 -2093132 1459153
8032 1459153 4052326 2388791 -50595 541454 2753806 2437609 -1757281 -7119592 -9972245
8023 -9972245 -8738345 -4452532 851648 5910476 10115702 12090950 10233580 5626846
8015 5626846 2356241 2773111 4083015 2543321 -262947 660777 5730248 9301958 7606286
8006 7606286 3791826 2250839 1732751 -1562961 -6471984 -7837922 -4699440 -2204477
7998 -2204477 -3596126 -4567375 1047870 12348016 21858044 24348615 21996747 20296845
7990 20296845 21437472 23222409 23054482 20958554 18597404 16777393 15126827 13977151
7982 13977151 14870570 17673523 18026616 10565777 -3990412 -17276851 -21370386 -17285768
7974 -17285768 -12732079 -12366774 -13834660 -13376186 -10943277 -8031535 -4434483 -241577
7966 -241577 1919101 394010 -1694382 -132251 3996399 5594620 2874937 -440056
7958 -440056 -533033 2335948 5672140 7649380 7454038 5596499 4563191 6403386 9226009
7949 9226009 9195296 6423308 5109185 6881289 8283831 6728655 4507817 3969838 2892379
7940 2892379 -1346664 -6447489 -8748259 -9451648 -11955470 -14573980 -11789923 -2828529
7932 -2828529 6322924 10543236 10726406 9909183 8704596 7161938 7554234 11591820 16511633
7923 16511633 17315361 12679502 6355356 2639981 2384034 4068454 7113074 12180833
7915 12180833 18221688 21340133 18543060 11769615 5636129 1243096 -4356380 -11288534
7907 -11288534 -13609694 -6718022 4639317 10715121 8358948 3619452 2769167 5598890
7899 5598890 8756932 10895068 11890393 10848236 8237550 7143197 8806829 9177145 3960563
7890 3960563 -4314318 -8806038 -7702102 -6305369 -8449656 -10354743 -6501733 1201837
7882 1201837 4902354 1277813 -3748121 -2588333 4669658 11346651 13016282 11952941
7874 11952941 12846660 17161976 22798029 26938848 27612451 24209541 18506602 14295894
7866 14295894 14189812 17037564 19482526 19368630 16684458 12320886 7420388 3115596
7858 3115596 -641925 -5294460 -11249527 -16111273 -17202457 -15329118 -14095530 -15536587
7850 -15536587 -17969412 -18157178 -14501291 -8509964 -4108412 -4514207 -8385306 -10260364
7842 -10260364 -6687489 -697567 2073877 380182 -2546502 -4805992 -7555824 -10577487
7834 -10577487 -10557959 -6190485 -1997461 -3692813 -10577878 -15392611 -12489351 -4605095
7826 -4605095 136039 -2049838 -5970553 -4601791 712223 1511799 -5803848 -14529211
7818 -14529211 -17189186 -15517720 -15706770 -17681376 -16326117 -11589781 -9321764 -11308932
7810 -11308932 -11889822 -7066695 -993596 36568 -4316275 -9492323 -11658400 -9660437
7802 -9660437 -4575251 219343 1109526 -1919931 -5773859 -8677213 -10540039 -9425208
7794 -9425208 -3314066 4050004 5777652 2092671 845319 5031708 7712084 3812770
7786 3812770 -1161972 -750814 1538793 -775874 -5246043 -5026659 -912019 1167006 1701854
7777 1701854 6231699 13761918 16927156 13924414 10532577 9182760 5610671 -1371543
7769 -1371543 -5953841 -4777473 -2417827 -3418410 -5786640 -6513402 -7035717 -8622702 -8170642
7760 -8170642 -3607879 1260623 1994671 -484365 -3076207 -5235295 -6555967 -4531977
7752 -4531977 535298 3143695 491640 -1839109 1516429 5608497 1688531 -8425674
7744 -8425674 -13123820 -6444227 4820233 11199112 11260665 9328122 7648709 5042390
7736 5042390 836339 -3442367 -5767631 -5321744 -2951950 -596652 378790 430706 782746
7727 782746 1693642 2930804 5058612 8342844 10952348 10477283 7093005 3093046 -524366
7718 -524366 -4383020 -7323043 -5846701 982036 8108361 8963153 3377154 -1410510 922339
7709 922339 7761647 10199718 3903839 -5233314 -8105325 -2871459 4732739 10045773
7701 10045773 13653201 16552712 16635478 12986303 9534326 10249114 13330804 14334401 12989039
7692 12989039 12342640 12522030 10493174 5999966 2838819 3076880 4024420 2529760 -1008487
7683 -1008487 -4500645 -7047189 -8236036 -7351033 -5433721 -5892324 -10608933 -16751787 -19470820
7674 -19470820 -16937899 -11438019 -6606358 -4794952 -5885905 -7370950 -6697726 -4475472
7666 -4475472 -3705503 -4726966 -3421598 3046388 10757604 12985920 8942252 4772180
7658 4772180 5436646 9296886 12135124 12984601 13303741 13192931 12288834 12972169 18128764
7649 18128764 25259306 27072588 20149377 10097405 5330411 7665453 12022325 13923202
7641 13923202 13541696 12552129 10870327 7863177 3938393 -791207 -7178078 -14424475
7633 -14424475 -18685510 -16803096 -10568479 -4986501 -2613348 -1653404 286946 2673171
7625 2673171 3375543 2415309 2785544 6989317 13366047 17039154 15054519 9602127 5101543
7616 5101543 3186715 2442212 2127818 3076512 4730036 4763947 3082313 3055104 6589741
7607 6589741 10653384 11425787 9699858 8977224 9776206 9182187 5119869 -1996677 -10874144
7598 -10874144 -19122852 -22066973 -15835012 -2389667 11596042 21572980 28052700 32326834
7590 32326834 32827550 27646073 18330543 9164175 3716893 2793845 4211117 4113881 460355
7581 460355 -4295966 -6144949 -5382191 -6356148 -10267857 -12034105 -7143947 1369285 6589318
7572 6589318 6425396 4426647 2841839 -255615 -5971373 -11070229 -12051523 -10042254 -8826927
7563 -8826927 -9755472 -11411621 -12945833 -14307689 -13729945 -9008430 -2032378 2119908 2688045
7554 2688045 5712184 15272188 25755160 28321480 22909562 17111855 13877707 8625104
7546 8625104 506870 -2488710 4464253 13026119 11909293 2756033 -3135746 -1644764
7538 -1644764 281481 -2158502 -4026753 492454 9047413 15419286 17754842 18323742
7530 18323742 18902316 20066450 22014092 23165904 20894332 15935340 12575924 12083923
7522 12083923 9991813 2989060 -5455648 -9932003 -9730253 -6685518 -359691 9390145
7514 9390145 17931150 19721760 15375838 10171313 6907411 4815286 4012123 5807172
7506 5807172 9161555 11522760 12687816 13596618 12535352 7732183 2724085 2951812 6951131
7497 6951131 7428474 2142670 -3000791 -3894319 -4440508 -8959980 -14449400 -15801129 -14240179
7488 -14240179 -14467237 -16351212 -15841658 -12746922 -11280077 -12575756 -12210802 -6745490 1493683
7479 1493683 7993647 10899066 10259880 5779612 -1615844 -8135993 -10526263 -10236655 -11050162
7470 -11050162 -12915497 -11575959 -4946933 3718879 10905679 17628704 25626489 31334191
7462 31334191 29026229 19819689 12033970 10701378 11609427 9047553 5052746 5719333
7454 5719333 10913866 13883380 10912906 5680575 2570540 499527 -3754513 -9315701
7446 -9315701 -11697156 -8302420 -1082345 5767631 9252786 9121548 7182320 5420520
7438 5420520 4821246 5852937 8798017 12641808 15116552 15473311 15512646 15646104 12343234
7429 12343234 3541493 -5257034 -6094371 291065 4721725 2478993 -705286 1065993
7421 1065993 4192175 2309039 -2020729 -272321 8917342 17156217 17645046 12810720
7413 12810720 8544656 6190559 3742638 1286574 878854 2383490 3133665 1876338
7405 1876338 527156 1321716 3941232 6447305 7835137 8125339 6433900 1150358 -6932549
7396 -6932549 -13418876 -14375779 -10954611 -7898242 -7970303 -10313308 -13752910 -17960426 -20693767
7387 -20693767 -18377510 -12001572 -8489860 -12156439 -17676048 -16612942 -9419800 -5119414
7379 -5119414 -8608646 -14057639 -13715553 -9003078 -8492511 -16558305 -28159781 -35146803
7371 -35146803 -34664466 -29990898 -25186815 -21336334 -17724393 -14305915 -11652358 -9636536
7363 -9636536 -7775004 -6404678 -6145805 -6666995 -7370784 -8540711 -10116132 -10714043 -10683051
7354 -10683051 -14402196 -24550226 -34524852 -33323845 -20303343 -8473984 -8590886 -15712724
7346 -15712724 -17701406 -12176638 -6918184 -6318249 -6826438 -5946079 -6882676 -11760560 -17327792
7337 -17327792 -20685734 -23483285 -26906794 -27629762 -22934054 -16128065 -12899060 -14821126
7329 -14821126 -19278625 -22976871 -22972171 -17458807 -8541523 -1423430 1774504 4187709 7604525
7320 7604525 7896332 1291302 -8282315 -13354345 -12288287 -9480370 -7794252 -6047479
7312 -6047479 -3397864 -1205306 -187863 260200 -278679 -2566698 -4647901 -3288158 1195776
7303 1195776 5172276 7060085 8650664 10547118 10491605 7709963 5038859 4444083 3531970
7294 3531970 -722117 -6821876 -10014715 -7772648 -2195305 2438252 3487154 2115869
7286 2115869 2248577 6343532 11952294 13938558 10385836 4594259 1010449 1346865 5063114
7277 5063114 10696612 15202403 14712193 8465380 452415 -4923658 -7354091 -8792214
7269 -8792214 -9055976 -6626056 -3150552 -3277811 -8598406 -14212027 -13411307 -4944516 5809186
7260 5809186 12417242 12844015 9491842 5404290 1593476 -2307484 -6145181 -8883896
7252 -8883896 -9922856 -10144608 -11221603 -13556859 -14944501 -12271702 -5636723 1166
7244 1166 -662808 -7004249 -12991171 -14629864 -14217660 -15689261 -18687155 -20127853 -19417359
7235 -19417359 -18458288 -17711182 -15938202 -13231474 -10786461 -8130671 -4044973 388855
7227 388855 3514691 7019275 13178198 18514832 16343678 6827134 -1887832 -5095523
7219 -5095523 -7713882 -15087010 -23572535 -25797343 -20606173 -11736161 -555119 12974142
7211 12974142 24857316 29966769 29144983 26798488 22696030 13453602 1573065 -5249301
7203 -5249301 -5063949 -4052465 -5670689 -5233111 725246 6798839 6030080 -380181 -6482925
7194 -6482925 -10489354 -14160489 -16532270 -14889795 -10498719 -7331149 -5555832 -1559989
7186 -1559989 5509665 11879325 14216228 12712464 9039917 5037551 3391355 5430542
7178 5430542 7729338 4963928 -2946551 -10347645 -13374206 -13876017 -14546170 -14743029 -13754528
7169 -13754528 -13886072 -16191280 -16141566 -8574129 4009582 12727495 12561913 7841069 6050581
7160 6050581 8704570 10708300 7981310 3280356 3075325 9411994 17005162 19428895
7152 19428895 16372677 12538475 10734927 9621965 8155691 8005336 10008370 12014976
7144 12014976 12634697 13647556 15632730 14628858 7494395 -1859361 -6593564 -5954069
7136 -5954069 -5143254 -7039794 -9534613 -11072200 -12857884 -14355695 -12633939 -8655200
7128 -8655200 -8404860 -13932502 -18328237 -14528935 -5192134 1575561 3148063 3080919 3338683
7119 3338683 2815272 2886730 7101837 13839780 15606717 8616649 -1568551 -7026505 -6361127
7110 -6361127 -3605727 -1720880 -957391 -1417774 -3270391 -5045282 -4531164 -1310917 2985001
7101 2985001 6210423 6599498 3784810 285166 190268 4557656 9453888 10026266 5162210
7092 5162210 -2644552 -9431808 -10379888 -1907217 13510460 27036082 31461818 27749475
7084 27749475 20962337 13086423 4518688 -634932 1957277 8609804 10119812 3937883
7076 3937883 -2476660 -2505145 1770211 5773830 10145038 16817674 22099739 20521430 13722136
7067 13722136 9445825 12007403 18454203 23835031 25616016 22774803 15407280 6661271
7059 6661271 1141828 -420999 -1797558 -4997216 -6817219 -4146876 359960 1663293
7051 1663293 -274755 -654692 2754560 6473973 6948586 5711641 5938685 6249728 2288812
7042 2288812 -5833212 -12285978 -13429600 -12849462 -14974740 -16923580 -12273390 -2068991
7034 -2068991 4212486 637771 -7367814 -10701440 -8324239 -6775969 -10031357 -14826963
7026 -14826963 -16189226 -13660644 -10639148 -9727040 -10098824 -8779436 -4178334 1563455
7018 1563455 4649071 4308958 3432715 3553093 2069080 -3080795 -8745808 -10343635 -8413411
7009 -8413411 -7084108 -7356894 -6883908 -5753763 -6585650 -8003893 -4152015 6486078 16763738
7000 16763738 18998596 13657266 6451056 527484 -4098490 -6527830 -5927406 -5169101
6992 -5169101 -8356893 -14808629 -19659295 -20338101 -18331833 -14568145 -7990241 -196675
6984 -196675 3085170 -1769292 -11306449 -18962090 -21876164 -21299637 -18577216 -14281230 -10118594
6975 -10118594 -7812356 -5972391 -1510580 5002089 8565483 5988083 288978 -3308219
6967 -3308219 -3631289 -3170437 -3335952 -3706184 -4977220 -8229914 -10826167 -7672483 1301745
6958 1301745 8757875 8044807 769281 -6795128 -11778964 -14954508 -15363181 -10335151 -695854
6949 -695854 8634546 13560190 12768217 5734121 -6085157 -16189311 -17285497 -10317990
6941 -10317990 -4005542 -3522352 -5052356 -3741097 -669295 1933861 6132106 13269957
6933 13269957 18612193 17591257 13573979 12531835 13260844 10652794 6328719 6976997
6925 6976997 12138829 12563327 3071669 -10164085 -18293183 -19817476 -18561572 -16561574
6917 -16561574 -12871176 -6448529 2317285 10483676 12262660 4037817 -9163356 -17084954
6909 -17084954 -15974184 -11911127 -10537141 -9784731 -6581685 -4316673 -7313338 -12229984
6901 -12229984 -11936145 -5601819 1456103 6428302 11196108 16400440 19415437 19052524
6893 19052524 17361963 15503497 11811580 5440399 -1028814 -3917535 -1595551 4679789
6885 4679789 10984714 12436125 7484021 229396 -4082990 -5143456 -6237160 -8003559
6877 -8003559 -7718065 -4624772 -1495580 42868 1699973 4623052 6966425 7247783 7095954
6868 7095954 8617902 11445282 14179812 16563165 18591260 19594160 19610338 19331141 17303686
6859 17303686 10333472 -654059 -7948208 -4457022 6872740 14767958 11523267 709931
6851 709931 -7910260 -9004753 -5425100 -2586703 -1905146 -1107229 565104 311855 -4299355
6842 -4299355 -11431921 -16663266 -17384074 -14057595 -8544627 -3280039 -878901 -1806756 -2925578
6833 -2925578 -988419 2707324 3816046 891956 -3007042 -4660187 -3602389 -512058
6825 -512058 3929519 7718678 8312567 6137465 4759157 6443723 9901330 12897890 13968401
6816 13968401 10953106 1903909 -10773017 -20771592 -24618397 -24596971 -23179335 -18967519
6808 -18967519 -11215895 -3830691 -190003 2549183 8531889 14935401 14619152 6436855
6800 6436855 -2529352 -5655418 -3487437 -1009674 -1696373 -5133095 -7848452 -6019422
6792 -6019422 423534 6613633 8110942 6767061 8046796 12837183 15638366 11601125
6784 11601125 2196364 -7215627 -12960448 -15084877 -15740435 -16632826 -17313589 -16167147 -13657032
6775 -13657032 -12784505 -14551683 -15425127 -12553970 -9220848 -10517438 -15055982 -16468001
6767 -16468001 -12959931 -9741332 -10977838 -14490250 -15964545 -13754994 -8032568 -36603
6759 -36603 5993466 5220657 -977712 -5467025 -5236413 -5430588 -10028126 -14453093 -13110721
6750 -13110721 -9454014 -11305152 -18666233 -23371558 -20227784 -12349170 -5350386 -1708741
6742 -1708741 -1437371 -3420049 -5024288 -4331718 -3279219 -4689263 -6265457 -2808345 4365651
6733 4365651 5891625 -4356483 -20448414 -30781988 -30598855 -24285907 -17374920 -11108338
6725 -11108338 -4884993 388778 3557125 5567020 8265982 11577952 13598791 13288592
6717 13288592 11414517 8488307 3605759 -3250011 -9192567 -11163110 -10292843 -10810052
6709 -10810052 -14104266 -16614753 -14788901 -9419371 -3218420 3232077 10280007 15882867
6701 15882867 16820797 12557453 5482255 -1757812 -7031546 -8644315 -7688248 -8867477
6693 -8867477 -14836161 -20563905 -18141029 -7546407 2168218 3864865 126721 -2043342
6685 -2043342 -213964 3094289 5995780 9076223 12680344 15727192 17367483 17860674
6677 17860674 17751382 17390697 17042213 16577919 15449536 13528964 11367526 9255589 6877943
6668 6877943 4193955 1704154 -231518 -1192196 -128559 3163605 6204702 5947366 3067687
6659 3067687 1512911 3142170 5656616 6720132 6813351 6451279 4136722 -415598 -4272856
6650 -4272856 -5568160 -6697857 -9440786 -9817955 -3062531 7718597 13548485 10501418
6642 10501418 3465781 -2145038 -7287861 -14936874 -22668052 -24040424 -16593735 -5400226
6634 -5400226 1737434 1165426 -4570298 -10215932 -12559674 -11859010 -9430250 -5399812 229074
6625 229074 5551622 7835749 6646569 4508919 4395856 7510710 12945107 17957941 19078463
6616 19078463 14949020 8192866 2921907 660118 395765 1730722 4975876 8297053
6608 8297053 8488811 5728509 4134060 5704017 6897072 3991755 -782726 -2055159
6600 -2055159 1176261 4440939 3762672 -449198 -5500998 -9450868 -11482981 -11768357 -11814885
6591 -11814885 -12926665 -13587754 -10584522 -3969819 1170810 30543 -5778360 -9387674
6583 -9387674 -5875101 3118546 12032923 17215490 19238369 20149596 20040773 17462743 12742423
6574 12742423 9038626 9042284 11779483 14147918 14789858 14700146 14766635 15030473 15867900 16927054
6564 16927054 15129729 7942718 -403896 -1310694 6242905 11451825 5465100 -4594170
6556 -4594170 -4124010 7604085 14985305 7929789 -3832636 -5276585 2861886 7599929
6548 7599929 4030273 377400 2486402 4550595 -90971 -7353289 -8473267 -2746944
6540 -2746944 2772412 3909077 3335968 4562991 7589230 11476148 16780755 23213259
6532 23213259 27518447 26337409 20701120 15963877 16367805 19860826 19659001 12269752
6524 12269752 2745081 -878247 1984905 3571818 -1626305 -9927626 -14955785 -16659195
6516 -16659195 -19110562 -22537200 -23566634 -21980954 -21026470 -21082417 -19095986 -15173443 -13451753
6507 -13451753 -14114278 -10662849 594061 12977105 16696152 10981573 3711319 387430
6499 387430 -1146586 -4782351 -9748455 -12162788 -10370274 -6874436 -6088606 -10895610 -20206166
6490 -20206166 -29297825 -33553435 -32286033 -28187155 -23385415 -17770367 -11516814 -7143565
6482 -7143565 -7258852 -11058838 -14980724 -17037910 -18813539 -22104253 -25004286 -23661698
6474 -23661698 -17975775 -12998284 -13129806 -16677358 -18189767 -14821777 -7941300 270104
6466 270104 8245629 13377664 13167544 9337321 7188170 8983602 11324206 11353233 11766639
6457 11766639 15828681 20535306 20051696 14615808 10415747 10363957 10407350 6662655 1244751
6448 1244751 -2186677 -4823246 -10184576 -17061271 -19663892 -15183374 -7805884 -3888728
6440 -3888728 -5192545 -8225071 -8875679 -6139230 -1897589 1347168 2240220 1347377 1109787
6431 1109787 4269381 10806090 16409925 15922313 9551058 4097703 5712006 12081869
6423 12081869 14709813 9480655 1925248 -48027 3702039 6016253 2370398 -3270130
6415 -3270130 -3804276 2269390 9616841 12432034 9844553 5121685 1578142 362833
6407 362833 1153040 3190206 4950482 3707326 -2890661 -13702038 -23074725 -24681515
6399 -24681515 -17473602 -7174596 -768662 191533 -310700 964454 1972840 -1786884
6391 -1786884 -10834725 -19585133 -21136042 -14074126 -4581905 -1522945 -8588950 -20940974
6383 -20940974 -30088862 -32048547 -29779600 -27851984 -26960128 -25000492 -21555054 -18615642
6375 -18615642 -17401679 -17097430 -17153447 -18469548 -20938727 -21399810 -16132432 -5516478 5063945
6366 5063945 9869928 8241741 4667896 3217673 3111205 1152438 -2613084 -4502062
6358 -4502062 -2437615 1820515 6562223 11950047 15476323 10588299 -4556015 -20082272
6350 -20082272 -23364281 -14532130 -6187581 -6890844 -11948372 -12982345 -9729682 -7752113
6342 -7752113 -9563514 -13312975 -16885207 -18593005 -16688513 -12514381 -10970237 -13068652
6334 -13068652 -11474517 287622 16575377 24738091 20725459 12603439 8521221 8797497
6326 8797497 11425783 17044126 23726344 23550520 11497314 -5428732 -14771151 -13338766
6318 -13338766 -9413937 -10021027 -11948574 -8237880 649884 6855401 5276153 -487428
6310 -487428 -3416581 -1242934 2948724 6199757 8240133 8906242 6790698 2013819 -2383546
6301 -2383546 -3938288 -3842402 -4602455 -6276874 -7009448 -5803376 -2871898 1197293 4830329
6292 4830329 6031037 5621671 7445801 12625862 16356514 14067358 8251510 4753008
6284 4753008 4453111 3772042 1722963 647078 869185 722449 1437417 5419700 9516197
6275 9516197 7276650 -738176 -6264236 -5162033 -2380671 -1897564 145542 6751563
6267 6751563 11775639 7922605 -1742446 -7938333 -7631939 -5082820 -2886964 320464
6259 320464 3932903 4231040 79592 -5321342 -8952318 -10151723 -8546530 -4125121 750284
6250 750284 3427204 4766411 7104199 9384875 8759795 6094263 4761264 4473693 2038273
6241 2038273 -1501534 -668791 5856386 12050082 12432796 8423608 4237456 996584 -1822157
6232 -1822157 -3124918 -2515575 -3146654 -7994967 -14582120 -17129985 -13873128 -9586802 -10249549
6223 -10249549 -16400849 -22346040 -22051807 -15862332 -10224457 -9725427 -11283429 -8798942
6215 -8798942 -1851031 4122371 5363445 2955958 -1140907 -5783783 -7777877 -3455623
6207 -3455623 4670131 8608170 5299205 651665 -614696 -2857718 -11166840 -20492017
6199 -20492017 -21411848 -14048126 -7664967 -7145107 -8343503 -7847727 -8804079 -13407432 -16503867
6190 -16503867 -12139930 -2394644 5492084 8354755 8859220 9476655 9029642 5292574 -1751518
6181 -1751518 -9390583 -13469632 -11252033 -4744232 348853 1247958 1884129 6825461 13005546
6172 13005546 12261562 2305606 -9753094 -16623162 -19035647 -21481957 -23563698 -20753361
6164 -20753361 -12453749 -4130870 -580200 -840003 -1157218 74884 2226025 4942840
6156 4942840 8398578 11997802 14489198 15053891 13827283 12181453 12301739 14539956 15121195
6147 15121195 9395637 -1576194 -10797091 -13467396 -12011082 -10352629 -7069511 829841
6139 829841 9809589 11985152 5687363 -1870976 -4268218 -3469787 -5041867 -9554161 -12452914
6130 -12452914 -10633780 -5888580 -2373573 -2763292 -6613234 -11166830 -13913883 -14729717
6122 -14729717 -14899217 -14542680 -13064885 -12070647 -14484524 -19035296 -18640585 -7827815 8990946
6113 8990946 19683593 15629146 -330425 -17132212 -25502439 -24630554 -20222902 -17477976
6105 -17477976 -16849912 -16109266 -14289688 -12041006 -9682917 -7439729 -6875380 -9282871 -12720694
6096 -12720694 -13432303 -10515221 -6534366 -3252481 129831 3634393 4496485 2378
6088 2378 -9770705 -22534714 -34275050 -39022281 -32756914 -19751423 -11062851 -13486494
6080 -13486494 -22600562 -29245418 -29808560 -27039613 -23766435 -20037712 -15112926 -8937138
6072 -8937138 -2452718 1697647 899712 -2915247 -3443842 2283793 9228643 10804164 7139789
6063 7139789 3078230 1091311 1008506 3857374 9887491 14464340 12357791 5646047 1338559
6054 1338559 1269963 630147 -2806782 -4552057 -793720 5422500 8405636 6561147 2690877
6045 2690877 654348 3182024 9780688 15679212 16236006 13192706 12684233 16316999 18913078
6036 18913078 16505954 11422478 6905891 1628414 -6711300 -15979704 -21659132 -21998305
6028 -21998305 -18427401 -13333437 -9692468 -10016122 -13153881 -14708120 -12535060 -8801406
6020 -8801406 -5121043 -100871 5728784 7491223 2567953 -4315912 -6751369 -3734802
6012 -3734802 2662075 11790201 21181539 23775842 16005601 5514844 2664089 6276520
6004 6276520 6524001 1124639 -1257776 4410335 11099977 10345274 3717590 -2058758 -5704790
5995 -5704790 -10493221 -16292345 -19134975 -17577970 -14305917 -11572871 -8862207 -5039835
5987 -5039835 81904 6095148 11533159 13801965 12169408 9962288 10632035 12100879
5979 12100879 8931420 1008902 -3924547 697129 11073422 16625468 12281728 3578622
5971 3578622 -1354649 -1351661 -1097162 -3128452 -5333555 -5839454 -5598767 -4816150 -1314237
5962 -1314237 4715771 8231935 5765955 1503753 1942610 6173496 7128639 2150523 -3607521
5953 -3607521 -5472862 -5336536 -6980202 -10108461 -12381917 -13614744 -14229780 -12483615 -7142907
5944 -7142907 -809832 3114477 5032705 7173242 8862478 7986641 5940962 6330340 8728361
5935 8728361 8355711 3076921 -3320255 -6742076 -8475104 -12742958 -20482654 -27813269
5927 -27813269 -29831574 -24696454 -14979895 -5892396 -1030321 825082 3418598 7312492
5919 7312492 8833217 5842395 1805213 1525105 4691238 6903325 6253014 5326429 6248156
5910 6248156 7003445 4400470 -1292653 -6541616 -8424498 -6949742 -4180054 -2233719
5902 -2233719 -1844172 -2136309 -1968294 -1390790 -673309 2062107 9785956 21429554 29838139
5893 29838139 28029338 17301035 6482822 2817112 5872653 10700862 13926846 15176452
5885 15176452 15155240 14894447 15394519 15588659 11928107 2835228 -7086239 -10439682 -4986633
5876 -4986633 4430698 12314913 17710002 21563243 22262915 17413901 8885267 2337640
5868 2337640 951172 2179414 2014971 428065 410966 2565201 3335545 -441969 -6815984
5859 -6815984 -10111269 -6739110 1396346 9068453 12239334 10497042 6418325 3274847
5851 3274847 2641138 3566818 4346035 4978936 6789530 9410285 9845793 5829526 -886486
5842 -886486 -5917255 -6312467 -2414125 3080595 6541662 5373430 828769 -2025441 368333
5833 368333 5348139 7319295 5212662 3209712 3897967 4892230 3751576 1931830 723569
5824 723569 -2979402 -11901515 -21241493 -22108063 -12947225 -2894929 -1475720 -8198849
5816 -8198849 -15134424 -17352714 -16980743 -17527899 -18284203 -16299261 -11671586 -7982760 -7596390
5807 -7596390 -8801316 -8560558 -6550199 -4995024 -5346842 -6774048 -7622406 -6764446 -3639770
5798 -3639770 1160338 4997467 4819052 638762 -4151185 -6929838 -8746738 -11825215
5790 -11825215 -15765890 -18104332 -17653679 -15401481 -12723901 -10526483 -9631917 -9988844 -9588681
5781 -9588681 -6227563 -856623 2460002 754151 -4705886 -10093225 -12899303 -13394182
5773 -13394182 -13006849 -12521924 -12108820 -12073716 -12244821 -10660333 -4839643 4109137 10238237
5764 10238237 8386931 504451 -6662518 -9747872 -10452112 -8821949 -975304 13073349
5756 13073349 24735073 25744692 18577231 12290963 10660134 10850756 11604160 14531212
5748 14531212 17302643 13972129 4254091 -4663560 -8100394 -8768294 -8960006 -5815151
5740 -5815151 845238 3683086 -2089742 -9728480 -9869652 -3789270 565249 1894411
5732 1894411 5297909 10838900 12717561 10233610 9861125 14249078 17740735 15920659
5724 15920659 11858364 9048164 5364250 -1044230 -5979212 -5073212 -1009321 563263
5716 563263 -1156055 -3298816 -5000094 -6775985 -6996450 -4273427 -1509025 -2647954 -6661410
5707 -6661410 -9023921 -7902393 -4951480 -1464191 2216029 4863501 5898251 7156463
5699 7156463 9251019 8573702 3001216 -1820114 1312944 9572889 12217167 5234070
5691 5234070 -3263018 -4509566 700738 6612399 11079951 14566656 15276476 11364743
5683 11364743 5898943 4463955 8513585 14612929 19141880 20304546 16631924 7552473
5675 7552473 -4309236 -14474740 -20825072 -24418148 -26229550 -25648224 -22737017 -19523365
5667 -19523365 -17509312 -15276469 -10424057 -3782252 -29420 -2754929 -9363649 -12923454
5659 -12923454 -10069004 -5125030 -4228177 -7013091 -7642054 -3613381 561704 -619557
5651 -619557 -7652513 -17337665 -26072396 -29630439 -24040948 -10997544 328265 1796371
5643 1796371 -4299251 -8460138 -5958667 -1141094 604285 542335 3746089 11274318 18317863
5634 18317863 19727557 15331848 9162591 4513458 1227260 -1909809 -4111795 -4191642
5626 -4191642 -4007928 -6599050 -10580792 -10725126 -5956299 -2373838 -4959962 -10254114 -11981221
5617 -11981221 -10701840 -11733274 -15271170 -15688753 -11082026 -6712415 -6728286 -8268139 -7180878
5608 -7180878 -4878625 -5113616 -7079123 -6418317 -1723053 3990211 7927319 10397512 12735088
5599 12735088 14757416 15180667 13447470 10554383 8281888 7450512 6950098 5132175 1989226
5590 1989226 -1206371 -4184364 -7658175 -10750761 -10868808 -7425757 -3622074 -2652301 -3549284
5581 -3549284 -2694279 1565405 7634303 13084935 16253109 15904970 11763455 6021788 2474684
5572 2474684 2691232 3751502 1220166 -5409606 -11283456 -11010155 -4395808 3672435 8675923
5563 8675923 10155886 9923878 9060535 8136785 8268768 9559855 9833063 7379597 3820728
5554 3820728 1518309 -671870 -5454160 -11325013 -12879377 -7803984 -128720 4713216
5546 4713216 4961937 1493807 -4693837 -11629193 -15904891 -16080685 -14884170 -15413700 -16407314
5537 -16407314 -13897388 -7039455 27109 2522222 30882 -3347453 -3680947 -1706118
5529 -1706118 -1753286 -5867591 -10856747 -12682002 -11449703 -9239036 -5663060 -436330 1588475
5520 1588475 -5162220 -17207630 -23892574 -21238641 -17006539 -18516717 -22405355 -21874158
5512 -21874158 -18032253 -16823561 -18710242 -19133179 -17218813 -16799449 -19314537 -21732226
5504 -21732226 -21379265 -17847889 -10862863 -1391700 6050289 7820487 7267566 10616143
5496 10616143 17327619 21283083 21651636 24579760 31804241 35611741 30014447 20606928
5488 20606928 16849937 18675836 17950692 11566208 5874013 6935211 12057267 14227545
5480 14227545 11612951 8620309 8522972 9148731 7283372 4219731 3816578 6653576 9933243
5471 9933243 12565675 15643366 17289907 12811692 2815976 -4360039 -3127676 919878
5463 919878 -961763 -7636163 -10187772 -5280966 939905 2174141 -1425776 -6436099
5455 -6436099 -9844665 -8857781 -2961085 2809957 2239003 -3541817 -7444164 -6779470 -5709999
5446 -5709999 -6474745 -5676346 -1634375 1972980 3125901 4971271 8228079 7138243 -1564806
5437 -1564806 -11536402 -14505991 -10316034 -3984584 2239816 7870187 9745532 5424648
5429 5424648 -1760044 -6604616 -8157402 -7330072 -2760839 4981076 9397097 5524730
5421 5524730 -1796114 -4403006 -2619028 -2784605 -5549027 -5469845 -1297242 2050722 1941307
5412 1941307 419744 -2285445 -8656386 -17259749 -22967417 -25121381 -27681272 -29637908
5404 -29637908 -23945341 -9398205 4478314 9087748 6615353 3671376 1973194 1154530
5396 1154530 4376535 13279427 21462210 21334060 15744941 15050838 22514973 29541210 27286548
5387 27286548 17616912 9363918 7063435 7212199 4794678 109499 -2498881 -1197621
5379 -1197621 846380 285264 -1769253 -2311082 -1521824 -1610712 -1812797 798915 5414890
5370 5414890 7306219 4869771 2304205 3168501 5445473 5653172 4017285 2317646 -103658
5361 -103658 -4453232 -9024941 -11292914 -11805621 -12829437 -14578097 -15654640 -15798415 -15430465
5352 -15430465 -13849834 -10576434 -7190345 -5267280 -3852617 -1594761 84840 -1062892
5344 -1062892 -4096249 -5857185 -5308206 -4075545 -3187220 -2172189 -1373544 -2344608 -5094456
5335 -5094456 -6836223 -4791122 149525 3325175 747886 -5786970 -9434502 -6223128
5327 -6223128 -958257 -1727166 -9269375 -16638540 -19565978 -20823490 -22221463 -19446145
5319 -19446145 -9888674 236148 3279185 776215 15591 3203897 7160832 11157718
5311 11157718 16887567 21667963 19968247 12265583 4979951 765803 -3703782 -8983097
5303 -8983097 -9891841 -4218426 2922526 7243392 11027686 16010824 16840759 8112203 -6079275
5294 -6079275 -15888498 -16703118 -11306107 -3425164 5399599 13543569 18755234 20173874
5286 20173874 18264339 13651017 8227167 5395255 6281857 7801110 7670966 8870563
5278 8870563 14825225 22013378 22466489 13411416 327876 -9388449 -11997866 -7275125
5270 -7275125 2203154 10468700 11082524 3062244 -8115287 -16481633 -20508011 -21661014
5262 -21661014 -20978636 -18687210 -15242022 -11067475 -6249132 -1317490 2681768 5368791
5254 5368791 7145388 7806711 6317078 2499916 -1993000 -4801296 -4399122 -757223 4589451
5245 4589451 9131421 10652344 7937338 707392 -9511855 -18346653 -21132720 -17999137
5237 -17999137 -13926014 -12062332 -10181392 -6425371 -4644206 -9075094 -16337590 -18674676
5229 -18674676 -14011572 -6851232 169413 8748135 18041409 22307161 18435845 10673306
5221 10673306 4878628 2445435 2349994 4343369 6897398 6471981 2395745 -1469249 -3085177
5212 -3085177 -5688657 -11181402 -15176893 -13768046 -10598474 -10923716 -12450948 -9363299
5204 -9363299 -2883337 149896 -1578171 -1877036 3121977 9994931 14294757 15768010
5196 15768010 15526561 13468386 10767561 10427107 13300656 17315717 21567118 26459969
5188 26459969 28762120 22541709 7993580 -5855140 -10976073 -8709646 -4910478 -1402305
5180 -1402305 2912417 6211445 5129985 627582 -2585809 -2122090 412188 3152735
5172 3152735 5487462 5991898 2692677 -3598664 -8611209 -8122511 -960406 11005008
5164 11005008 24024673 33914975 38149410 36667031 30078020 18699091 5134369 -4176828
5156 -4176828 -3770242 4106722 10418982 8436286 703694 -3980151 -1942 9112306
5148 9112306 14109487 9398666 -1333842 -9559997 -11072291 -8668701 -6360862 -4918476
5140 -4918476 -4841457 -9651812 -21718868 -36048730 -42601062 -36069180 -21637901 -10371290
5132 -10371290 -9390470 -15952764 -20423128 -15922692 -5533280 1458783 643833 -2926428
5124 -2926428 -2260849 2972433 7825238 8782844 5662585 -397452 -6546782 -7754728 -1543598
5115 -1543598 7427387 11684048 9596999 6107195 5328936 6305691 5935664 2326284 -4740747
5106 -4740747 -13024534 -17603492 -15317891 -9639508 -7410603 -10615330 -15123110 -17313371
5098 -17313371 -17260948 -15054400 -9378635 -1537595 3871189 4741977 4161021 5282027 7249823
5089 7249823 8264900 8727258 8720432 6025780 -378719 -7857181 -13754701 -18363574 -21725034
5080 -21725034 -21214117 -15945474 -10414490 -9444560 -11600522 -11758153 -8712680 -6138893 -6642441
5071 -6642441 -8398968 -7774574 -3060963 3976293 8745674 7361808 1245479 -3450208
5063 -3450208 -2647792 1573123 5206225 7168609 7270995 3566949 -3502854 -7650275 -3526899
5054 -3526899 4862903 8892133 7385595 6830030 9327618 8528224 669756 -7610784 -8078426
5045 -8078426 -2664313 -51954 -3150333 -6487829 -5582387 -2865072 -2632869 -4459592 -4276803
5036 -4276803 314900 7903563 14808263 17086438 12633430 3494227 -4668710 -7411495
5028 -7411495 -5574799 -3057780 -1269478 1927269 7884421 14576672 19427581 22525244
5020 22525244 25435970 28360686 30008714 29133582 25133577 18727682 13065759 11754577
5012 11754577 13899258 13692605 7633894 -348832 -4333614 -4363670 -4516118 -5303449 -3952646
5003 -3952646 -1441077 -2696425 -8831339 -15069861 -17937767 -18810867 -18385528 -13864854 -5186572
4994 -5186572 1447832 930909 -3835467 -6697091 -6264550 -4719322 -2155052 2459218 6826588
4985 6826588 7181377 3823693 638432 -297150 -253158 -846890 -2537417 -5159387 -7287877
4976 -7287877 -6297427 -1517561 4167061 8018687 10509608 12293711 11125514 5306482
4968 5306482 -2373381 -7933721 -11120008 -13310715 -13409782 -10664416 -9139107 -13428406 -20663050
4959 -20663050 -22329348 -14541696 -2385134 6224641 7622609 3734589 -166004 642517
4951 642517 5656166 9120796 7252948 3369065 2166743 1620521 -3689003 -12355685 -15754837
4942 -15754837 -9112114 1909658 7657230 4465048 -3180361 -8334510 -8532334 -7807038
4934 -7807038 -11174338 -17061602 -18437413 -12970766 -7615478 -9606570 -17060844 -22999514
4926 -22999514 -24783109 -24320917 -22655349 -20456730 -20852134 -25391261 -29728439 -29461251 -27469037
4917 -27469037 -29006614 -32664464 -33531915 -32314730 -32962312 -33460467 -27921119 -16930419
4909 -16930419 -7569990 -3678283 -3467933 -5593785 -10052626 -14376228 -16028655 -16493425
4901 -16493425 -16512693 -11973954 -2870262 -76351 -11791708 -28987733 -37456673 -38458805
4893 -38458805 -41996931 -45525363 -38451329 -24244183 -17096656 -17974071 -15857754 -12167752
4885 -12167752 -19483036 -34457578 -38672876 -30720577 -29602025 -40513543 -47892108 -49942143
4877 -49942143 -64414934 -88856417 -98633252 -105291809 -164607827 -283063349 -361952789
4870 -361952789 -300105934 -130754274 10551443 47749005 28338624 22837572 32728351
4863 32728351 27451912 13104445 16281850 32815183 37228040 25781271 14724356 8190576
4855 8190576 -1470919 -10341945 -7504085 2305851 4048655 -2938977 -5242309 2628958
4847 2628958 13530795 21868316 27273427 27520924 21883330 17982428 22144669 27111944
4839 27111944 22410903 12369602 9968292 16474001 21115489 18307021 11786157 3956116
4831 3956116 -5465755 -11721735 -9113485 -2216170 -804648 -4433746 -4525300 -1188803 -4249279
4822 -4249279 -15707330 -24103464 -20341010 -8661156 2157862 9415866 14243521 16743973
4814 16743973 17790625 19700919 21803932 20269879 14320259 7819997 3653553 1380929
4806 1380929 664888 1536243 1202018 -3523300 -10291110 -13266348 -11017082 -6993311 -3238096
4797 -3238096 5429 -237503 -6829846 -15437306 -18203524 -14868563 -12522040 -14031785
4789 -14031785 -15060360 -13310545 -11774479 -11135010 -8046384 -3400971 -3015620 -6780227
4781 -6780227 -6643099 18116 4539528 816835 -3642653 1431170 13847046 23136288
4773 23136288 25018297 23142081 19929327 14276455 6790205 -37712 -6102068 -12135203
4765 -12135203 -15153795 -11640699 -4506844 -701502 -1836679 -2862881 -446634 2969861
4757 2969861 4579206 5267088 6140264 5700390 3524699 3131025 7397380 13235194 14705176
4748 14705176 10858427 7098525 8250139 13144195 17560938 20100154 22103948 22721427
4740 22721427 18236912 8053577 -1922513 -5282410 -2869922 -896165 -2235360 -3977286
4732 -3977286 -3918584 -4490787 -7830650 -11063085 -10382436 -7340586 -6709713 -9044527 -9687150
4723 -9687150 -5699403 -104200 2469164 1761969 1202550 2706304 4733730 5411629 5447245
4714 5447245 7045756 10963786 15393488 17307706 14870345 9589594 6222555 8775356
4706 8775356 15720949 21142403 22026305 21889966 24477471 26585606 22036527 11685652
4698 11685652 3651101 2723788 5057768 5250773 3128843 319334 -4524515 -12022415
4690 -12022415 -17263826 -14338409 -4136879 6599729 12654330 13399861 10585737 6886560
4682 6886560 4985794 4704649 2896082 -972618 -2282907 2009742 7804707 9694242
4674 9694242 8472989 7170086 3981869 -3108861 -8319978 -4481571 4082191 5678933
4666 5678933 -1201293 -5279037 -35562 6898035 7122508 4675187 8105002 16154196
4658 16154196 20245360 17840983 15109592 16885083 20230121 19145365 12290859 4895987
4650 4895987 3798762 10075869 16783170 16107110 8465661 1292460 -849857 -200408 645645
4641 645645 3227119 8720993 13955453 15229718 12484785 7343450 1015746 -3790537
4633 -3790537 -3693678 -30384 1463205 -926770 -2430359 -1150036 -3201314 -12792844 -22908573
4624 -22908573 -23283615 -14109614 -4590492 -301247 878092 1600312 908906 -2283352 -6796651
4615 -6796651 -10833493 -12369762 -8551422 1315107 12555197 18297187 15395230 5125720
4607 5125720 -9362118 -22831135 -28488745 -24227209 -16688413 -13920765 -15323531 -14087751
4599 -14087751 -8173145 -2556839 -632790 275594 3230065 6609532 7099990 4405656
4591 4405656 1025332 -572897 377221 2494921 3542380 3523560 5091090 8828761 10485056
4582 10485056 6384838 -445485 -3858184 -2887226 -1941004 -3634119 -6079778 -6942369 -5792330
4573 -5792330 -2558126 2350167 6545157 7841471 7194902 6102487 3023520 -3084102
4565 -3084102 -7927044 -6547061 -1318141 1205856 166605 -282484 -648570 -5916303 -14379837
4556 -14379837 -16226030 -7314919 3530566 5997100 583092 -5561060 -8980466 -10177148
4548 -10177148 -8471948 -3207503 2703817 5741351 6119248 5333526 2593197 -2121593
4540 -2121593 -5016006 -3533391 -1493653 -3918033 -9149094 -11503461 -9854126 -8115856
4532 -8115856 -8472312 -9347405 -9263543 -7885386 -4130932 1856993 5741537 3314455 -2591440
4523 -2591440 -5018965 -2861543 -2120107 -6137003 -10481620 -10079849 -6434646 -4342623 -5095458
4514 -5095458 -6394402 -6339297 -4366270 -361295 4314587 6721585 5735022 3660445 2128328
4505 2128328 -1154737 -8232597 -15590828 -17307642 -12580022 -5805124 411186 7342311
4497 7342311 14410810 16747658 11492274 2559249 -4540542 -9463288 -14419516 -17640671
4489 -17640671 -15195444 -8357522 -3165121 -1994982 -1236383 1090338 1345286 -2806981
4481 -2806981 -6845819 -5759597 -2123546 -2088170 -5735161 -7544350 -5487621 -3584555 -4895513
4472 -4895513 -7231111 -7152448 -3993946 1387226 7983945 13357988 14554037 11826987 8453417
4463 8453417 5894986 2546723 -1875207 -4843299 -5480376 -6321790 -8498419 -9311460 -7227641
4454 -7227641 -5064207 -4790724 -3248845 2469679 8707734 9610903 5766882 3056609 3793594
4445 3793594 4319622 1760809 -1423874 -951812 4323762 11877411 17528935 17744271 12507893
4436 12507893 6248334 3587245 4072634 3432830 -191880 -4014827 -4464196 -329162 7764088
4427 7764088 17343983 23138330 20450838 11472121 4718886 5658744 10665057 12765884
4419 12765884 10459497 7436800 5977666 5009608 3699054 2540813 787177 -3077872
4411 -3077872 -7505594 -8545451 -5933526 -4549311 -7033179 -8556811 -3304509 5990439
4403 5990439 10276409 5891101 -851685 -2179614 2093580 6221123 5843301 831834
4395 831834 -6595021 -13340704 -16548307 -16174548 -15410369 -16276067 -16410917 -12801530 -6598460
4386 -6598460 -696515 5405271 13489608 20600253 21112746 15372512 10294504 9352454 7642476
4377 7642476 389850 -8453494 -10950889 -5626643 1455152 4350122 2030523 -2990655
4369 -2990655 -6880690 -6176655 -796991 5032232 7394993 6875870 5430752 1734765 -5441298
4360 -5441298 -11077998 -7975625 2308959 9336442 7271125 2332434 2374047 4489230
4352 4489230 -103364 -11662382 -20348774 -19420438 -12937605 -7864181 -4633778 -130106
4344 -130106 4282705 3820192 -2005759 -8078408 -10160623 -8349279 -3950275 2221522 7202197
4335 7202197 6597687 861404 -3175578 -695960 4346663 4795294 -250612 -6264727 -11255279
4326 -11255279 -16897170 -22233295 -22499399 -15954685 -7162020 -1122547 2364078 6183886
4318 6183886 10592993 13014459 11723454 7998781 5147748 5461111 7092427 5022660
4310 5022660 -2787872 -11886396 -17301386 -20955913 -27710984 -35151591 -34627746 -23974962
4302 -23974962 -12252911 -8634887 -12356462 -17057412 -19310962 -18664248 -14716985 -9230478
4294 -9230478 -6535074 -6964689 -4747137 2270753 6395133 758648 -8678727 -10604756
4286 -10604756 -4410711 1020483 2724430 6992475 16451733 24256619 24549866 20132831
4278 20132831 15587321 10380734 3858647 423470 3392906 8275880 8458994 4617626
4270 4617626 2805247 5448538 9870453 14447786 20471744 27376999 30767381 27096701
4262 27096701 17995344 8715349 3609298 3547262 6390754 9281380 10918305 11733014 11943533
4253 11943533 10565943 7261483 4287016 5024075 10088897 15419628 15003757 6493457
4245 6493457 -5401923 -12092929 -8888847 830101 9932257 14547652 15075547 12256290
4237 12256290 6209552 -707048 -4244888 -3121921 -620502 363416 1211545 4456459
4229 4456459 9090110 11627364 10483318 6956772 2910262 -278689 -1298041 94770
4221 94770 1735953 743459 -3173302 -7446213 -9618904 -9125771 -6215393 -1038096 5438689
4212 5438689 11117095 14648718 16961668 19903887 23738710 26713915 26672020 22507488 15023163
4203 15023163 7612767 4943544 8426182 13157562 12432138 6230858 2088213 5660803
4195 5660803 13629413 18963561 20274689 21609260 24935722 28014129 29154069 29101352 28079362
4186 28079362 25649076 23705925 24734986 26797446 25554026 21630459 19770557 19824841
4178 19824841 16043000 7688781 2283204 3898904 5874027 1312821 -5632752 -6157069
4170 -6157069 494335 8022548 12886772 15936260 17238133 16040199 13690524 11137542
4162 11137542 6410436 -519082 -4597488 -2977544 -537714 -1777019 -2639525 2195745
4154 2195745 9572208 13879690 17069357 23104988 28108696 26708508 22790753 22531843
4146 22531843 22497202 17366820 13255279 18542798 27460818 29472851 28806433 35352428 42667726
4137 42667726 38679408 32654922 42646264 60250094 65341193 77545323 143465250 251305920
4129 251305920 307005675 238836774 95365952 -8389231 -23958655 42813 8290365
4122 8290365 1889303 2469137 5517158 -3007847 -16130567 -19907989 -18156795 -20727692
4114 -20727692 -22796958 -15815935 -6173716 -4375338 -6289578 -2594972 2437189 -849237
4106 -849237 -7795749 -5659960 4848521 11128480 9747738 9966884 15833598 19656751
4098 19656751 16665307 13621198 17156551 22713055 21815290 14818921 9966409 11855730
4090 11855730 15691581 13443565 3413546 -7765012 -12557973 -10218179 -5316341 -630142
4082 -630142 4096455 7014088 4300170 -2345840 -4548641 2031940 10481375 10986568 2847452
4073 2847452 -6598276 -11703753 -11876286 -7919191 -1010346 5596802 8881436 9790832 10865896
4064 10865896 11122512 7461993 510331 -5235883 -7095670 -6280363 -4321169 -1387405
4056 -1387405 1232922 989893 -1727426 -2340908 2116322 7416928 5503667 -5989687
4048 -5989687 -19795068 -26373878 -23964853 -18513821 -14136332 -8532839 -309940 4475263
4040 4475263 -607869 -11472102 -17446774 -15878158 -14710258 -18658971 -21138684 -14667359
4032 -14667359 -2665527 5319968 5654487 1763285 -3149872 -7886053 -9848435 -6486967
4024 -6486967 43165 4625653 5419001 4362805 2460221 -814244 -3997075 -4489432 -3158013
4015 -3158013 -3389735 -4894408 -3244235 2777408 7849593 7013374 2697356 1487923 5735215
4006 5735215 11683668 15186195 16007614 15789205 14309127 9836784 2543698 -4268098 -6928916
3997 -6928916 -4684165 -8063 3530871 3515196 41737 -4349218 -6975001 -7750559 -8474395
3988 -8474395 -9255321 -8065244 -4806210 -2713888 -3651633 -5291563 -5803984 -7423797 -10946894
3979 -10946894 -10800420 -2354918 8576532 11710136 6839251 3746829 7074263 10562030
3971 10562030 8867539 5844051 6256273 7246568 4291637 -507485 -2542934 -2272061 -2578758
3962 -2578758 -2823913 -1503184 -963156 -3417799 -5676490 -3816244 76726 1832525 2649886
3953 2649886 5989992 9633341 8106684 1927930 -2231559 -472641 4587601 8507100
3945 8507100 8598026 3719096 -4537497 -11058835 -11929737 -8953385 -5890509 -2930490 277108
3936 277108 -368886 -8296239 -18338771 -21767094 -18361797 -15674912 -16499153 -15409450 -8993685
3927 -8993685 -1537981 1894049 1110336 -2848261 -9905576 -16339337 -15086125 -5486595
3919 -5486595 2988416 2262695 -3439717 -4016444 2347189 7876683 7098502 3859519 4677001
3910 4677001 9119173 10336145 4473282 -3576673 -5823810 -1112230 3998822 4441829
3902 4441829 2428133 2169134 3690885 5852709 10809065 19312641 25044782 21284872
3894 21284872 11618063 6045008 6886023 7010711 2972386 766552 5021351 10375576
3886 10375576 8946642 952954 -7056011 -10352157 -8129895 -1444615 6440180 10565347
3878 10565347 8953491 4461040 -351878 -6456822 -13652093 -17231287 -13860876 -7236376
3870 -7236376 -3013426 -1001051 2355835 6027365 5139055 -603732 -4883127 -2711658
3862 -2711658 3522743 8014753 8895736 9051079 10577988 11212276 7773154 1884886 -833489
3853 -833489 1550155 3543499 -559820 -7925949 -10282774 -4977450 2215549 5693183
3845 5693183 5974225 5378673 3147019 -1601110 -5634866 -4193528 3617723 13889088
3837 13889088 20810879 20169633 13099495 6973221 8525518 14919226 16341266 9465967
3829 9465967 3038186 6365258 16791498 23522831 20951516 13164610 6760870 3869242
3821 3869242 2428907 325773 -1849498 -2010232 -914900 -3493485 -12238510 -20411827
3813 -20411827 -17927605 -5209130 5364119 4840896 -1863578 -5292038 -4795057 -5791273
3805 -5791273 -8345504 -6915159 -253742 5713255 5695737 629570 -5460368 -10247080 -13448482
3796 -13448482 -14807417 -13181324 -7827269 -1192607 1046518 -3580005 -8494200 -4668642
3788 -4668642 5635289 9044696 -1154509 -14614921 -17214148 -8330262 2517628 10390850
3780 10390850 16650342 19677844 14921633 4228827 -4054274 -5667490 -4013397 -2654003
3772 -2654003 -1604661 -1956766 -6383296 -12766180 -14394864 -9727345 -5953216 -9169204
3764 -9169204 -15985357 -18838257 -15704424 -10395583 -5859504 -1298331 4832700 11781677
3756 11781677 16924141 18514062 17603388 16224562 13553736 6642485 -3294784 -8872797
3748 -8872797 -4663160 5285056 12454353 14050905 13196186 11232216 6211467 -1644536
3740 -1644536 -9045745 -14262518 -17533383 -17612435 -13732759 -10251331 -12620715 -18754579 -21352963
3731 -21352963 -19113937 -17962848 -19940743 -19128198 -11474095 -1116371 6666493 11747015
3723 11747015 14393724 11347341 2088428 -6800837 -9405302 -8041641 -7649686 -7175257
3715 -7175257 -2761659 3986803 7664240 7266827 6795370 8200986 8469235 3865756 -5964772
3706 -5964772 -17619089 -25402715 -24689946 -16504537 -7605317 -3911178 -5137550 -7252470
3698 -7252470 -7717021 -6271013 -3103277 1253281 6000406 11479911 18000125 22393201
3690 22393201 19847818 11153865 3629891 1879797 2025381 -1327447 -6996997 -10757085
3682 -10757085 -12738429 -15451867 -17364572 -14744294 -8531167 -3700891 -2298852 -1825795
3674 -1825795 -4469 3238006 7989559 14172789 19246480 19976585 16609109 12178836
3666 12178836 8231017 4533651 2230986 3290451 6679600 8550130 6785101 2845168
3658 2845168 -1062608 -4480298 -8363087 -13681748 -19573438 -21999759 -16758538 -5796012
3650 -5796012 2692348 3647316 1312855 1807813 3155361 -899410 -9340108 -14070920 -12167169
3641 -12167169 -10340469 -14271365 -19584098 -18072783 -9393528 -1782066 -2076503 -8310917
3633 -8310917 -12507849 -9275628 -1206054 3995721 1555981 -5879798 -11997324 -13455988
3625 -13455988 -11683753 -9936508 -10622890 -14066726 -17562735 -16796824 -10533455 -2953675
3617 -2953675 614064 -969002 -5151770 -9158664 -10669269 -8024452 -3197992 -1761100
3609 -1761100 -5778201 -9494788 -6904562 -708351 2349471 2441725 4990053 9072195 6946653
3600 6946653 -2733255 -10046072 -6892753 1732488 5411408 2531529 415625 3716547
3592 3716547 9000155 10922777 8922024 5935342 3120604 -1403126 -8322500 -13803259
3584 -13803259 -13332659 -8846960 -7656105 -11755551 -13061449 -4741398 6687744 8726496
3576 8726496 697255 -5444974 -3355939 -1403077 -8910350 -21604601 -27727987 -23353482
3568 -23353482 -14621083 -7986037 -4689569 -3272246 -2220525 -513165 1336831 1881468
3560 1881468 1976266 4285251 7601041 6436422 -174276 -4750682 -1635524 3545925 1569275
3551 1569275 -6857911 -13087003 -13659704 -12687897 -11706872 -6483684 3813536 12188100 12567326
3542 12567326 7480565 3278821 2198716 2856942 4785751 8314681 12162912 14376560
3534 14376560 14063104 10190670 1170699 -11733001 -22804084 -26816491 -24460047 -20474870
3526 -20474870 -17658213 -15297299 -12664838 -11137793 -12213989 -14849784 -15404534 -10295403
3518 -10295403 384581 11501257 16558942 13859799 7992025 4324049 3381043 1878757
3510 1878757 -2187988 -7360357 -10607248 -9454176 -3040338 6542365 13990959 14315522
3502 14315522 7793673 238471 -2583381 -212896 3110888 3389240 585236 -1956793
3494 -1956793 -1158609 2567456 5632573 5119813 2049447 -40330 475369 1794195 1887473
3485 1887473 1238176 1018433 252183 -2837482 -7377045 -10257785 -9993737 -7812597 -4680969
3476 -4680969 100147 6410775 11919080 14550297 14224643 11034826 4594166 -2929685
3468 -2929685 -6585824 -4890473 -3437694 -7717012 -14376591 -15220674 -9198776 -4274762
3460 -4274762 -6358571 -12179162 -15454408 -14999232 -13491433 -12574108 -13110142 -16852583 -23582769
3451 -23582769 -29028700 -29663480 -27487139 -25974440 -23291417 -14593439 -621384 10708115
3443 10708115 12346098 4944966 -4607922 -9003313 -5216727 3485933 9925673 9950336
3435 9950336 7118205 8000681 13135440 16030870 11822598 3550864 -2019415 -2496219 -1370808
3426 -1370808 -2180032 -3229459 663230 10974685 21329130 23092623 15550300 7255238
3418 7255238 5414071 7752205 8583794 8898345 13642989 20646564 20553104 9753719 -3508451
3409 -3508451 -9559429 -8450381 -6547699 -6660648 -6923539 -6488109 -6596154 -7090914 -6551534
3400 -6551534 -5237016 -3763028 236971 9150940 18904312 20791987 11973379 80429
3392 80429 -5540210 -4076919 -1357349 -277770 1865353 6475492 8997923 4114172 -6671630
3383 -6671630 -15911125 -18308089 -15366204 -11666257 -9072850 -6257487 -2481906 374199
3375 374199 -205470 -4305014 -8753894 -9447405 -5199799 664010 3809554 4211217 6020493
3366 6020493 11210739 15783165 14465089 7327059 -868975 -6379723 -8671190 -8495785
3358 -8495785 -7571290 -9291120 -15359882 -21489314 -20741563 -12303473 -3285773 -515734 -3849988
3349 -3849988 -8625286 -10863694 -8464201 -1318737 7196608 12186193 13184104 14952386
3341 14952386 19958299 23712482 20739669 11827010 1971759 -5445544 -8733065 -6050230
3333 -6050230 1464885 7975941 10047704 12696269 21937242 33690807 37949828 33141461
3325 33141461 27765354 26716248 24660159 16100413 4103363 -5698693 -13060939 -19415382
3317 -19415382 -22006108 -18582561 -13630473 -12316762 -11005081 -2065722 12723373 22166780
3309 22166780 20770473 16285590 18240650 24637839 25363200 15628038 698421 -11448158
3301 -11448158 -17277608 -17351994 -13370309 -7851947 -4302789 -4825477 -7833535 -9796674 -9228380
3292 -9228380 -7565020 -5989377 -3206745 2306015 8994585 13183775 13276457 11211761 9459568
3283 9459568 8553499 8509228 10479062 14785454 18558193 18018577 12955556 6541628 605876
3274 605876 -6047853 -13504327 -17955042 -16002908 -10235074 -6948437 -8252040 -9789450
3266 -9789450 -7517184 -3608561 -3022909 -6361951 -9649396 -10429856 -10343387 -11083345 -11183514
3257 -11183514 -8454483 -3259802 2183401 5776061 5663347 1036530 -5448916 -8887843
3249 -8887843 -8082614 -7281259 -9050764 -9129377 -3216606 4299427 5225961 -165669 -3435911
3240 -3435911 -1107606 542425 -3462094 -8589291 -8472353 -4554172 -1991796 -561149
3232 -561149 3688411 10702549 16784879 20693149 23389797 23471508 19093428 13279338 10913171
3223 10913171 11054049 8818789 4642554 4178547 7850034 8431138 2335843 -3700585 -2198451
3214 -2198451 4077470 6423602 2171112 -3138691 -3799760 451174 5967012 8666322
3206 8666322 6494813 1126501 -3300858 -4797994 -5484605 -7548061 -9720735 -9992152 -9156856
3197 -9156856 -8715648 -7691096 -4925842 -2312534 -1884290 -1656512 1256402 4955073 5266515
3188 5266515 3230631 4430066 10101132 14457917 13195972 9939978 10516093 13929610
3180 13929610 13484262 5988281 -3842942 -8703647 -6090387 368529 5208730 5484630
3172 5484630 1941329 -2124256 -2786871 1844964 9117460 12852228 9173883 1439519
3164 1439519 -2787530 -174753 5089934 7122220 5071293 2758291 3687083 7847580
3156 7847580 11807043 11195628 5365869 73160 2099346 10183499 15648779 13881631
3148 13881631 9838681 8906465 8539089 4753622 1207549 3600137 8870377 9257996 4911958
3139 4911958 2418815 1632096 -4624346 -15835046 -20404497 -12223340 -918724 1427305
3131 1427305 -3876835 -7284165 -5758834 -3650393 -2996357 -2055434 -1798779 -5503056 -11529337
3122 -11529337 -13150917 -6958436 3036713 10456348 12188367 8948061 3800710 503787
3114 503787 510678 1311490 -510814 -5286240 -10774923 -14855556 -15814457 -12469771 -6613792
3105 -6613792 -2681170 -2042773 -672155 4062343 8036905 6753659 3660079 5644842
3097 5644842 12187967 15770403 12415011 5505489 -569913 -4239266 -4160075 565537 6586630
3088 6586630 8795285 7740781 8530964 11269058 9461597 238120 -10611693 -17012546
3080 -17012546 -19508257 -19869496 -15520800 -5263652 4679454 7318381 4430402 2921246
3072 2921246 4054959 3249603 -331857 -1139704 4322749 11810991 14652515 11437574 6176735
3063 6176735 3078469 3386399 6329926 11227245 17983912 25644299 31229189 31584072 27000148
3054 27000148 21645456 19459847 20688187 22912801 23590443 20668522 13269981 3935404
3046 3935404 -1771254 -540737 4870162 9169952 10431385 10110215 9002310 6905454
3038 6905454 5676101 8379013 14178719 17278382 12995684 3088616 -6625416 -12363739
3030 -12363739 -14164070 -12913746 -8611093 -2217113 3127997 4775086 3763320 3640555
3022 3640555 6360418 11028115 16311670 21331142 23603846 19724850 10601146 3002130
3014 3002130 2092090 4341076 2186386 -5425856 -11963651 -12381451 -8099783 -2515214 2823265
3005 2823265 5914933 3904029 -1815813 -4801748 -1649767 3050762 3788914 2310759
2997 2310759 3802777 7891238 9300528 6394337 3657240 5202181 9682054 12403565
2989 12403565 10044932 3228444 -3766087 -6610792 -5820121 -6204288 -9553122 -11021134
2981 -11021134 -6423525 37462 862177 -3677937 -5926057 -2278728 2098590 1578648
2973 1578648 -2594056 -6164383 -8433530 -10990238 -12796900 -10941850 -5661248 -1327343
2965 -1327343 -1626378 -5158173 -6689840 -2672025 5065508 11882750 16038271 19518054
2957 19518054 22690361 21851292 15027709 7067036 4311473 5977100 6024528 2757383 679484
2948 679484 2234885 3736718 1810426 -1173048 -1200152 1897261 6313957 11975735 18406161
2939 18406161 21615130 17758490 9162300 3053849 3935008 9171130 12108675 8375851
2931 8375851 -379000 -8102382 -10290807 -8365664 -6525998 -4761554 1281318 12327718
2923 12327718 21724164 22918483 17512683 12056277 9521010 8572273 9108667 12345960
2915 12345960 15441940 12434744 2907752 -5355439 -5949951 -2250061 -1800043 -5054541
2907 -5054541 -5439494 -125988 5322273 5238442 1964735 1796114 5975255 10460949 12959220
2898 12959220 14799023 15945420 13904776 9273665 6872955 8098087 7220250 331224
2890 331224 -6104352 -2518633 9692020 18718173 17458440 11237528 8268599 8703605
2882 8703605 7336391 2702564 -1805847 -3966531 -5182182 -7034260 -8646414 -8232447
2874 -8232447 -5701787 -3153796 -3005718 -5230609 -6613199 -3898137 2483930 9289126
2866 9289126 14434875 17654723 17693563 12589227 3674747 -4198577 -7980624 -8854337 -7914161
2857 -7914161 -3181307 6426106 17248496 24083047 25033406 20903783 12819094 3592966
2849 3592966 -1538499 210417 5296711 8543830 9805249 11774961 12989358 8544733
2841 8544733 -1964025 -11944494 -14609681 -9256416 -258286 7028885 8868028 5198776
2833 5198776 559048 344327 4783925 8696159 8133829 4985415 3763917 5856412 8433424
2824 8433424 7713883 2257398 -5784150 -11942233 -13194242 -11063987 -9776091 -11088542
2816 -11088542 -12667536 -12011730 -9756727 -7760731 -5833866 -2465595 2110322 5621423
2808 5621423 6458426 5257711 3735911 3107730 3727922 4961040 4820325 1058009 -5901315
2799 -5901315 -11663217 -11408766 -5223906 1681238 4806725 4630216 3839625 2662962 -260910
2790 -260910 -3960780 -5771097 -5347368 -4242025 -1659556 4784435 13195420 17296538 14586295
2781 14586295 10187318 9363292 10130308 7223023 106476 -7371812 -12730130 -15691849
2773 -15691849 -15356511 -11227404 -5611391 -736163 4725685 11664947 15416155 10939088
2765 10939088 2080656 -1340824 3656854 9888764 10862197 8317044 6285880 4092333
2757 4092333 -168287 -3861173 -2822881 2275847 6797247 7837395 6081980 3847348
2749 3847348 4028620 8898761 16996894 23204587 24953106 26173708 31292304 37173194
2741 37173194 36149607 27191774 19082084 20112325 27686448 31227404 24219395 10486012
2733 10486012 -1608237 -8290716 -11511315 -12622600 -9194929 59580 10388896 14895895
2725 14895895 12499400 8616841 8161194 11240715 15825394 20575288 23631628 22322992
2717 22322992 16670412 11036408 10217346 15284867 23970215 32522655 36204213 31595886
2709 31595886 20964213 11483556 7299121 4849970 -1016259 -9016271 -13495142 -12589830
2701 -12589830 -9695018 -7427867 -4848713 -1471910 175869 -1640749 -3933135 -1571254
2693 -1571254 6592941 15751575 19687313 16849135 11405371 8117857 7131805 5199564
2685 5199564 1265785 -1954016 -2491548 -2083623 -2718023 -2866134 37872 5052025 8594056
2676 8594056 8926191 7257604 5255702 3957909 4278247 5781965 5467164 775199 -6042744
2667 -6042744 -9299193 -6202433 374694 5971817 9188407 11305802 13097233 13549378
2659 13549378 11220838 6002653 -509362 -6352997 -10775254 -13856768 -14825187 -12499702
2651 -12499702 -7943804 -4370572 -2896813 -723063 4138831 8576718 8123444 3392017
2643 3392017 -1137026 -3880997 -7269928 -11890475 -14094919 -11121012 -5028303 471478
2635 471478 4143948 6116276 5559822 2433581 -367231 321399 4012183 7716247 9974959
2626 9974959 11021942 9735878 4085088 -4564919 -10898936 -11757348 -10823881 -14259751 -22313343
2617 -22313343 -28388935 -27086367 -20358230 -14156896 -11545346 -11633461 -13079039 -14783443
2609 -14783443 -14190311 -9495998 -3924255 -3238269 -7716439 -11247789 -10512483 -9945546 -13853333
2600 -13853333 -18606774 -18483411 -15538615 -16169272 -19363176 -16639580 -5144581 6379206
2592 6379206 8272729 1731344 -3949576 -2768242 2679299 5268886 353698 -9562958
2584 -9562958 -15733512 -11104717 1197233 9932648 7816067 -1349515 -9133251 -12296207
2576 -12296207 -13260539 -14200903 -14857017 -14487023 -12386655 -7786259 -2339907 -900762 -5882677
2567 -5882677 -12102508 -11767469 -4496625 2024339 2218319 -657135 99510 5658479 10760058
2558 10760058 10181870 3734826 -4642754 -11077052 -14882810 -18060066 -21675785 -23219527
2550 -23219527 -18947359 -9214798 134117 3170127 186724 -2641041 31982 7271766
2542 7271766 13429584 14236879 10290486 4791975 -413995 -5329474 -9413697 -10775685
2534 -10775685 -8090177 -2034691 5445597 12195644 16266345 16957651 15808843 14980654
2526 14980654 14430828 12666987 10571673 11633241 16985160 22858131 25038121 23687274
2518 23687274 21513643 19278441 15784497 10540740 3707288 -4752975 -12821889 -15471949
2510 -15471949 -10116414 -1589665 2911565 2949261 3860535 7283236 9017111 7349522 6618583
2501 6618583 9244777 10446294 6023191 668153 2184679 10150319 16699873 17200559
2493 17200559 13785872 8582130 336104 -10061491 -16393469 -13524913 -4146047 4218820
2485 4218820 7279000 6585914 5642607 6119339 7498981 8517830 8665685 8593885 8356965
2476 8356965 5547457 -2347117 -12614583 -17153791 -10595398 2663204 12508902 13777823
2468 13777823 10133685 7521230 7237451 6946445 5709608 5074863 6010487 7350622 7765864
2459 7765864 7731259 8716706 11037403 13019022 12229754 7909219 2788015 1766967 6968882
2450 6968882 13948590 15228290 9095661 2613485 3074242 8191720 9091280 2762561 -3821842
2441 -3821842 -3888606 247353 2577547 2977331 4967428 6690102 2158975 -8199783 -15786556
2432 -15786556 -14829822 -8750318 -2839612 2707686 8119343 8908974 2192166 -6070843
2424 -6070843 -7456701 -2432946 1384376 623037 -1073004 -691235 932406 3733563 9255923
2415 9255923 15719484 18693618 18166836 18654193 20626616 18732271 11335770 4946384 5045250
2406 5045250 8587319 10249919 10320292 10848653 9321517 2981632 -4351257 -6712250 -4683645
2397 -4683645 -3339661 -3977039 -4425817 -5311017 -8700913 -11912977 -10390514 -6401085 -6974426
2388 -6974426 -12468304 -15193182 -11384870 -6609270 -5727573 -4898467 1038284 8969761 11769343
2379 11769343 8588859 4565149 2207401 -879630 -6052623 -10692799 -12228300 -11296828
2371 -11296828 -9514219 -6920338 -3402228 -754474 -980833 -2705425 -1179548 6680267
2363 6680267 17653042 24453213 23465348 18569964 15741732 15824707 15625059 14637216 15939394
2354 15939394 19689268 20405202 13571990 2052194 -7189407 -10948782 -11387437 -11089569
2346 -11089569 -10079714 -8072154 -6659551 -7466765 -9539273 -10625833 -10896747 -13261233
2338 -13261233 -18764743 -23396660 -22120228 -15582680 -9619001 -7561483 -6612985 -3359511
2330 -3359511 1082245 4280053 7003217 10277366 11060597 6248259 -848367 -3702961
2322 -3702961 -1530704 267077 -1741972 -5625605 -8671417 -10046922 -8806816 -4686813
2314 -4686813 -1196078 -2426188 -6524196 -8188534 -7603552 -9609129 -13154928 -10254918
2306 -10254918 1325430 12471681 14711659 11108690 9880486 12955879 16439165 17503825
2298 17503825 15395161 9955755 4116950 3409202 8200273 11114052 6905285 -362148
2290 -362148 -4909922 -7599906 -10387367 -9408719 -2264890 3702184 669992 -6344697 -6350775
2281 -6350775 222090 2543963 -3210442 -9178741 -9519397 -7780596 -8044696 -8761837 -9126510
2272 -9126510 -12584110 -19041514 -20931035 -12701576 755857 9991075 11767136 10391033
2264 10391033 11199684 15329238 18818373 16055123 6636686 -1837899 -1567034 6053087
2256 6053087 13464834 17284978 19029227 17614935 10335806 1349235 -907611 2972814
2248 2972814 2385243 -7383565 -17722023 -20012590 -17345026 -16717064 -17729006 -16518808
2240 -16518808 -14283570 -13967566 -13594831 -10258420 -6112748 -3387998 1648944 11943305
2232 11943305 21308771 21611797 15261357 11725992 13659676 15396070 14110059 13100335
2224 13100335 13239718 10094849 2338325 -4155213 -4371900 -1173261 -619289 -4000489 -7859394
2215 -7859394 -9378428 -8771191 -7703526 -7547846 -8673086 -10212379 -10597722 -8696099 -4670372
2206 -4670372 -237792 2354786 3004084 4728557 9344412 12804862 9285042 486191
2198 486191 -4784415 -2713003 -138104 -3789118 -9542054 -8764445 -1217316 5788873 8712998
2189 8712998 10534102 12808854 12354170 7158365 42445 -5196611 -7337104 -6648178 -3817104
2180 -3817104 -327314 3140549 8064155 14455875 17377027 11931305 1144899 -6262780
2172 -6262780 -6212591 -2739331 -999673 -1708213 -3203656 -4297000 -3894113 -1918533 -1494645
2163 -1494645 -5997764 -13021718 -15755077 -11804073 -6405988 -5072789 -6994241 -7945843
2155 -7945843 -6344172 -3915823 -2723645 -3479403 -5034803 -4578830 -409358 4976797 7064371
2146 7064371 5043548 2536076 2051823 1903442 -167241 -3190716 -4564799 -3616917 -2121385
2137 -2121385 -2027078 -2891230 -1173006 6371949 17193852 23373624 20406522 13053110 8737390
2128 8737390 7985854 6610164 4722184 6324127 10513641 10630767 3548688 -6424293 -14374622
2119 -14374622 -19595814 -22110031 -20594260 -16136895 -12622570 -11108973 -8825088 -5253345
2111 -5253345 -3338681 -3026681 -498981 3560502 2423165 -5930395 -13796983 -14735056 -12699627
2102 -12699627 -13748314 -14904609 -9486400 751091 7595492 8479398 8456806 10555547
2094 10555547 11527015 8363244 3312892 347352 158715 357588 -1099735 -3268924 -2551016
2085 -2551016 3002176 9302713 9217074 1465989 -6973075 -9417882 -6443110 -1840949 3306858
2076 3306858 8420311 10236026 7455412 4789678 6463428 8949182 6389438 254433
2068 254433 -3345391 -3698742 -5371033 -9367499 -12124139 -12989362 -14910283 -16945418 -14003926
2059 -14003926 -6366412 -2246577 -6978263 -15181919 -18143860 -15048191 -12246048 -13639206
2051 -13639206 -16245437 -15155536 -9954105 -5110082 -4743349 -7970994 -10226153 -8679963
2043 -8679963 -4371158 1072476 7473101 13417934 15270983 11593942 5268856 -1467904
2035 -1467904 -9817557 -18489880 -20290641 -11138277 1350674 5966033 2400581 -13468
2027 -13468 3503941 8479739 10242967 9294770 6851873 3052394 1216440 6231387 16186374
2018 16186374 22344279 20097780 14017553 9912893 8063919 6598629 5369032 3865481
2010 3865481 916768 -1631511 -939550 -48962 -5246802 -14843545 -19351745 -15817536 -12346279
2001 -12346279 -13863591 -13867600 -7491730 -2665572 -8198738 -18667921 -22742786 -21014791
1993 -21014791 -23269191 -31128550 -35658111 -31548628 -22535612 -12123935 471647 12794865
1985 12794865 16910576 8883562 -5546673 -17517311 -22212640 -18474312 -7894559 3279326
1977 3279326 7521057 4913785 4243759 12159361 24953137 33675615 33847956 27542991
1969 27542991 19073561 11538010 5746050 565657 -4654904 -8057931 -7913278 -6672434
1961 -6672434 -8686154 -13633270 -16171836 -13074217 -7158229 -3149993 -2954495 -5712606
1953 -5712606 -9038267 -9640119 -6509745 -3901514 -6715176 -12321378 -12266438 -3649451 6680544
1944 6680544 11556945 11411982 9595236 5929531 159797 -3262374 -664061 3571269
1936 3571269 2260731 -3304757 -4232009 3411670 13153124 17200701 15942081 15239993 17665219
1927 17665219 20265041 19835161 17034823 14619430 13505786 12015101 8578473 3793865
1919 3793865 -779733 -4693169 -8069703 -9720682 -7811153 -2520135 3733199 8943578
1911 8943578 12703858 14747015 14496436 12369029 9268666 4612243 -2291099 -8511276
1903 -8511276 -8873708 -2649430 4574437 7791925 7991197 8182459 7681223 4265310 -527500
1894 -527500 -2658985 -993627 2136730 4747761 6290133 5927414 3025016 -1252521 -5435832
1885 -5435832 -9628947 -13342512 -13615467 -8989586 -3318362 -1034574 -251430 4002727 10583530
1876 10583530 12496187 6838628 -1695680 -8757557 -15651187 -23911823 -30182468 -30732615
1868 -30732615 -27196567 -23596606 -20448800 -15674182 -9143961 -2688195 2841748 7550922
1860 7550922 11043700 13381026 15628799 17279012 15615587 10173949 4850128 2253525
1852 2253525 -882220 -8144327 -15930720 -17218346 -11810670 -7037271 -7820716 -11146242
1844 -11146242 -11611290 -8076157 -3047945 1030604 2914270 2405592 519208 -1729468
1836 -1729468 -4605514 -7557890 -6963284 99370 10216752 16513370 17511126 17791172 18651579
1827 18651579 14432288 1603971 -13888768 -23179012 -24603612 -22696902 -20563978 -18452520
1819 -18452520 -17201667 -17438226 -16760262 -12688919 -7138216 -3402806 -733982 2605824
1811 2605824 3142528 -3518870 -12824025 -14031149 -4505843 6387519 10295364 9175776
1803 9175776 7885635 5585689 922452 -1096569 3869695 9764265 6775740 -3988802
1795 -3988802 -11429665 -9882345 -4802967 -1743681 1264810 6389616 8997790 4441958
1787 4441958 -3072315 -5086828 238288 7571821 12764471 15952645 17295726 15699473
1779 15699473 12723328 12817884 17730873 23993093 27433616 27290932 24762385 20825280 17240312
1770 17240312 16524107 18484683 19329022 16750611 13524653 13118218 13957369 11866680 6930649
1761 6930649 3770876 5093287 8672664 11158673 11443089 9545540 5597255 1193499
1753 1193499 -1416785 -3055868 -7440893 -15265182 -21408872 -20758565 -14543722 -8133939
1745 -8133939 -4521079 -2845823 -1505065 561722 4268470 8734740 10413466 7234039
1737 7234039 2481144 886865 1942648 1282509 -2205598 -5744196 -8934835 -14616343
1729 -14616343 -21943590 -24572662 -19038867 -10195078 -4345128 -795473 5207048 13790384
1721 13790384 19511492 18111772 10740175 2253972 -2195725 -411008 4429587 6255443
1713 6255443 3309147 386470 1179962 1957824 -2514216 -9773000 -12514567 -9175378 -5157607
1704 -5157607 -3729093 -2392167 584043 2582920 2187432 2680404 6525702 10846804 12097060
1695 12097060 11395672 11196759 9922051 4654141 -2667653 -6359778 -3944090 1355106
1687 1355106 4849515 4445918 749995 -4326428 -8740500 -11667410 -13763507 -15372246
1679 -15372246 -15467673 -13528249 -11171332 -10245313 -10230637 -9204336 -6747167 -4546994 -4671254
1670 -4671254 -7951099 -12852970 -15290920 -11563012 -2740137 5999466 11784271 16848782
1662 16848782 22585971 24486747 17865121 6672525 677857 3408880 8079700 7217998
1654 7217998 1861475 -1648153 -559102 2400937 4235174 4844261 4976166 4068651 1295699
1645 1295699 -2848767 -7070785 -10372586 -11705257 -9557543 -3567562 3658647 8283369
1637 8283369 9492756 10044020 11479406 11080797 6469034 1237015 1443886 6710954 9799862
1628 9799862 6415653 642008 -1830068 -1265515 -1113767 -1897945 -2551343 -4377841 -8071715
1619 -8071715 -9260816 -3298078 6677705 12717400 12707393 11737957 12668404 12354622 9162314
1610 9162314 7485450 11058259 16832610 19500189 18196821 15064073 10894525 6303274
1602 6303274 4130711 6257221 10037820 11738601 11699617 12425245 13351106 11624316 7192170
1593 7192170 3365744 2531757 4094278 6192016 7062509 5595489 2922762 2225576 4359779
1584 4359779 5257953 997699 -5916389 -9295422 -7532312 -4781652 -3906212 -3072006 -897677
1575 -897677 -607249 -5745222 -14027346 -18818874 -16386031 -9607784 -4406528 -3927758 -6762894
1566 -6762894 -9956531 -12264713 -13734593 -13357118 -9496791 -2947448 2770717 5292112
1558 5292112 5631577 5370121 3942033 583158 -3157355 -5146443 -5204107 -3860660 -615262
1549 -615262 4208261 8015030 8956262 8141156 6293097 1525941 -5720213 -9274244 -4650450
1540 -4650450 2661322 3212422 -3231787 -7731406 -5333408 -720290 526317 -1066181
1532 -1066181 -3112263 -5847641 -8808248 -8777965 -5010358 -1848652 -2571024 -4839726 -5219897
1523 -5219897 -3561240 4275 6946401 15427299 19029897 14976860 8490171 4313946
1515 4313946 -329302 -8577911 -15827314 -16467211 -13777512 -14398644 -16737692 -14378543 -8386142
1506 -8386142 -5869593 -7300255 -5987299 -983110 227487 -5103753 -8786762 -3282835
1498 -3282835 8189681 17807530 22641008 23322023 19768097 13895989 11261921 14047586
1490 14047586 16584074 13572479 9093638 11337218 20803047 29565978 31001188 25422415
1482 25422415 17150354 10485492 8153614 10093496 13770455 17572548 22387728 28037616
1474 28037616 31205841 30167841 28592995 30272915 32329878 28704738 19314308 10859462
1466 10859462 8690591 12043564 17285962 21760091 23806200 22464580 18213460 11974223
1458 11974223 3668985 -5896244 -12773600 -13067615 -8228391 -3738645 -2381821 -2092127
1450 -2092127 -613787 1502260 3607636 7139427 12959791 18585600 20101389 16180370
1442 16180370 9442453 4238741 2820001 3125774 1540616 -1300231 -1807 7861157
1434 7861157 16422501 18361718 15076492 14238263 17726328 18680966 12192486 2590269 -3267970
1425 -3267970 -4635634 -4429962 -2718259 1516049 4920135 2787093 -2792371 -3869879
1417 -3869879 2786709 11054983 14065265 13388642 15511197 21535799 25697176 24423971
1409 24423971 21815475 23238072 27004844 26850812 21086477 14276407 9719743 5475240
1401 5475240 -350743 -5222147 -6256623 -4660895 -2274223 2555964 10749691 17255676
1393 17255676 16085254 8963399 2900212 90447 -3260616 -8056841 -9300313 -3822891
1385 -3822891 4855328 11719981 15271472 15341942 11355288 5659465 3698211 7517117 13037373
1376 13037373 16321364 18054602 19259589 17991999 14071762 11846106 13596410 14941616
1368 14941616 11822950 7429442 6530425 7417419 6008138 3840813 4437429 5133548 1177749
1359 1177749 -4233533 -3569514 1826304 2027765 -6276947 -14199259 -13855335 -9118125 -8217687
1350 -8217687 -11874637 -14357061 -12061268 -6091221 476494 3833097 1101682 -5407479
1342 -5407479 -8698615 -5625806 -1655117 -2784488 -5994653 -3542093 4865131 10411186
1334 10411186 6418339 -3444875 -9861715 -7829427 -583946 4366191 2074790 -5668074
1326 -5668074 -12480049 -14330937 -13527109 -14508333 -17322570 -18181365 -15655552 -12463519 -10422598
1317 -10422598 -7432983 -1692587 3958659 5046114 1243494 -4091397 -9214426 -14839843
1309 -14839843 -19333311 -17832194 -9327333 -1233995 -1859590 -9279395 -13015274 -7686896
1301 -7686896 243393 2104639 -1265104 -2199952 2245781 7193174 7777494 4670226 780719
1292 780719 -2902818 -6001963 -6808753 -4597802 -1956151 -2120479 -4706517 -6012899 -3524215
1283 -3524215 976937 3201482 1356509 -985189 1470876 8529297 13247004 10131224
1275 10131224 2471197 -1965472 -992975 646304 -692406 -3257076 -4153314 -2868739
1267 -2868739 760022 7045298 12789059 12184559 4661676 -2517821 -3392542 -1295607 -3316231
1258 -3316231 -9832237 -14568696 -13286038 -7608905 -1101246 4109085 7003206 7714060
1250 7714060 8268195 10778056 14987185 19416945 23862046 28540883 32030490 32442416 29491814
1241 29491814 23487713 14342152 3964130 -3087379 -4760440 -4843980 -7423926 -10821352
1233 -10821352 -11615585 -11561957 -14172590 -16580870 -12480311 -2862294 3922833 3950261 2250823
1224 2250823 3664968 6406723 7623496 8370935 9226098 7595537 4037528 4752783 11826314
1215 11826314 16886674 11867479 1489921 -3328819 -1365072 -1181920 -6488453 -10882975
1207 -10882975 -8562998 -1928493 4328874 9585973 13978937 14840098 11236559 7657362
1199 7657362 8306567 10824709 10124651 5853639 1547148 -1541808 -4919073 -8189971 -8579585
1190 -8579585 -5161298 144915 5845584 11661697 16003967 16473033 13641927 10740152
1182 10740152 8359412 3115696 -6266564 -14716663 -15893328 -9903745 -3054742 -610685
1174 -610685 -2064868 -3095143 -91988 7227258 15989513 22381791 24153554 21003010
1166 21003010 13345204 2862371 -5590338 -6187671 1225209 9096760 9780280 3419360
1158 3419360 -4554429 -11074055 -15848237 -16098602 -7841320 6151731 15543844 12938140
1150 12938140 1712935 -9177324 -14857111 -16272691 -15610616 -13738342 -10645785 -5747076
1142 -5747076 1014705 6980250 8268020 5277002 3448933 5870104 8501821 6294078
1134 6294078 767846 -2913015 -3601371 -3712139 -3295314 -534438 2816285 2673357 -387577
1125 -387577 -1071860 2634384 6529091 6768607 4758037 3720113 4592991 7214823 11563885
1116 11563885 15598561 15425490 10015733 2986943 -1930452 -4184487 -4063219 -1243678
1108 -1243678 2210508 1696049 -3814593 -8863691 -8086248 -2901978 1492317 2894416 2356684
1099 2356684 473204 -2404681 -4138095 -3075748 -1091402 -753516 -879158 1269002 4635199
1090 4635199 5572479 3958328 3841805 7591480 13097384 17502820 20346033 21922413 21588724
1081 21588724 19402005 17290334 16740277 16437409 13667796 7781523 1614925 -645291
1073 -645291 2561828 8003144 10287696 7358651 2415521 -314735 -169162 901123 2085547
1064 2085547 4097830 6625569 7957019 7461184 6827751 8253518 11817499 14637879 13091884
1055 13091884 7201013 2345231 4026781 10752647 15493744 14974005 13133841 13473204
1047 13473204 13274511 9531964 5756984 6866363 10633756 10968447 7640865 5727141
1039 5727141 6543617 6584146 5362845 6470490 9519220 8785431 2638499 -2721035 -2590677
1030 -2590677 -388733 -495364 -422603 4153880 11123884 15020822 15408480 16095537 17770645
1021 17770645 17176211 12989988 7686258 3602996 897351 -932612 -2756745 -6255975
1013 -6255975 -11308216 -13864541 -10073902 -1871658 5105277 8445810 9960883 10458943
1005 10458943 8196982 3047948 -2079933 -5102981 -6367724 -5519038 -971860 5695391
997 5695391 8923348 5766468 469694 -530137 3998865 10356734 15153406 16826089 13943325
988 13943325 6607684 -704879 -2102601 2707972 7562940 7264203 2896247 -1694061
980 -1694061 -5211922 -7794581 -7556472 -2730204 3940973 7637712 8335449 10511514 14975543
971 14975543 16199090 10703875 3445767 1212774 3055102 3011635 320973 79093 3482945
962 3482945 4278459 -2187325 -11331301 -14572309 -9334250 -649851 5120344 5449872 2209592
953 2209592 -461324 234230 3017529 4678688 5045331 6785151 9636800 9282734 4373480
944 4373480 327319 2341588 8151406 12079639 13189139 14368598 15818771 15269504 13293653
935 13293653 12416653 11431373 6715756 -326325 -3280515 148292 4526000 4559153 1508668
926 1508668 -1304902 -4577886 -10028722 -14525984 -12528937 -3695449 6004883 11084724
918 11084724 11565644 10602858 9473420 6705460 1681015 -2699732 -2665941 1131891 3319163
909 3319163 454676 -4119938 -4983816 -2516288 -1908053 -4796504 -6704409 -3879575 1725055
900 1725055 6207841 8526000 9183829 7780152 4864760 3142286 3434450 1954369 -4704522
891 -4704522 -13583612 -17921693 -14645547 -6395968 2501871 8728226 9759524 5029617
883 5029617 -2210876 -7075397 -7825268 -6691468 -5922415 -5000477 -2095156 3209462 8983976
874 8983976 12182374 11416856 8949864 8330137 9231177 7187615 355865 -6418091 -7680204
865 -7680204 -5196821 -5271685 -9457260 -12876479 -11921922 -8825772 -7179441 -6913118 -5939512
856 -5939512 -4066621 -3129877 -4792122 -9328466 -15048880 -18537867 -17614024 -14427959 -13086598
847 -13086598 -13787434 -12532795 -7804475 -3946317 -5376104 -9995602 -11371173 -6210931
839 -6210931 2711155 10203755 13238472 12478874 10866282 10628608 11278168 11167888 10512303
830 10512303 10812187 11527773 10535894 8544516 9159617 12716443 14177276 10440826 5974589
821 5974589 6457147 9485429 7377186 -1658361 -10851109 -13850549 -11189908 -6445708 -954923
812 -954923 4827903 8516020 8087906 5239909 3505013 3930829 4604794 3478047 -60959
803 -60959 -5416299 -10880847 -14212097 -14402894 -12118897 -7622903 -12143 9877516 17602654
794 17602654 18777402 13982587 7918563 4398627 4381129 7798121 13613774 17763267 15176265
785 15176265 6261470 -1431577 -1289419 3970722 5326858 -1320583 -10181552 -12866744
777 -12866744 -8059733 -1927359 -353621 -3102209 -5454665 -3637761 1991948 7832739
769 7832739 10095368 7570177 2358242 -1948241 -3112747 -1481926 1334779 4379279
761 4379279 7465221 9706397 9023636 4253310 -2193248 -5250942 -2383210 2648695 3438118
752 3438118 -1072228 -4792949 -2577735 2255547 1991180 -4969630 -11969276 -13036648 -9715618
743 -9715618 -6991203 -6146533 -4888293 -2014169 1623910 5247382 7936898 7636555 3793705
734 3793705 -147639 -573938 951123 378353 -1416269 933250 8665615 15769238 16393972
725 16393972 11072977 3556365 -3911873 -9197861 -8747259 -1877482 6463302 11393798
717 11393798 13884158 16922029 19212286 17931416 15014911 14404252 14697168 11407892 5886680
708 5886680 4488510 8097706 10200844 7612686 5324958 6691815 6331556 -818073 -9207638
699 -9207638 -9414153 -1880815 4188975 4348964 3366241 5540858 7877648 5636333 -557169
690 -557169 -6335164 -8782179 -7357568 -2703247 2600556 4344772 805293 -4359556 -5541694
681 -5541694 -1206457 4837705 7888958 7054775 5260223 4700518 3066235 -3720335 -14323973
672 -14323973 -20581986 -16342606 -5698039 1614073 1793763 -593701 -852736 1095230
664 1095230 4796594 11507847 19549395 23094168 19561739 13805322 11152938 10863507 10790765
655 10790765 13222833 19500710 23059838 16424272 3663383 -2646288 2539363 11412247
647 11412247 15578738 16086622 17901011 20991283 22050739 20893934 19897649 19100437 15984612
638 15984612 9371228 1234390 -4376860 -3387110 4740539 14192691 16823054 11060754
630 11060754 3675764 499254 -822126 -5537010 -12987061 -17869771 -18129359 -16714407
622 -16714407 -16318725 -16585184 -16434401 -15984270 -16192250 -18480052 -23272927 -26900584 -22875104
613 -22875104 -9995767 3475434 8532921 6280109 4771861 7001327 8757371 7650176
605 7650176 6515976 6656391 5234915 1976468 1287792 4038596 4288282 -527011 -2673990
596 -2673990 5172813 16772631 18541379 7400887 -5606769 -9818860 -5884889 -645751
588 -645751 2280070 3194277 2145546 -1377500 -6075528 -9190358 -8993550 -5857073 -1627011
579 -1627011 1612591 3303830 5021760 7740207 8817579 4572175 -3326744 -7161083
571 -7161083 -1302656 10590541 18980332 18369045 11751481 5528949 2381739 294329
563 294329 -2780635 -5565407 -5706109 -4131976 -4813346 -9361614 -13870347 -13311110 -8146508
554 -8146508 -3881483 -3850618 -5151955 -3161950 1816105 4601235 1420988 -5530009 -10313453
545 -10313453 -9372154 -4880417 -1889280 -2518225 -3874711 -2159229 2230425 5046305 3305235
536 3305235 -1312521 -4349895 -2971848 1462271 4385820 1934472 -4936777 -10431033
528 -10431033 -9268516 -2036182 5854600 10066251 10626518 9758959 8657759 6913554 3432411
519 3432411 -2563830 -9928507 -14757561 -13145544 -5595686 2806596 7257840 7062376 4781676
510 4781676 3734791 6391862 12253327 16366758 13139196 3528869 -4443769 -4896376 -1242275
501 -1242275 -953655 -5216505 -7881015 -4108879 3836747 10010398 11015094 7973740 4675383
492 4675383 4760467 8858289 13420543 13707064 8827500 2909109 751598 3204192 7160775
483 7160775 9136469 8364845 7076209 8150336 12131615 16455735 17822325 15063174 9597938
474 9597938 4024468 809477 1080642 3428808 4790351 3784909 2234786 2013078 1712604
465 1712604 -1293493 -6186978 -8677141 -5856194 803363 7433037 11056409 10939908 8592470
456 8592470 6838856 7469895 9471428 10413867 9137810 6138995 2602230 705241 3039235
447 3039235 8841863 12404383 9182054 2612413 228149 3190895 5201289 2893335
439 2893335 1141236 4761863 10348822 11345020 7473877 3498548 921232 -3085170 -9118875
430 -9118875 -13613852 -14385153 -13539662 -13197557 -11958214 -7968082 -3175635 -2010715 -6482684
421 -6482684 -13946648 -19483845 -20028389 -16571447 -12642562 -10732789 -10742883 -11785364 -13740107
412 -13740107 -16044070 -16764253 -14683274 -11057691 -7680395 -4723101 -2295085 -2002157 -4132752
403 -4132752 -5296826 -2650349 937655 394592 -3531719 -4725844 -547978 4856083 7359337
394 7359337 7808765 7791845 5442301 -637056 -7011734 -9440705 -8732308 -8241344 -7686206
385 -7686206 -4495057 -232879 -53816 -4724936 -7856408 -3488707 6488812 14905831 17281933
376 17281933 14748703 10321297 5392849 628052 -1990013 -451426 3946591 6729184
368 6729184 5208887 1997554 1428796 3433662 4184787 2906130 3976442 10285664 18003281
359 18003281 21095369 18479851 13232550 7066948 177787 -4753705 -3805009 2242715
351 2242715 7627914 8663544 7533720 7796724 9712239 11806130 13656474 14751764 13469566
$$ [...]
##END NTUPLES=NMR SPECTRUM
##END=
