##TITLE=31Pdec_DE-63_P4-NaOH
 , 64 sc
 24.12.2024
##JCAMPDX= 6.0         $$ Bruker NMR JCAMP-DX V2.0
##DATA TYPE= NMR SPECTRUM
##DATA CLASS= NTUPLES
##ORIGIN= UXNMR, Bruker Analytische Messtechnik GmbH
##OWNER= root
$$ XWIN-NMR		Version 3.5
$$ Tue Dec 24 14:44:56 2024 Russian Standard Time (UT+4h)  she@DPX200
##.OBSERVE FREQUENCY= 81.013821
##.OBSERVE NUCLEUS= ^31P
##.ACQUISITION MODE= SIMULTANEOUS
##.ACQUISITION SCHEME= undefined
##.AVERAGES= 64
##.DIGITISER RES= 17
##SPECTROMETER/DATA SYSTEM= spect
##.PULSE SEQUENCE= zgpg30
##.SOLVENT NAME= CDCl3
##.SHIFT REFERENCE= (INTERNAL, CDCl3, 0, 198.062)
##AUDIT TRAIL= $$ (NUMBER, WHEN, WHO, WHERE, WHAT)
$$ ##TITLE= Audit trail, XWIN-NMR		Version 3.5
$$ ##JCAMPDX= 5.01
$$ ##ORIGIN= Bruker BioSpin GmbH
$$ ##OWNER= she
$$ F:/spectra/data/she/nmr/P31/2/pdata/1/auditp.txt
$$ ##AUDIT TRAIL=  $$ (NUMBER, WHEN, WHO, WHERE, WHAT)
(   1,<2024-12-24 14:43:36.60 +0400>,<she>,<DPX200>,
      <created by zg, POWCHK disabled, PULCHK disabled
       configuration hash MD5:
       00 E9 B6 7A A2 85 ED C7 34 08 36 98 17 FE 4E 26
       data hash MD5: 32K
       EA 58 03 80 9A 78 03 84 5F CD 1F 45 C4 79 05 51>)
(   2,<2024-12-24 14:43:53.25 +0400>,<she>,<DPX200>,
      <Start of raw data processing
       efp BC_mod = 2 LB = 1.5 FT_mod = 6 PKNL = 1 PHC0 = 2071.323 PHC1 = 137.486 SI = 64K 
       data hash MD5: 64K
       5F C1 91 C8 E9 C5 89 E1 C9 2B F2 0A AE 34 3B D9>)
(   3,<2024-12-24 14:44:15.09 +0400>,<she>,<DPX200>,
      <pk PHC0 = 196.6102 PHC1 = -457.6001 
       data hash MD5: 64K
       A4 C1 AC A0 7A C1 5B 66 68 68 DA 7F 5C 5A AE 39>)
(   4,<2024-12-24 14:44:18.76 +0400>,<she>,<DPX200>,
      <abs ABSG = 5 
       data hash MD5: 64K
       6F 70 29 97 BE 1B BC 25 A1 22 CB D5 19 C2 8D F6>)
$$ ##END=
$$ 
$$ hash MD5
$$ 95 80 D5 D0 E9 94 DE 9F 31 C7 E7 EB E6 69 5B 99
##$RELAX= 
##$RELAX= 
##$RELAX= 
##$RELAX= 
##$RELAX= 
##$RELAX= 
##$RELAX= 
##$RELAX= 
$$ Bruker specific parameters
$$ --------------------------
##$DU= <F:/spectra>
##$EXPNO= 2
##$NAME= <P31>
##$PROCNO= 1
##$TYPE= <nmr>
##$USER= <she>
##$AMP= (0..31)
100 100 100 100 100 100 100 100 100 100 100 100 100 100 100 100 100 100 
100 100 100 100 100 100 100 100 100 100 100 100 100 100 
##$AQSEQ= 0
##$AQ_mod= 1
##$AUNM= <au_zg>
##$AUTOPOS= <>
##$BF1= 81.014009
##$BF2= 200.13
##$BF3= 200.13
##$BF4= 200.13
##$BF5= 200.13
##$BF6= 200.13
##$BF7= 200.13
##$BF8= 200.13
##$BYTORDA= 1
##$CFDGTYP= 0
##$CFRGTYP= 5
##$CHEMSTR= <none>
##$CNST= (0..31)
1 1 145 1 1 1 1 1 1 1 1 1 1 1 1 1 1 1 1 1 1 1 1 1 1 1 1 1 1 1 1 1 
##$CPDPRG= <waltz16>
##$CPDPRG1= <>
##$CPDPRG2= <waltz16>
##$CPDPRG3= <>
##$CPDPRG4= <mlev>
##$CPDPRG5= <mlev>
##$CPDPRG6= <mlev>
##$CPDPRG7= <mlev>
##$CPDPRG8= <mlev>
##$CPDPRGB= <>
##$CPDPRGT= <>
##$D= (0..31)
0 1 0 0 0 0 0 0 0 0.06 0 0.03 2e-05 3e-06 0 0 0.0002 0 0 0 0 0 0 0 0 0 
0 0 0 0 0 0 
##$DATE= 1735037015
##$DBL= (0..7)
120 120 120 11 120 120 24 19 
##$DBP= (0..7)
150 150 150 150 150 150 150 150 
##$DBP07= 0
##$DBPNAM0= <>
##$DBPNAM1= <>
$$ [...]
##$SUBNAM3= <"">
##$SUBNAM4= <"">
##$SUBNAM5= <"">
##$SUBNAM6= <"">
##$SUBNAM7= <"">
##$SUBNAM8= <"">
##$SUBNAM9= <"">
##$SW= 400.765351723535
##$SWIBOX= (0..15)
0 1 3 0 0 0 0 0 0 0 0 0 0 0 0 0 
##$SW_h= 32467.5324675325
##$TD= 32768
##$TD0= 1
##$TE= 0
##$TE2= 300
##$TE3= 300
##$TEG= 300
##$TL= (0..7)
0 120 53 12 22 120 120 120 
##$TP= (0..7)
150 150 150 150 150 150 150 150 
##$TP07= 0
##$TPNAME0= <>
##$TPNAME1= <>
##$TPNAME2= <>
##$TPNAME3= <>
##$TPNAME4= <>
##$TPNAME5= <>
##$TPNAME6= <>
##$TPNAME7= <>
##$TPOAL= (0..7)
0.5 0.5 0.5 0.5 0.5 0.5 0.5 0.5 
##$TPOFFS= (0..7)
0 0 0 0 0 0 0 0 
##$TUNHIN= 0
##$TUNHOUT= 0
##$TUNXOUT= 0
##$USERA1= <user>
##$USERA2= <user>
##$USERA3= <user>
##$USERA4= <user>
##$USERA5= <user>
##$V9= 5
##$VALIST= <valist>
##$VCLIST= <CCCCCCCCCCCCCCC>
##$VD= 0
##$VDLIST= <DDDDDDDDDDDDDDD>
##$VPLIST= <PPPPPPPPPPPPPPP>
##$VTLIST= <TTTTTTTTTTTTTTT>
##$WBST= 1024
##$WBSW= 4
##$XGAIN= (0..3)
0 0 0 0 
##$XL= 0
##$YL= 0
##$YMAX_a= 15830
##$YMIN_a= -14448
##$ZGOPTNS= <>
##$ZL1= 120
##$ZL2= 120
##$ZL3= 120
##$ZL4= 120
##$ABSF1= 198.0616
##$ABSF2= -202.7028
##$ABSG= 5
##$ABSL= 3
##$ALPHA= 0
##$AQORDER= 0
##$ASSFAC= 0
##$ASSFACI= 0
##$ASSFACX= 0
##$ASSWID= 0
##$AUNMP= <proc_1d>
##$AZFE= 0.1
##$AZFW= 0.5
##$BCFW= 0
##$BC_mod= 2
##$BYTORDP= 0
##$COROFFS= 0
##$CY= -3
##$DATMOD= 1
##$DC= 0
##$DFILT= <>
##$DTYPP= 0
##$F1P= 0
##$F2P= 0
##$FCOR= 1
##$FTSIZE= 65536
##$FT_mod= 6
##$GAMMA= 0
##$GB= 0
##$INTBC= 1
##$INTSCL= 9.790993e-09
##$ISEN= 30
##$LB= 1.5
##$LEV0= 0
##$LPBIN= 0
##$MAXI= 10000
##$MC2= 0
##$MEAN= 0
##$ME_mod= 0
##$MI= 50
##$NCOEF= 0
##$NC_proc= -6
##$NLEV= 6
##$NOISF1= 182.463
##$NOISF2= 159.3651
##$NSP= 0
##$NTH_PI= 0
##$NZP= 0
##$OFFSET= 198.0616
##$PC= 4
##$PHC0= 2267.933
##$PHC1= -320.1141
##$PH_mod= 1
##$PKNL= yes
##$PPARMOD= 0
##$PSCAL= 0
##$PSIGN= 0
##$REVERSE= no
##$SF= 81.0140089999434
##$SI= 65536
##$SIGF1= 159.3651
##$SIGF2= -187.1042
##$SINO= 113.3802
##$SIOLD= 16384
##$SREGLST= <1H.CDCl3>
##$SSB= 0
##$STSI= 65536
##$STSR= 0
##$SW_p= 32467.5324675325
##$SYMM= 0
##$S_DEV= 0
##$TDeff= 32768
##$TDoff= 0
##$TI= <>
##$TILT= no
##$TM1= 0
##$TM2= 0
##$TOPLEV= 0
##$USERP1= <user>
##$USERP2= <user>
##$USERP3= <user>
##$USERP4= <user>
##$USERP5= <user>
##$WDW= 1
##$XDIM= 65536
##$YMAX_p= 521246380
##$YMIN_p= -8125651
$$ End of Bruker specific parameters
$$ ---------------------------------
##NTUPLES= NMR SPECTRUM
##VAR_NAME=  FREQUENCY,     SPECTRUM/REAL,   SPECTRUM/IMAG
##SYMBOL=    X,             R,               I
##VAR_TYPE=  INDEPENDENT,   DEPENDENT,       DEPENDENT
##VAR_FORM=  AFFN,          ASDF,            ASDF
##VAR_DIM=   65536,         65536,           65536
##UNITS=     HZ,            ARBITRARY UNITS, ARBITRARY UNITS
##FACTOR=    0.49542278885378, 1,            1
##FIRST=     16045.7642231865, 0,            0
##LAST=      -16421.768244346, 0,            0
##MIN=       -16421.768244346, -8125651,     0
##MAX=       16045.7642231865, 521246380,    0
$$ Real data points
##PAGE= N=1
##DATA TABLE= (X++(R..R)), XYDATA
$$ [...]
39759G08569r60702o79230k4086K26538j24509m71959k72206K79974O40122N99858
$$ 708569 -252133 -931363 -955449 -728911 -853420 -1325379 -1597585 -1317611 -677489 -77631
39749g7631L04548o6801k87050n4207N84042R96704O30678k26070p97722q12886
$$ -77631 226917 160116 -126934 -181141 402901 1399605 2030283 1804213 1006491 193605
39739A93605o20584l95596R7588P89623J019501L93242n09141p90272l55110J11385
$$ 193605 -426979 -822575 -724987 64636 1084137 1477379 968238 177966 -177144 -65759
39729f5759J47212k3644n3795N726l1167p4221M7527J95762J25884n345K05261
$$ -65759 81453 57809 4014 9740 -21427 -95648 -48121 147641 273525 268180 473441
39718D73441O49107N82274l94231j568291j823931r79911O3181M64601K27791
$$ 473441 1122548 1704822 1310591 -257700 -2081631 -3061542 -2998361 -2533760 -2305969
39709b305969j64049l16922M715P74530J401295J104189m8114j012056j071421
$$ -2305969 -2470018 -2786940 -2782225 -2007695 -606400 497789 449675 -562381 -1633802
39700a633802o66006m36355j60482N71453J247056J049613K33753k15243j21547
$$ -1633802 -2299808 -2736163 -2896645 -2325192 -1078136 -28523 205230 -10013 -131560
39691a31560j99577o46175q30246n21972k70689k82893n7472M82997O39197K19732
$$ -131560 -331137 -977312 -1807558 -2329530 -2600219 -2883112 -2940584 -2457587 -1818390 -1598658
39681a598658M1517M96606P43773J52959n21207m21442o7149l53546q72439n77840
$$ -1598658 -1557141 -1060535 -316762 -163803 -685010 -1106452 -1173601 -1527147 -2399586 -2977426
39671b977426M05796R70726O85164O3707m84763p83251l41517R69077J987457
$$ -2977426 -2571630 -1600904 -915740 -852033 -1336796 -2120047 -2461564 -1492487 494970
39662D94970J478311J10867l46154K53530K98559p78804j516744r19459o5905
$$ 494970 1973281 2084148 1737994 1991524 2290083 1511279 -5465 -924924 -990829
39653i90829j24817m13787J24685Q62109O01960j98203j59753O00625O42470l44110
$$ -990829 -1115646 -1529433 -1404748 -542639 59321 -138882 -298635 301990 944460 600350
39643F00350j033628o64738j35760l01379n21297J68892J348169J711088Q47750
$$ 600350 -433278 -1098016 -1233776 -1535155 -2056452 -1887560 -539391 1171697 2019447
39634B019447l75607j073787j229796j235892j131438o35867K77069J144349J396013
$$ 2019447 1643840 570053 -659743 -1895635 -3027073 -3662940 -3385871 -2241522 -845509
39625h45509Q74523l5463p02193o66448N5385R45113J369232J142183O15575J46609
$$ -845509 29014 -6449 -708642 -1375090 -1319705 -374592 994640 2136823 2752398 2899007
39615B899007k24360l90134O198Q23490R89210k55422j914823k182765q83558
$$ 2899007 2674647 2284513 2290711 3114201 4103411 3847989 1933166 -249599 -1133157
39606a133157K64346J43087l50396q1436M61753K50487l71613l06878L85470O80245
$$ -1133157 -868811 -725724 -1076120 -1157556 -695803 -445316 -816929 -1123807 -738337 -58092
39596e8092L66707J85829K91087J3303o86130q79219j80063N50722M98012n7216
$$ -58092 308615 494444 785531 798834 112704 -766515 -946578 -395856 102156 44940
39586D4940m54970n65570m90669j47394L14333L68320r2565m46701l20174k12922
$$ 44940 -410030 -975600 -1466269 -1613663 -1299330 -931010 -1023575 -1470276 -1790450 -2003372
39576b003372n69343q56539l20416P57556J334479R58889K07645j71438l8040
$$ -2003372 -2572715 -3429254 -3749670 -2992114 -1657635 -698746 -491101 -662539 -700579
39567g00579K52037L66440K92098K45497L37368L90707K14607p2187k52484l82469
$$ -700579 -448542 -82102 209996 455493 792861 1183568 1398175 1325988 1073504 691035
39557F91035n75048o16174l32622j32206m48167p94203l14653P01284R47467J6668
$$ 691035 115987 -500187 -832809 -965015 -1413182 -2207385 -2522038 -1820754 -873287 -856619
39547h56619r19349q29859j51238K60007M50538P73474Q85292L75396k97237n08534
$$ -856619 -1775968 -2605827 -2757065 -2497058 -2046520 -1273046 -387754 -12358 -309595 -818129
39537h18129m86784o25546m62093M62346J308764R07594l09506p86455j38791
$$ -818129 -1304913 -1930459 -2392552 -1930206 -621442 286152 -23354 -809809 -948600
39528i48600M61691K68820j14016j11114j15872m73410o51499j57768N35698O63486
$$ -948600 -486909 -218089 -332105 -443219 -559091 -1032501 -1684000 -1841768 -1306070 -642584
39518f42584J58453n37566j069772j139101m92293N60752J137967P61420o9471
$$ -642584 -484131 -1021697 -2091469 -3230570 -3722863 -3162111 -2024144 -1262724 -1332195
39509a332195o02044o54614m40507j20740J38703J83030K21241O00644J015024
$$ -1332195 -1934239 -2588853 -3029360 -3150100 -3011397 -2828367 -2607126 -2006482 -991458
39500i91458O85131l33745q86865l23519M67102L84157k47272l06011L77358R25128
$$ -991458 -306327 -640072 -1526937 -1850456 -1383354 -999197 -1246469 -1552480 -1175122 -249994
39490b49994Q01239L33308p6997m20829p04322p73190o06645l19314Q5484N34420
$$ -249994 551245 884553 807556 386727 -317595 -1090785 -1697430 -2016744 -1931260 -1396840
39480a396840O34109J39972m80920n43524j01224J75629L972k25523j53100J17418
$$ -1396840 -762731 -622759 -1103679 -1647203 -1748427 -1572798 -1568826 -1794349 -1947449 -1830031
39470a830031L16530K72341q0350n06090m39758K95469R29255O01175l49229p56896
$$ -1830031 -1513501 -1241160 -1321510 -1827600 -2267358 -1971889 -1042634 -441459 -790688 -1547584
39460a547584k64569L27849M59315N45324R45887J157694O77364p2149m11048
$$ -1547584 -1812153 -1484304 -1024989 -479665 466222 1623916 2301280 2229131 1818083
39451A818083m38218o41296r14737p91874l91515k92079n33873n37804j01755
$$ 1818083 1379865 738569 -176168 -968042 -1359557 -1651636 -2185509 -2723313 -2825068
39442b825068K57682K07968J93080O67050J191789R32398o6907p38726l53057
$$ -2825068 -2567386 -2359418 -2166338 -1499288 -307499 624899 557992 -180734 -533791
39433e33791M49365M79578l46983q47141k23921P77079Q98786R7020n34522l69141
$$ -533791 -84426 395152 48169 -798972 -1022893 -245814 652972 749992 215470 -153671
39423a53671R4210K51062J90746J53402j1563l41404m09577r6061o6694p03474
$$ -153671 -59461 191601 382347 535749 524186 182782 -226795 -322856 -389550 -1093024
39413a093024j120424k73149J259359J770114P35693n00302o64816j16751J21596
$$ -1093024 -2213448 -2486597 -1227238 542876 1278569 778267 113451 -3300 118296
39404A18296j4127J20762N54692O33469J51704l11345k99324n6883J0026p3131
$$ 118296 104169 224931 779623 1413092 1564796 1253451 954127 897244 907270 834139
39394H34139q2594m6009j43225l73013n63078n61443k55306L97354J136456J382509
$$ 834139 751545 705536 562311 189298 -373780 -935223 -1190529 -793175 343281 1725790
39384A725790P63223l59025j116255r49057j06001O41635P09648K08765j65008
$$ 1725790 2489013 2129988 1013733 64676 -41325 600310 1309958 1518723 1353715
39375A353715J35302P92923Q72644j0177j043901j154057l93472J66361q9480
$$ 1353715 1489017 2281940 3154584 3144407 2100506 946449 552977 719338 629858
39366F29858o06886o15561j40185L53938P71245J247745J568723J395727R28919
$$ 629858 22972 -592589 -732774 -378836 392409 1640154 3208877 4604604 5533523
39357E533523P45468J019521J413726J731422K213724L162283M577460O023130
$$ 5533523 6278991 7298512 8712238 10443660 12657384 15819667 20397127 26420257
39349B6420257O543419N176438K267955j34109l04252Q01094M39085k392716n562963
$$ 26420257 32963676 38140114 40408069 40273960 39969708 40770802 41209887 38817171 33254208
39340C3254208o519093n225532l525915k616223k353549k366247k464426k188273
$$ 33254208 26735115 21509583 17983668 15367445 13013896 10647649 8183223 5994950
39332E994950j171058M9720N57948L65912K81779N34824N29322J8181m91332o91856
$$ 5994950 4823892 4873612 5431560 5797472 6079251 6614075 7143397 7161578 6670246 5978390
39322E978390q88235j193208j196198p42236k20601J98836P47981J192462P91789
$$ 5978390 5090155 3896947 2700749 1958513 1737912 1936748 2684729 3877191 4668980
39313D668980l83456j101272o28018J52586P2577o83520j174129j194712j142012
$$ 4668980 4285524 3184252 2556234 2708820 2781397 2097877 923748 -270964 -1412976
39304a412976r77818m51640O0433O4961k6199M56300J031815O15767n82467j086969
$$ -1412976 -2390794 -2842434 -2782001 -2717040 -2743239 -2286939 -1255124 -639357 -1221824 -2308793
39294b308793k99745P04935R51871Q45139J002409R97719K71886n66354n14140
$$ -2308793 -2608538 -1903603 -951732 -106593 895816 1893535 2165421 1599067 1084927
39285A084927K10054M21852l10710j123279j059375j23363R31466J325497P32534
$$ 1084927 1294981 1716833 1406123 282844 -776531 -899894 31572 1357069 2089603
39276B089603m76323j398768j370551n97904K02931O19731O74752M19108p3749
$$ 2089603 1613280 214512 -1156039 -1753943 -1551012 -931281 -256529 162579 88830
39267H8830m64666m65252l15054l81743m01233J64592J017097J140314K95630
$$ 88830 -375836 -841088 -1156142 -1537885 -1939118 -1774526 -757429 382885 678515
39258F78515m58666k52663L47784L08865k55530l82628J36441M96652K48137o3814
$$ 678515 219849 -32814 314970 623835 368305 -14323 122118 618770 866907 803093
39248H03093O0537K47078M191l37060j41193M53763P13739M12533N3508l4653
$$ 803093 863630 1110708 1114899 777839 636646 1090409 1804148 2216681 2270189 2235536
39238B235536j46200n13987p49504l92533L15298O71153M06224m5298j67160N8331
$$ 2235536 2089336 1575349 825845 433312 748610 1419763 1825987 1780689 1613529 1671860
39228A671860K66803J90939j03024l58090m00316k79348j72866j76110k20988
$$ 1671860 1938663 2129602 2026578 1668488 1268172 988824 815958 639848 418860
39219D18860j93143n4006J66223M03081N53588N39914M22652L49643L52700L08567
$$ 418860 225717 171711 337934 741015 1294603 1834517 2257169 2606812 2959512 3268079
39209C268079J29017j49957m71162p39112p00992j78872M85864O38875K00491
$$ 3268079 3397096 3247139 2775977 2036865 1335873 1157001 1642865 2281740 2482231
39200B482231r9756K31241O16528K20911p42199j286320j077870p21720n88612
$$ 2482231 2382475 2613716 3230244 3451155 2708956 1422636 344766 -376954 -965566
39191i65566l01416L06452O29794K70061j41151J79944R65075J300143Q73797
$$ -965566 -1266982 -960530 -330736 -60675 -201826 -21882 943193 2243336 3117133
39182C117133J11163o14240j124779j051679k05968P16916P08814j44023o59794
$$ 3117133 3228296 2614056 1489277 437598 231630 948546 1657360 1513337 853543
39173H53543k00594M96788N03567l9451l81458k84140o2198P0875P6112j87418
$$ 853543 652949 1149737 1653304 1613853 1232395 948255 886057 956932 1033044 845626
39163H45626p18485j072765q59450l55236q8136o740L12538P53465O84197j2952
$$ 845626 127141 -945624 -1805074 -2160310 -2248446 -2255186 -1942648 -1189183 -504986 -517938
39153e17938o02753m51533J79421N83098M57953L4212l18917l38371R804M10910
$$ -517938 -1120691 -1572224 -1392803 -809705 -351752 -317540 -636457 -974828 -965024 -554114
39143e54114M47542J53257K1706K53008L68252p0299o96087q00487l69481q8049
$$ -554114 -106572 46685 68391 321399 689651 619352 -76735 -877222 -1246703 -1334752
39133a334752l02305n18476j44743O53615J145668Q90738J26822o18617j033102
$$ -1334752 -1637057 -2155533 -2300276 -1646661 -500993 389745 516567 -102050 -1135152
39124a135152j053813o13364L35879J448929J940399J319660J46254m11220M2090
$$ -1135152 -2188965 -2802329 -2466450 -1017521 922878 2242538 2388792 1977572 2019662
39115B019662O02017K46427q32300j551136j326389n51740J89127P11472R41430
$$ 2019662 2621679 2868106 2035806 484670 -841719 -1393459 -1204332 -492860 448570
39106D48570P04846J36423j77950J25542O79833R19428Q57849R17174J162356
$$ 448570 1153416 1289839 1111889 1237431 1917264 2836692 3694541 4611715 5774071
39097E774071J204484Q93453O57901R56648J749950K875491M644161P265019R426949
$$ 5774071 6978555 7872008 8529909 9486557 11236507 14111998 18756159 26021178 35448127
39088C5448127Q421566K940160m385179q713807p957011m872529l299824l577973
$$ 35448127 43869693 46809853 42424674 33710867 25753856 20881327 17581503 14003530
39080A4003530l337684j812585p91281j210900j486774l49829Q63637M41437q70750
$$ 14003530 10665846 8853261 8061980 6851080 5364306 5014477 5878114 6319551 5448801
39071E448801j238416p06165o43745j061373p75715J40720L91738q3968L8366
$$ 5448801 4210385 3504220 2860475 1799102 1023387 1164107 1555845 1471877 1510243
39062A510243Q75062Q54167n08344j510021r61762m4871j79759p45055m47875
$$ 1510243 2385305 3239472 2731128 1221107 259345 214474 34715 -710340 -1158215
39053a158215M25477P63557N48714M31369L11530r0359j05007Q16009J676990
$$ -1158215 -732738 30819 579533 1010902 1322432 1232073 1127066 1943075 3620065
39044C620065J292393L67333M04002J171092J312029R84289J559724K916297L676539
$$ 3620065 4912458 5279791 5683793 6854885 8166914 9151203 10710927 13627224 17303763
39035A7303763M339037P085546J1274806J2108117O217471l212439r491022r701247
$$ 17303763 21642800 28728346 40003152 52111269 58328740 55116301 45625279 35924032
39027C5924032o678048m364562l719749l487618k810522j923079j309046j135388
$$ 35924032 29245984 24881422 21161673 17674055 14863533 12940454 11631408 10496020
39019A0496020j190139j041087n48431j91178m24696q79862q50637m23228l11621
$$ 10496020 9305881 8264794 7716363 7525185 7100489 6220627 5369990 4946762 4635141
39010D635141o15920o57176j84953J69451l4370l59155l20873j52554j80602j01865
$$ 4635141 4019221 3362045 3177092 3346543 3312173 2953018 2632145 2479591 2298989 2197124
39000B197124M23951R61744Q53002K70724m3360Q0379J28737j29891l79607n47050
$$ 2197124 2621075 3582819 4435821 4706545 4663185 4743564 4872301 4742410 4362803 3815753
38990C815753r99841j621435j530457l82225P10533M89130n73625q01038K73874
$$ 3815753 2815912 1194477 -335980 -718205 -7672 481458 -92167 -893205 -619331
38981f19331J183292O63168n21485p49632J74906J006706R71947N19830J58248
$$ -619331 563961 1227129 705644 -43988 130918 1137624 2109571 2629401 2787649
38972B787649k85830q63672r71080k77509N31276O77073M28274N24118Q44149
$$ 2787649 2501819 1638147 667067 389558 920834 1597907 2026181 2550299 3394448
38963C394448N72623l95022j105461q30283j8327L91253J43318k45958k98221
$$ 3394448 3967071 3572049 2466588 1636305 1617978 2009231 2152549 1906591 1608370
38954A608370p0983P6411o5254l61233m64922j55552L79450O52432L74176j76393
$$ 1608370 1537387 1613798 1548544 1187311 722389 566837 946287 1598719 1972895 1796502
38944A796502m09271r5451L43932L60379L318j41598K10720N98048M45697j20768
$$ 1796502 1387231 1291780 1635712 1996091 1999409 1857811 2068531 2666579 3112276 2991508
38934B991508m78809l65210r1223K0070o2333l14332o71553p60397j97337O95670
$$ 2991508 2512699 2147489 2056266 2076336 2014003 1699671 1028118 267721 70384 766054
38924G66054J078002P17646K94623K78328K44581j71056l97459J75395R86524
$$ 766054 1844056 2561702 2856325 3134653 3379234 3208178 2810719 2986114 3972638
38915C972638R84786K17540k93588j72549j30888o37281j134773r90354m40270
$$ 3972638 4957424 5174964 4881376 4708827 4577939 3940658 2805885 1815531 1375261
38906A375261p2998L8906J36167J35589k07776p06765q29491l69250K92088O12316
$$ 1375261 1302263 1341169 1477336 1612925 1405149 698384 -131107 -500357 -208269 404047
38896D04047M14929L210j65449M7403L19665K84996j118k08039k30347k18551
$$ 404047 818976 822186 656737 704140 1023805 1308801 1307683 1099644 869297 650746
38886F50746j66584J08140N00998N75649J96345j58513k4861L41046K45999m87307
$$ 650746 484162 592302 1093300 1668949 1865294 1706781 1681920 2022966 2268965 1781658
38876A781658j136440q14181M36580J464213J181436r5658r01286m22941M61247
$$ 1781658 645218 -168963 267617 1731830 2913266 2817608 1916322 1493381 1954628
38867A954628M57885l04585n73596R5508P57336O05245O0386j66077k26650o08772
$$ 1954628 2412513 2107928 1534332 1629840 2387176 2992421 3052807 2886730 2660080 2051308
38857B051308j080414j039272n76231l38372m67095m69131j61505J0982j99466
$$ 2051308 970894 -68378 -644609 -982981 -1450076 -1919207 -2080712 -2069730 -2269196
38848b269196l46193K6304O54850R34335P34954M09553J44399k09558o12394o21937
$$ -2269196 -2615389 -2589085 -1934235 -999900 -264946 144607 289006 79448 -532946 -1154883
38838a154883j3944O82356P13872P6133n08043n95066m57232l50328j0934O45763
$$ -1154883 -1168827 -486471 227401 303534 -204509 -799575 -1256807 -1607135 -1618069 -972306
38828i72306R40964L12889o20273p92361k66073m2411l30468k20046N99542J036916
$$ -972306 -31342 281547 -338726 -1131087 -1397160 -1439571 -1770039 -1990085 -1390543 -353627
38818c53627K72202p75546p04587L00314Q04309K11043o06737p35551k75031K24805
$$ -353627 -81425 -856971 -1561558 -1261244 -456935 -245892 -852629 -1588180 -1863211 -1638406
38808a638406N42337O60336M91720J32727k6765J83459L64186L7110o68566j087451
$$ -1638406 -1096069 -435733 55987 188714 161949 345408 709594 746704 78138 -1009313
38798a009313p39156J71740R72901J166315Q25884L73031O6026j39972k96581
$$ -1009313 -1748469 -1576729 -603828 562487 1388371 1761402 1827428 1687456 1390875
38789A390875l12681j70959k9886p32n8508k28582n33850o88528k95537M70055
$$ 1390875 1078194 907235 877349 876617 818109 589527 55677 -632851 -928388 -458333
38779d58333Q72032O03074K59574M24310P70857O16568m6295o71817r70762r67793
$$ -458333 413699 1016773 1276347 1700657 2471514 3088082 3041787 2369970 1399208 431415
38769D31415n60902K48992Q88020P39633R0006j73080J91459N32176L70997M573
$$ 431415 -129487 119505 1007525 1747158 1837164 1664084 1855543 2387719 2758716 2763289
38759B763289j57610k29182n05005r13547j097916p96176m2528P51206R48061
$$ 2763289 2605679 2376497 1871492 957945 -139971 -936147 -978675 -227469 720592
38750G20592K96426o23970r67731o22138k16672j60869j71872J58643P63882J192826
$$ 720592 1017018 393048 -574683 -1196821 -1413493 -1574362 -1746234 -1587591 -823709 369117
38740C69117J018715J88033p46427r19845j03130Q52153J020930N98529M48010
$$ 369117 1387832 1575865 829438 -90407 -193537 658616 1679546 2278075 2726085
38731B726085P22633P70167K68724m47274j139516j776062j894692r71828L91417
$$ 2726085 3448718 4218885 4487609 4040335 2900819 1124757 -769935 -1741763 -1350346
38722a350346Q17556O4965n38200p6372O77777O67143J43581o1733L5875q7249
$$ -1350346 -532790 -467825 -1006025 -1082397 -404620 262523 406104 344371 380246 292997
38712B92997l62811l73417j89506o6326J97809P28591R27579L00718n37601o66367
$$ 292997 -69814 -443231 -632737 -699063 -501254 227337 1154916 1455634 918033 251666
38702B51666k33907l1778j31852o1084M8612k61428n97745j68012O56574O45398
$$ 251666 17759 -14019 -145871 -206955 -158343 -419771 -1017516 -1185528 -528954 116444
38692A16444k89742q26817l21640K51234N1024k83407N4779N30507K38671m25093
$$ 116444 -173298 -1000115 -1321755 -1070521 -1019497 -1302904 -1248125 -717618 -478947 -904040
38682i04040l64971L69500O22078m3143o86850m04615M87486J069097R83842N33610
$$ -904040 -1269011 -899511 -277433 -320576 -1007426 -1412041 -924555 144542 1128384 1661994
38672A661994M1204l53395m54647j00924M34194N36245m760n90282m99798J33574
$$ 1661994 1703198 1349803 895156 794232 1228426 1764671 1759911 1169629 669831 803405
38662H03405M71405J40740k52129o2557L92819K78461n73631j460639j687716
$$ 803405 1274810 1415550 1163421 1100864 1493683 1772144 1198513 -262126 -1949842
38653a949842j165949k19295O85678J040653O73576J04136L3332M01731M71675
$$ -1949842 -3115791 -3335086 -2649408 -1608755 -935179 -831043 -797711 -395980 75695
38644G5695m3688n25826l86413R7989K95746J32994L911M7654M5561m9241L3624
$$ 75695 32007 -493819 -880232 -782243 -486497 -353503 -349592 -301938 -256377 -305618 -271994
38633b71994L95972O75769M56202j59400o06836n37335k39102j83030l02751j41082
$$ -271994 123978 799747 1255949 1096549 489713 -47622 -286724 -469754 -772505 -913587
38623i13587K86142L68717q2795l53524P1526N25627J58713n37858l85571M48194
$$ -913587 -627445 -258728 -341523 -695047 -623521 -97894 60819 -477039 -862610 -414416
38613d14416M69998p54658j617336p00087J097785J820207J139931M61289O01265
$$ -414416 55582 -699076 -2316412 -3016499 -1918714 -98507 1041424 1502713 2103978
38604B103978P36566m3131j218796j565718q18402J11757M07472K10549J02164
$$ 2103978 2840544 2797413 1578617 12899 -805503 -693746 -286274 -75725 26439
38595B6439K10771K39236J57994L07968P04498P89952K49050l90331n08739l54402
$$ 26439 237210 476446 634440 942408 1646906 2436858 2685908 2295577 1786838 1432436
38585A432436n35259q47750n38123L35408Q13078M69004n1637k26474l70549o87725
$$ 1432436 897177 49427 -488696 -153288 659790 1128794 1077157 850683 480134 -207591
38575b07591o35662M7436N79178K59316l74224m19677J0623K49349L10317N82014
$$ -207591 -843253 -795817 -216639 42677 -331547 -751224 -740601 -491252 -180935 401079
38565D01079P66506L07286m37022o56326n24979q86892j538490j216219L88289
$$ 401079 1167585 1474871 1037849 381523 -143456 -1030348 -2568838 -3785057 -3396768
38556c396768J863804J910574R39040J78716P085o0088k61632k90458N6713M84233
$$ -3396768 -1532964 377610 1316650 1495366 1502451 1442363 1180731 890273 946986 1431219
38546A431219M94316r5385q72671j106640n35354K20644L83773J7708j86615J0254
$$ 1431219 1925535 1830150 957479 -149161 -684515 -463871 -80098 -62390 -249005 -238751
38536b38751J70477J9551j69452j50462n7261m2008q2389k00841l53137j82242
$$ -238751 -68274 -48723 -218175 -368637 -425898 -467906 -550295 -751136 -1104273 -1286515
38526a286515M51915Q44802K45963p67900p96349L69801J375725J240289M94008
$$ -1286515 -834600 10202 256165 -511735 -1308084 -938283 437442 1677731 2171739
38517B171739m5888l92136o43681l83411K96083L32128o59507j326901m51234
$$ 2171739 2125851 1733715 1090034 706623 1002706 1334834 675327 -651574 -1102808
38508a102808R99735J133909j52312j208009j023323j66259M97703O74204K72034
$$ -1102808 -103073 1030836 878524 -329485 -1352808 -1519067 -1021364 -347160 -75126
38499g5126n87538j152715p40583J48610M75615K92988N04012J081148R81789
$$ -75126 -662664 -1815379 -2555962 -2407352 -1931737 -1638749 -1134737 -53589 928200
38490I28200L3730n79661j95734L17374P1503n25164p10774n62017m30897j42818
$$ 928200 961930 382269 186535 503909 575412 50248 -660526 -1222543 -1653440 -1796258
38480a796258L67709M63954k00323p82830l26908P79415J350873J016948M08631
$$ -1796258 -1428549 -964595 -1164918 -1947748 -2274656 -1495241 -144368 872580 1281211
38471A281211M6512r5825q5340J46905N00472P46080P91402N74923j3784p53176
$$ 1281211 1327723 1231898 1146558 1293463 1793935 2540015 3331417 3906340 3892556 3139380
38461C139380j051319p34004m17148o02674r14945q06582m60866k94883j32776
$$ 3139380 2088061 1354057 936909 334235 -580710 -1387292 -1848158 -2143041 -2275817
38452b275817K81465M68899p8858p56018n03652N70507J301105J114938N37668
$$ -2275817 -1994352 -1525453 -1604311 -2360329 -2863981 -2293474 -992369 122569 660237
38443F60237Q2081l00655n69671m36929n6352O9849L1518L86629R50294Q14000
$$ 660237 742318 441663 -128008 -564937 -621289 -551440 -519922 -133293 817001 1631001
38433A631001j30009q31325o94165l90649m74883l93709K61942O63592P2354o44349
$$ 1631001 1500992 669667 -24498 -415147 -890030 -1283739 -1021797 -358205 -285851 -930200
38423i30200k07470R26749J082900j50245j331271j202551j53468O76546Q17644
$$ -930200 -1137670 -210921 871979 721734 -609537 -1812088 -1965556 -1289010 -471366
38414d71366N45346K13101j4051j19520k17088l65860l85927j38231J39899J85769
$$ -471366 73980 287081 273030 153510 -63578 -429438 -815365 -953596 -813697 -627928
38404f27928K12193N12410P53819L83704l36679n27500n811M35259K79583l2026
$$ -627928 -415735 96675 850494 1234198 897519 370019 364208 799467 1079050 1047024
38394A047024m3978p0245m68145q37901o51765j57608O9525O5628K19277M02951
$$ 1047024 1003046 932801 464656 -373245 -1025010 -1182618 -1113093 -1047465 -828188 -425237
38384d25237J87023k45111k49973J78317K76753k90621p99482m32140N91875J300836
$$ -425237 -238214 -483325 -733298 -554981 -278228 -568849 -1368331 -1800471 -1208596 92240
38374I2240J134115M30409j40026l09117l27051m97148p18657n98865m8654M40649
$$ 92240 1226355 1656764 1516738 1207621 880570 383422 -335235 -934100 -982754 -542105
38364e42105L45600j94996n46000l85802r839J84597J50595M0200m5081M474L02090
$$ -542105 -196505 -391501 -937501 -1323303 -1333142 -1148545 -997950 -957750 -1002831 -998357 -696267
38353f96267P04709Q19669M67236r5730n71562r39307j160370r31641j36106O99660
$$ -696267 8442 828111 1295347 1199617 628055 -311252 -1471622 -2403263 -2539369 -1839709
38343a839709Q82510M19498k5591n0975K6448k38731p04885p59104n4040R95973
$$ -1839709 -957199 -537701 -563292 -614267 -587819 -826550 -1531435 -2290539 -2344579 -1348606
38333a348606J491638R29796j49525o43162j78402M29071L70924N9311M13976
$$ -1348606 143032 1072828 923303 280141 101739 530810 901734 961045 1375021
38324A375021J203169J157298r1060j286478j343798q61768r22714j210557o47190
$$ 1375021 2578190 3735488 3644428 2357950 1014152 152384 -770330 -1980887 -2628077
38315b628077N14395P93164j79464r20516l22924O60092N68749k92279m59804
$$ -2628077 -2113682 -1320518 -1499982 -2420498 -2743422 -2083330 -1514581 -1806860 -2266664
38306b266664L18625P78902K23739m36280j89192N88399Q73620N09029J46642
$$ -2266664 -1948039 -1169137 -945398 -1381678 -1570870 -982471 -108851 400178 546820
38297E46820J05205J22135Q0523J97671M39522M20690P1682j53612R744K12860
$$ 546820 652025 774160 854683 1052354 1491876 1912566 1984248 1830636 1840380 2053240
38287B053240J13431l3027J22046K68628j76572j037532j389659p54489K52735
$$ 2053240 2166671 2133644 2255690 2524318 2347746 1310214 -79445 -833934 -581199
38278e81199P51016O34312L94099K36174p9766n97808q96938o35954l0165M38282
$$ -581199 169817 804129 1198228 1434402 1354636 756828 -140110 -776064 -806229 -367947
38268c67947N84384N75635N42170L73650n8205o06973q81362n96913R7806O83838
$$ -367947 216437 792072 1334242 1707892 1649687 1042714 161352 -435561 -337755 346083
38258C46083P28176K94975j38519j89652L8932R7443k90649q79982j145321q96112
$$ 346083 1074259 1369234 1230715 1041063 1079995 1177438 886789 6807 -1138514 -2034626
38248b034626n05541l69294l05602J26910P48703P60084j06749r63031q13122
$$ -2034626 -2540167 -2909461 -3215063 -3088153 -2339450 -1579366 -1686115 -2649146 -3462268
38239c462268J39575Q78266J004922R88066J054144P80574O8750l54766K5258
$$ -3462268 -3322693 -2444427 -1439505 -451439 602705 1383279 1452029 1097263 1122521
38230A122521O18974N40176j39370o29367n99898m15786l65555l35322j99739
$$ 1122521 1741495 2281671 2142301 1512934 913036 497250 131695 -203627 -403366
38221d03366N5452N54016J273768J608308Q85615n44698j422872j064369j57215
$$ -403366 -347914 206102 1479870 3088178 3973793 3429095 2006223 941854 784639
38212G84639K74404J55910J05831L07009K98903j92269p84256r35991n77749q3952
$$ 784639 1059043 1214953 1320784 1627793 1926696 1734427 950171 14180 -563569 -647521
38202f47521J96145K32654K08057K28829K06116M5963j26894r3688J15176K11898
$$ -647521 -451376 -218722 -10665 218164 424280 470243 343349 249661 364837 576735
38192E76735O9722p0793L675P0253k27076p07766o71748K04419J243162J410190
$$ 576735 646457 575664 579339 649592 422516 -285250 -956998 -752579 490583 1900773
38182A900773N48297m27970o99431m74307l99143m46318p5538O27967Q31099K05521
$$ 1900773 2449070 2021100 1321669 847362 448219 1901 -73637 554330 1385429 1590950
38172A590950m76151m63588p3488J0498j21326K0449K66490Q3707l13519j99903
$$ 1590950 1114799 651211 577723 588221 466895 487344 753834 837541 524022 324119
38162C24119L32969L46864m46036j142270r60332k28155L55906O33230O74968
$$ 324119 657088 1003952 557916 -584354 -1544686 -1772841 -1416935 -783705 -108737
38153a08737L47016k24658m34113n3290L13498K24463J51881N23505P49107J67531
$$ -108737 238279 13621 -420492 -473782 -160284 64179 216060 739565 1488672 1656203
38143A656203o29603n66071J93661N04719P6024k18919L6937J31249m19212r34840
$$ 1656203 1026600 460529 654190 1158909 1234933 1016014 1052951 1184200 764988 -169852
38133a69852o59540K6200K21036k03636o33987o91399n16836k55066J43190N85978
$$ -169852 -829392 -803192 -582156 -785792 -1419779 -2111178 -2628014 -2883080 -2739890 -2153912
38123b153912P44940M38418q1434l24994l0262N40030P88180L78251l73945q34685
$$ -2153912 -1408972 -970554 -1051988 -1376982 -1407244 -867214 -79034 299217 -74728 -909413
38113i09413p22137k74419J59787M37693N62082N74246N37456M59391K84999R7133
$$ -909413 -1631550 -1905969 -1746182 -1308489 -746407 -172161 365295 824686 1109685 1206818
38103A206818J08592K26608l3977p75487j214056o14849M96185Q61292J78424
$$ 1206818 1315410 1542018 1508041 732554 -481502 -1096351 -600166 261126 439550
38094D39550n96337p11537m59657k87437j5172N31565R13175P64043M72548M99222
$$ 439550 -156787 -868324 -1327981 -1615418 -1630590 -1099025 -185850 578193 1050741 1549963
38084A549963N43822J04788n63947p98842n15045j48809J05772K90103J65420
$$ 1549963 2093785 2198573 1634626 835784 320739 171930 277702 567805 733225
38075G33225n00925j238478j231848m04226M93727Q77530P97777M61275k663k47491
$$ 733225 232300 -1006178 -2238026 -2642252 -2148525 -1270995 -473218 -11943 -14606 -262097
38065b62097O6380N70383M35879l85317q60782k47420Q35677J250472Q00709K27409
$$ -262097 -195717 374666 810545 425228 -435554 -682974 152703 1403175 2203884 2431293
38055B431293L5547P368j55824l21462k53429o2663m6996k30613k96373K990M80574
$$ 2431293 2466840 2474208 2318384 1996922 1743493 1680830 1633834 1403221 1106848 1109838 1590412
38044A590412O57022K79559l81003q23830q34485n87252l05573l6534J98755K39056
$$ 1590412 2247434 2526993 2145990 1322160 487675 -99577 -405150 -441684 -242929 -3873
38034c873o2134n49173p54214k94386O28843J204502P53225m08363j137890p43465
$$ -3873 -66007 -615180 -1369394 -1663780 -1034937 169565 922790 514427 -623463 -1366928
38024a366928J71642M83341o5879p16006p67780k30644N85078J447938J966265
$$ -1366928 -1195286 -711945 -777824 -1493830 -2261610 -2492254 -1907176 -459238 1507027
38015A507027J602890L77789q36125j166532o56253k311L19832K91544J7440l30121
$$ 1507027 3109917 3487706 2651581 1485049 828796 826485 1146317 1437861 1455301 1125180
38005A125180l97979j0098M08292K54123l86950p70136m78443O9090K62001L6178
$$ 1125180 727201 717103 1125395 1379518 992568 222432 -256011 -186921 75080 111258
37995A11258k80109m89470n39678k69819M12620J141114J266146N69137l87093
$$ 111258 -168851 -658321 -1197999 -1467818 -1055198 85916 1352062 1921199 1534106
37986A534106p69385k91245N38919R58873P02013J88772k1522J22231J87457j18333
$$ 1534106 764721 473476 1012395 1971268 2673281 2862053 2840531 2962762 3150219 3031886
37976C031886n76469p97123p14698n55805m65686m00061k98268j25926J77260
$$ 3031886 2455417 1658294 943596 387791 -77895 -477956 -776224 -902150 -724890
37967g24890N19800N11880j08478q77432r15842n9051P72730P15618R7577j04225
$$ -724890 -205090 306790 198312 -679120 -1594962 -1654013 -881283 -165665 -68088 -172313
37957a72313L08215N59558J35043m99603o69213l98154j42863m5750O6799K21768
$$ -172313 135902 695460 830503 330900 -338313 -736467 -879330 -925080 -858281 -636513
37947f36513L09546L71998M39868K64753k83021o94843l32441N32252Q75221L27642
$$ -636513 -326967 45031 484899 749652 466631 -228212 -560653 -28401 846820 1174462
37937A174462k64520j21463K68271l9930q40133r68137j27536M86938j01547j093233
$$ 1174462 909942 788479 1056750 1016820 176687 -791450 -918986 -432048 -533595 -1626828
37927a626828r28643M92129J614245J344327L98495L2246K18487R382o72888p65302
$$ -1626828 -2555471 -2063342 -449097 895230 1293725 1325971 1544458 1553840 880952 115650
37917A15650K10933J166839Q44265m39318j257720r57703j97643L24422P23379
$$ 115650 326583 1493422 2337687 1898369 640649 -317054 -514697 -190275 533104
37908E33104J178890J176670K43094r79351j248892l34081O03267M95320l11722
$$ 533104 1711994 2888664 3131758 2152407 903515 569434 1172701 1668021 1356299
37899A356299o69544k04786L07868R1862o74380j229018j136954n47387J50128
$$ 1356299 686755 481969 789837 881699 207319 -1021699 -2158653 -2706040 -2555912
37890b555912N92280N88872L61469M46254R55773J140617K68310j129601j618109
$$ -2555912 -1963632 -1374760 -1013291 -567037 388736 1529353 1797663 668062 -950047
37881i50047o70675N73829P81669M9113n28026m22127m2772K06985L94292N36748
$$ -950047 -1620722 -1046893 -265224 -216111 -744137 -1166264 -1209036 -1002051 -607759 -71011
37871g1011L72125j00779m01721j91731K66267N20490M82454L42741K26032J55206
$$ -71011 301114 200335 -201386 -393117 -126850 393640 876094 1218835 1444867 1600073
37861A600073J27274M7700j87015m15245l04775J20932L73922J49389k31390l30033
$$ 1600073 1727347 1775047 1588032 1172787 868012 988944 1362866 1512255 1280865 950832
37851I50832k58321m24750p84461q29624l67552J13676P7642l04975l34111L04588
$$ 950832 692511 267761 -516700 -1346324 -1713876 -1600200 -1522558 -1827533 -2161644 -1857056
37841a857056J062625J149285N13613r3819j09690J34193k1129n55187q02060
$$ -1857056 -794431 354854 868467 774648 664958 799151 778022 222835 -579225
37832e79225m17539J85675M52573L00737j5267k52527k28318R4588L97480K77985
$$ -579225 -996764 -811089 -358516 -57779 -73046 -325573 -553891 -459303 -61823 216162
37822B16162r8958j04753L64445N91109J35266l95195l14333l2162l49018r37309
$$ 216162 117204 12451 376896 968005 1103271 708076 393743 361581 12563 -924746
37812i24746o65057N48977J366068R07064j4015k08035J58864Q2017n47572q22117
$$ -924746 -1589803 -1040826 325242 1232306 1218291 1010256 1169120 1251137 703565 -118552
37802a18552l45623J49646j5169m98779o32454m48136l79976l50568Q8516Q31854
$$ -118552 -464175 -314529 -329698 -828477 -1460931 -1909067 -2289043 -2639611 -2551095 -1719241
37792a719241J200186R84932Q26396J179019J453004P82921o24288j565102j283824
$$ -1719241 -519055 465877 1292273 2471292 3924296 4707217 4082929 2517827 1234003
37783A234003l20570K47178L4174m11640l81756J93150O66797L58277o35754j410252
$$ 1234003 913433 1160611 1194785 783145 401389 594539 1261336 1619613 983859 -426393
37773d26393j206364k69854N06721O56280M68190L48042L53209M06284M64933
$$ -426393 -1632757 -1902611 -1395890 -739610 -271420 76622 429831 836115 1301048
37764A301048L63649k6548l65458j32304M73652N64490j90139j013816j164166
$$ 1301048 1664697 1638149 1272691 1140387 1614039 2178529 1988390 974574 -189592
37755a89592r34288q86155p47454L2396J057874J328070O61324j21469l98861
$$ -189592 -1123880 -2010035 -2757489 -2725093 -1667219 -339149 322175 200706 -198155
37746a98155k96538m1406L49722O04483K65338n04418r00538n45444O3873M12124
$$ -198155 -494693 -536099 -186377 418106 683444 179026 -721512 -1266956 -1203083 -790959
37736g90959N81767P17119N89626J33053k04963j24938L3829q6233k61744j67104
$$ -790959 -209192 507927 1097553 1230606 1025643 900705 934534 848301 586557 419453
37726D19453O0932K21218M77274Q34026P32005j38740j068181j147715n37175
$$ 419453 480385 701603 1178877 2012903 2744908 2606168 1537987 390272 -146903
37717a46903j21659j64087j51752J60404M48512N67766P32027Q15210L17615o79908
$$ -146903 -268562 -432649 -584401 -423997 24515 592281 1324308 2139518 2457133 1777225
37707A777225j268324q31366J37892P27846O50560K38789j48918l14642j71075
$$ 1777225 508901 -322465 -184573 543273 1193833 1432622 1283704 969062 797987
37698G97987R3787O7692l43653o86220n50606r5526L01689N49663O35131L18090
$$ 797987 891774 959466 615813 -70407 -621013 -716539 -414850 134813 769944 1088034
37688A088034m28497r80239p20782p572K08196k53716n25856K291P72205R06617
$$ 1088034 659537 -320702 -1041484 -1049056 -840860 -1094576 -1620432 -1618141 -845936 60681
37678F0681M80242L09100O82199R70629N87380k12295p76853r31069r94495j099120
$$ 60681 540923 850023 1532222 2502851 3090231 2877936 2101083 1170014 175519 -923601
37668i23601r55049l83061K78220N36520L34236L7380n4603N9271K87100N91150
$$ -923601 -1878650 -2261711 -1983491 -1446971 -1112735 -1075355 -1129958 -1070687 -783587 -192437
37658a92437Q50871Q14702L66384k56966o55220o48802m05318k26170k67140m37276
$$ -192437 658434 1473136 1839520 1582554 927334 278532 -126786 -352956 -620096 -1057372
37648a057372n17911l75802o6723K47469M11608L05385o9387m13900k54948M74351
$$ -1057372 -1575283 -1951085 -2017808 -1770339 -1358731 -1053346 -1122733 -1536633 -1791581 -1317230
37638a317230J101500Q52120j55169r35714p82686k9407N11800N20347K94553
$$ -1317230 -215730 636390 481221 -454493 -1237179 -1266586 -754786 -234439 60114
37629F0114J90874K92526M95812O24224N25489K40407m6541l33660p96713j271517
$$ 60114 250988 543514 1039326 1663550 2189039 2429446 2382905 2049245 1252532 -18985
37619a8985j154769k26773P84273J005434N23047O5490j81878o28307j186379
$$ -18985 -1173754 -1400527 -616254 389180 912227 977717 795839 167532 -1018847
37610a018847j092537j48061O90341N30754k39791o09136l81710k32769n02332
$$ -1018847 -2111384 -2259445 -1569104 -1038350 -1278141 -1887277 -2268987 -2501756 -3004088
37601c004088o60973j08676R60691J707413J469729L72203p53651j057563m07867
$$ -3004088 -3665061 -3773737 -2813046 -1105633 364096 736299 -17352 -1074915 -1482782
37592a482782N26935R20135M42745n96101j466920j427598l68966Q18507R79244
$$ -1482782 -955847 -35712 407033 -189068 -1655988 -3083586 -3452552 -2634045 -1654801
37583a654801L2221q33904n67948N57143J447276J413019N49203n92421j243041
$$ -1654801 -1622580 -2456484 -3024432 -2467289 -1020013 393006 942209 349788 -893253
37574h93253q26695L12560J036733Q11001M27720O71545R46739K68201r08005
$$ -893253 -1719948 -1407388 -370655 440346 868066 1539611 2486350 2754551 1846546
37565A846546j163578k41946O56961P62760N68062N09961J69054o57918j263714
$$ 1846546 682968 441022 1097983 1860743 2428805 2938766 3107820 2449902 1186188
37556A186188j118427o79710m24984k0185P71446J261823Q44225P2789k14957
$$ 1186188 67761 -611949 -1036933 -1057118 -285672 976151 1820376 1893165 1678208
37547A678208j76942l71259n30598r0805N31402M37452k28255m75860r0531J58778
$$ 1678208 1501266 1130007 599409 508604 1040006 1477458 1249203 773343 682812 841590
37537H41590j7659K3581N69174R18073N24890j30400l76545l20794l87277m84104
$$ 841590 823931 847512 1416686 2334759 2859649 2729249 2352704 2031910 1644633 1160529
37527A160529k90207L2773O9686j26259j29874J21695K32668N9273L5955M98039
$$ 1160529 870322 903095 972781 846522 716648 838343 1071011 1130284 1166239 1664278
37517A664278R77213O62647m04939j119646o61613L29266N48039k22458r58416
$$ 1664278 2641491 3304138 2899199 1779553 1117940 1447206 1995245 1772787 814371
37508H14371r79936p16650o25732m03070J30783L61847l2717k21035M78121J185038
$$ 814371 -165565 -882215 -1507947 -1911017 -1780234 -1418387 -1451104 -1672139 -1194018 -8980
37498h980O52167o90445j324046r18463m62134k78861L41368J316696J361109
$$ -8980 643187 -47258 -1371304 -2289767 -2751901 -3030762 -2689394 -1372698 -11589
37489a1589Q5324j011679o10826N60975R71159M27817j25130k49407k95272m18290
$$ -11589 73735 -937944 -1548770 -987795 -16636 411181 286051 36644 -258628 -676918
37479f76918l37132J4319L09996K97084L7583j90060k3057O33899J238576J089378
$$ -676918 -1014050 -999731 -689735 -392651 -355068 -545128 -568185 65714 1304290 2393668
37469B393668L50635l9109K65019M97533K8341o75255q89935o98850n58271m56217
$$ 2393668 2744303 2705194 2970213 3467746 3496087 2820832 1930897 1232047 673776 217559
37459B17559j98533K7453L8605Q1784K87709K96796R708j2427M16887M90468k93698
$$ 217559 19026 46479 85084 166868 454577 751373 761081 748654 1165541 1656009 1362311
37448A362311j017467o24213L57935O17053P9525k01320J13847K64776k09468
$$ 1362311 344844 -279369 78566 695619 775144 573824 687671 952447 742979
37439G42979q78721j254546j187095m99955P17627J558577J188229K37867R0907
$$ 742979 -135742 -1390288 -2577383 -3077338 -2359711 -801134 387095 624962 715869
37430G15869P73490R17017J1331p64120m63997K21727K45562k50810n44964n73108
$$ 715869 1489359 2406376 2417707 1653587 1189590 1411317 1656879 1406069 861105 287997
37420B87997o29284n34505m3026M26733L32301r0205k29858p9982n7038j04891
$$ 287997 -341287 -875792 -918818 -492085 -159784 -249989 -479847 -559829 -616867 -721758
37410g21758K02382P31013P54873M5119o17472m02249M35889Q45543L59810k87725
$$ -721758 -519376 211637 966510 1011629 394157 -8092 427797 1273340 1633150 1345425
37400A345425k12764L40261M03184j74451n06404k11219p7441n19485n24318O34386
$$ 1345425 1132661 1472922 1876106 1701655 1195251 984032 906591 387106 -137212 497174
37390D97174J614261P14000j164316j391794M79763J916715J172696k90031l79732
$$ 497174 2111435 2825435 1661119 269325 749088 2665803 3838499 3548468 3168736
37381C168736N23235P99103M83310Q00517J600807J463520K05500o95953m56337
$$ 3168736 3691971 4491074 4974384 5774901 7375708 8839228 9044728 8348775 7892438
37372G892438p5391n31882j274614j282479o31648j81950l14960o85211q71851
$$ 7892438 7817047 7285165 6010551 4728072 4096424 3914474 3599514 2914303 2042452
37363B042452p61989m85768k63262j63049L7620M82908Q12768N73263j568k15355
$$ 2042452 1280463 794695 531433 368384 406004 888912 1701680 2274943 2273375 2058020
37353B058020N6737K43023J02283R0132L94912M21060k15111q71637p85764k64370
$$ 2058020 2114757 2357780 2460063 2550195 2945107 3366167 3151056 2279419 1493655 1229285
37343A229285j50930m75620n47697k12597m6020k40610k48595J89385N22439L49440
$$ 1229285 1078355 602735 55038 -157559 -203579 -444189 -692784 -503399 19040 368480
37333C68480J50385M56231Q96493P86471K23026j48199j37093l6259Q5354L26474
$$ 368480 518865 975096 1871589 2658060 2881086 2732887 2595794 2559535 2644889 2971363
37323B971363M14770Q3914j92955J82956P26679M48524l30896j31490J361660
$$ 2971363 3386133 3470047 3277092 3460048 4186727 4635251 4304355 4172865 5534525
37314E534525K561386K266984J342451J165139J656257K031117K374810L087473
$$ 5534525 8095911 10362895 11705346 12870485 14526742 16557859 18932669 22020142
37306B2020142L720509L851509M280053N861647Q112206J0614479J4371717J9038537
$$ 22020142 25740651 29592160 33872213 39733860 47846066 58460545 72832262 91870799
37298I1870799J9903332J1707927l704511j7126113k1259242j7714624j2997305
$$ 91870799 111774131 123482058 119777547 102651434 81392192 63677568 50680263
37291E0680263j0324997q309022n696740l540094k767227k645598k366641k155285
$$ 50680263 40355266 32046244 26349504 22809410 20042183 17396585 15029944 12874659
37283A2874659k168934j855282j019664l30970k65589n07119p12084r56598j167532
$$ 12874659 10705725 8850443 7830779 7499809 7234220 6727101 6015017 5058419 3890887
37274C890887r93800m91439j37041K497K98821O61426N43801N0400M0614P30275
$$ 3890887 2897087 2405648 2268607 2271104 2569925 3231351 3775152 3825552 3866166 4596441
37264D596441J118776L98574q08997j308254q83537k95622o9711j7719R9438Q0822
$$ 4596441 5715217 6113791 5304794 3996540 3113003 2817381 2747670 2729951 2829389 2910211
37254B910211k96553p08545n15518L85548J196840R99418j24764j067898r10277
$$ 2910211 2613658 1905113 1389595 1775143 2971983 3971401 3846637 2778739 1868462
37245A868462J10089R78782R75528K00228o80289j003888o45216q8985K22436
$$ 1868462 1978551 2957333 3932861 4133089 3452800 2448912 1803696 1714711 1937147
37236A937147M83667J012349J352774P43780n11365j197417r48069o64331p14170
$$ 1937147 2420814 3433163 4785937 5529717 5018352 3820935 2872866 2208535 1494365
37227A494365j10241J601324K996294K705083J622994J533670K271571K099496
$$ 1494365 1384124 2985448 5981742 8686825 10309819 11843489 14115060 16214556
37219A6214556N62810r17246j356126j374356j702234k021637j848302j380779
$$ 16214556 16777366 15860120 14503994 13129638 11427404 9405767 7557465 6176686
37211F176686r27553m42273m4510j12653n07086n57881j36965R6059j99476n29629
$$ 6176686 5249133 4806860 4762350 4649697 4142611 3584730 3447765 3543824 3344348 2814719
37201B814719m44863j36965J11836L18827M21768K50851K3723J03392K02673l02261
$$ 2814719 2369856 2232891 2344727 2663554 3085322 3336173 3359896 3463288 3665961 3363700
37191C363700j216617j643267j317857q05032l23825M32703J178118J070803J99045
$$ 3363700 2147083 503816 -814041 -1619073 -1942898 -1510195 -332077 738726 937771
37182I37771k93017K4623L26268K29835N19318J420965J689252N07798r99057
$$ 937771 644754 669377 995645 1225480 1744798 3165763 4855015 5362813 4363756
37173D363756j380187q67529m99756k90849K52533O29340J6375j012020j036523
$$ 4363756 2983569 2116040 1616284 1325435 1577968 2207308 2223683 1211663 175140
37164A75140N9271Q93066N89584k29222o32792n23652k94426j29448J3526J91004
$$ 175140 234411 1127477 1717061 1487839 855047 331395 36969 -92479 -78953 112051
37154A12051M17542N51004L31077j72555m15609p6342M16724N02011K75475J59785
$$ 112051 529593 1080597 1411674 1239119 823510 747168 1163892 1665903 1941378 2101163
37144B101163J71779J11607J05852K87370K70870k93356r01322p66309q2157J57245
$$ 2101163 2272942 2384549 2490401 2777771 3048641 2755285 1853963 1087654 1005497 1162742
37134A162742l47460p44018l40820L62830M68844L3935k2040P13616J469543J301272
$$ 1162742 815282 71264 -269556 93274 562118 596053 574013 1287629 2757172 4058444
37124D058444M25124m3550L23531O53651J18470p87746j034594n96392k44274
$$ 4058444 4483568 4440018 4763549 5417200 5535670 4747924 3713330 3116938 2872664
37115B872664j30910K58154Q09304O90805k04549q86464p39216l20550k32639
$$ 2872664 2741754 2999908 3809212 4500017 4295468 3409004 2669788 2349238 2116599
37106B116599k12702R0650L71531L19020J93869J76269o2642n82548p79608l46812
$$ 2116599 1903897 1994547 2366078 2685098 2878967 3055236 2992594 2410046 1630438 1283626
37096A283626J49738J99691P3083J20620J89474K28075N74681J135587J214122
$$ 1283626 1433364 1633055 1706138 1826758 2016232 2244307 2818988 3954575 5168697
37087E168697O60063K02448J90453J42320j239M54413J426756J709248R69760
$$ 5168697 5828760 6031208 6221661 6363981 6362742 6817155 8243911 9953159 10922919
37078A0922919N19341J105581J614698J200173R69272J977331L167421L167078
$$ 10922919 11442260 12547841 14162539 15362712 16331984 18309315 21476736 24643814
37070B4643814K732324L380619M768645N529331N756725O590778Q175023R983447
$$ 24643814 27376138 30756757 35525402 41054733 46811458 53402236 61577259 71560706
37062G1560706J2128947J4068537J3028734O598507l294720j1528698j5017437
$$ 71560706 83689653 97758190 110786924 117385431 114090711 102562013 87544576
37055H7544576j4770260j3019935j0785987q507594o705330n236002l494110j783191
$$ 87544576 72774316 59754381 48968394 40460800 33755470 28519468 25025358 23242167
37047B3242167j099226j445174j792099j697391j551891j420778j121018j105752
$$ 23242167 22142941 20697767 18905668 17208277 15656386 14235608 13114590 12008838
37039A2008838j684753j855632o93205O58214M08057r64533j416886n65436J13071
$$ 12008838 10324085 8468453 7775248 8433462 8841519 7876986 6460100 5894664 6007735
37030F007735J0132o7778J10968L6995P7709Q63350J368551J87930j618593j771464
$$ 6007735 6017867 5950089 6061057 6098052 6175761 7039111 8407662 8595592 6976999 5205535
37020E205535n42215j97650r15733o87481O58859J000847p6430m87021M46191
$$ 5205535 4663320 4465670 3549937 2862456 3521315 4522162 4445732 3958711 4404902
37011D404902R00404K22920Q7482R99655J245188M05908L29766J485377J990064
$$ 4404902 5305306 5528226 5615708 6615363 7860551 8266459 8596225 10081602 12071666
37002A2071666J351563J405781K512060K849716K473460L628370O004851O595513
$$ 12071666 13423229 14829010 17341070 20190786 22664246 26292616 32297467 38892980
36994C8892980N395037N733955P688807P549456N542574O730098J1770686J5066344
$$ 38892980 44288017 50021972 57710779 65260235 70802809 77532907 89303593 104369937
36986A04369937J5384588J8857430K7182095L4495208M2334293O2216130Q9591226
$$ 104369937 119754525 138611955 165794050 200289258 242623551 304839681 394430907
36979C94430907R0259142L6556331m7856400j04059430j01937571o7506321m1469418
$$ 394430907 484690049 521246380 473389980 369330550 267392979 199886658 158417240
36972A58417240l3029824k7072557j7250819j1032521j0824066r882102n768224
$$ 158417240 125387416 98314859 81064040 70031519 59207453 49325351 43557127
36965D3557127l496409m783391n267992l303038k308177l343466l272171j398575
$$ 43557127 40060718 35277327 30009335 26706297 24398120 21054654 17782483 16383908
36957A6383908q57033k219087k178922N9423J059603n92918j772813m47855J017582
$$ 16383908 15526875 13307788 11128866 11188289 12247892 11654974 9882161 9434306 10451888
36948A0451888L32854j082222j143783l82923j23409j63863p689p2342l85884
$$ 10451888 10784742 9702520 8558737 8175814 8052405 7888542 7880853 7808511 7422627
36939G422627k05714K32129k23247j286720j333085k81855J88735k37791K2675
$$ 7422627 7216913 7449042 7225795 5939075 4605990 4324135 4512870 4275079 4297754
36930D297754J235405J523507K34605p35765k33084K67098m55369j125624l58907
$$ 4297754 5533159 7056666 7291271 6555506 6322422 6589520 6134151 5008527 4649620
36921D649620R13980J251603J080818J448073J972175J824736J446916J637997
$$ 4649620 5563600 6815203 7896021 9344094 11316269 13141005 14587921 16225918
36913A6225918K046550K042387K038708K583182L180140L358359L869168N418204
$$ 16225918 18272468 20314855 22353563 24936745 28116885 31475244 35344412 40762616
36905D0762616P205963Q310236R689172J2878804J6763056J7306539J1263405
$$ 40762616 47968579 56278815 65967987 78846791 95609847 112916386 124179791
36898A24179791k51714j2079760j8849738j8919381j4986543j0916079q277968
$$ 124179791 123928077 111848317 92998579 74079198 59092655 48176576 39898608
36891C9898608o321490m454772l191362k737719k370412j756911j506513j806460
$$ 39898608 33577118 29122346 25930984 23193265 20822853 19065942 17559429 15752969
36883A5752969j829990j182968o57153p89313r42288o54106n96735j185119j493246
$$ 15752969 13922979 12740011 12082858 11293545 10351257 9697151 9100416 7915297 6422051
36874F422051p54671J68847J18052n28388o98051m46378m98516o76813k96010
$$ 6422051 5667380 5836227 5954279 5425891 4727840 4281462 3782946 3106133 2810123
36865B810123L55716M00579q0040k45770J7554J41520J58590N42454Q99962L04602
$$ 2810123 3165839 3566418 3486378 3240608 3258162 3399682 3558272 4100726 5000688 5305290
36855E305290r70373j500281p93997J4264O192k77280r7991J51684j62676n70110
$$ 5305290 4334917 2834636 2040639 2054903 2061095 1783815 1685824 1837508 1674832 1104722
36845A104722j62821Q32603J238415N98736k45022m13264q7134K8165j66715j36049
$$ 1104722 941901 1774504 3012919 3611655 3366633 2953369 2866235 2894400 2727685 2591636
36835B591636L40916P62819O35788J92622j281R2677M4214k04787j92506K04384
$$ 2591636 2932552 3695371 4331159 4523781 4522500 4615177 4659391 4454604 4262098 4466482
36825D466482M18079J21668m9388O20461J657701J812471P01806p04081j379559
$$ 4466482 4884561 5006229 4956841 5577302 7235003 9047474 9749280 9045199 7665640
36816G665640j329124j066882o92767j04533L13136L8151o16035o85227N4689
$$ 7665640 6336516 5269634 4576867 4472334 4785470 4823621 4207586 3522359 3577048
36807C577048O00122J04070q45244j047842l95643J57320J75976K30041O11968
$$ 3577048 4177170 4281240 3435996 2388154 1992511 2149831 2325807 2555848 3167816
36798C167816O70726M28o41811m34717J93245K76447k00860n26586n42475n97301
$$ 3167816 3838542 3838970 3197159 2762442 2955687 3232134 3031274 2504688 1962213 1364912
36788A364912n00728K39849J167980J129979L3956p85205l96418N22343Q50060
$$ 1364912 864184 1104033 2272013 3401992 3435948 2650743 2254325 2776668 3626728
36779C626728N26351K19075J48469j2505l99155p03958n61645O1093P25022Q01686
$$ 3626728 4153079 4372154 4520623 4508118 4108963 3405005 2843360 2904453 3629475 4431161
36769D431161K37357j25688M28237J309299J284445K73395m91169k25413N18469
$$ 4431161 4668518 4542830 4971067 6280366 7564811 7838206 7347037 7121624 7640093
36760G640093J003023J279182J571084J706393J698165J940000K290107J999749
$$ 7640093 8643116 9922298 11493382 13199775 14897940 16837940 19128047 21127796
36752B1127796J176240J148897K484902L786811L664792K948011L505760N549168
$$ 21127796 22304036 23452933 25937835 29724646 33389438 36337449 39843209 45392377
36744D5392377P675708R239439J0962304J2909976J3230341R708638K191415o780469
$$ 45392377 53068085 62307524 73269828 86179804 99410145 109118783 111310198 104529729
36736A04529729j3554567j5851706j4268104j1353785r054989p414117n814271
$$ 104529729 90975162 75123456 60855352 49501567 40446578 33032461 27218190
36729B7218190m428247l657015l054693j998933r08063o36243j033963j239184
$$ 27218190 22789943 19132928 16078235 14079302 13171239 12534996 11501033 10261849
36721A0261849j078463j015487r74930m75219J81878J25846o22553j080948q21004
$$ 10261849 9183386 8167899 7192969 6717750 6899628 7025474 6402921 5321973 4500969
36712D500969m52557m34107m67073k98686j40929n3749J83203M05709J67765l68562
$$ 4500969 4048412 3614305 3147232 2848546 2707617 2653868 2837071 3242780 3410545 3041983
36702C041983n72918m43893n42440p77212m56435K71326L53205m01322q21078
$$ 3041983 2469065 2025172 1482732 705520 249085 520411 873616 472294 -348784
36693c48784k28628M81203L78900p2557n6922J74652r207l46733k17203J66445
$$ -348784 -577412 -96209 282691 210134 153212 327864 318657 -28076 -245279 -78834
36683g8834J77397o8937Q794L64411M48772J84085m3371j71494m32007o53813
$$ -78834 98563 29626 38420 402831 851603 1035688 992317 820823 388816 -264997
36673b64997l69733L60622Q45045N64297k82280j009490r92768j80534P14265
$$ -264997 -634730 -274108 570937 1135234 852954 -156536 -1149304 -1329838 -615573
36664f15573Q43705K73960l0655M40377R76018P00644j57156p01967o61441n15086
$$ -615573 228132 502092 471437 911814 1887832 2588476 2431320 1729353 1067912 552826
36654E52826n62810n49015j80322M55203R77785R92555M52827j11529r0707L37590
$$ 552826 -9984 -558999 -739321 -284118 693667 1686222 2139049 2027520 1936813 2274403
36644B274403L72683j73160n13269j33964L80742L27498q0106l23828m58820n86351
$$ 2274403 2647086 2473926 1960657 1826693 2207435 2534933 2454827 2130999 1672179 1085828
36634A085828k36045P33256J316778O07953o73793j108134n86944j26295m2401
$$ 1085828 849783 1583039 2899817 3507770 2833977 1725843 1138899 1012604 970203
36625I70203K33611O64935M62322l93460q55051l78493L77212P47731Q60285R02905
$$ 970203 1203814 1868749 2331071 1937611 1082560 704067 1081279 1829010 2689295 3592200
36615C592200O70160K05249j00684l33201r12377j402722p80098O87038J283454
$$ 3592200 4262360 4467609 4366925 4033724 3121347 1718625 938527 1625565 2909019
36606B909019L25589o47619k39573N84171J04113j330584j829007q32938K51430
$$ 2909019 3234608 2586989 2347416 2931587 3035700 1705116 -123891 -956829 -705399
36597g05399K89916k06277k69801J28900L91115K31825j50720l98271k39439K31740
$$ -705399 -415483 -621760 -891561 -762661 -371546 -139721 -290441 -688712 -928151 -696411
36587f96411M64920N0061n87585n55094L83096J463164J779689J152963J25045
$$ -696411 -231491 -181430 -769015 -1324109 -941013 522151 2301840 3454803 3579848
36578C579848n96052o93039m90380n66402r35184r21138j76320O06279N83753
$$ 3579848 2983796 2290757 1800377 1233975 298791 -622347 -798667 -192388 391365
36569C91365J1146j80662J51915K47064j89667m64891p1173M65262M43318N1913
$$ 391365 402511 221849 373764 620828 431161 -33730 -104903 360359 803677 855590
36559H55590o6512J10205N4707l22144m20577J67634R58233J053696K14973p88774
$$ 855590 789078 899283 953990 631846 211269 378903 1337136 2390832 2605805 1817031
36549A817031j016635m27655J39404Q8188k11689r1345M03009O82215N83218N09686
$$ 1817031 800396 372741 512145 600333 388644 297299 700308 1382523 1965741 2475427
36539B475427O18676N51385J44350k32723l45898n07061r01543j061635n98104
$$ 2475427 3094103 3645488 3789838 3557115 3211217 2704156 1802613 740978 142874
36530A42874l6828j88161q63446r98191j35977R10320J166125O92256K27998O9381
$$ 142874 106046 -82115 -945561 -1943752 -2079729 -1169409 -3284 688972 916970 986351
36520I86351o5301k34797r0916L40368L91581k55140q43647n27066K45723K44365
$$ 986351 921050 686253 595337 935705 1327286 1072146 228499 -298567 -52844 191521
36510A91521o73077j241199o53083K92509N58799M21636O57878R63483N09017
$$ 191521 -481556 -1722755 -2375838 -2083329 -1524530 -1102894 -445016 518467 1027484
36501A027484l51255m22503L09647N05025l76289j180254r20801k20295k7111
$$ 1027484 676229 253726 563373 1068398 692109 -488145 -1408946 -1629241 -1656352
36492a656352m0110M78542J187058J194567N55442N5492j17796l69062o46246
$$ -1656352 -1696462 -1217920 -30862 1163705 1719147 1774639 1656843 1287781 641535
36483F41535n38014k63292m23989p94722m97426M88009J092206P25998P0704j05620
$$ 641535 103521 -159771 -583760 -1378482 -1875908 -1387899 -295693 430305 501009 395389
36473C95389O497p4394k19461j08985O4779n909r1095J70907N23029M02561j21594
$$ 395389 401886 327492 108031 -954 63825 57916 -33179 137728 660757 1063318 941724
36462I41724l18292K13077R17972Q79406o8264j021193r79471q7865M85139Q9314
$$ 941724 623432 836509 1754481 2633887 2565623 1544430 564959 477094 962233 1051547
36452A051547n18056l30252L99840O75764M16572M42552Q61066P79378n5730o31602
$$ 1051547 533491 203239 603079 1278843 1695415 2137967 2999033 3778411 3722681 3091079
36442C091079l29174k8364o28686j441533j205850m8386P56114N99483K0919l93683
$$ 3091079 2761905 2733541 2104855 663322 -542528 -590914 165200 764683 785602 391919
36432C91919n84310o03067n01458n32294p21096m82517N10859J401612J115748
$$ 391919 -192391 -795458 -1296916 -1829210 -2550306 -3032823 -2521964 -1120352 -4604
36423d604K5527n23585k43105j35655n81850o49961J64893Q63773M77997l77823
$$ -4604 20923 -502662 -745767 -881422 -1463272 -2113233 -1948340 -1084567 -606570 -984393
36413i84393n24803k5267J41881k66609n37729k46579K62266O44390R63111J177396
$$ -984393 -1509196 -1534463 -1392582 -1659191 -2196920 -2443499 -2181233 -1536843 -573732 603664
36403F03664R22977J03057p57235j046590p10398j68141K14126L80495M14298
$$ 603664 1526641 1629698 872463 -174127 -884525 -1052666 -838540 -458045 -43747
36394d3747L08472J0087l38258l91007r443M49589N32547K98618J74842K42771
$$ -43747 264725 274812 -63446 -454453 -463896 -14307 518240 816858 991700 1234471
36384A234471J38754k54850n34243m05795j19296L347Q169m1223l43333q26310
$$ 1234471 1373225 1118375 584132 178337 59041 62388 70557 29334 -313999 -1140309
36374a140309q22264P7924J164032J328543N20292k35033k71403k4531j45543
$$ -1140309 -1962573 -1884649 -720617 607926 1128218 893185 621782 597251 451708
36365D51708n20209n88013k26485J75278L62380M74855O07202M63391k73510j320782
$$ 451708 -68501 -656514 -882999 -707721 -345341 129514 736716 1200107 926597 -394185
36355c94185j852353j333281j38832Q54831J167735R57245N27001L8789k86958
$$ -394185 -2246538 -3579819 -3718651 -2863820 -1696085 -738840 -211839 -173050 -460008
36346d60008j89036K29561N15449M67842L25848J93680j83019p63120r27267l68067
$$ -460008 -649044 -419483 95966 563808 889656 1083336 900317 137197 -790070 -1158137
36336a158137K42839J36387l90143m45425O7165L62233K1367m77373n99129m12209
$$ -1158137 -915298 -778911 -1169054 -1614479 -1547314 -1185081 -1163714 -1641087 -2240216 -2652425
36326b652425j87835N4543L13626L97363K40122O3499j863j02498k69717k08708
$$ -2652425 -2840260 -2785717 -2472091 -2074728 -1834606 -1771107 -1772970 -1875468 -2145185 -2353893
36316b353893K59269Q27369J027264P31461J77714k98551m37247j95888J42852
$$ -2353893 -2094624 -1267255 -239991 491470 669184 370633 -66614 -262502 -119650
36307a19650J97051r0767m29711n80872n33904l07509Q2817M12357L55977q5194
$$ -119650 77401 -13366 -443077 -1023949 -1557853 -1865362 -1782545 -1370188 -1014211 -1099405
36297a099405n46535p32506o03199j89431L57078N81651J69694l68488j29471
$$ -1099405 -1645940 -2378446 -2981645 -3171076 -2813998 -2232347 -2062653 -2431141 -2560612
36288b560612Q34731J301474M64817q52502j190299k74341P86164R32040K20086
$$ -2560612 -1725881 -424407 40410 -812092 -2002391 -2276732 -1490568 -558528 -338442
36279c38442m88752m76991K01307P97783O46146l2169l68158j5127L95590K69301
$$ -338442 -827194 -1304185 -1102878 -305095 341051 308882 -59276 -74403 321187 590488
36269E90488n5411J0005K33172j5547n55261n34817K26295R03517Q57188M00887
$$ 590488 535077 545082 778254 762707 207446 -327371 -101076 802441 1659629 2060516
36259B060516R0922p3294l21339n23744m29049j42185P6665K29812L98099L74836
$$ 2060516 2151438 2078144 1756805 1233061 804012 661827 738492 968304 1366403 1741239
36249A741239p2560o95298r40475o39566k05087j07058l88425p27287p86918m80707
$$ 1741239 1668679 973381 32906 -606660 -811747 -918805 -1307230 -2034517 -2821435 -3302142
36239c302142m5461J49492J0708j03700J81774O79556P86715L06736j91782j05814
$$ -3302142 -3347603 -3198111 -3187403 -3291103 -3109329 -2429773 -1643058 -1336322 -1528104 -1633918
36229a633918L37132L57398k74025q77542p81617j77938K82834M12039M89147
$$ -1633918 -1296786 -939388 -1213413 -2090955 -2872572 -3050510 -2767676 -2355637 -1866490
36220a866490N38872K59430k58707l93938J20694O87608O27412O6352m08058o13533
$$ -1866490 -1327618 -1068188 -1326895 -1720833 -1600139 -912531 -285119 -218767 -626825 -1240358
36210a240358p45876p70078n04371j94792l05718o83453n98039J85892R82123
$$ -1240358 -1986234 -2756312 -3260683 -3455475 -3761193 -4444646 -5042685 -4856793 -3874670
36201c874670J122352P95757N77807N86675N82864N49228O10414N71106J13877
$$ -3874670 -2752318 -1956561 -1378754 -792079 -209215 340013 950427 1521533 1635410
36192A635410n63085q19385l97892K05300L47760o0187n94050q12610n84255j30290
$$ 1635410 1072325 252940 -144952 60348 408108 347921 -246129 -1058739 -1642994 -1773284
36182a773284J14199j27630n87516o21764L2245Q19606R41329K93581m26005n42340
$$ -1773284 -1659085 -1786715 -2374231 -2995995 -2963750 -2144144 -1202815 -909234 -1335239 -1877579
36172a877579p0120M98042P96658Q05172O48771M20129J58334j38982m47049n92886
$$ -1877579 -1947699 -1449657 -652999 152173 800944 1221073 1379407 1240425 793376 200490
36162B00490l54047J78377N25469L69419K8974M1533L60823M11369k2587m43643
$$ 200490 -153557 24820 550289 919708 948682 990215 1351038 1762407 1739820 1296177
36152A296177l70745j503J47997o6914m15342o95718p84873n10899J25317P34524
$$ 1296177 925432 923929 1071926 1005012 589670 -106048 -890921 -1401820 -1276503 -541979
36142e41979Q96466O32881K47590j20406m57688o17815n27752m58582o05220n81655
$$ -541979 354487 987368 1234958 1114552 656864 39049 -488703 -947285 -1552505 -2134160
36132b134160O1665R19135J044485K68730m93290m78945J4472K73179J40842n9880
$$ -2134160 -2072495 -1153360 -108875 159855 -333435 -812380 -797908 -524729 -383887 -443767
36122d43767j11913K1621L33346N92522M02265j68277m06438J13752P92159P61432
$$ -443767 -555680 -534059 -200713 391809 794074 625797 219359 333111 1125270 1886702
36112A886702J04320l22990j36494J55403o600n21475q61374o12875K69661J383819
$$ 1886702 1991022 1668032 1531538 1686941 1680341 1158866 297492 -315383 -45722 1338097
36102A338097K012941J684155O48843m17947j084318j246729q36831j8994M86481
$$ 1338097 3351038 5035193 5684036 5266089 4181771 2935042 2098211 2079217 2565698
36093B565698L5483r09032j133268l01968N02425K77368n48703q64995m34697
$$ 2565698 2601181 1692149 558881 256913 759338 1036706 488003 -376992 -811689
36084h11689N0350J44442O6807M0490j6977n1097K03015O41923P36408L53451
$$ -811689 -761339 -616897 -550090 -509600 -526577 -577674 -374659 267264 1003672 1357123
36074A357123R7831M09130P75734M40041l83145o95324j24069N35803M53477j20885
$$ 1357123 1454954 1864084 2639818 3079859 2696714 2001390 1877321 2413124 2866601 2745716
36064B745716l43210k9996J86879r7582m61174l21297K08471M88681K00869l15996
$$ 2745716 2402506 2372510 2559389 2461807 2000633 1679336 1887807 2376488 2577357 2261361
36054B261361n56308m13825j73235q6412j02508l5190J03586R8505r9884k12557
$$ 2261361 1705053 1291228 1117993 1031581 929073 893883 997469 1095974 996090 783533
36044G83533k9939K29465K84611L36132P34633J168758Q68239k07604j106308
$$ 783533 753594 983059 1267670 1603802 2338435 3507193 4375432 4167828 3061520
36035C061520j185947r46630r67350p83863J93781J207403R06053n43136j449089
$$ 3061520 1875573 928943 -38407 -822270 -628489 578914 1484967 941831 -507258
36026e07258r51203j00982n1809l77410j04585N34309N86442Q7098J1936O16244
$$ -507258 -1458461 -1559443 -1611252 -1988662 -2093247 -1558938 -972496 -885398 -873462 -257218
36016b57218R61130L46417o46032r67132m20184K62216L82292k9224m14563l82532
$$ -257218 703912 1050329 404297 -562835 -983019 -720803 -338511 -367735 -782298 -1164830
36006a164830r8999O3265J12205L24518N69073L23622l87852p20129j76606N31762
$$ -1164830 -1263829 -1200564 -1088359 -763841 -194768 128854 -258998 -979127 -1155733 -623971
35996f23971M85948j05105m29412m76083q06144j168696o59091O21577J362216
$$ -623971 -138023 -243128 -672540 -1148623 -1954767 -3123463 -3782554 -3160977 -1798761
35987a798761R17898K20751K15619M79876K31849k27379j33057L32526L55163
$$ -1798761 -880863 -660112 -444493 35383 267232 39853 -93204 239322 594485
35978E94485j63637o04517p35666q28164p96068k19632P18434J222459R79720
$$ 594485 430848 -173669 -909335 -1737499 -2533567 -2753199 -2034765 -812306 167414
35969A67414M93345J49289k66522q35247j038151m90573L89548R12479R23682
$$ 167414 660759 810048 543526 -291721 -1329872 -1820445 -1430897 -518418 405264
35960D05264O71644K43401l71327q60844p41577K7089Q49227J001893K99361o97457
$$ 405264 1076908 1320309 948982 88138 -653439 -626350 222877 1224770 1524131 826674
35950H26674j141972p12624M8863L81443K04896O3911K24502L08423n306l69744
$$ 826674 -315298 -1027922 -979059 -597616 -392720 -328809 -104307 204116 198810 -170934
35940a70934k22600M02010Q75170P06858N0912m81857m20212O5115K53812l18696
$$ -170934 -393534 8476 883646 1590504 1641416 1159559 739347 804462 1058274 739578
35930G39578j165797j316440n44960L17175M98417K18984J34472L20100L83014
$$ 739578 -426219 -1742659 -2287619 -1970444 -1472027 -1253043 -1118571 -798471 -415457
35921d15457K69175K63790K97149l2699o49487q73973l76759K95060N16055M37420
$$ -415457 -146282 117508 414657 381958 -267529 -1141502 -1518261 -1223201 -707146 -269726
35911b69726N31145O20827P1388j059142j738101j158941K01770J155628J189110
$$ -269726 261419 882246 953634 -105508 -1843609 -3002550 -2800780 -1645152 -456042
35902d56042Q06422N92506N00006K28555j70433m17451m33751k91759K9877M66557
$$ -456042 350380 942886 1442892 1671447 1501014 1083563 649812 358053 387930 854487
35892H54487O53414L39233j22646j80522J04379J76740j25323l94515l98454l39906
$$ 854487 1507901 1847134 1724488 1543966 1648345 1825085 1699762 1305247 906793 566887
35882E66887k44347J75855P53508P25224j47016r91990r86798m92219l04557l39856
$$ 566887 322540 498395 1251903 1977127 1830111 838121 -148677 -640896 -945453 -1285309
35872a285309J2834O26577P90924M79073L84059O34708N27160k06746q30151p16285
$$ -1285309 -1272475 -645898 145026 624099 1008158 1642866 2170026 1963280 1133129 416844
35862D16844k03469J45542L75634O48319O05984l6177p45391p87760k97939j7052
$$ 416844 213375 358917 734551 1382870 1988854 1952677 1207286 419526 121587 104535
35852A04535j53359k19536L9744K42487M3236k98626k77418K00883P07443P31658
$$ 104535 -48824 -268360 -228616 13871 57107 -241519 -518937 -318054 389389 1121047
35842A121047J93195m15138m67843J13030P35354P89646K57963m08635p60761
$$ 1121047 1314242 899104 431261 544291 1279645 2069291 2327254 1918619 1157858
35833A157858n87158l3242L33142jo77654o69162K95173J065897N56441o17846
$$ 1157858 570700 537458 870600 870599 192945 -476217 -181044 884853 1441294 823448
35823H23448r42439j61903M95912K67652j72713o1312K33640L4016m28310m60450
$$ 823448 -118991 -280894 215018 482670 309957 248645 482285 516301 87991 -372459
35813c72459n8921K12833J89493J98600L57609M27862K97873R7449q6045j85684
$$ -372459 -431380 -218547 -29054 169546 527155 955017 1252890 1350339 1264294 1078610
35803A078610k9190L26707L89545j11383o28215m97107J225N4086l71149n41179
$$ 1078610 1049420 1376127 1765672 1654289 1026074 528967 530192 584278 213129 -328050
35793c28050k82945k76132p78462j075705o80197j46827m8133Q114N08702R35620
$$ -328050 -610995 -887127 -1665589 -2741294 -3421491 -3568318 -3616451 -3608337 -3099635 -2164015
35783b164015N82992o6178K4095P08984Q39541J71421k08860L14059Q91070O50459
$$ -2164015 -1581023 -1647201 -1623106 -914122 -74581 96840 -112020 202039 1093109 1743568
35773A743568O8650M63J66868k53010r95727r41073P3809Q53125N88889J6573
$$ 1743568 1812218 1812681 1979549 1726539 730812 -210261 -136452 716673 1305562 1322135
35763A322135K02669R15297J076701M85846J17457O19198J385284J583214J438778
$$ 1322135 1524804 2440101 3516802 4002648 4120105 4739303 6124587 7707801 9146579
35754I146579J713119K185215J619896m96432k935945l980078l251508j779458
$$ 9146579 10859698 13044913 14664809 14168377 11232432 7252354 4000846 2221388
35746B221388o31492j33530j71223m50170m63463N0553N25535J62342p77718j105998
$$ 2221388 1589896 1456366 1285143 834973 371510 422063 947598 1109940 332222 -773776
35736g73776m01497L38671K46934j37295N9039M88944K14069n88058p78857j3717
$$ -773776 -1175273 -836602 -589668 -726963 -667924 -178980 35089 -552969 -1331826 -1345543
35726a345543Q05342R55295P36499O11934M38923J6334l39831k88186r402J60245
$$ -1345543 -540201 415094 1151593 1763527 2202450 2218784 1878953 1590767 1581365 1741610
35716A741610J89266J08772j93345n71135n14909J25680P57645Q18705N10301
$$ 1741610 1930876 2039648 1846303 1275168 760259 885939 1643584 2462289 2972590
35707B972590L06103J71890j69146n60365o27424m36371l42021l46536j74516
$$ 2972590 3278693 3450583 3281437 2721072 2093648 1657277 1315256 968720 794204
35698G94204J45502L30178L58881L76123J86592m86912j231436j158775j33326
$$ 794204 939706 1269884 1628765 2004888 2191480 1704568 473132 -685643 -818969
35689h18969Q25797P50418j05609p15477n91264j78540m5046j15781J14789P80594
$$ -818969 6828 757246 651637 -63840 -655104 -833644 -878690 -994471 -879682 -99088
35679i9088J300047J002361M9893n90746l17224K87103K57057l41971m98172J88583
$$ -99088 1200959 2203320 2253213 1662467 1345243 1632346 1889403 1547432 1049260 1237843
35669A237843Q23999N25425k55292m38272O1974L12999j25695o07910n52509l11631
$$ 1237843 2061842 2587267 2331975 1893703 1955677 2268676 2142981 1535071 982562 670931
35659F70931l46962k77673M05314J136844Q43197l66559j148005q13075k56556
$$ 670931 323969 46296 451610 1588454 2431651 2065092 917087 104012 -152544
35650a52544m42696q90523n60631L97291Q83089N36126Q2082L4861J17490J18042
$$ -152544 -595240 -1485763 -2046394 -1649103 -766014 -229888 -147806 -112945 4545 122587
35640A22587K83714N35870K73388n47288j028502o45591j24382k54766n83199
$$ 122587 406301 942171 1215559 668271 -360231 -1005822 -1130204 -1384970 -1968169
35631a968169k40831N04906O45962Q5635k45749J00209N34039N63107N07923O88452
$$ -1968169 -2209000 -1704094 -1058132 -972497 -1218246 -1118037 -583998 -20891 487032 1175484
35621A175484O95543O2241q26208j097587m95181L24101N95103K88927K9634K10072
$$ 1175484 1871027 1933268 1107060 9473 -485708 -161607 433496 722423 752057 962129
35611I62129M07834n302p66019q65826m1840O26013K32104n38049m82956J52562
$$ 962129 1369963 1364661 598642 -267184 -309024 316989 549093 11044 -471912 -319350
35601c19350J11692o46960o92974N48865J676048J329105J56743l39566o7626
$$ -319350 -207658 -854618 -1547592 -998727 677321 2006426 2163169 1823603 1755977
35592A755977j39534q42885j195608o00345K08341K90200j98311l49665K63153
$$ 1755977 1616443 773558 -422050 -1022395 -814054 -523854 -722165 -1071830 -808677
35583h08677J146218J500258R95847J8940p02965p67310m28866k01200j95971
$$ -808677 337541 1837799 2833646 2852586 2149621 1382311 953445 752245 556274
35574E56274p2562L43470O74366M25156l37042j000342j109765p94903l79245
$$ 556274 483712 827182 1501548 1926704 1589662 589320 -520445 -1315348 -1694593
35565a694593J41127Q64043J392871J066585o1582j009861r86794l00994K47404
$$ -1694593 -1553466 -689423 703448 1770033 1708451 698590 -288204 -589198 -341794
35556c41794M27302M62233K84926k91100q62447p62252r4685L47959K53512Q0089
$$ -341794 85508 547741 832667 541567 -320880 -1083132 -1177817 -829858 -576346 -496257
35546d96257Q6553n0493m03091m39515Q8357O44394P21752M84708K05411k15605
$$ -496257 -409704 -460197 -863288 -1302803 -1214446 -570052 151700 636408 841819 626214
35536F26214p06375p48677k20612J68676r9495n47009n47207k97745k13999l3923
$$ 626214 -80161 -828838 -1049450 -880774 -980269 -1527278 -2074485 -2372230 -2586229 -2620152
35526b620152N77494J101687Q45993J51513p4900K42594L89684J08751j38752
$$ -2620152 -2042658 -940971 -94978 56535 -18365 224229 613913 722664 583912
35517E83912o8697J14621K43310K82453M1604m85520p26996k77716K46539K0861
$$ 583912 515215 629836 873146 1155599 1197203 711683 -15313 -293029 -46490 -25629
35507b5629o08073o29917m8848J86682j00462j5140P57819J287103Q47807m8134
$$ -25629 -633702 -1263619 -1312467 -1125785 -1226247 -1241387 -483568 803535 1651342 1603208
35497A603208n87327o70108n13825j63399J17245j30745o54294n25424L96598
$$ 1603208 1015881 345773 -168052 -331451 -214206 -344951 -999245 -1524669 -1128071
35488a128071J016631O37733L5906J15529M58502J95371m79682p46235n06839
$$ -1128071 -111440 526293 562199 677728 1136230 1331601 851919 105684 -401155
35479d01155k43129j7347L50640N48132K61373J4274M16556R05097M51713o50828
$$ -401155 -644284 -661631 -310991 237141 498514 512788 929344 1834441 2286154 1635326
35469A635326j029816l42282J74562l47576j093448q86625N8664N65656J91765
$$ 1635326 605510 263228 437790 90214 -1003234 -1889859 -1831195 -1265539 -1073774
35460a073774l22779j86729M65700Q48317M81778k84477o94213m44116M9581K77247
$$ -1073774 -1396553 -1583282 -1117582 -269265 212513 -71964 -766177 -1210293 -1160712 -883465
35450h83465K19511J05196m2851k30502j94734J89369M64317J76090k78744j12725
$$ -883465 -663954 -558758 -601609 -832111 -1026845 -837476 -373159 -197069 -475813 -588538
35440e88538N99192R02764L25508m70769o53815k25107K35501L11991m1444n66941
$$ -588538 10654 913418 1238926 768157 114342 -110765 124736 436727 395283 -171658
35430a71658p29732j55883P15424R23514J96054o65220r00773o90242n36237m13199
$$ -171658 -901390 -1057273 -341849 581665 777719 112499 -788274 -1478516 -2014753 -2427952
35420b427952j34259J8911j89883k45439M14125J241036J106376k4664r01954
$$ -2427952 -2562211 -2543300 -2733183 -2978622 -2564497 -1323461 -217085 -241749 -1143703
35411a143703o80729O6968M00305K80343K25743L09280K12374n7529j96965k02580
$$ -1143703 -1824432 -1757464 -1357159 -1076816 -851073 -541793 -329419 -386948 -583913 -786493
35401g86493l18721m48233k22422K73040M23385l1191n05092l17303L62434P13549
$$ -786493 -1105214 -1553447 -1775869 -1502829 -1079444 -1110635 -1615727 -1933030 -1570596 -857047
35391h57047L08457l71149m98697J89816J097844J330975N96963m42041q35795
$$ -857047 -548590 -919739 -1418436 -1228620 -130776 1200199 1797162 1355121 519326
35382E19326l91687J47060O9365m17981n38108o019O30279P27620K97337j47812
$$ 519326 127639 274699 344064 -73917 -612025 -618044 12235 739855 1037192 889380
35372H89380l00008l65453o56450j061298j127794p00084k18973j35959k11610
$$ 889380 589372 223919 -432531 -1493829 -2621623 -3321707 -3540680 -3676639 -3888249
35363c888249J55442R18281J270091P64043j312k14075J11082M36431O00958P40340
$$ -3888249 -3732807 -2814526 -1544435 -780392 -781704 -995779 -884697 -448266 152692 893032
35353H93032O41087L265p70490q90506l39165O5077j03645l44469j44897K95124
$$ 893032 1534119 1537384 766894 -123612 -462777 -397700 -501345 -845814 -990711 -695587
35343f95587N62137O10297N26471L06883J44511L14324N23553J23665p13715r28246
$$ -695587 -133450 476847 1003318 1310201 1454712 1769036 2292589 2416254 1702539 774293
35333G74293j98322L19105l14672j245760j026710K33387J131226J024192N73032
$$ 774293 575971 895076 580404 -665356 -1692066 -1458679 -327453 696739 1269771
35324A269771L39813Q6535l43594n35504k91234q2133k80189n69186n22909k52339
$$ 1269771 1609584 1696119 1352525 817021 525787 443654 163465 -405721 -928630 -1180969
35314a180969p6377N9854M31428R86881J250019P82427k59793j042782p96180
$$ -1180969 -1257346 -1197492 -766064 220817 1470836 2253263 1993470 950688 154508
35305A54508K08377Q14045M13109k81693l85347j48417l04226o33124l06479N56473
$$ 154508 362885 1176930 1590039 1308346 922999 774582 470356 -162768 -469247 87226
35295H7226Q96652L52580k59148l28711k17988k82117j95293K09824L73584o8975
$$ 87226 983878 1336458 1077310 748599 530611 248494 53201 263025 636609 567634
35285E67634n76832n75319l55597m17909n23706j59276M86396P37443L81090j62766
$$ 567634 -9198 -584517 -940114 -1358023 -1881729 -2041005 -1554609 -817166 -436076 -598842
35275e98842m36699l12216K5254J92939l311j73527J91955P66193O14718l65365
$$ -598842 -1035541 -1347757 -1322503 -1129564 -1132875 -1306402 -1114447 -348254 266464 -98901
35265i8901j085743q12161k03502j50156m07664k52717J98259L40619K58245M96717
$$ -98901 -1184644 -1996805 -2200307 -2350463 -2758127 -3010844 -2812585 -2471966 -2213721 -1717004
35255a717004R50092R71976M60874m3720k61877l83142m61610l43269j34170p3836
$$ -1717004 -766912 205064 665938 622218 360341 -22801 -484411 -827680 -961850 -1035686
35245a035686m3780J68032K99996J1968l49540j59411M43147P13528M31374R6428
$$ -1035686 -1079466 -911434 -611438 -599470 -949010 -1108421 -665274 48254 479628 576056
35235E76056M2331J10019J58123J54935j46545q25329j211769o27447L57258M75460
$$ 576056 618387 728406 886529 1041464 894919 69590 -1142179 -1769626 -1412368 -936908
35225i36908l34331p26016L8245R87575R10938j4699p34848p23337k07106M37780
$$ -936908 -1271239 -1997255 -1959010 -971435 -60497 -75196 -810044 -1533381 -1740487 -1302707
35215a302707Q79014Q45814M68462K32530K51786Q0163m17396o37008j70619M29384
$$ -1302707 -423693 422121 890583 1123113 1374899 1455062 1037666 400658 230039 659423
35205F59423M36639J6788j63127k7807r1281n38665r36302q48358l25141K23508
$$ 659423 1096062 1112850 949723 921916 830635 291970 -644332 -1492690 -1817831 -1594323
35195a594323M06617J88428k9527J45727N26564N65991J95074o0927P5716K72462
$$ -1594323 -1187706 -999278 -1028805 -883078 -356514 209477 404551 343624 419340 691802
35185F91802K70406K57035K46704j65187r52872j291112o51438L66107R27320
$$ 691802 962208 1219243 1465947 1300760 347888 -943224 -1594662 -1228555 -301235
35176c01235J030550R80857N53994l49199q68676k09332Q95618J006188P0592
$$ -301235 729315 1710172 2264166 1914967 1046291 836959 1732577 2738765 2809357
35167B809357n76312k86999J41686J569l08704k69036j38634k45102k70349P5410
$$ 2809357 2233045 1946046 2087732 2089301 1780597 1511561 1372927 1127825 857476 932886
35157I32886L95446K91271P4154J27901J57740j78363m07864J00214R21365R59539
$$ 932886 1328332 1619603 1693757 1821658 1979398 1801035 1393171 1493385 2414750 3374289
35147C374289L2670p66418n27990K87361N13674k11088j027834r33582o841O67887
$$ 3374289 3406959 2640541 2112551 2399912 2913586 2702498 1674664 741082 734241 1402128
35137A402128L40225m06570l71995O23375J399613R72299j13109n62009r6857
$$ 1402128 1742353 1335783 963788 1587163 2986776 3959075 3845966 3283957 3187100
35128C187100L03727q6903p43104p35452p2692L49678l030o27025p19284k63445
$$ 3187100 3490827 3403924 2660820 1925368 1852676 2202354 2199324 1572299 853015 589570
35118E89570j222l51238p64664m44132N26941J215877R91825J95386m69973p41122
$$ 589570 588348 237110 -527554 -971686 -444745 771132 1762957 1958343 1488370 747248
35108G47248o88499k66653M79439J013228P64947j3881m39600j44777L14167L73414
$$ 747248 58749 -207904 271535 1284763 2049710 2035829 1596229 1451452 1765619 2139033
35098B139033J85553P1659j58191p19726j111122o74828K25192M60392k65043
$$ 2139033 2324586 2396245 2238054 1518328 407206 -267622 -42430 417962 152919
35089A52919q95104n18588L24036M91829r4475m72560j18115M55125O46553N36107
$$ 152919 -742185 -1260773 -936737 -444908 -539383 -1011943 -1130058 -674933 -28380 507727
35079E07727M19232K31288j28218l85291l13000k28882n36322r72275q75567j76942
$$ 507727 926959 1158247 1030029 644738 331738 102856 -433466 -1405741 -2281308 -2458250
35069b458250L97237K54900l02068m82292K7897P41857R89987O76614K84593J70074
$$ -2458250 -2061013 -1806113 -2108181 -2590473 -2562576 -1820719 -830732 -154118 130475 300549
35059C00549J21050j70149m44785j72817N29011Q68903M61022j41691l31218k83871
$$ 300549 421599 251450 -193335 -366152 162859 1031762 1492784 1351093 1019875 736004
35049G36004m07397m85176q7203N33946P60691O00245N20076M44111j20121r14599
$$ 736004 328607 -156569 -243772 290174 1050865 1651110 2171186 2615297 2495176 1580577
35039A580577r48757k5351P04422K67630q10754j340410r77997k30382M91937
$$ 1580577 631820 606469 1310891 1578521 767767 -572643 -1550640 -1781022 -1289085
35030a289085J042600J170340Q07880M83219O58015Q50048K53308q67405j342812
$$ -1289085 -246485 923855 1731735 2214954 2872969 3723017 3976325 3108920 1766108
35021A766108p85075j70490l61310q80323p71932n1554M82960N21034M76513N42982
$$ 1766108 981033 810543 449233 -431090 -1203022 -1254576 -771616 -250582 225931 768913
35011G68913L43735k62638p17015n38782j06508j17620n22896n91881K287P30896
$$ 768913 1112648 850010 132995 -405787 -512295 -629915 -1152811 -1744692 -1742405 -1011509
35001a011509R69730P16208L14770q5834m51336o00272m49244k62963k44229j33789
$$ -1011509 -41779 674429 989199 903365 452029 -148243 -597487 -860450 -1104679 -1238468
34991a238468L06131O82621M71513n3096j24901L18131N35359J79714k34077k99826
$$ -1238468 -932337 -249716 221797 168701 43800 361931 897290 1077004 842927 543101
34981E43101l14928m97723m35013Q8538M28119j0582p52470r26809n24361j92808
$$ 543101 228173 -269550 -704563 -616025 -187906 -198488 -950958 -1877767 -2402128 -2594936
34971b594936j43659q3368N3524J33606L47037Q49126J102612N27303l27577l09202
$$ -2594936 -2738595 -2821963 -2768439 -2634833 -2287796 -1438670 -336058 191245 -136332 -445534
34961d45534O05877J173789O84925j34739l89021k08133j57427k75710l17826
$$ -445534 160343 1334132 2019057 1884318 1495297 1287164 1129737 854027 536201
34952E36201l25688l86520l31797j33090q0919j96343q4169K42714J51194m75012
$$ 536201 210513 -176007 -507804 -640894 -721813 -918156 -1002325 -759611 -608417 -1083429
34942a083429p21810k4028P28871M51353m05818n46401J47406N51905J54640k93977
$$ -1083429 -1805239 -1829267 -1100396 -649043 -1054861 -1601262 -1453856 -901951 -747311 -1041288
34932a041288j73596R4767l3410k97357j87982J93601M02825L84363M52421P43987
$$ -1041288 -1214884 -1120117 -1153527 -1450884 -1638866 -1445265 -1042440 -658077 -205656 538331
34922E38331J017801Q99020K21415p07972j202273q40560k2514M19304J31405
$$ 538331 1556132 2455152 2676567 1968595 766322 -74238 -96752 322552 453957
34913D53957n39783j110202j309190r89855k44190M08730N06213L25814N14021
$$ 453957 -85826 -1196028 -2505218 -3495073 -3739263 -3330533 -2824320 -2498506 -1984485
34904a984485J030476J138551N50656j21537k64802M6962M72151Q22237Q21727
$$ -1984485 -954009 184542 735198 613661 348859 395821 867972 1690209 2511936
34895B511936J93805o79098r26322m03051M7382l7062l7649M41628N81407l33292
$$ 2511936 2705741 2026643 1100321 697270 744652 707590 669941 1111569 1692976 1359684
34885A359684j412454j234545O1629J024846R52279M36438j3913n51593j038354
$$ 1359684 -52770 -1287315 -1225686 -200840 751439 1187877 1173964 622371 -415983
34876d15983q02516J98030R84547Q39195J71816l26592n99341q04733p30736k20696
$$ -415983 -1218499 -1020469 -35922 803273 975089 648497 49156 -755577 -1486313 -1707009
34866a707009L87367P69251J040298J221431Q85205r5464r92546j070767n71057
$$ -1707009 -1319642 -550391 489907 1711338 2596543 2501079 1508533 437766 -133291
34857a33291k25874j91255j23939K8227M7071L3953K64760N80087N75781L01392
$$ -133291 -359165 -550420 -674359 -646132 -599061 -565108 -300348 279739 855520 1156912
34847A156912J25095J061m09694q93100p45729J12135P99838O23450K796k03969
$$ 1156912 1282007 1283068 873374 -19726 -765455 -653320 146518 769968 772764 568795
34837E68795R7145K29642k33205r11708j115142o07252K09571P37215P29213M24291
$$ 568795 665940 895582 662377 -249331 -1364473 -1971725 -1762154 -1024939 -295726 128565
34827A28565J87648J05515k738k59981n69011p61610p74265o40058l84579J4968
$$ 128565 316213 421728 418990 159009 -410002 -1171612 -1945877 -2585935 -2970514 -2955546
34817b955546N39259R86568J044461O63537K44952J65788K07973j00213n96675
$$ -2955546 -2416287 -1429719 -385258 278279 523231 689019 896992 796779 200104
34808B00104n70943Q0022N03342J26463m66551n27169l18302m15661m47093K74302
$$ 200104 -370839 -290817 212525 338988 -127563 -654732 -973034 -1388695 -1835788 -1561486
34798a561486J204167J052827j58116r36309n42779j871k73965p15766l14114
$$ -1561486 -357319 695508 537392 -398917 -941696 -943567 -1217532 -1933298 -2247412
34789b247412N87131R41230O44272L51772J77744k23272o08729l96333J53641
$$ -2247412 -1660281 -719051 -74779 276993 454737 231465 -377264 -773597 -619956
34780f19956J39992n54641j065796q70243l22946K63523J031149J759652J671868
$$ -619956 -479964 -1034605 -2100401 -2970644 -3293590 -3030067 -1998918 -239266 1432602
34771A432602O14468l96524m55208N5751K09047j02988k62811l149L23242L62571
$$ 1432602 2047070 1650546 1195338 1251089 1460136 1357148 1094337 1091188 1414430 1777001
34761A777001P6670m30190r38141j096017p77549l16332o2598P2248K96398M76977
$$ 1777001 1853671 1423481 485340 -610677 -1388226 -1704558 -1767156 -1694908 -1398510 -921533
34751i21533M39385M12015O24996P38186L20081k97059l91358j5434L4618m79931
$$ -921533 -482148 -70133 554863 1293049 1613130 1316071 924713 909279 943897 463966
34741D63966q19891m64163P3764J45771j678J95125N20223L20298l03979n60093
$$ 463966 -355925 -820088 -746324 -600553 -602231 -407106 113117 433415 129436 -430657
34731d30657k37947m3171l91511o81345l08096K41731J11258m61151l71093N93484
$$ -430657 -668604 -711775 -1103286 -1784631 -2092727 -1850996 -1739738 -2200889 -2571982 -1978498
34721a978498J201969N08605o27788o31701N46925J327868P18703l93943o71246
$$ -1978498 -776529 -267924 -895712 -1527413 -980488 347380 1066083 672140 894
34712H94j77988M7532k65631l97909k8860K65196J57437K08571P97288J225188
$$ 894 -177094 -129562 -395193 -793102 -821962 -556766 -399329 -190758 606530 1831718
34702A831718O81507m42807j083171j005121q40375p89369l66612M00745O11014
$$ 1831718 2513225 2070418 987247 -17874 -858249 -1647618 -2014230 -1613485 -1002471
34693a002471j20766p85120l09137Q15733J187575M92026j68533L224M15192J34024
$$ -1002471 -1123237 -1908357 -2217494 -1401761 -214186 277840 109307 112531 527723 661747
34683F61747p05721j174231q58571k72323m1448j81170k68322k3896M00560N91497
$$ 661747 -43974 -1218205 -2076776 -2349099 -2390547 -2571717 -2840039 -2863935 -2463375 -1871878
34673a871878L02258k26722m74141k56250N5383J24545J92243O27271J120657
$$ -1871878 -1569620 -1796342 -2270483 -2526733 -2471350 -2346805 -2154562 -1527291 -406634
34664d06634R36601M1098o56783n13423l9318n9824m47485m42956r531N7000m96724
$$ -406634 529967 571065 -85718 -599141 -638459 -698283 -1145768 -1588724 -1598255 -1541255 -2037979
34653b037979q03499j59764Q18323J029239M24528p9574O568K72659K92064J56904
$$ -2037979 -2841478 -3001242 -2182919 -1153680 -729152 -808726 -802158 -529499 -237435 -80531
34643h0531j4645l26975n80465k44698O09022J041671M93249l10966l94337P7090
$$ -80531 -95176 -422151 -1002616 -1247314 -638292 403379 896628 585662 191325 268415
34633B68415K77485J30002J75960L13025q7724p75312o62956L42958Q61131J00215
$$ 268415 545900 675902 851862 1164887 1077163 301851 -361105 -18147 842984 943199
34623I43199p85224m52828N01011N42583l11657n95088J98419Q97383N97024j19733
$$ 943199 157975 -294853 206158 748741 437084 -158004 40415 937798 1534822 1415089
34613A415089m49696n84217q71363q59155j98131L43267m8553p13382l71608P69170
$$ 1415089 965393 381176 -490187 -1349342 -1547473 -1204206 -1252759 -1966141 -2337749 -1568579
34603a568579J139885J62639q27331n09036O41778J236536Q60972K14384j41199
$$ -1568579 -428694 -266055 -1093386 -1602422 -960644 275892 1136864 1351248 1210049
34594A210049k56905k24651K2726L03296K58403m8940j74733n2664j28106n20607
$$ 1210049 953144 728493 751219 1054515 1312918 1263978 1089245 1036581 908475 387868
34584C87868o58942j65979L91539K19094n34685r59719o36289q0092J19566N095
$$ 387868 -271074 -437053 -45514 173580 -361105 -1320824 -1957113 -2037205 -1917639 -1912544
34574a912544j22637k42603l92516l03246K58702R84114J315280J146100Q06110
$$ -1912544 -2035181 -2277784 -2670300 -2973546 -2714844 -1730730 -415450 730650 1536760
34565A536760M38479q5309n94173n65010N6454M78423J3147q77785j083152l36096
$$ 1536760 1975239 1889930 1295757 730747 787201 1265624 1278771 400986 -682166 -1018262
34555a018262L90251J71956o70480j042698m51108N29933J054215Q43793K13553
$$ -1018262 -628011 -456055 -1126535 -2169233 -2620341 -2090408 -1036193 -192400 21153
34546B1153l44964m45734J7092P25477J121990R35414M25625J237k22990l51631
$$ 21153 -323811 -769545 -752453 -26976 1095014 2030428 2456053 2457290 2234300 1882669
34536A882669m36744n02084n95855n60835o9102P25191R54502J23733q54772o44710
$$ 1882669 1445925 943841 347986 -212849 -281951 443240 1397742 1521475 666703 21993
34526B1993N22015R55067m9904j050505n38132Q24033J224750L08205o36478q05777
$$ 21993 544008 1499075 1449171 398666 -139466 684567 1909317 2217522 1581044 775267
34516G75267p08882p34122l59535O09329J203473N72267o76495j276942r09569
$$ 775267 66385 -667737 -1027272 -417943 785530 1357797 681302 -595640 -1505209
34507a505209k39811J85575K94733Q4405l51119n64316k11333L69765O20680N84419
$$ -1505209 -1745020 -1559445 -1264712 -1180307 -1531426 -2095742 -2307075 -1937310 -1316630 -732211
34497g32211O19705N54728k5178p35917o14347M06157J130776O72375l14779n72661
$$ -732211 -112506 442222 417044 -318873 -933220 -527063 603713 1276088 961309 388648
34487C88648P2079O48958M63531j02077l07692q3900k0764m79054j030769r49894
$$ 388648 460727 1109685 1573216 1471139 1163447 1079547 1058783 579729 -451040 -1400934
34477a400934j48657O64062Q55037N90085M10953L75023J13904l55429m98306
$$ -1400934 -1549591 -885529 -30492 559593 970546 1345569 1459473 1104044 605738
34468F05738j21606J67630k36116r76934j043615j4920J317699J700595P14032
$$ 605738 484132 651762 415646 -561288 -1604903 -1619823 -302124 1398471 2112503
34459B112503p52788j363587o74078M92344J046147P80756L13044J21502P4125
$$ 2112503 1359715 -3872 -677950 -185606 860541 1641297 1954341 2075843 2149968
34450B149968j31716n01857q32546r52755p79466l83810m1207M7561O9149L10815
$$ 2149968 2018252 1516395 683849 -268906 -1048372 -1432182 -1473389 -1425828 -1356679 -1045864
34440a045864O16739N72304K18654L0085Q5735j02934o82670j021061o26599L2866
$$ -1045864 -429125 143179 361833 391918 477653 374719 -307951 -1329012 -1955611 -1922745
34430a922745K01270p2750j40102K00130M91375L76275J7219k50906k71844o5124
$$ -1922745 -1721475 -1794225 -1934327 -1734197 -1242822 -866547 -849328 -1100234 -1372078 -1437202
34420a437202J97776K52577O3323k3419K56004O30717O68997M09718J72724p1976
$$ -1437202 -1239426 -986849 -923526 -946945 -690941 -60224 608773 1018491 1191215 1119239
34410A119239n57708j020958q45121o1257M42603P9792n47864m16954N04615J126894
$$ 1119239 561531 -459427 -1304548 -1365805 -923202 -843410 -1391274 -1808228 -1303613 -176719
34400a76719N64504p46810j464569p89831O70898J577797J283477L81434j49263
$$ -176719 387785 -359025 -1823594 -2613425 -1942527 -364730 918747 1300181 1150918
34391A150918k3244K97272L38281Q2334j89076k66290k43042m32733q93164j082623
$$ 1150918 1127674 1424946 1763227 1845561 1656485 1390195 1147153 714420 -178744 -1261367
34381a261367m36266O38102J005227L72142j51317L18279J029579P85806j09460
$$ -1261367 -1697633 -1059531 -54304 317838 166521 484800 1514379 2300185 2190725
34372B190725l93559M1198R4994m93916o76035m2196L47506j60652n66621Q3143
$$ 2190725 1797166 1838364 1933358 1439442 763407 721211 1068717 908065 341444 424587
34362D24587R87560R04107J97738P9264M78252L07188m86039p95887l19596o4935
$$ 424587 1412147 2316254 2513992 2593256 3071508 3378696 2892657 2096770 1777174 1712239
34352A712239n50026q99116l53696M51266M95578j67147p27877q05276o01786
$$ 1712239 1162213 263097 -90599 360667 856245 689098 -38779 -844055 -1445841
34343a445841l08613N727J92534K03640K44099M00138M23958K05601P6833K73516
$$ -1445841 -1754454 -1748727 -1556193 -1352553 -1108454 -708316 -284358 -78757 -1924 271592
34333B71592M81221L36116Q587j75987l39697p25987j053808q14367p7334N66694
$$ 271592 752813 1088929 1097516 921529 581832 -144155 -1197963 -2012330 -2089664 -1522970
34323a522970P97602P75541O24042K73729j38589k67233r7559j1963j38270r4183
$$ -1522970 -725368 50173 674215 947944 809355 542122 444563 432600 294330 200147
34313B00147L41721P02545L78103n18939j216340j156169n10578J74243N75920
$$ 200147 541868 1244413 1622516 1103577 -112763 -1268932 -1779510 -1605267 -1029347
34304a029347P14821O43980K67053m24646j040652r74969p2156J002537J302917
$$ -1029347 -314526 329454 596507 171861 -868791 -1843760 -1915916 -913379 389538
34295C89538N63766n19147j013499o31633J36632N96835M44966p1087l99254j25623
$$ 389538 953304 434157 -579342 -1210975 -1074343 -477508 -32542 -103629 -502883 -628506
34285f28506O44430J279505J137608K40468o25377o81772o0879L13948j05269
$$ -628506 15924 1295429 2433037 2673505 2048128 1366356 1305477 1619425 1514156
34276A514156p46131p19361j52552p3781q59629j514872r89127L17598J085978
$$ 1514156 768025 48664 -103888 -177669 -1037298 -2552170 -3541297 -3223699 -2137721
34267b137721Q46632L96961M47014O92765N52271J21901j31267j57673k13565
$$ -2137721 -1291089 -894128 -447114 245651 797922 919823 788556 630883 417318
34258D17318k58234p8126J31204o7511n82614p73807l67618J19588J56792m3460
$$ 417318 159084 80958 212162 144651 -437963 -1211770 -1579388 -1459800 -1303008 -1346468
34248a346468K7856K70387R4284n71512r61739m53507N06313R00060M39224j32041
$$ -1346468 -1318612 -1048225 -953941 -1525453 -2487192 -2940699 -2434386 -1534326 -1095102 -1227143
34238a227143j32962J66796J47587o6542J91457Q96055J106386L34490n57045
$$ -1227143 -1360105 -1193309 -1045722 -1112264 -920807 -24752 1081634 1416124 859079
34229H59079m97496K15021L71455k78509o54091q6943N62147K04519p79037j082976
$$ 859079 361583 576604 948059 669550 15459 -71484 490663 695182 -83855 -1166831
34219a166831l89951K60459O1149m99533n02163J49578Q25189J078689R42609
$$ -1166831 -1556782 -1296323 -1235174 -1734707 -2236870 -2087292 -1262103 -183414 759195
34210G59195N61627N1507l30613l00234Q5381M26470M36275K48869K04652L94007
$$ 759195 1320822 1372329 1041716 741482 826863 1253333 1689608 1938477 2143129 2537136
34200B537136M61210o7737j146870j978832j721792m99321O25700Q51445M58224
$$ 2537136 2998346 2930609 1783739 -195093 -1916885 -2416206 -1790506 -939061 -480837
34191d80837J83331K03388K10525J66135L22356N99065N86752K06898k03802n04129
$$ -480837 -297506 -94118 116407 282542 604898 1203963 1790715 1997613 1793811 1289682
34181A289682q19640r37368l96695N54027R05192K92367k95763P1052P92027O20482
$$ 1289682 470042 -467326 -864021 -309994 595198 887565 591802 662854 1454881 2075363
34171B075363m00450r98866n78152M9866M1759l63519n36365m36017l20590j00300
$$ 2075363 1674913 676047 97895 147761 189520 -173999 -710364 -1146381 -1466971 -1567271
34161a567271L79505Q23993Q48334N55118K51440r1495n49182p20416j75409O96119
$$ -1567271 -1187766 -363773 484561 1039679 1291119 1199624 650442 -69974 -245383 450736
$$ [...]
##END NTUPLES=NMR SPECTRUM
##END=
