##TITLE=31Pdec_DE-63_36
 D2O, 64 sc
 15.8.2024
##JCAMPDX= 6.0         $$ Bruker NMR JCAMP-DX V2.0
##DATA TYPE= NMR SPECTRUM
##DATA CLASS= NTUPLES
##ORIGIN= UXNMR, Bruker Analytische Messtechnik GmbH
##OWNER= root
$$ XWIN-NMR		Version 3.5
$$ Thu Aug 15 15:42:02 2024 Russian Standard Time (UT+4h)  she@DPX200
##.OBSERVE FREQUENCY= 81.013821
##.OBSERVE NUCLEUS= ^31P
##.ACQUISITION MODE= SIMULTANEOUS
##.ACQUISITION SCHEME= undefined
##.AVERAGES= 64
##.DIGITISER RES= 17
##SPECTROMETER/DATA SYSTEM= spect
##.PULSE SEQUENCE= zgpg30
##.SOLVENT NAME= CDCl3
##.SHIFT REFERENCE= (INTERNAL, CDCl3, 0, 198.062)
##AUDIT TRAIL= $$ (NUMBER, WHEN, WHO, WHERE, WHAT)
$$ ##TITLE= Audit trail, XWIN-NMR		Version 3.5
$$ ##JCAMPDX= 5.01
$$ ##ORIGIN= Bruker BioSpin GmbH
$$ ##OWNER= she
$$ F:/spectra/data/she/nmr/P31/2/pdata/1/auditp.txt
$$ ##AUDIT TRAIL=  $$ (NUMBER, WHEN, WHO, WHERE, WHAT)
(   1,<2024-08-15 15:39:53.35 +0400>,<she>,<DPX200>,
      <created by zg, POWCHK disabled, PULCHK disabled
       configuration hash MD5:
       00 E9 B6 7A A2 85 ED C7 34 08 36 98 17 FE 4E 26
       data hash MD5: 32K
       C0 CF C2 10 AF 41 BF 7C 55 8B 11 05 3F 7A 26 AE>)
(   2,<2024-08-15 15:41:05.18 +0400>,<she>,<DPX200>,
      <Start of raw data processing
       efp BC_mod = 2 LB = 1.5 FT_mod = 6 PKNL = 1 PHC0 = 2682.584 PHC1 = 62.0881 SI = 64K 
       data hash MD5: 64K
       9B 40 10 A7 DC 7E CB B7 A1 16 C5 68 42 D7 61 86>)
(   3,<2024-08-15 15:41:24.23 +0400>,<she>,<DPX200>,
      <pk PHC0 = -55.01757 PHC1 = 143.6 
       data hash MD5: 64K
       5F 29 88 2E A9 CF 01 A5 73 A8 0D B3 4C F9 66 73>)
$$ ##END=
$$ 
$$ hash MD5
$$ AF 6D 00 AE 09 B5 47 06 8C DC E2 F5 4C DA 0C 46
##$RELAX= 
##$RELAX= 
##$RELAX= 
##$RELAX= 
##$RELAX= 
##$RELAX= 
##$RELAX= 
##$RELAX= 
$$ Bruker specific parameters
$$ --------------------------
##$DU= <F:/spectra>
##$EXPNO= 2
##$NAME= <P31>
##$PROCNO= 1
##$TYPE= <nmr>
##$USER= <she>
##$AMP= (0..31)
100 100 100 100 100 100 100 100 100 100 100 100 100 100 100 100 100 100 
100 100 100 100 100 100 100 100 100 100 100 100 100 100 
##$AQSEQ= 0
##$AQ_mod= 1
##$AUNM= <au_zg>
##$AUTOPOS= <>
##$BF1= 81.014009
##$BF2= 200.13
##$BF3= 200.13
##$BF4= 200.13
##$BF5= 200.13
##$BF6= 200.13
##$BF7= 200.13
##$BF8= 200.13
##$BYTORDA= 1
##$CFDGTYP= 0
##$CFRGTYP= 5
##$CHEMSTR= <none>
##$CNST= (0..31)
1 1 145 1 1 1 1 1 1 1 1 1 1 1 1 1 1 1 1 1 1 1 1 1 1 1 1 1 1 1 1 1 
##$CPDPRG= <waltz16>
##$CPDPRG1= <>
##$CPDPRG2= <waltz16>
##$CPDPRG3= <>
##$CPDPRG4= <mlev>
##$CPDPRG5= <mlev>
##$CPDPRG6= <mlev>
##$CPDPRG7= <mlev>
##$CPDPRG8= <mlev>
##$CPDPRGB= <>
##$CPDPRGT= <>
##$D= (0..31)
0 1 0 0 0 0 0 0 0 0.06 0 0.03 2e-05 3e-06 0 0 0.0002 0 0 0 0 0 0 0 0 0 
0 0 0 0 0 0 
##$DATE= 1723721992
##$DBL= (0..7)
120 120 120 11 120 120 24 19 
##$DBP= (0..7)
150 150 150 150 150 150 150 150 
##$DBP07= 0
##$DBPNAM0= <>
##$DBPNAM1= <>
##$DBPNAM2= <>
##$DBPNAM3= <>
##$DBPNAM4= <>
##$DBPNAM5= <>
##$DBPNAM6= <>
##$DBPNAM7= <>
##$DBPOAL= (0..7)
0.5 0.5 0.5 0.5 0.5 0.5 0.5 0.5 
##$DBPOFFS= (0..7)
$$ [...]
##$SUBNAM3= <"">
##$SUBNAM4= <"">
##$SUBNAM5= <"">
##$SUBNAM6= <"">
##$SUBNAM7= <"">
##$SUBNAM8= <"">
##$SUBNAM9= <"">
##$SW= 400.765351723535
##$SWIBOX= (0..15)
0 1 3 0 0 0 0 0 0 0 0 0 0 0 0 0 
##$SW_h= 32467.5324675325
##$TD= 32768
##$TD0= 1
##$TE= 0
##$TE2= 300
##$TE3= 300
##$TEG= 300
##$TL= (0..7)
0 120 53 12 22 120 120 120 
##$TP= (0..7)
150 150 150 150 150 150 150 150 
##$TP07= 0
##$TPNAME0= <>
##$TPNAME1= <>
##$TPNAME2= <>
##$TPNAME3= <>
##$TPNAME4= <>
##$TPNAME5= <>
##$TPNAME6= <>
##$TPNAME7= <>
##$TPOAL= (0..7)
0.5 0.5 0.5 0.5 0.5 0.5 0.5 0.5 
##$TPOFFS= (0..7)
0 0 0 0 0 0 0 0 
##$TUNHIN= 0
##$TUNHOUT= 0
##$TUNXOUT= 0
##$USERA1= <user>
##$USERA2= <user>
##$USERA3= <user>
##$USERA4= <user>
##$USERA5= <user>
##$V9= 5
##$VALIST= <valist>
##$VCLIST= <CCCCCCCCCCCCCCC>
##$VD= 0
##$VDLIST= <DDDDDDDDDDDDDDD>
##$VPLIST= <PPPPPPPPPPPPPPP>
##$VTLIST= <TTTTTTTTTTTTTTT>
##$WBST= 1024
##$WBSW= 4
##$XGAIN= (0..3)
0 0 0 0 
##$XL= 0
##$YL= 0
##$YMAX_a= 12760
##$YMIN_a= -8410
##$ZGOPTNS= <>
##$ZL1= 120
##$ZL2= 120
##$ZL3= 120
##$ZL4= 120
##$ABSF1= 0
##$ABSF2= 0
##$ABSG= 0
##$ABSL= 0
##$ALPHA= 0
##$AQORDER= 0
##$ASSFAC= 0
##$ASSFACI= 0
##$ASSFACX= 0
##$ASSWID= 0
##$AUNMP= <proc_1d>
##$AZFE= 0.1
##$AZFW= 0.5
##$BCFW= 0
##$BC_mod= 2
##$BYTORDP= 0
##$COROFFS= 0
##$CY= -3
##$DATMOD= 1
##$DC= 0
##$DFILT= <>
##$DTYPP= 0
##$F1P= 0
##$F2P= 0
##$FCOR= 1
##$FTSIZE= 65536
##$FT_mod= 6
##$GAMMA= 0
##$GB= 0
##$INTBC= 1
##$INTSCL= 9.790993e-09
##$ISEN= 30
##$LB= 1.5
##$LEV0= 0
##$LPBIN= 0
##$MAXI= 10000
##$MC2= 0
##$MEAN= 0
##$ME_mod= 0
##$MI= 50
##$NCOEF= 0
##$NC_proc= -9
##$NLEV= 6
##$NOISF1= 182.463
##$NOISF2= 159.3651
##$NSP= 0
##$NTH_PI= 0
##$NZP= 0
##$OFFSET= 198.0616
##$PC= 4
##$PHC0= 2627.566
##$PHC1= 205.6881
##$PH_mod= 1
##$PKNL= yes
##$PPARMOD= 0
##$PSCAL= 0
##$PSIGN= 0
##$REVERSE= no
##$SF= 81.0140089999434
##$SI= 65536
##$SIGF1= 159.3651
##$SIGF2= -187.1042
##$SINO= 113.3802
##$SIOLD= 16384
##$SREGLST= <1H.CDCl3>
##$SSB= 0
##$STSI= 65536
##$STSR= 0
##$SW_p= 32467.5324675325
##$SYMM= 0
##$S_DEV= 0
##$TDeff= 32768
##$TDoff= 0
##$TI= <>
##$TILT= no
##$TM1= 0
##$TM2= 0
##$TOPLEV= 0
##$USERP1= <user>
##$USERP2= <user>
##$USERP3= <user>
##$USERP4= <user>
##$USERP5= <user>
##$WDW= 1
##$XDIM= 65536
##$YMAX_p= 441344025
##$YMIN_p= -199259094
$$ End of Bruker specific parameters
$$ ---------------------------------
##NTUPLES= NMR SPECTRUM
##VAR_NAME=  FREQUENCY,     SPECTRUM/REAL,   SPECTRUM/IMAG
##SYMBOL=    X,             R,               I
##VAR_TYPE=  INDEPENDENT,   DEPENDENT,       DEPENDENT
##VAR_FORM=  AFFN,          ASDF,            ASDF
##VAR_DIM=   65536,         65536,           65536
##UNITS=     HZ,            ARBITRARY UNITS, ARBITRARY UNITS
##FACTOR=    0.49542278885378, 1,            1
##FIRST=     16045.7642231865, 0,            0
##LAST=      -16421.768244346, 0,            0
##MIN=       -16421.768244346, -199259094,   0
##MAX=       16045.7642231865, 441344025,    0
$$ Real data points
##PAGE= N=1
##DATA TABLE= (X++(R..R)), XYDATA
$$ [...]
$$ plain form
42989 -3561747 -8910557 -11434854 -8116220 -2176147 -841828 -6433419 -12508642 -11529245
42981 -11529245 -4016499 3017438 5007582 3712183 2888863 3392087 2957984 -1091464
42973 -1091464 -8894212 -16394287 -17607741 -10641609 -661288 5421426 6401589 6285042
42965 6285042 7279635 7282626 5133320 4360951 8696351 15661553 17939498 11644468 1422620
42956 1422620 -3998974 -1037724 5146702 6796702 2051844 -4303877 -7545491 -7405556
42948 -7405556 -5588363 -2756570 -20842 -37879 -3392159 -6283425 -5286944 -2465703 -2072007
42939 -2072007 -3993918 -4779930 -3813359 -3568327 -4328972 -3959604 -3297587 -6260799 -12774687
42930 -12774687 -16364458 -11735846 -1806074 5129541 3246823 -6615597 -17752803 -21883851
$$ packed form
42989c561747n348810k524297L318634N940073J334319n591591o075223R79397
42981a1529245P512746P033937J990144j295399q23320N03224m34103m049448
42973a091464p802748p500075j213454O966132R980321O082714R80163j16547
42965F285042R94593K991k149306p72369M335400O965202K277945o295030j0221848
42956A422620n421594K961250O184426J650000m744858o355721l241614J39935
42948g405556J817193K831793K735728j7037l354280k891266R96481K821241L93696
42939b072007j921911p86012R66571K45032p60645L69368O62017k963212o513888
42930a2774687l589771M628612R929772O935615j882718r862420j1137206m131048
$$ plain form
42922 -21883851 -16186023 -7278805 -4878297 -10688517 -17634309 -20738929 -22837016 -26896558
42914 -26896558 -29104222 -24989298 -17875543 -14779817 -16359439 -17115310 -14339594 -10958619
42906 -10958619 -9666167 -9731487 -10532878 -13521893 -18794141 -23058016 -23162179 -19902015 -17014098
42897 -17014098 -17418381 -20885105 -24558139 -25816982 -24902562 -23442041 -20112699 -11088679
42889 -11088679 2755089 12583025 10461387 114009 -6285338 -2157405 7209615 13030022
42881 13030022 12957938 10710712 9645989 9873323 10059014 9665492 9635683 11315340 13949925
42872 13949925 13957449 8813683 1190183 -3626146 -4350526 -4314972 -5050551 -3525966 2110750
42863 2110750 7827265 8322027 4287241 1545871 3811180 9270211 14030948 16251447
$$ packed form
42922b1883851N697828Q907218K400508n810220o945792l104620k098087m059542
42914b6896558k207664M114924P113755L095726j579622p55871K775716L380975
42906a0958619J292452o5320q01391k989015n272248m263875j04163L260164K887917
42897a7014098m04283l466724l673034j258843R14420J460521L329342R024020
42889a1088679J3843768R827936k121638j0347378o399347M127933R367020N820407
42881A3030022p2084k247226j064723K27334J85691l93522k9809J679657K634585
42872A3949925P524n143766p623500m816329p24380L5554p35579J524585N636716
42863B110750N716515M94762m034786k741370K265309N459031M760737K220499
$$ plain form
42855 16251447 16462233 15923601 15660413 16062372 16598091 16263577 14697775 12701158 11382383
42846 11382383 10674037 8948120 4794995 -647586 -4164943 -3926497 -1353965 1311706
42838 1311706 3515749 4707726 2451590 -4129140 -10271610 -9778436 -3713362 167237
42830 167237 -1521263 -2558789 3145859 10875733 10087805 -1486653 -14476126 -19038547
42822 -19038547 -14775518 -8283966 -4827384 -4702553 -5239264 -3968546 -1076664 -138407
42814 -138407 -4961982 -14384819 -21876037 -22149597 -16961876 -12457264 -11844441 -12980857 -12489880
42805 -12489880 -9378007 -4237526 2176358 7889866 9331552 4549578 -3625559 -9359485
42797 -9359485 -8744563 -2334972 5860463 10267743 6477062 -4153534 -12706279 -9912913
$$ packed form
42855A6251447K10786n38632k63188M01959N35719l34514j565802j996617j318775
42846A1382383p08346j725917m153125n442581l517357K38446K572532K665671
42838A311706K204043J191977k256136o580730o142470M93174O065074L880599
42830A67237j688500j037526N704648P729874p87928j1574458j2989473m562421
42822a9038547M263029O491552L456582J24831n36711J270718K891882R38257
42814a38407m823575r422837p491218k73560N187721M504612O12823j136416M90977
42805a2489880L111873N140481O413884N713508J441686m781974q175137n733926
42797i359485O14922O409591Q195435M407280l790681j0630596q552745K793366
$$ plain form
42789 -9912913 2736068 12496503 9065614 -3753269 -13661614 -14877834 -12442932 -12226355
42781 -12226355 -12905912 -10391731 -5343483 -1812158 -793944 359027 2856877 4966181
42773 4966181 6099173 8762030 14670256 21487327 25769106 27494244 28783199 28734105
42765 28734105 23132249 10861247 -2088641 -8067552 -6263098 -2614864 -1419275 -883952
42757 -883952 1535179 3461674 1068046 -4155950 -6762760 -4835549 -1650658 317562
42749 317562 2284320 4645337 4435992 514769 -2422681 710246 7992358 12665954
42741 12665954 11482097 6949772 2279160 -1252248 -1832897 2725786 10168438 13317041
42733 13317041 7975643 -1019888 -5064984 -1625580 4488160 8473721 9924421 9590233
$$ packed form
42789i912913J2648981R760435l430889j2818883r908345j216220K434902K16577
42781a2226355o79557K514181N048248L531325J018214J152971K497850K109304
42773D966181J132992K662857N908226O817071M281779J725138J288955m9094
42765B8734105n601856j2271002j2949888n978911J804454L648234J195589N35323
42757h83952K419131J926495k393628n223996k606810J927211L184891J968220
42749C17562J966758K361017k09345l921223k937450L132927P282112M673596
42741A2665954j183857m532325m670612l531408n80649M558683P442652L148603
42733A3317041n341398q995531m045096L439404O113740L985561J450700l34188
$$ plain form
42725 9590233 6375591 359586 -4104751 -2281172 4483885 9395167 7787627 1624532
42717 1624532 -4215319 -7514811 -8955771 -9026960 -7529787 -5500943 -4963706 -6313040 -7743858
42708 -7743858 -7789928 -6879598 -5705636 -3544468 540616 5516192 8583657 7684678 3506597
42699 3506597 -943599 -2885782 -2299927 -1733645 -3086216 -5148506 -5432543 -3892022 -2964915
42690 -2964915 -3807747 -4629561 -3665174 -1776749 -485930 936839 4128337 8188783 10096349
42681 10096349 8719768 6215088 4675122 3396330 1074292 -701419 1261799 6728242
42673 6728242 10666394 8650122 2395474 -2374210 -3241322 -3427162 -5857461 -7935139
42665 -7935139 -5189505 1459541 5873221 4368125 -7814 -2014877 -425941 1991234
$$ packed form
42725I590233l214642o016005m464337J823579O765057M911282j607540o163095
42717A624532n839851l299492j440960p1189J497173K028844N37237j349334j430818
42708g743858m6070R10330J173962K161168M085084M975576L067465q98979m178081
42699C506597m450196j942183N85855N66282j352571k062290k84037J540521R27107
42690b964915q42832q21814R64387J888425J290819J422769L191498M060446J907566
42681A0096349j376581k504680j539966j278792k322038j775711J963218N466443
42673F728242L938152k016272o254648m769684q67112j85840k430299k077678
42665g935139K745634O649046M413680j505096m375939k007063J588936K417175
$$ plain form
42657 1991234 2711638 1572058 -342946 -2090053 -3343325 -4369219 -5231458 -5008191 -3076719
42648 -3076719 -1245713 -2351311 -5751866 -6749755 -2577443 3060614 4090129 -645731
42640 -645731 -7008050 -11442325 -13961218 -15454445 -15374080 -12984691 -8489021 -2167217 5268918
42631 5268918 10727509 9962480 2672244 -5478967 -8020207 -3936100 2472044 6529483
42623 6529483 6435501 3324638 647973 2415924 8903328 14170040 11150333 231912
42615 231912 -10155942 -13155283 -10810123 -9175141 -8946456 -5745452 1019795 5258213
42607 5258213 2343062 -4172511 -7594511 -6959813 -6538722 -8045913 -8298599 -5037056 -838203
42598 -838203 351363 -2384060 -7383664 -12456713 -14902350 -12371640 -6111108 -1240765
$$ packed form
42657A991234P20404j139580j915004j747107j253272j025894q62239K23267J931472
42648c076719J831006j105598l400555r97889M172312N638057J029515m735860
42640f45731o362319m434275k518893j493227Q0365K389389M495670O321804P436135
42631E268918N458591p65029p290236q151211k541240M084107O408144M057439
42623F529483r3982l110863k676665J767951O487404N266712l019707j0918421
42615B31912j0387854k999341K345160J634982K28685L201004O765247M238418
42607E258213k915151o515573l422000O34698M21091j507191k52686L261543M198853
42598h38203J189566k735423m999604n073049k445637K530710O260532M870343
$$ plain form
42590 -1240765 -1359211 -4590808 -7292478 -9536359 -13457281 -17561350 -17145123 -10923695
42582 -10923695 -3463083 535370 1322874 1255944 -538328 -6876555 -16280411 -21855762
42574 -21855762 -18566609 -9744321 -3491286 -2941803 -3259468 404219 5048798 3320598
42566 3320598 -6435962 -17657232 -23514640 -23717521 -21964058 -20044494 -17205415 -13231482
42558 -13231482 -9210868 -6144513 -4849954 -6238939 -9876645 -13493515 -15821347 -18469060
42550 -18469060 -22705092 -25905668 -24362176 -19053300 -15457906 -17211217 -22203554 -25320341
42542 -25320341 -23261324 -16678176 -9533488 -6598270 -9833375 -16654419 -22472669 -24566505
42534 -24566505 -22872343 -18572844 -13643515 -10308834 -8691766 -6238222 -1699367 2047869
$$ packed form
42590a240765j18446l231597k701670k243881l920922m104069M16227O221428
42582a0923695P460612L998453P87504o6930j794272o338227r403856n575351
42574b1855762L289153Q822288O253035N49483l17665L663687M644579j728200
42566C320598r756560j1221270n857408k02881J753463J919564K839079L973933
42558a3231482M020614L066355J294559j388985l637706l616870k327832k647713
42550a8469060m236032l200576J543492N308876L595394j753311m992337l116787
42542b5320341K059017O583148P144688K935218l235105o821044n818250k093836
42534b4566505J694162M299499M929329L334681J617068K453544M538855L747236
$$ plain form
42526 2047869 2082147 418420 911213 2677043 1570960 -2437960 -5113995 -5739486 -8849199
42517 -8849199 -15881593 -20887866 -18588230 -12418247 -9905314 -12822749 -16407332 -16520986
42509 -16520986 -13370270 -9134030 -5612503 -3745190 -2487466 1187437 8365022 15044688
42501 15044688 15929096 10874101 4567345 181808 -3173545 -6314181 -7059779 -3507039
42493 -3507039 2083653 5113338 3554021 -670618 -4688579 -7273623 -8186607 -6721293
42485 -6721293 -2692435 1473454 1869929 -2342146 -6998051 -7544313 -4726529 -3351570
42477 -3351570 -6010769 -11030850 -16532266 -22545615 -27675411 -27650197 -20498496 -10918694
42469 -10918694 -6114302 -8182666 -12914324 -14900553 -11648520 -4317571 2655395 3781577
$$ packed form
42526B047869L4278j663727M92793J765830j106083m008920k676035o25491l109713
42517h849199p032394n006273K299636O169983K512933k917435l584583j13654
42509a6520986L150716M236240L521527J867313J257724L674903P177585O679666
42501A5044688Q84408n054995o306756m385537l355353l140636p45598L552740
42493c507039N590692L029685j559317m224639m017961k585044r12984J465314
42485f721293M028858M165889L96475m212075m655905n46262K817784J374959
42477c351570k659199n020081n501416o013349n129796K5214P151701R579802
42469a0918694M804392k068364m731658j986229L252033P330949O972966J126182
$$ plain form
42461 3781577 -2402109 -10820084 -15134525 -15134246 -16136459 -21454380 -28616588 -33222551 -33338792
42452 -33338792 -29258454 -21920838 -13228288 -5927895 -1571939 236740 -201639 -3810125
42444 -3810125 -10522829 -17110501 -18738320 -12846649 -1578786 9092112 13356472 10478234
42436 10478234 5855599 5528375 9393360 11638741 8156698 1195594 -4342980 -6811622
42428 -6811622 -7956667 -8765369 -7833535 -3705196 3067894 10416882 16021451 18071931
42420 18071931 16166688 11872487 7371125 3173371 -1817587 -7594278 -11887850 -13064995
42412 -13064995 -13072422 -15296684 -19689734 -22669180 -22707606 -23011765 -26123386 -28328553 -23692591
42403 -23692591 -13006382 -4044243 -1940027 -3759175 -4760801 -5519174 -8680726 -11916670
$$ packed form
42461C781577o183686q417975m314441K79j002213n317921p162208m605963j16241
42452c3338792M080338P337616Q692550P300393M355956J808679m38379l608486
42444c810125o712704o587672j627819N891671J1267863J0670898M264360k878238
42436A0478234m622635l27224L864985K245381l482043o961104n538574k468642
42428f811622j145045q08702R31834M128339O773090P348988N604569K050480
42420A8071931j905243m294201m501362m197754m990958n776691m293572j177145
42412a3064995p427k224262m393050k979446l8426l04159l111621k205167M635962
42403b3692591J0686209Q962139K104216j819148j001626p58373l161552l235944
$$ plain form
42395 -11916670 -9878556 -2689626 2578989 217147 -7570645 -13623008 -13079710 -7184845
42387 -7184845 -2171835 -4534108 -14525605 -23848615 -23112626 -12913627 -4246437 -5823432
42379 -5823432 -14025044 -18440645 -14848608 -8446985 -5148513 -4509571 -2855158 149721
42371 149721 1286715 -951327 -3798202 -3557713 205068 4932265 8509895 10856857
42363 10856857 12240055 11763901 8504287 3152470 -2545839 -7273035 -9949618 -8961238
42355 -8961238 -3598353 3603716 7945627 7117790 3619323 1551095 1806866 1900360 359576
42346 359576 -576623 2085291 7422806 10989422 10229433 7294985 4979133 2180191 -3205591
42337 -3205591 -8076720 -5784579 4566422 14861078 17070860 12357201 7418258 4525168
$$ packed form
42395a1916670K038114P188930N268615k361842p787792o052363N43298N894865
42387g184845N013010k362273r991497r323010P35989J0198999Q667190j576995
42379e823432q201612m415601L592037O401623L298472O38942J654413L004879
42371A49721J136994k238042k846875K40489L762781M727197L577630K346962
42363A0856857J383198m76154l259614n351817n698309m727196k676583R88380
42355h961238N362885P202069M341911q27837l498467k068228K55771R3494j540784
42346C59576r36199K661914N337515L566616p59989k934448k315852k798942n385782
42337c205591m871129K292141J0351001J0294656K209782m713659m938943k893090
$$ plain form
42329 4525168 218491 -7073825 -13364535 -14111685 -9319343 -2587555 2135755 2286009
42321 2286009 -1808447 -6249181 -7088810 -5248650 -5195109 -8332410 -11369218 -12411795 -14457710
42312 -14457710 -20059335 -25943542 -26713106 -21877525 -15546582 -10463900 -6119403 -2311822
42304 -2311822 -721611 -1985821 -4006571 -4650410 -4383550 -4833546 -6055685 -6982743 -8036247
42295 -8036247 -11108675 -15912885 -17898555 -12344534 -953890 7983927 7840446 696441
42287 696441 -5846649 -7628378 -6859853 -6642078 -6177947 -2778025 3806595 10858268 15393963
42278 15393963 16436466 15526282 15361915 16864502 17587326 14347960 7172606 -850615
42270 -850615 -6756167 -8536981 -4290450 5390062 14466740 15821443 9951564 4913899
$$ packed form
42329D525168m306677p292316o290710p47150M792342O731788M723310J50254
42321B286009m094456m440734q39629J840160N3541l137301l036808j042577k045915
42312a4457710n601625n884207p69564M835581O330943N082682M344497L807581
42304b311822J590211j264210k020750o43839K66860m49996j222139r27058j053504
42295h036247l072428m804210j985670N554021J1390644Q937817j43481p144005
42287F96441o543090j781729P68525K17775M64131L399922O584620P051673M535695
42278A5393963J042503r10184j64367J502587P22824l239366p175354q023221
42270h50615n905552j780814M246531R680512R076678J354703n869879n037665
$$ plain form
42262 4913899 5630421 7624986 4319407 -3366185 -8545982 -6877762 -104711 6726595
42254 6726595 8633451 3743846 -3866629 -6801540 -3011178 808565 -1981017 -8764765
42246 -8764765 -11869358 -9382049 -6239821 -5999801 -7386336 -8769649 -10516897 -12182955
42238 -12182955 -12074036 -10479372 -9295015 -8075220 -4860951 -1372782 -2342862 -8230771
42230 -8230771 -13344500 -13326305 -10327219 -8422208 -7927419 -7261145 -7057657 -8880981 -11841138
42221 -11841138 -13324198 -11761927 -7135092 -895059 3135227 753482 -7322382 -14706608
42213 -14706608 -16436038 -14351434 -12837118 -12243354 -10410557 -8192891 -8219943 -8917844 -5242773
42204 -5242773 3338270 10037378 8549842 956178 -5024195 -5293424 -3137039 -3895223
$$ packed form
42262D913899P16522J994565l305579p685592n179797J668220O773051O831306
42254F726595J906856m889605p610475k934911L790362L819743k789582o783748
42246h764765l104593K487309L142228K40020j386535j383313j747248j666058
42238a2182955J08919J594664J184357J219795L214269L488169r70080n887909
42230h230771n113729J8195K999086J905011M94789O66274K03488j823324k960157
42221a1841138j483060J562271M626835O240033M030286k381745q075864p384226
42213a4706608j729430K084604J514316N93764J832797K217666k7052o97901L675071
42204e242773Q581043O699108j487536p593664n980373k69229K156385p58184
$$ plain form
42196 -3895223 -8254134 -12027950 -11543514 -7683251 -4393713 -4349546 -6932989 -9811983 -11382087
42187 -11382087 -11852937 -12877997 -15891885 -19940799 -21799946 -19644241 -15864886 -14103891
42179 -14103891 -13930919 -11339702 -4835468 2281176 6913329 9884274 12178965 10889108
42171 10889108 3291624 -6606093 -10547992 -5613924 2639002 7890963 10233655 13243868
42163 13243868 17099364 18799964 18088130 18281725 19824157 17261663 6421607 -7698724
42155 -7698724 -15250681 -13865322 -11607955 -15436129 -21370815 -20601359 -12291275 -4371555
42147 -4371555 -2360835 -3587806 -3935570 -4667265 -8997844 -15614508 -19899582 -20045647 -18545126
42138 -18545126 -18214723 -19131339 -19057929 -15341763 -7284470 2054270 7806572 8571969 8136240
$$ packed form
42196c895223m358911l773816M84436L860263L289538M4167k583443k878994j570104
42187a1382087m70850j025060l013888m048914j859147K155705L779355J760995
42179a4103891J72972K591217O504234P116644M632153K970945K294691j289857
42171A0889108p597484r897717l941899M934068Q252926N251961K342692L010213
42163A3243868L855496J700600p11834J93595J542432k562494j0840056j4120331
42155g698724p551957J385359K257367l828174n934686P69456Q310084P919720
42147d371555K010720j226971l47764p31695m330579o616664m285074j46065J500521
42138a8545126L30403r16616P3410L716166Q057293R338740N752302P65397m35729
$$ plain form
42129 8136240 10195121 13327523 13663338 10720784 7360051 5033700 2626481 -259435
42121 -259435 -2368187 -3635429 -5817258 -9129040 -10778172 -8370863 -3131925 1457858
42113 1457858 2840806 312137 -5436738 -11966441 -15307146 -12664782 -5368098 1863720
42105 1863720 5084020 4141619 1409635 -1565080 -4876866 -7953867 -8658621 -6341767
42097 -6341767 -4202643 -5821781 -9940218 -12020181 -11250979 -12087445 -17235795 -22967272
42089 -22967272 -24276732 -21515597 -18335802 -15720095 -12349011 -8906776 -6993693 -4590237
42081 -4590237 2132681 11973717 18370083 17258965 11600236 6925588 5844313 7889383
42073 7889383 10864294 10747228 4146281 -6763440 -14764806 -15144189 -9925016 -3153493
$$ packed form
42129H136240K058881L132402L35815k942554l360733k326351k407219k885916
42121b59435k108752j267242k181829l311782j649132K407309N238938M589783
42113A457858J382948k528669n748875o529703l340705K642364P296684P231818
42105A863720L220300r42401k731984k974715l311786l077001p04754K316854
42097f341767K139124j619138m118437k079963P69202q36466n148350n731477
42089b2967272j309460K761135L179795K615707L371084L442235J913083K403456
42081d590237O722918R841036O396366j111118n658729m674648j081275K045070
42073G889383K974911j17066o600947j0909721q001366l79383N219173O771523
$$ plain form
42065 -3153493 4007814 10958046 14789640 13913172 11420162 10502017 9271241 4896166
42057 4896166 290325 730260 5138189 7128124 4738911 2760581 4248402 5989987
42049 5989987 4751410 2194888 280170 -2699403 -6948420 -6964158 1376871 12700440
42041 12700440 17713623 15212185 11802507 10349913 6276455 -3056703 -12469200 -16258861
42033 -16258861 -15851971 -15474601 -14516182 -9850021 -3068779 600347 -339968 -2798183 -5424398
42024 -5424398 -10387493 -17750522 -22923951 -21918559 -15610389 -6902973 2754263 11567036
42016 11567036 15606128 12561382 5552918 18114 -2139771 -2903211 -4206422 -6542964
42008 -6542964 -10240230 -14811861 -17597033 -16368629 -13385266 -13679091 -18573714 -23679367
$$ packed form
42065c153493P161307O950232L831594q76468k493010r18145j230776m375075
42057D896166m605841M39935M407929J989935k389213j978330J487821J741585
42049E989987j238577k556522j914718k979573m249017j5738Q341029J1323569
42041A2700440N013183k501438l409678j452594m073458r333158r412497l789661
42033a6258861M06890L77370R58419M666161O781242L669126r40315k458215k626215
42024e424398m963095p363029n173429J005392O308170Q707416R657236Q812773
42016A1567036M039092l044746p008464n534804k157885p63440j303211k336542
42008f542964l697266m571631k785172J228404K983363k93825m894623n105653
$$ plain form
42000 -23679367 -24610104 -22476242 -21875829 -24547492 -26785095 -23412292 -13834078 -3586500
41992 -3586500 979486 -413313 -1986613 489589 4405945 4487420 -265636 -7114116
41984 -7114116 -14883948 -23670472 -29757621 -26918014 -15162227 -3625350 -1184984 -6885896
41976 -6885896 -12665314 -13119795 -9248672 -4477708 -936884 773739 1422095 3109513
41968 3109513 7147139 11654480 12937061 9445590 3233717 -2247411 -4730398 -4077711
41960 -4077711 -1874114 282967 2654084 6380303 10142043 10214539 5682704 1092896
41952 1092896 830692 2727474 1089419 -5013946 -10828514 -13096528 -13594844 -14657062
41944 -14657062 -15625712 -15598828 -15643403 -15638879 -12532608 -5314299 899871 -89058 -7539702
$$ packed form
42000b3679367r30737K133862O00413k671663k237603L372803R578214J0247578
41992c586500M565986j392799j573300K476202L916356Q1475m753056o848480
41984g114116p769832q786524o087149K839607J1755787J1536877K440366n700912
41976f885896n779418m54481L871123M770964L540824J710623O48356J687418
41968C109513M037626M507341J282581l491471o211873n481128k482987O52687
41960d077711K203597K157081K371117L726219L761740P2496m531835m589808
41952A092896k62204J896782j638055o103365n814568k268014m98316j062218
41944a4657062r68650K6884m4575M524L106271P218309O214170r88929p450644
$$ plain form
41935 -7539702 -14278895 -14631663 -8961410 -1253121 4300901 4590407 -647073 -7277395
41927 -7277395 -9844101 -7354792 -3767734 -2115538 -1097202 1142145 2948355 1446853
41919 1446853 -3155099 -8225427 -12153215 -14386020 -13344674 -7871689 -804787 2224713
41911 2224713 -1122258 -7023923 -9915615 -8400724 -5872972 -6460419 -11119826 -16703290
41903 -16703290 -18342865 -13957076 -7036077 -3765624 -6645254 -11995800 -14335941 -11961621
41895 -11961621 -7624493 -5348153 -7623564 -14011057 -20739395 -22771340 -18068754 -9361214
41887 -9361214 -792706 5749939 9496863 8083230 -541024 -13513052 -23388618 -24457843
41879 -24457843 -17693913 -9210809 -4964142 -6758929 -11808213 -15833513 -17423786 -18832134
$$ packed form
41935g539702o739193l52768N670253P708289N554022K89506n237480o630322
41927g277395k566706K489309L587058J652196J018336K239347J806210j501502
41919A446853m601952n070328l927788k232805J041346N472985P066902L029500
41911B224713l346971n901665k891692J514891K527752n87447m659407n583464
41903a6703290j639575M385789O920999L270453k879630n350546k340141K374320
41895a1961621M337128K276340k275411o387493o728338k031945M702586Q707540
41887i361214Q568508O542645L746924j413633q624254j2972028r875566j069225
41879b4457843O763930Q483104M246667j794787n049284m025300j590273j408348
$$ plain form
41871 -18832134 -21500380 -22518343 -18323138 -10890860 -6304342 -6671335 -7390055 -4127105
41863 -4127105 1007290 3026612 1325165 35211 2177019 6391031 9487062 10171872
41855 10171872 9661931 9339477 8109609 2740604 -7773437 -18615460 -22636445 -18340999
41847 -18340999 -11818979 -9445382 -11438289 -14370414 -16691826 -18585220 -19044207 -17133767
41839 -17133767 -14682883 -14128712 -15093028 -16572902 -20381021 -27532309 -32951386 -30276464
41831 -30276464 -21981781 -17739770 -20817127 -22961011 -16606951 -6089604 -1121853 -3547275
41823 -3547275 -7163091 -8157478 -8731236 -10834781 -12816290 -13539320 -14531648 -15940864 -14568700
41814 -14568700 -8625005 -1568846 1324267 -1581199 -7854155 -13948102 -16957148 -15616359
$$ packed form
41871a8832134k668246j017963M195205P432278M586518l66993p18720L262950
41863d127105N134395K019322j701447j289954K141808M214012L096031O84810
41855A0171872n09941l22454j229868n369005j0514041j0842023m020985M295446
41847a8340999O522020K373597j992907k932125k321412j893394m58987J910440
41839a7133767K450884N54171r64316j479874l808119p151288n419077K674922
41831c0276464Q294683M242011l077357k143884O354060J0517347M967751k425422
41823c547275l615816r94387n73758k103545j981509p23030r92328j409216J372164
41814a4568700N943695P056159K893113k905466o272956o093947l009046J340789
$$ plain form
41806 -15616359 -11670507 -8691712 -7723748 -5709478 -102895 6744010 10204582 9038315
41798 9038315 5921076 3410551 2023815 1458128 854473 -1603211 -6346351 -10004898
41790 -10004898 -8599612 -3157470 1391222 3169119 4937563 7637883 7440009 2369708
41782 2369708 -2657895 -2397305 13167 -3323972 -13729104 -23864862 -27418391 -25762423
41774 -25762423 -23501600 -21924953 -19424200 -15095150 -9180324 -2286063 3461662 4703914
41766 4703914 921645 -3512100 -4081006 -1762631 -1372444 -5164378 -10648569 -14333898
41758 -14333898 -15172412 -14243773 -13171177 -13264697 -14614749 -15641820 -14858909 -13324245 -13927087
41749 -13927087 -17615924 -21454218 -21445093 -16985390 -11716111 -9665937 -10945774 -11992753
$$ packed form
41806a5616359L945852K978795R67964K014270N606583O846905L460572j166267
41798I038315l117239k510525j386736n65687o03655k457684m743140l658547
41790a0004898J405286N442142M548692J777897J768444K700320j97874n070301
41782B369708n027603K60590K410472l337139j0405132j0135758l553529J655968
41774b5762423K260823J576647K500753M329050N914826O894261N747725J242252
41766D703914l782269m433745n68906K318375L90187l791934n484191l685329
41758a4333898q38514R28639J072596r3520j350052j027071P82911J534664o02842
41749a3927087l688837l838294R125M459703N269279K050174j279837j046979
$$ plain form
41741 -11992753 -10173840 -6956818 -5551049 -6698541 -8842415 -11606960 -16051404 -21161203
41733 -21161203 -23356610 -20977160 -16634961 -13425423 -11312935 -9228706 -8065571 -8786735
41725 -8786735 -9715598 -8926901 -7795733 -8887878 -11467181 -12462475 -11175885 -9737586 -9322707
41716 -9322707 -9136166 -8916590 -9269984 -9601370 -8912334 -8686923 -11509804 -16159792 -17375401
41707 -17375401 -11888914 -2436397 5288772 8056248 7299812 7669543 12890577 20787308
41699 20787308 23406849 15304391 857192 -10533671 -15665344 -19021551 -23560652 -26644971
41691 -26644971 -26672400 -26828123 -28578808 -27502396 -20639832 -13106611 -11500770 -14351435
41683 -14351435 -15299547 -13020214 -11295727 -10823571 -8004514 -1910504 3991337 7943521
$$ packed form
41741a1992753J818913L217022J405769j147492k143874k764545m444444n109799
41733b1161203k195407K379450M342199L209538K112488K084229J163135p21164
41725h786735r28863P88697J131168j092145k579303r95294J286590J438299M14879
41716i322707J86541K19576l53394l31386O89036K25411k822881m649988j215609
41707a7375401N486487R452517P725169K767476p56436L69731N221034P896731
41699B0787308K619541q102458j4447199j1390863n131673l356207m539101l084319
41691b6644971k7429j55723j750685J076412O862564P533221J605841k850665
41683a4351435r48112K279333J724487M72156K819057O094010N901841L952184
$$ plain form
41675 7943521 11678124 14594425 12408250 4847699 -657322 2162230 9179684 10778485
41667 10778485 4627977 -1473758 56271 7649879 13993827 15479238 14950863 15650748
41659 15650748 15895843 11878294 4251500 -1020675 970627 8734879 16257058 18615279
41651 18615279 14929692 7930856 2530029 3061108 9208447 15293952 15929256 11981960
41643 11981960 8860707 9516907 11690102 11777936 8517639 2476136 -5134798 -11917514
41635 -11917514 -14991011 -13959203 -11719344 -11022862 -11544608 -11445235 -10295899 -8922328 -7548486
41626 -7548486 -5863337 -4235326 -3147068 -1855821 437188 1875335 -1498299 -10905326
41618 -10905326 -21460338 -25578924 -20220781 -9650976 -685310 3363777 3344580 1268231
$$ packed form
41675G943521L734603K916301k186175p560551n505021K819552P017454J598801
41667A0778485o150508o101735J530029P593608O343948J485411n28375O99885
41659A5650748K45095m017549p626794n272175J991302P764252P522179K358221
41651A8615279l685587o998836n400827N31079O147339O085505O35304l947296
41643A1981960l121253O56200K173195Q7834l260297o041503p610934o782716
41635a1917514l073497J031808K239859O96482n21746R9373J149336J373571J373842
41626g548486J685149J628011J088258J291247K293009J438147l373634r407027
41618a0905326j0555012m118586N358143J0569805Q965666M049087j9197k076349
$$ plain form
41610 1268231 -633374 696990 6475047 12105168 9863230 -2214718 -17014597 -26224637
41602 -26224637 -28573264 -27312288 -23083355 -14747272 -5729823 -2888514 -7431536 -12086643
41594 -12086643 -10308730 -4812265 -3474231 -8879178 -15600462 -17260138 -13110325 -7087284
41586 -7087284 -2884736 -1663812 -3297108 -7206287 -11149686 -11443287 -7054254 -2592878
41578 -2592878 -3646924 -8634239 -9557202 -3230924 2459608 -1953202 -14511493 -23904134
41570 -23904134 -23590447 -18222532 -15567031 -17348147 -19810062 -19187552 -14697142 -9196504
41562 -9196504 -7776206 -12179842 -16355522 -12583537 -3135617 357654 -7860977 -19268850
41554 -19268850 -22641359 -18472067 -15403069 -16737418 -18755754 -20250640 -24449305 -30432772
$$ packed form
41610A268231j901605J330364N778057N630121k241938j2077948j4799879r210040
41602b6224637k348627J260976M228933Q336083R017449K841309m543022m655107
41594a2086643J777913N496465J338034n404947o721284j659676M149813O023041
41586g087284M202548J220924j633296l909179l943399k93601M389033M461376
41578b592878j054046m987315r22963O326278N690532m412810j2558291r392641
41570b3904134L13687N367915K655501j781116k461915O22510M490410N500638
41562i196504J420298m403636m175680L771985R447920L493271q218631j1407873
41554a9268850l372509M169292L068998j334349k018336j494886m198665n983467
$$ plain form
41546 -30432772 -31093952 -23313590 -13936694 -10950167 -13084964 -13257324 -9411606 -6274355
41538 -6274355 -7159145 -9429496 -9447698 -8033368 -8367949 -10672626 -11918188 -10167472 -6526591
41529 -6526591 -2418751 2567510 8474178 12276234 9960623 1398893 -8556719 -14226200
41521 -14226200 -13335045 -7436357 54823 5883098 8716896 9731352 10478781 10142798
41513 10142798 6547649 178021 -4830084 -4718754 251109 6785252 11600555 12977960
41505 12977960 11293250 9068548 8861574 10113492 9485832 4871243 -2497621 -9941059
41497 -9941059 -15024197 -15493571 -10893002 -4841179 -2087208 -2466430 -1875438 -80435 -1914970
41488 -1914970 -8360030 -12773984 -10398032 -5747725 -4764238 -5064163 -1386396 3780869
$$ packed form
41546c0432772o61180P780362R376896K986527k134797j72360L845718L137251
41538f274355q84790k270351j8202J414330l34581k304677j245562J750716L640881
41529f526591M107840M986261N906668L802056k315611q561730r955612n669481
41521a4226200Q91155N898688P491180N828275K833798J014456P47429l35983
41513A0142798l595149o369628n008105J11330M969863O534143M815303J377405
41505A2977960j684710k224702k06974J251918o27660m614589p368864p443438
41497i941059n083138m69374M600569O051823K753971l79222N90992J795003j834535
41488a914970o445060m413954K375952M650307R83487k99925L677767N167265
$$ plain form
41480 3780869 3959024 246902 -507229 2117961 1805843 -2322628 -3584516 91498 2055659
41471 2055659 -1218792 -4083830 -3087514 -4944315 -15082427 -25844340 -26043030 -17489745
41463 -17489745 -11641109 -12142586 -11120186 -3213361 6150827 9384150 6563687 2825091
41455 2825091 859878 67719 317016 2852031 8062637 13923605 16484512 12587049
41447 12587049 3909834 -2538988 -1030528 5738579 9269512 5485094 -1070196 -4302691
41439 -4302691 -4092827 -4252351 -5957696 -6989301 -6407212 -6262077 -8031792 -10015265 -9672511
41430 -9672511 -6954853 -3736831 -997685 1446978 2853640 1854559 -282123 546077
41422 546077 5788000 10543543 8837628 1656199 -4343084 -6189552 -8010320 -13545872
$$ packed form
41480C780869J78155l712122p54131K625190l12118m128471j261888L676014J964161
41471B055659l274451k865038R96316j856801j0138112j0761913j98690Q553285
41463a7489745N848636n01477J022400P906825R364188L233323k820463l738596
41455B825091j965213p92159K49297K535015N210606N860968K560907l897463
41447A2587049q677215o448822J508460O769107L530933l784418o555290l232495
41439d302691K09864j59524j705345j031605N82089J45135j769715j983473L42754
41430i672511K717658L218022K739146K444663J406662r99081k136682Q28200
41422E46077N241923M755543j705915p181429n999283j846468j820768n535552
$$ plain form
41414 -13545872 -19859829 -21728174 -18849007 -14823343 -11410105 -7928146 -4847892 -3855645
41406 -3855645 -4911237 -6634289 -9082444 -13048535 -17310740 -19814235 -20895876 -21919221
41398 -21919221 -21395323 -16428106 -7943468 -445496 3883914 6934932 9799789 10222828
41390 10222828 6474061 311089 -5726472 -11092533 -15699763 -18408032 -18752216 -17772593
41382 -17772593 -15894933 -12710396 -9846232 -10334562 -13232489 -12951058 -7159972 -1737768
41374 -1737768 -3414861 -9916725 -12550198 -7875999 -2013597 -2612263 -10205966 -18798311
41366 -18798311 -22314833 -18985857 -11215406 -2917115 3293291 6972894 8418044 7522902
41358 7522902 4806704 2193166 1071645 370739 -1727995 -4894952 -7468796 -9626833
$$ packed form
41414a3545872o313957j868345K879167M025664L413238L481959L080254R92247
41406c855645j055592j723052k448155l966091m262205k503495j081641j023345
41398b1919221N23898M967217Q484638P497972M329410L051018K864857M23039
41390A0222828l748767o162972o037561n366061m607230k708269l44184R79623
41382a7772593J877660L184537K864164m88330k897927K81431N791086N422204
41374a737768j677093o501864k633473M674199N862402n98666p593703q592345
41366a8798311l516522L328976P770451Q298291O210406L679603J445150q95142
41358G522902k716198k613538j121521p00906k098734l166957k573844k158037
$$ plain form
41350 -9626833 -13259534 -18359365 -21821065 -21007017 -17157671 -14060226 -13934271 -15485098
41342 -15485098 -15799855 -13587650 -10365214 -8557162 -8916337 -10473758 -12698152 -16297304
41334 -16297304 -21410215 -26298583 -28706942 -27663289 -23464471 -17182284 -10855500 -6619918
41326 -6619918 -4613733 -3116491 -1481102 -901450 -1329815 -614949 1075422 -929716 -9768025
41317 -9768025 -20747405 -25413038 -21227585 -13357967 -7482631 -5180102 -6429929 -11628503
41309 -11628503 -19123950 -24296115 -23507892 -17279721 -8860812 -1941572 154493 -3474630
41301 -3474630 -9072143 -11350743 -9920513 -9219767 -11232556 -12696529 -11276182 -9554592
41293 -9554592 -9744151 -9065439 -4745592 103900 553443 -2931719 -6239692 -8168321 -9990479
$$ packed form
41350i626833l632701n099831l461700Q14048L849346L097445J25955j550827
41342a5485098l14757K212205L222436J808052l59175j557421k224394l599152
41334a6297304n112911m888368k408359J043653M198818O282187O326784M235582
41326f619918K006185J497242J635389N79652m28365P14866J690371k005138q838309
41317i768025j0979380m665633M185453P869618N875336K302529j249827n198574
41309a1628503p495447n172165P88223O228171Q418909O919240K096065l629123
41301c474630n597513k278600J430230P00746k012789j463973J420347J721590
41293i554592j89559O78712M319847M849492M49543l485162l307973j928629j822158
$$ plain form
41284 -9990479 -10445911 -7010692 -1244842 2760746 4740705 7329711 9138147 5420090
41276 5420090 -3261077 -9796744 -10690850 -11488101 -18069295 -27160006 -30197718 -23848098
41268 -23848098 -12692443 -3569337 -689735 -4485347 -11778832 -17813448 -20210502 -19962298
41260 -19962298 -17853321 -12983387 -6574480 -3259614 -4961946 -6615716 -2501823 5089014
41252 5089014 8201449 3473867 -4020351 -7055905 -3205233 4132216 8789148 6474491
41244 6474491 -953691 -6572551 -6061791 -2757613 -2430185 -5505900 -8523098 -10917524
41236 -10917524 -14783274 -19079698 -20277049 -18947834 -19728206 -23697145 -26428497 -25067266
41228 -25067266 -21839272 -18789766 -14796180 -10249308 -8743707 -10492784 -9546726 -2127076
$$ packed form
41284i990479m55432L435219N765850M005588J979959K589006J808436l718057
41276E420090q681167o535667q94106p97251o581194r090711l037712O349620
41268b3848098J1155655R123106K879602l795612p293485o034616k397054K48204
41260a9962298K108977M869934O408907L314866j702332j653770M113893P590837
41252E089014L112435m727582p494218l035554L850672P337449M656932k314657
41244F474491p428182n618860N10760L304178L27428l075715l017198k394426
41236a0917524l865750m296424j197351J329215p80372l968939k731352J361231
41228b5067266L227994L049506L993586M546872J505601j749077R46058P419650
$$ plain form
41220 -2127076 6895860 10763440 9916351 8858031 7565233 2564961 -5289305 -10439792
41212 -10439792 -9659033 -4496659 2781079 10851293 17111903 18534238 15429628 10914046
41204 10914046 6570294 1912928 -2283633 -3863352 -2487530 213082 3152278 5338308
41196 5338308 4445686 213811 -2180785 2128414 9023802 8999988 411543 -7614576 -8062285
41187 -8062285 -5370691 -7517078 -13887863 -16922549 -13357300 -8261845 -7987254 -12746811
41179 -12746811 -16966627 -15562998 -9713403 -6275166 -10133650 -17686891 -20802980 -17109752
41171 -17109752 -12290355 -11303930 -12063728 -10095978 -5031675 659108 5440585 7718518
41163 7718518 4882093 -2484204 -8602786 -8994900 -6051124 -3898964 -1352081 4236008
$$ packed form
41220b127076R022936L867580q47089j058320j292798n000272p854266n150487
41212a0439792P80759N162374P277738Q070214O260610J422335l104610m515582
41204A0914046m343752m657366m196561j579719J375822K700612K939196K186030
41196E338308q92622m231875k394596M309199O895388k3814q588445q026119m47709
41187h062285K691594k146387o370785l034686L565249N095455K74591m759557
41179a2746811m219816J403629N849595L438237l858484p553241l116089L693228
41171a7109752M819397R86425p59798J967750N064303N690783M781477K277933
41163G718518k836425p366297o118582l92114K943776K152160K546883N588089
$$ plain form
41155 4236008 9122962 6648138 -2181556 -8737151 -8222756 -4884898 -4450705 -7271307
41147 -7271307 -11183984 -15814414 -20777527 -23561568 -22532600 -19466819 -16819201 -15020261
41139 -15020261 -14193079 -15478789 -18596165 -21053475 -21882011 -23050025 -24933141 -24042602
41131 -24042602 -18618664 -13136917 -12759652 -15579429 -15418728 -11230504 -8324618 -9794945
41123 -9794945 -11832485 -9700577 -4522153 -1016245 -735309 -869386 945195 3497679
41115 3497679 4064114 1507035 -3623176 -10493387 -17749225 -22455547 -21556697 -15504203
41107 -15504203 -8967155 -6035998 -5283824 -1840725 5390672 11273213 10969455 6957155
41099 6957155 6454630 12106856 18358435 18438714 12607962 7032472 5688801 6527143 5962527
$$ packed form
41155D236008M886954k474824q829694o555595N14395L337858M34193k820602
41147g271307l912677m630430m963113k784041J028968L065781K647618J798940
41139a5020261Q27182j285710l117376k457310q28536j168014j883116Q90539
41131b4042602N423938N481747L77265k819777J60701M188224K905886j470327
41123i794945k037540K131908N178424L505908K80936j34077J814581K552484
41115C497679N66435k557079n130211o870211p255838m706322Q98850O052494
41107a5504203O537048K931157P52174L443099P231397N882541l03758m012300
41099F957155n02525N652226O251579Q0279n830752n575490j343671Q38342n64616
$$ plain form
41090 5962527 3890390 2081791 -186942 -5568985 -14102701 -22135886 -26226068 -25877460
41082 -25877460 -22212348 -16656721 -11604834 -9260915 -8296069 -4732217 1589665 4478678
41074 4478678 -1154912 -11219836 -15707611 -9589986 2319889 10751146 9797406 548190
41066 548190 -10074945 -14721948 -12332081 -8538211 -7551092 -6501943 -1435303 4521763
41058 4521763 5126789 1242202 -175312 2961264 5566580 5154983 5893833 9916045 12148566
41049 12148566 8496182 2918829 879225 790455 -2226966 -8012661 -12363761 -13131386
41041 -13131386 -10420675 -4330176 2355080 3216026 -3893364 -11491646 -11647425 -7174624
41033 -7174624 -6222934 -8877784 -8331638 -3833012 -2243482 -5883064 -8708241 -7196748
$$ packed form
41090E962527k072137j808599k268733n382043q533716q033185m090182L48608
41082b5877460L665112N555627N051887K343919R64846L563852O321882K889013
41074D478678n633590j0064924m487775O117625J1909875Q431257r53740r249216
41066E48190j0623135m647003K389867L793870R87119J049149N066640N957066
41058D521763O05026l884587j417514L136576K605316m11597P38850M022212K232521
41049A2148566l652384n577353k039604q8770l017421n785695m351100p67625
41041a3131386K710711O090499O685256Q60946p109390p598282j55779M472801
41033g174624R51690k654850N46146M498626J589530l639582k825177J511493
$$ plain form
41025 -7196748 -5827387 -7609402 -7508104 -1003795 7418915 10613079 8564960 5647752
41017 5647752 2277903 -3855068 -10622051 -12115274 -6198058 3081056 10277239 12565017
41009 12565017 10214948 6319742 4708180 5100033 2199678 -6905910 -16532690 -18036492
41001 -18036492 -10404432 -580497 5989071 9886128 12467910 11870997 7206958 2874192
40993 2874192 4506584 11590089 17209005 15705291 9036224 4562602 6978420 13513675
40985 13513675 17518614 15466174 8848865 464529 -7879621 -13950535 -15492221 -13785910
40977 -13785910 -13137229 -14416081 -12973853 -6495354 -903499 -2944448 -9608756 -11741695
40969 -11741695 -7441558 -4683776 -9240801 -16598935 -19032215 -15428036 -10021425 -5438465
$$ packed form
41025g196748J369361j782015J01298O504309Q422710L194164k048119k917208
41017E647752l369849o132971o766983j493223N917216R279114P196183K287778
41009A2565017k350069l895206j611562L91853k900355r105588r626780j503802
41001a8036492P632060R823935O569568L897057K581782n96913m664039m332766
40993B874192J632392P083505N618916j503714o669067m473622K415818O535255
40985A3513675M004939k052440o617309q384336q344150o070914j541686J706311
40977a3785910O48681j278852J442228O478499N591855k040949o664308k132939
40969a1741695M300137K757782m557025p358134k433280L604179N406611M582960
$$ plain form
40961 -5438465 -1781704 9439 -912324 -1804303 1629078 9097468 15085399 15459781 11938835
40952 11938835 8323733 4649610 -1803046 -10120999 -14086167 -9410694 -647621 3255384
40944 3255384 521130 -1092706 3963285 9731130 6819885 -3064727 -8289892 -3239223
40936 -3239223 4653404 6629710 4221425 3874883 5583254 4285500 -11892 -1138266
40928 -1138266 4008372 11160261 14832916 14077175 10798792 6714598 3975473 5258589
40920 5258589 10727841 16980718 20578696 20769955 18062241 12925598 7167749 3751637
40912 3751637 3514791 4402218 5187740 6958107 9299919 8666175 3358690 -3097626 -6887741
40903 -6887741 -9037428 -11523186 -11518904 -5417417 3204300 6464334 3157872 194408 1582656
$$ packed form
40961e438465L656761J791143r21763q91979L433381P468390N987931L74382l520946
40952A1938835l615102l674123o452656q317953l965168M675473Q763073L903005
40944C255384k734254j613836N055991N767845k911245r884612n225165N050669
40936c239223P892627J976306k408285l46542J708371j297754m297392j126374
40928a138266N146638P151889L672655p55741l278383m084194k739125J283116
40920E258589N469252O252877L597978J91259k707714n136643n757849l416112
40912C751637k36846Q87427P85522J770367K341812o33744n307485o456316l790115
40903f887741k149687k485758M282O101487Q621717L260034l306462k963464J388248
$$ plain form
40894 1582656 2630660 -1595722 -7886292 -9792052 -6665208 -2458152 1419768 6198033
40886 6198033 10480625 11068634 9010935 9236016 12926781 14956020 10946766 3253409
40878 3253409 -2438196 -3813906 -2927058 -2360227 -2529133 -1921109 1071410 5683515 8120965
40869 8120965 5355830 -263578 -3013013 -1156230 1116536 828912 1327047 6466960
40861 6466960 12598496 11883786 3494627 -3522367 -576918 10394266 19529382 19743156
40853 19743156 12333667 3031558 -4348154 -9232225 -11537495 -10661435 -7854054 -7108032
40845 -7108032 -11015031 -16347846 -16728820 -10423706 -2765952 741734 1124672 3003782
40837 3003782 6879402 8324098 4982217 738699 1077442 6246836 11050836 10815059
$$ packed form
40894A582656J048004m226382o290570j905760L126844M207056L877920M778265
40886F198033M282592N88009k057699K25081L690765K029239m009254p693357
40878C253409n691605j375710Q86848N66831j68906O08024K992519M612105K437450
40869H120965k765135n619408k749435J856783K272766k87624M98135N139913
40861F466960O131536p14710q389159p016994K945449J0971184R135116K13774
40853A9743156p409489r302109p379712m884071k305270Q76060K807381P46022
40845g108032l906999n332815l80974O305114P657754L507686L82938J879110
40837C003782L875620J444696l341881m243518L38743N169394M804000k35777
$$ plain form
40829 10815059 6186613 2048220 2390596 6419243 9616461 8575532 4363188 707445
40821 707445 -561434 -1191190 -3608763 -7443213 -9720323 -8214814 -3848653 552454
40813 552454 3322236 4789566 5114613 3084840 -1486249 -5505017 -5194371 -669090 4362276
40804 4362276 7216210 7892688 6499859 3032794 494820 3447221 10896189 15161260
40796 15161260 11800413 6705017 8055342 14293736 16706158 12586266 8546180 9889094
40788 9889094 13417429 13474562 9925093 6768156 6485226 8848877 12590415 15742825 16669676
40779 16669676 16445608 17483989 18671289 15933622 9616273 6377792 10063254 15352863
40771 15352863 15663799 13366322 15277527 20462675 20886851 14545702 9459337 11153191
$$ packed form
40829A0815059m628446m138393L42376M028647L197218j040929m212344l655743
40821G07445j268879o29756k417573l834450k277110J505509M366161M401107
40813E52454K769782J467330L25047k029773m571089m018768L10646M525281N031366
40804D362276K853934O76478j392829l467065k537974K952401P448968M265071
40796A5161260l360847n095396J350325O238394K412422m119892m040086J342914
40788I889094L528335N7133l549469l156937k82930K363651L741538L152410R26851
40779A6669676k24068J038381J187300k737667o317349l238481L685462N289609
40771A5352863L10936k297477J911205N185148M24176o341149n086365J693854
$$ plain form
40763 11153191 13309893 7112287 -4303080 -8287218 806340 14076139 19320094 15156940
40755 15156940 10057256 10017443 12408358 12378063 10417720 10205429 11545745 10038228 3907663
40746 3907663 -2729688 -5191250 -4191617 -4071194 -6570186 -9051925 -8681548 -6043650 -3726990
40737 -3726990 -2534555 -389718 4737037 11322258 14679260 11626267 4376151 -1240978
40729 -1240978 -1440185 2305456 5241360 3499820 -2874878 -9155662 -8626695 1387921
40721 1387921 15624339 25120006 26040115 22405565 19748433 18806135 16816122 12581873
40713 12581873 8102236 6292504 8340217 12378820 14547627 13105535 11342244 13535014
40705 13535014 17908125 17745593 10860968 3373577 1298186 2799816 2928983 2288540
$$ packed form
40763A1153191K156702o197606j1415367l984138R093558J3269799N243955m163154
40755A5156940n099684l9813K390915l0295j960343k12291J340316j507517o130565
40746C907663o637351k461562R99633J20423k498992k481739L70377K637898K316660
40737c726990J192435K144837N126755O585221L357002l052993p250116n617129
40729a240978j99207L745641K935904j741540o374698o280784N28967J0014616
40721A387921J4236418R495667R20109l634550k657132r42298j990013m234249
40713A2581873m479637j809732K047713M038603K168807j442092j763291K192770
40705A3535014M373111j62532o884625p487391k075391J501630J29167o40443
$$ plain form
40697 2288540 5493900 13022132 20168971 23667104 24664863 25050298 24927354 24377723 24604151
40688 24604151 26652211 30754109 36124499 39513158 36231428 26214228 17177020 17194563
40680 17194563 25113737 32769064 35571991 35582610 34761450 31815938 27189949 25073780
40672 25073780 27440603 30617769 30872360 29715036 30607772 33541716 36035216 37135128
40664 37135128 37513003 37355698 36625577 36057584 36081016 36143226 36459807 38728968 43699890
40655 43699890 49599093 54124863 56447590 56477144 54147131 50404546 47039161 44700055
40647 44700055 42887033 42309913 44959401 51209114 58996981 66210653 71690647 74267091
40639 74267091 74045745 74561542 79844095 88900214 96797818 101319518 104217685 106040780
$$ packed form
40697B288540L205360P528232P146839L498133R97759L85435j22944n49631K26428
40688B4604151K048060M101898N370390L388659l281730j0017200r037208J7543
40680A7194563P919174P655327K802927J0619q21160k945512m625989k116169
40672B5073780K366823L177166K54591j157324Q92736K933944K493500J099912
40664C7135128L77875j57305p30121n67993K3432O2210L16581K269161M970922
40655D3699890N899203M525770K322727K9554k330013l742585l365385k339106
40647D4700055j813022n77120K649488O249713P787867P213672N479994K576444
40639G4267091k21346N15797N282553R056119P897604M521700K898167J823095
$$ plain form
40631 106040780 105612454 105645980 112150460 125460154 137950775 144094726 147009046 151453968
40623 151453968 156825515 161969023 170268294 183165336 194316271 198414921 201736989 214958732
40615 214958732 237814338 259847581 275423809 288838328 303556797 315042908 317728626
40608 317728626 313135786 307273760 303467890 300469669 295565808 288205047 281634925 279982176
40600 279982176 281911648 279820495 268846173 253691923 241743601 232908253 223157771
40593 223157771 215071314 215187303 221127172 221823280 213542363 206414047 209957206 219574780
40585 219574780 223698880 219109872 212939018 213046587 222063135 238373372 257626974 274377978
40577 274377978 286193638 295647666 306328004 318811741 332391552 347811012 365534571
$$ packed form
40631A06040780m28326L3526O504480J3309694J2490621O143951K914320M444922
40623A51453968N371547N143508Q299271J2897042J1150935M098650L322068J3221743
40615B14958732K2855606K2033243J5576228J3414519J4718469J1486111K685718
40608C17728626m592840n862026l805870k998221m903861p360761o570122j652749
40600B79982176J929472k091153j0974322j5154250j1948322q835348r750482
40593B23157771q086457J15989N939869O96108q280917p128316L543159R617574
40585B19574780M124100m589008o170854J07569R016548J6310237J9253602J6751004
40577B74377978J1815660R454028J0680338J2483737J3579811J5419460J7723559
$$ plain form
40570 365534571 383795668 400959504 417308253 431979155 440984662 441344025 434872259
40563 434872259 425104579 412870721 397626482 380452622 362547636 343217489 322665438
40556 322665438 304361855 290978395 279945434 266715299 250780347 234956703 220441012
40549 220441012 206498779 193920086 184932477 180079875 178081093 177944442 178557467 177605005
40541 177605005 174066434 170460242 169210702 168097753 163229443 155726569 151240413 152688682
40533 152688682 157091018 159968128 159613598 156536841 151755323 146524044 141524000 135930972
40525 135930972 129273948 123870869 122634484 124283046 123596260 117303285 107565822 98832166
40517 98832166 93068683 88950123 84424670 79205229 75025066 73291092 72556041 69819374
$$ packed form
40570C65534571J8261097J7163836J6348749J4670902R005507L59363o471766
40563D34872259r767680j2233858j5244239j7173860j7904986j9330147k0552051
40556C22665438j8303583j3383460j1032961j3230135j5934952j5823644j4515691
40549B20441012j3942233j2578693q987609m852602j998782j36651O13025r52462
40541A77605005l538571l606192j249540j112949m868310p502874m486156J448269
40533A52688682M402336K877110l54530l076757m781518n231279n000044n593028
40525A35930972o657024n403079j236385J648562o86786o292975r737463q733656
40517I8832166n763483m118560m525453n219441m180163j733974p35051k736667
$$ plain form
40509 69819374 64765213 60150432 56603691 50456798 39912755 30289290 28389565 33342000
40501 33342000 38041361 38785197 38158597 38557021 38791042 38412880 39659201 42333694 41636939
40492 41636939 34935687 27163933 25187809 28893936 32000113 30632852 27093223 25034341
40484 25034341 24613095 24123490 24130074 27218322 33609602 39150610 39254292 34128259 28353968
40475 28353968 25536692 25543780 27059699 29574237 31419688 29425366 23507458 18676947
40467 18676947 18738733 20463228 18454195 13688081 11728775 13597299 14678125 13050604
40459 13050604 12567672 15690089 18730513 17154844 11566042 5855155 2969432 4546814
40451 4546814 10651892 17252696 17992912 11814966 5532204 5550359 10137136 13336115 13462092
$$ packed form
40509F9819374n054161m614781l546741o146893j0544043r623465j899725M952435
40501C3342000M699361P43836o26600L98424K34021l78162J246321K674493o96755
40492D1636939o701252p771754j976124L706127L106177j367261l539629k058882
40484B5034341m21246m89605O584L088248O391280N541008J03682n126033n774291
40475B8353968k817276P088J515919K514538J845451j994322n917908m830511
40467A8676947O1786J724495k009033m766114j959306J868524J080826j627521
40459A3050604m82932L122417L040424j575669n588802n710887k885723J577382
40451D546814O105078O600804P40216o177946o282762J8155M586777L198979J25977
$$ plain form
40442 13462092 13492798 15153689 17007156 17652887 17510910 17808079 19726599 23208029 25000223
40433 25000223 20532840 10424196 2477085 3676860 12210802 20905067 26335114 30122307
40425 30122307 32809255 31807498 25861740 17406279 9476626 3198340 -1066376 -2724481
40417 -2724481 -1829894 889291 5053408 10186592 14752309 17228073 17321806 14803455 9105808
40408 9105808 2220354 -738479 2352744 5994297 3211833 -4679673 -9230487 -5438054
40400 -5438054 3399473 11120006 14009484 10701445 2591644 -4404880 -4263685 764649
40392 764649 1596230 -5098938 -11383838 -9162000 -1378691 3677272 5046903 8630473
40384 8630473 15779564 20128941 16938959 9386902 3187405 -183216 -1907361 -1543089
$$ packed form
40442A3462092L0706J660891J853467O45731j41977K97169J918520L481430J792194
40433B5000223m467383j0108644p947111J199775Q533942Q694265N430047L787193
40425C0122307K686948j001757n945758q455461p929653o278286m264716j658105
40417b724481Q94587K719185M164117N133184M565717K475764R3733k518351n697647
40408I105808o885454k958833L091223L641553k782464p891506m550814L792433
40400e438054Q837527P720533K889478l308039q109801o996524J41195N028334
40392G64649Q31581o695168o284900K221838P783309N055963J369631L583570
40384H630473P149091M349377l189982p552057o199497l370621j724145L64272
$$ plain form
40376 -1543089 1470760 4172602 2392244 -3231860 -6713719 -3124975 6311467 16208873
40368 16208873 22377233 24040912 22010767 16675027 8347147 -1215111 -8627734 -10996826
40360 -10996826 -8666137 -5373487 -4621434 -6032336 -6854721 -7247763 -11342609 -20958660
40352 -20958660 -30547654 -32190993 -25159322 -16727169 -13044157 -13054990 -12848561 -12128678 -13511685
40343 -13511685 -17949049 -23675265 -28008450 -28249667 -23161982 -15775617 -11924465 -13153260
40335 -13153260 -14042140 -10050471 -4674022 -3900040 -6448510 -5988964 -1692264 576342
40327 576342 -1974216 -5001378 -4631046 -2970052 -3114984 -3875974 -3142708 -2584874 -5163039
40318 -5163039 -10301586 -14251075 -13496043 -6774467 3372564 10399888 9305652 3652301
$$ packed form
40376a543089L013849K701842j780358n624104l481859L588744R436442R897406
40368A6208873O168360J663679k030145n335740q327880r562258p412623k369092
40360a0996826K330689L292650P52053j410902q22385l93042m094846r616051
40352b0958660r588994j643339P031671Q432153L683012j0833K06429P19883j383007
40343a3511685m437364n726216m333185k41217N087685P386365L851152j228795
40335a3153260q88880L991669N376449P73982k548470M59546M296700K268606
40327E76342k550558l027162L70332J660994j44932p60990P33266N57834k578165
40318e163039n138547l949489P55032O721576J0147031P027324j094236n653351
$$ plain form
40310 3652301 2248418 7078516 10186754 5397546 -3067022 -7980732 -8946017 -9001543 -7200112
40301 -7200112 -2290413 575532 -4116455 -11734247 -12205569 -4637526 1664895 1260035
40293 1260035 -1441847 -2241226 -4037401 -9275061 -13256309 -11113092 -6084119 -4620297
40285 -4620297 -7060521 -9235919 -10451106 -13343035 -16996082 -16555094 -10549125 -3856019
40277 -3856019 -1873418 -5110378 -10807941 -16613103 -20503912 -19653329 -12727466 -2963198
40269 -2963198 3787943 5156963 4881742 8018502 14619728 20030306 20781603 17502900
40261 17502900 11895621 4568164 -2158890 -3093775 3881026 12575135 13983505 6851043
40253 6851043 -1224710 -3272544 415467 5296550 7774996 6283981 1419008 -3190257
$$ packed form
40310C652301j403883M830098L108238m789208q464568m913710r65285n5526J801431
40301g200112M909699K865945m691987p617792m71322P568043O302421m04860
40293A260035k701882p99379j796175n237660l981248K143217N028973J463822
40285d620297k440224k175398j215187k891929l653047M40988O005969O693106
40277c856019J982601l236960n697563n805162l890809Q50583O925863R764268
40269b963198O751141J369020k75221L136760O601226N410578P51297l278703
40261A7502900n607279p327457o727054r34885O974801Q694109J408370p132462
40253F851043q075753k047834L688011M881083K478446j491015m864973m609265
$$ plain form
40245 -3190257 -3703806 -1374562 -1357023 -4714357 -6159101 -2316127 2582779 3289856 1608915
40236 1608915 2584083 5592040 5301812 324287 -4876579 -6814182 -6687793 -6479911 -5808633
40227 -5808633 -4176153 -2810118 -2483657 -2117952 -1150908 -1243294 -4189540 -9579228 -15458810
40218 -15458810 -20052674 -22381524 -22664943 -22628924 -24099792 -26830169 -28615772 -27443972
40210 -27443972 -22668438 -15033418 -7164753 -2793293 -2897105 -3477933 -369685 4164126
40202 4164126 3529388 -3901823 -11631941 -12976331 -8731681 -4506325 -3311269 -3826894
40194 -3826894 -3890020 -2292301 1685389 7111803 10140369 7164986 -176252 -5718132
40186 -5718132 -5493723 -1833693 257843 -1051613 -3848543 -6340747 -8796106 -11567427
$$ packed form
40245c190257n13549K329244J7539l357334j444744L842974M898906P07077j680941
40236A608915R75168L007957k90228m977525n200866j937603J26389K07882O71278
40227e808633J632480J366035L26461L65705R67044r2386k946246n389688n879582
40218a5458810m593864k328850k83419L6019j470868k730377j785603J171800
40210b7443972M775534P635020P868665M371460j03812n80828L108248M533811
40202D164126o34738p431211p730118j344390M244650M225356J195056n15625
40194c826894o3126J597719L977690N426414L028566k975383p341238n541880
40186e718132K24409L660030K091536j309456k796930k492204k455359k771321
$$ plain form
40178 -11567427 -13493186 -13584690 -12936836 -13207575 -13852332 -12903050 -10562766 -9834744 -12523655
40169 -12523655 -16238523 -16875189 -13247170 -8107933 -5264023 -6511260 -10574633 -14301541
40161 -14301541 -15725310 -16131856 -17478280 -17861254 -12869810 -2743198 5753581 7491201
40153 7491201 5253877 3799578 1547218 -5468070 -13780793 -14746870 -7112093 279325
40145 279325 649614 -2630523 -3640490 -3419445 -6659719 -13109881 -17968333 -18840817 -17734787
40136 -17734787 -17272192 -18346723 -20476720 -21860599 -20382484 -16546978 -13489056 -12339056
40128 -12339056 -10362657 -5758052 -837886 2245960 4955289 7874308 6935712 -839936
40120 -839936 -11250912 -18197259 -22169096 -27188667 -31645357 -29564889 -20423362 -10644498
$$ packed form
40178a1567427j925759r1504O47854k70739o44757R49282K340284P28022k688911
40169a2523655l714868o36666L628019N139237K843910j247237m063373l726908
40161a4301541j423769m06546j346424l82974M991444J0126612Q496779J737620
40153G491201k237324j454299k252360p015288q312723r66077P634777P391418
40145B79325L70289l280137j009967K21045l240274o450162m858452q72484J106030
40136a7734787M62595j074531k129997j383879J478115L835506L057922J150000
40128a2339056J976399M604605M920166L083846K709329K919019r38596p775648
40120h39936j0410976o946347l971837n019571m456690K080468R141527R778864
$$ plain form
40112 -10644498 -4751162 -1208496 2166120 4549512 4927607 3218604 -2033069 -11380356
40104 -11380356 -19373083 -18406858 -9313174 -1602862 -1061674 -3792403 -5187084 -7346130
40096 -7346130 -13041620 -18916222 -20454082 -18708897 -16632300 -13399694 -7991190 -3743004
40088 -3743004 -2906574 -785034 7466988 17272606 19550074 13412176 6501000 3713014
40080 3713014 3054763 2374429 2441248 2299612 -1086107 -6372375 -7564103 -3106473 521414
40071 521414 -2115224 -7575658 -8897580 -5086388 -939509 146504 -984769 -2406239
40063 -2406239 -3537673 -4464823 -5135562 -5660279 -6536751 -8434921 -11502277 -14298284 -14460642
40054 -14460642 -12086440 -11107247 -14398773 -18540779 -17395237 -10662949 -4346308 -2266464
$$ packed form
40112a0644498N893336L542666L374616K383392L78095j709003n251673r347287
40104a1380356p992727R66225R093684P710312N41188k730729j394681k159046
40096g346130n695490n874602j537860J745185K076597L232606N408504M248186
40088c743004Q36430K121540Q252022R805618K277468o137898o911176k787986
40080C713014o58251o80334O6819j41636l385719n286268j191728M457630L627887
40071E21414k636638n460434j321922L811192M146879J086013j131273j421470
40063b406239j131434r27150o70739n24717q76472j898170l067356k796007j62358
40054a4460642K374202R79193l291526m142006J145542O732288O316641K079844
$$ plain form
40046 -2266464 -2406531 -3203450 -7316149 -15241186 -20559464 -17444627 -9604766 -5437590
40038 -5437590 -6179931 -5652838 -1531904 328813 -4764810 -12505099 -15361033 -12745257
40030 -12745257 -10710875 -12821955 -15562697 -13217493 -4369794 7268861 16273003 18807749
40022 18807749 14746349 8409893 5922933 9600746 15274894 17023323 14211785 11588896
40014 11588896 12455732 14822600 15507767 14877295 14980900 15445705 14624073 13390253 14181632
40005 14181632 16823205 18622386 18271072 16370191 12501909 5699030 -2046596 -7092026
39997 -7092026 -9856740 -14644186 -21870640 -25125830 -19480435 -9386563 -4268427 -8014612
39989 -8014612 -16042807 -21203891 -19650957 -12434237 -4474939 -1059284 -2749561 -4734719
$$ packed form
40046b266464j40067p96919m112699p925037n318278L114837P839861M167176
40038e437590p42341N27093M120934J860717n093623p740289k855934K615776
40030a2745257K034382k111080k740742K345204Q847699J1638655R004142K534746
40022A8807749m061400o336456k486960L677813N674148J748429k811538k622889
40014A1588896Q66836K366868O85167o30472J03605M64805q21632j233820P91379
40005A4181632K641573J799181l51314j900881l868282o802879p745626n045430
39997g092026k764714m787446p226454l255190N645395J0093872N118136l746185
39989h014612q028195n161084J552934P216720P959298L415655j690277j985158
$$ plain form
39981 -4734719 -3308464 -1046029 -2483204 -6481996 -7075908 -1482511 6509076 11291311
39973 11291311 10297842 4063067 -4886726 -12202647 -13975255 -10542863 -6088359 -3457564
39965 -3457564 -1509151 1349158 3409804 1455061 -5032929 -13245945 -19940539 -23686213
39957 -23686213 -24998843 -25720918 -27976534 -32223026 -35898072 -35135893 -28916937 -21106706
39949 -21106706 -16963085 -17256037 -17382362 -13399106 -7224905 -3661370 -3694423 -4141152 -3336750
39940 -3336750 -2819794 -2666784 9075 5544336 9117568 7211044 3071612 1532199
39932 1532199 1480169 -1445380 -6741065 -9248117 -6863743 -2956107 -907196 -584889 -538034
39923 -538034 140887 2167877 4560709 3310624 -4008466 -12732078 -15403294 -11702263
$$ packed form
39981d734719J426255K262435j437175l998792n93912N593397P991587M782235
39973A1291311r93469o234775q949793p315921j772608L432392M454504K630795
39965c457564J948413K858309K060646j954743o487990q213016o694594l745674
39957b3686213j312630p22075k255616m246492l675046P62179O218956P810231
39949b1106706M143621k92952j26325L983256O174201L563535l3053m46729Q04402
39940c336750N16956J53010K675859N535261L573232j906524m139432j539413
39932A532199n2030k925549n295685k507052K384374L907636K048911L22307M6855
39923e38034O78921K026990K392832j250085p319090q723612k671216L701031
$$ plain form
39915 -11702263 -8322647 -8248318 -7020414 -2235983 327104 -4727027 -12955340 -15641715
39907 -15641715 -11915718 -8847378 -10454518 -12726153 -10641835 -5345695 -1633993 -784912
39899 -784912 911822 6249483 11883055 11370506 3662090 -4143247 -4616913 1760307 9385881
39890 9385881 15972617 22631738 26742000 22355086 9891548 -1260569 -3835593 -1326180
39882 -1326180 -1463385 -5841004 -10864525 -14795399 -18012092 -19062440 -16277489 -11750977
39874 -11750977 -8804558 -7018047 -4290746 -1918418 -2630417 -5253789 -6601375 -7276040
39866 -7276040 -10040500 -13539706 -13795977 -11655895 -12341313 -16774909 -19427573 -16507234
39858 -16507234 -10918188 -6923568 -4597911 -1999991 1157377 4356797 7356529 8535959
$$ packed form
39915a1702263L379616P4329J227904M784431K563087n054131q228313k686375
39907a5641715L725997L068340j607140k271635K084318N296140L711702Q49081
39899g84912J696734N337661N633572n12549p708416p805337m73666O377220P625574
39890I385881O586736O659121M110262m386914j2463538j1152117k575024K509413
39882a326180j37205m377619n023521l930874l216693j050348K784951M526512
39874a1750977K946419J786511K727301K372328p11999k623372j347586o74665
39866g276040k764460l499206k56271K140082o85418m433596k652664K920339
39858a6507234N589046L994620K325657K597920L157368L199420K999732J179430
$$ plain form
39850 8535959 5644191 30394 -3380851 -2218112 716270 2691134 4830194 8147950
39842 8147950 10024334 8479476 6823313 9591863 15528691 18799048 16692999 12647703
39834 12647703 11278036 12972087 14421086 13244623 10791827 9756904 9470896 5787353
39826 5787353 -2681700 -10521604 -11285627 -6088491 -2086722 -2818733 -5077896 -5850752 -6700537
39817 -6700537 -9328575 -12097840 -13774166 -15919612 -18442663 -17562229 -12002596 -6715892
39809 -6715892 -6151474 -8131687 -9172339 -11310552 -17278562 -22411544 -19025015 -7754068
39801 -7754068 2271500 4641991 1577345 -1241938 -557297 3675009 8380451 8312451
39793 8312451 1735825 -5106652 -4324779 3051178 8296030 6646773 1627734 -2581738
$$ packed form
39850H535959k891768n613797l411245J162739K934382J974864K139060L317756
39842H147950J876384j544858j656163K768550N936828L270357k106049m045296
39834A2647703j369667J694051J448999j176463k452796j034923k86008l683543
39826E787353q469053p839904p64023N197136M001769p32011k259163p72856q49785
39817f700537k628038k769265j676326k145446k523051Q80434N559633N286704
39809f715892N64418j980213j040652k138213n968010n132982L386529J1270947
39801g754068J0025568K370491l064646k819283O84641M232306M705442o8000
39793H312451o576626o842477P81873P375957N244852j649257n019039m209472
$$ plain form
39785 -2581738 -6046947 -8493600 -6764712 -327531 6149495 9104846 10032814 10153715
39777 10153715 6869761 -209680 -5097965 -2879193 2564433 3913378 571244 -2030040
39769 -2030040 -1074496 977417 857871 -3020896 -11001413 -20671520 -26617609 -26243402 -24078398
39760 -24078398 -25476885 -28027535 -25080740 -16474914 -9055913 -6517487 -5475131 -2958059
39752 -2958059 -1517876 -4376174 -10486291 -16924124 -21901226 -23313843 -18906373 -10663588
39744 -10663588 -5035825 -5863294 -10338862 -14066927 -16065199 -16364572 -13476491 -7971079
39736 -7971079 -4241426 -4381974 -4303093 -761227 1790111 -2415874 -10231496 -12912548 -8336247
39727 -8336247 -2840637 -1120579 -1381694 -1518624 -3143429 -6893017 -9528864 -8999480 -7827112
$$ packed form
39785b581738l465209k446653J728888O437181O477026K955351R27968J20901
39777A0153715l283954p079441m888285K218772N443626J348945l342134k601284
39769b030040R55544K051913j19546l878767p980517r670107n946089L74207K165004
39760b4078398j398487k550650K946795Q605826P419001K538426J042356K517072
39752b958059J440183k858298o110117o437833m977102j412617M407470Q242785
39744a0663588N627763q27469m475568l728065j998272k99373K888081N505412
39736g971079L729653j40548P8881L541866K551338m205985p815622k681052M576301
39727h336247N495610J720058k61115j36930j624805l749588k635847N29384J172368
$$ plain form
39718 -7827112 -8279528 -8305233 -5668194 -2384849 -1228610 -909004 1145598 3439919 1974490
39709 1974490 -4086069 -11692060 -17772486 -20894187 -20420184 -17304339 -14926026 -16062537
39701 -16062537 -19358083 -21065445 -19457674 -15454665 -10620112 -7490343 -9927560 -18730413
39693 -18730413 -27598262 -28217613 -20052582 -11096183 -7993473 -9335557 -10070119 -8407936
39685 -8407936 -5755865 -3149046 -1232308 -1821358 -5952065 -11060820 -13026155 -11030809
39677 -11030809 -8173848 -7136113 -7477028 -8072659 -10157153 -15618278 -22671963 -25991777
39669 -25991777 -22850532 -17279122 -15075110 -15469506 -12129626 -3505358 2992214 964937
39661 964937 -5023839 -5377337 978492 5901098 4541909 1159775 534058 504557 -2827702
$$ packed form
39718g827112m52416k5705K637039L283345J156239L19606K054602K294321j465429
39709A974490o060559p605991o080426l121701M74003L115845K378313j136511
39701a6062537l295546j707362J607771M003009M834553L129769k437217q802853
39693a8730413q867849o19351Q165031Q956399L102710j342084p34562J662183
39685h407936K652071K606819J916738n89050m130707n108755j965335J995346
39677a1030809K856961J037735l40915n95631k084494n461125p053685l319814
39669b5991777L141245N571410K204012l94396L339880Q624268O497572k027277
39661I64937n988776l53498O355829M922606j359189l382134o25717k9501l332259
$$ plain form
39652 -2827702 -7703565 -9695652 -8958526 -9597731 -13452899 -18373417 -21450992 -20984060 -16815470
39643 -16815470 -11570182 -9733967 -12493141 -15337941 -13917723 -10267018 -9585851 -12565652
39635 -12565652 -14870867 -12991699 -6792037 2357462 11581286 15633949 11044439 1427361
39627 1427361 -5553143 -6926015 -6307254 -7010653 -7718182 -5986981 -2109233 1862924 3862622
39618 3862622 2088816 -2928860 -6285128 -3061395 4389172 8095175 4831071 150576
39610 150576 164734 4240242 8667421 12652305 16687168 19126739 18998192 18942683 20657355
39601 20657355 20383597 14271052 6000553 3085909 6438372 9430697 7563627 3568125
39593 3568125 1675923 1827759 1917729 1890172 2600437 3020087 1400715 -2007325 -5462208
$$ packed form
39652b827702m875863j992087P37126o39205l855168m920518l077575M66932M168590
39643a6815470N245288J836215k759174k844800J420218L650705O81167k979801
39635a2565652k305215J879168O199662R149499R223824M052663m589510r617078
39627A427361o980504j372872O18761p03399p07529J731201L877748L972157J999698
39618C862622j773806n017676l356268L223733P450567L706003l264104m680495
39610A50576J4158M075508M427179L984884M034863K439571j28547n5509J714672
39601B0657355k73758o112545q270499k914644L352463K992325j867070l995502
39593C568125j892202J51836Q9970k7557P10265M19650j619372l408040l454883
$$ plain form
39584 -5462208 -8144058 -10480731 -12606122 -13810374 -13480075 -11884320 -9890632 -8011264
39576 -8011264 -5903760 -3284840 -1166094 -855056 -1384788 2200 3392286 4403760
39568 4403760 -514991 -8491701 -13245100 -13060614 -12208521 -14256614 -17682118 -19364988
39560 -19364988 -19096327 -18343366 -16866462 -13401648 -8891092 -6620668 -8589140 -12558114
39552 -12558114 -13244611 -7046615 3726681 11916371 12141883 6183868 529216 -892019
39544 -892019 208914 6751 -3259834 -8479718 -12459854 -11550993 -5437780 474819 -85487
39535 -85487 -6234141 -10449878 -8356469 -3867515 -2578003 -4572547 -7072379 -9781649
39527 -9781649 -12969474 -14055010 -11841059 -11144093 -16423796 -22718450 -20729856 -10612120
$$ packed form
39584e462208k681850k336673k125391j204252L30299J595755J993688J879368
39576h011264K107504K618920K118746L11038n29732J386988L390086J011474
39568D403760m918751p976710m753399J84486Q52093k048093l425504j682870
39560a9364988K68661P52961J476904L464814M510556K270424j968472l968974
39552a2558114o86497O197996J0773296Q189690K25512n958015n654652j421235
39544h92019J100933k02163l266585n219884l980136R08861O113213N912599n60306
39535h5487o148654m215737K093409M488954J289512j994544k499832k709270
39527i781649l187825j085536K213951O96966n279703o294654J988594J0117736
$$ plain form
39519 -10612120 -2250947 -279587 2285518 11285684 20493839 20449808 12653977 6916415
39511 6916415 7502079 9653768 8692609 5361163 1949869 -648447 -1392097 -264929 -1590527
39502 -1590527 -10125204 -22471922 -28609207 -24431947 -16782766 -12747969 -10279233 -4765386
39494 -4765386 525710 -1789892 -11357441 -19359230 -19548875 -14071550 -7897720 -3194828
39486 -3194828 -811130 -2304512 -7450059 -12512383 -13416014 -9237140 -1898461 5370004
39478 5370004 8760591 5950474 -1293341 -8665697 -14029266 -18070461 -20192576 -17793678
39470 -17793678 -11234928 -5605066 -4759264 -6613732 -7250441 -6770832 -7438449 -8363622 -6500215
39461 -6500215 -2040196 1317951 1527616 123817 -1473589 -4458096 -10186902 -17121054
$$ packed form
39519a0612120Q361173J971360K565105R000166R208155m4031p795831n737562
39511F916415N85664K151689r61159l331446l411294k598316p43650J127168j325598
39502a590527q534677j2346718o137285M177260P649181M034797K468736N513847
39494d765386N291096k315602r567549q001789j89645N477325O173830M702892
39486c194828K383698j493382n145547n062324r03631M178874P338679P268465
39478E370004L390587k810117p243815p372356n363569m041195k122115K398898
39470a7793678O558750N629862Q45802j854468o36709M79609o67617r25173J863407
39461f500215M460019L358147K09665j403799j597406k984507n728806o934152
$$ plain form
39453 -17121054 -21274907 -19062571 -10227574 640746 6402430 3501212 -4398237 -10902005
39445 -10902005 -14308456 -17650155 -21662155 -21870654 -14713340 -3704336 3483365 3146944
39437 3146944 -1440353 -4796919 -5126278 -4979248 -7072438 -10469403 -11469026 -8209609 -3312737
39428 -3312737 -918160 -1789172 -2921935 -1792827 864033 2927998 3710895 3715462 2710497
39419 2710497 -423480 -5887619 -11668511 -14322562 -11438162 -4055584 3295171 5884513
39411 5884513 2882170 -1835855 -3206964 498745 6281015 9263564 7186076 2260097
39403 2260097 -1485801 -2144427 -383321 3131473 8346416 13469682 14762629 10432108
39395 10432108 2912215 -4216552 -9420110 -11684105 -9087739 -2647626 751467 -5590862
$$ packed form
39453a7121054m153853K212336Q834997J0868320N761684k901218p899449o503768
39445a0902005l406451l341699m012000k08499P157314J1009004P187701l36421
39437C146944m587297l356566l29359J47030k093190l396965r99623L259417M896872
39428c312737K394577q71012j132763J129108K656860K063965P82897M567j004965
39419B710497l133977n464139n780892k654051K884400P382578P350755K589342
39411E884513l002343m718025j371109L705709N782270K982549k077488m925979
39403B260097l745898o58626J761106L514794N214943N123266J292947m330521
39395A0432108p519893p128767n203558k263995K596366O440113L399093o342329
$$ plain form
39387 -5590862 -19340384 -30651401 -33013312 -28786649 -23500638 -19062388 -14517421 -9965939
39379 -9965939 -6886547 -6230493 -7912294 -10895734 -12981055 -12127273 -8520008 -3777462
39371 -3777462 1532022 7129718 10430713 8446652 2559585 -2437340 -4521022 -5390477
39363 -5390477 -4772404 487481 9423612 14930298 12880350 8660841 9934423 16630500
39355 16630500 23023427 26365909 27816281 27177757 22699342 15154616 7088850 -1097799
39347 -1097799 -9630018 -15198926 -13808008 -7436776 -2509211 -1382046 -302688 3635199
39339 3635199 8487952 11511073 12530111 11618730 7488122 202863 -7476253 -12742895
39331 -12742895 -14142459 -10411724 -2042570 5531444 5371821 -2292666 -9076004 -8397951
$$ packed form
39387e590862j3749522j1311017k361911M226663N286011M438250M544967M551482
39379i965939L079392O56054j681801k983440k085321Q53782L607265M742546
39371c777462N309484N597696L300995j984061n887067m996925k083682q69455
39363e390477O18073N259885Q936131N506686k049948m219509J273582O696077
39355A6630500O392927L342482J450372o38524m478415p544726q065766q186649
39347a097799q532219n568908J390918O371232M927565J127165J079358L937887
39339C635199M852753L023121J019038r11381m130608p285259p679116n266642
39331a2742895j399564L730735Q369154P574014j59623p664487o783338O78053
$$ plain form
39323 -8397951 -2540866 2406708 4064532 2735944 -2861056 -13543557 -25190606 -31152815
39315 -31152815 -29068562 -22290271 -14975259 -8495649 -2585451 2287679 4315548 1531342
39307 1531342 -5887351 -14427310 -20112763 -23054219 -26718948 -31729284 -33518738 -28351894
39299 -28351894 -18988480 -11557850 -8801331 -9086328 -10067982 -10196712 -8286776 -5046652
39291 -5046652 -3936412 -7145262 -11603464 -12522966 -10371928 -10460739 -15226111 -20631894 -21632043
39282 -21632043 -18366742 -14991115 -14057185 -14034921 -12010272 -7709953 -4528090 -6395404
39274 -6395404 -13602746 -22454144 -29257052 -33187187 -34379908 -31322104 -22669358 -10875565
39266 -10875565 -1477473 1643384 -823752 -4968077 -6702993 -4315942 279255 3130813
$$ packed form
39323h397951N857085M947574J657824j328588n597000j0682501j1647049n962209
39315c1152815K084253O778291P315012O479610N910198M873130K027869k784206
39307A531342p418693q539959n685453k941456l664729n010336j789454N166844
39299b8351894R363414P430630K756519k84997r81654j28730J909936L240124
39291e046652J110240l208850m458202r19502K151038q8811m765372n405783j000149
39282b1632043L265301L375627R33930K2264K024649M300319L181863j867314
39274f395404p207342q851398o802908l930135j192721L057804Q652746J1793793
39266a0875565R398092L120857k467136m144325j734916K387051M595197K851558
$$ plain form
39258 3130813 2239283 -684658 -3196600 -5094395 -6881485 -7508885 -6477274 -6451745 -10065371
39249 -10065371 -14779839 -14792155 -8511175 -956160 2062835 -464782 -5609339 -10220212
39241 -10220212 -12435354 -11348082 -6837585 256296 7520218 10602932 5946441 -4081469
39233 -4081469 -11339320 -10800970 -7417565 -9635687 -17447567 -22550291 -20360382 -15681998
39225 -15681998 -14778115 -17493596 -19930670 -19898696 -16422302 -8465225 1753501 7874153
39217 7874153 6239041 1034064 -1098128 1196736 5263067 9940607 14666210 15808409
39209 15808409 10149615 1081275 -4603006 -6070022 -8851565 -15129737 -19582159 -17466984
39201 -17466984 -11892056 -9096186 -9687177 -9087021 -5498680 -3042471 -5859161 -11938521
$$ packed form
39258C130813q91530k923941k511942j897795j787090o27400J031611K5529l613626
39249a0065371m714468j2316O280980P555015L018995k527617n144557m610873
39241a0220212k215142J087272M510497P093881P263922L082714m656491j0027910
39233d081469p257851N38350L383405k218122p811880n102724K189909M678384
39225a5681998R03883k715481k437074L1974L476394P957077J0218726O120652
39217G874153j635112n204977k132192K294864M066331M677540M725603J142199
39209A5808409n658794r068340n684281j467016k781543o278172m452422K115175
39201a7466984N574928K795870n90991O00156L588341K456209k816690o079360
$$ plain form
39193 -11938521 -15303531 -13680317 -11347402 -13004656 -16844064 -16839889 -11404121 -5757415
39185 -5757415 -4481421 -5799870 -6056389 -6232479 -9690993 -15663373 -19688522 -19553672 -16582275
39176 -16582275 -11876632 -5829126 -1101507 -1362979 -6335602 -11928472 -15693135 -18359305
39168 -18359305 -20069525 -19915892 -19826901 -23622025 -30534463 -34642639 -32831044 -28452199
39160 -28452199 -24789192 -20327871 -13972654 -9544088 -10181518 -12616009 -12404126 -11177512
39152 -11177512 -12765431 -15191305 -13300890 -7567080 -3357211 -2195037 -766723 1179549
39144 1179549 -658179 -6746725 -10577606 -7496054 -1502359 777920 -1195549 -3564648
39136 -3564648 -5232594 -8198019 -12070149 -13068674 -9081778 -2628314 2157189 3692565
$$ packed form
39193a1938521l365010J623214K332915j657254l839408M175N435768N646706
39185e757415J275994j318449k56519j76090l458514n972380m025149J34850K971397
39176a6582275M705643O047506M727619k61472m972623n592870l764663k666170
39168a8359305j710220J53633Q8991l795124o912438m108176J811595M378845
39160b8452199L663007M461321O355217M428566o37430k434491K11883J226614
39152a1177512j587919k425874J890415N733810M209869J162174J428314J946272
39144A179549j837728o088546l830881L081552N993695K280279j973469k369099
39136c564648j667946k965425l872130r98525L986896O453464M785503J535376
$$ plain form
39128 3692565 3443518 3412255 3771345 2838064 -465377 -4364780 -5594374 -3282656 -60502
39119 -60502 1337163 928037 -162852 -2347402 -6334203 -10142507 -10044258 -5079640 1228484
39110 1228484 4864487 5972368 7962909 12073806 14556240 10696675 1067625 -7959089
39102 -7959089 -10292618 -5343511 3077558 10892567 15439097 15261289 11097431 6482349
39094 6482349 4921107 6297227 7403868 5442127 -221796 -8225877 -15072552 -16636083
39086 -16636083 -12775776 -8799574 -8763724 -9139762 -4047810 4524936 8221483 4511367
39078 4511367 514103 2387880 7456298 10543637 12032080 14399072 15539280 11641647
39070 11641647 3775293 -3787191 -9274942 -12431455 -10820378 -3264306 5003546 7086919
$$ packed form
39128C692565k49047l1263L59090r33281l303441l899403j229594K311718L222154
39119f0502J397665m09126j090889k184550l986801l808304R8249M964618O308124
39110A228484L636003J107881J990541M110897K482434l859565r629050r026714
39102g959089k333529M949107Q421069P815009M546530j77808m163858m615082
39094F482349j561242J376120J106641j961741n663923q004081o846675j563531
39086a6636083L860307L976202L5850l76038N091952Q572746L696547l710116
39078D511367l997264J873777N068418L087339J488443K366992J140208l897633
39070A1641647p866354p562484n487751l156513J611077P556072Q267852K083373
$$ plain form
39062 7086919 3482243 509435 643492 879747 297894 1732830 4379779 1925063 -8415506
39053 -8415506 -20266969 -25284047 -22129374 -15090089 -7510869 -518815 4306901 5244039
39045 5244039 3034533 839715 1493907 5132697 8588006 7598081 1685692 -3797179
39037 -3797179 -3465288 870053 2678747 95606 -2191107 -1109237 399132 -733066
39029 -733066 -2791194 -3373407 -3564119 -4322553 -3076680 1797582 6766676 7889883 6703952
39020 6703952 6945077 8284256 8032802 6574255 6026401 5241825 1145373 -5903363 -12388261
39011 -12388261 -16378058 -18240988 -17969708 -15620485 -12855373 -10101558 -4181176 6553700
39003 6553700 16702902 19058547 14251578 9433822 8054840 7076432 4260397 1605296
$$ packed form
39062G086919l604676k972808J34057K36255n81853J434936K646949k454716j0340569
39053h415506j1851463n017078L154673P039285P579220O992054M825716R37138
39045E244039k209506k194818O54192L638790L455309r89925n912389n482871
39037c797179L31891M335341J808694k583141k286713J081870J508369j132198
39029g33066k058128n82213j90712p58434J245873M874262M969094J123207j185931
39020F703952K41125J339179k51454j458547n47854p84576m096452p048736o484898
39011a2388261l989797j862930K71280K349223K765112K753815N920382J0734876
39003F553700J0149202K355645m806969m817756j378982r78408k816035k655101
$$ plain form
38995 1605296 353851 -1190853 -2852656 -1251483 4079149 8121650 6805155 1968967
38987 1968967 -2597680 -6084522 -9030165 -10637773 -10698695 -10977875 -11902674 -10762484 -5780182
38978 -5780182 596901 4555951 4575419 1121021 -3640878 -4655192 2382013 13553049
38970 13553049 18227937 12101806 3851499 3764317 10251454 14014703 11991347 9255264
38962 9255264 8439677 5542855 -2335019 -11721807 -17884203 -20388629 -20852821 -18994579
38954 -18994579 -13981598 -7273705 -1460587 2337729 4231535 4175059 2426434 371862
38946 371862 -502490 -123101 122783 -1683946 -6832249 -14480960 -21113076 -22750042 -18386235
38937 -18386235 -10863391 -4443623 -1869079 -2959955 -4966858 -4817386 -2119851 507742
$$ packed form
38995A605296j251445j544704j661803J601173N330632M042501j316495m836188
38987A968967m566647l486842k945643j607608o0922k79180r24799J140190M982302
38978e780182O377083L959050J9468l454398m761899j014314P037205J1171036
38970A3553049M674888o126131q250307q7182O487137L763249k023356k736083
38962I255264q15587k896822p877874r386788o162396k504426m64192J858242
38954a8994579N012981O707893N813118L798316J893806n6476j748625k054572
38946C71862q74352L79389K45884j806729n148303p648711o632116j636966M363807
38937a8386235P522844O419768K574544j090876k006903J49472K697535K627593
$$ plain form
38929 507742 869922 -139290 -512971 -369110 -1173041 -2669370 -3001246 -1663877 -220156
38920 -220156 -12311 -877122 -2077271 -2875139 -2244044 439001 4303613 7512017 8399991
38911 8399991 5519858 -1604715 -10009487 -13676394 -9429843 -1133327 5168659 8787318
38903 8787318 12833684 16310521 13877216 4912867 -3035893 -3503782 374362 1028158
38895 1028158 -2747355 -5315127 -3300130 317479 2147632 3609900 7188101 10467681
38887 10467681 8218437 120174 -7436619 -8860588 -5906624 -4069853 -4407539 -2986442
38879 -2986442 1788717 5987395 6211425 4915798 6482996 10917602 15223507 18706180
38871 18706180 22333701 24264139 21257622 14590442 9616967 8413728 7239271 2801876
$$ packed form
38929E07742L62180j009212l73681J43861q03931j496329l31876J337369J443721
38920b20156K07845q64811j200149p97868O31095K683045L864612L208404Q87974
38911H399991k880133p124573q404772l666907M246551Q296516O301986L618659
38903H787318M046366L476837k433305q964349p948760m67889L878144O53796
38895A028158l775513k567772K014997L617609J830153J462268L578201L279580
38887A0467681k249244q098263p556793j423969K953964J836771l37686J421097
38879b986442M775159M198678K24030j295627J567198M434606M305905L482673
38871A8706180L627521J930438l006517o667180m973475j203239j174457m437395
$$ plain form
38863 2801876 -3044200 -6915031 -8562562 -9363803 -9059144 -6742538 -3075213 738526
38855 738526 4434884 7465208 8382971 7132323 5578503 3893580 -805330 -9490915
38847 -9490915 -17367483 -18504537 -12985298 -6182570 -1880731 527414 2399962 3060817
38839 3060817 1805263 257780 869750 3727765 6107382 5490905 2428036 -616669
38831 -616669 -3239005 -7708308 -13908537 -16237753 -9628607 2518676 11543835 14713571
38823 14713571 17217732 21514228 21664396 12672063 -260965 -7815919 -8059538 -5940627
38815 -5940627 -4652686 -4113120 -5441498 -9395958 -11384767 -5611667 5519612 13136642
38807 13136642 13730462 12231459 12130093 10356880 4940641 225976 -297914 -150797 -3259945
$$ packed form
38863B801876n846076l870831j647531q01241L04659K316606L667325L813739
38855G38526L696358L030324R17763j250648j553820j684923m698910q685585
38847i490915p876568j137054N519239O802728M301839K408145J872548O60855
38839C060817j255554j547483O11970K858015K379617o16477l062869l044705
38831f16669k622336m469303o200229k329216O609146J2147283R025159L169736
38823A4713571K504161M296496J50168q992333j2933028p554954k43619K118911
38815e940627J287941N39566j328378l954460j988809N773100J1131279P617030
38807A3136642N93820j499003j01366j773213n416239m714665n23890J47117l109148
$$ plain form
38798 -3259945 -6374331 -4517186 -233928 -393703 -5788015 -10648473 -11797520 -11953056
38790 -11953056 -13506132 -14784164 -14125424 -13075429 -13353287 -13944596 -13203082 -11324112 -9126642
38781 -9126642 -6613311 -4160237 -3020906 -3230840 -3037506 -1937946 -2237133 -5480066 -8838560
38772 -8838560 -7658549 -1358971 5247732 6969195 3446769 -969588 -1746542 1884446
38764 1884446 7041257 10454151 11006761 9217020 5543610 424874 -4740927 -8452661
38756 -8452661 -10952570 -13471444 -15398585 -14272229 -9422476 -3535894 749575 3685038
38748 3685038 5918851 5470173 539441 -5863475 -8073936 -4773313 -319151 1572673
38740 1572673 1906346 2959697 4512405 5636225 6661529 6434467 1152549 -9731234
$$ packed form
38798c259945l114386J857145M283258j59775n394312m860458j149047j55536
38790a1953056j553076j278032O58740J049995k77858n91309P41514J878970K197470
38781i126642K513331K453074J139331k09934J93334J099560k99187l242933l358494
38772h838560J180011O299578O606703J721463l522426m416357p76954L630988
38764A884446N156811L412894N52610j789741l673410n118736n165801l711734
38756h452661k499909k518874j927141J126356M849753N886582M285469K935463
38748C685038K233813m48678m930732o402916k210461L300623M454162J891824
38740A572673L33673J053351J552708J123820J025304k27062n281918j0883783
$$ plain form
38732 -9731234 -18918083 -17750003 -6547652 5826817 11898068 10677217 4209462 -4708210
38724 -4708210 -10960416 -9890786 -3925187 -894876 -3412285 -5762133 -4330769 -4299510
38716 -4299510 -10583202 -18087784 -18359923 -12054209 -7012438 -6364323 -6506647 -5754360 -6809252
38707 -6809252 -10048891 -11702465 -10157600 -7766121 -5136511 -120052 5898700 7558501
38699 7558501 4094359 1934223 5271839 9907002 10290994 7019589 2945353 -2483891
38691 -2483891 -9423046 -13056473 -9480805 -3035005 -1435680 -5738229 -10793486 -13500328
38683 -13500328 -14603791 -14005705 -10753539 -7178530 -7075720 -9647380 -10547150 -9005369
38675 -9005369 -8647529 -10989790 -13493598 -14692587 -15773259 -15983329 -12261795 -5715713
$$ packed form
38732i731234r186849J168080J1202351J2374469O071251j220851o467755q917672
38724d708210o252206J069630N965599L030311k517409k349848J431364L1259
38716d299510o283692p504582k72139O305714N041771O48115j42324P52287j054892
38707f809252l239639j653574J544865K391479K629610N016459O018752J659801
38699G558501l464142k160136L337616M635163L83992l271405m074236n429244
38691b483891o939155l633427L575668O445800J599325m302549n055257k706842
38683a3500328j103463N98086L252166L575009J02810k571660q99770J541781
38675i005369L57840k342261k503808j198989j080672k10070L721534O546082
$$ plain form
38667 -5715713 -3150554 -8624758 -17120748 -19887104 -13536636 -1685243 9338069 13964306
38659 13964306 9872355 523605 -6665926 -7622999 -5701273 -6242495 -8975336 -8903033 -3887696
38650 -3887696 1652159 1192060 -7053871 -18031930 -24236681 -22428353 -15888955 -9764043
38642 -9764043 -5708479 -2861139 -1854790 -3606896 -5029624 -1574432 4842665 6254295
38634 6254295 -137317 -6466173 -4346729 3791807 9066092 8823372 8457970 11503053
38626 11503053 14405563 12629776 7225259 2921798 2383676 4251625 5352380 3784042
38618 3784042 815821 -107485 2716368 6865848 8775051 8162585 7365708 7067640 5482077
38609 5482077 1798461 -2251418 -4953052 -6672420 -8459849 -9919578 -9292126 -5393688
$$ packed form
38667e715713K565159n474204q495990k766356O350468J1851393J1023312M626237
38659A3964306m091951r348750p189531r57073J921726n41222k732841P2303N015337
38650c887696N539855m60099q245931j0978059o204751J808328O539398O124912
38642i764043M055564K847340J006349j752106j422728L455192O417097J411630
38634F254295o391612o328856K119444Q138536N274285k42720l65402L045083
38626A1503053K902510j775787n404517m303461n38122J867949J100755j568338
38618C784042k968221r23306K823853M149480J909203o12466p96877k98068j585563
38609E482077l683616m049879k701634j719368j787429j459729O27452L898438
$$ plain form
38601 -5393688 209794 2939879 -1029592 -9593450 -15562752 -14814672 -11332695 -11280794 -14496404
38592 -14496404 -15951486 -13722645 -10275300 -6640375 -1219512 4894209 7159497 4242362
38584 4242362 656879 302720 1613964 1864658 2273610 5381707 10368940 14192445 14858151
38575 14858151 10974253 1350376 -11357336 -19398307 -16718802 -5898898 4704740 9208075
38567 9208075 7019610 145237 -8077985 -13012306 -11779527 -6152739 178692 5787929
38559 5787929 10067453 10072964 3603393 -5647987 -10989810 -10835214 -9731741 -11356482 -14706671
38550 -14706671 -17339775 -17949489 -15157112 -8138103 456703 6052148 7574458 7829818
38542 7829818 8325538 8128603 8054297 10338648 12872469 9979795 1585649 -4545167 -3553442
$$ packed form
38601e393688N603482K730085l969471q563858n969302P48080L481977N1901l215610
38592a4496404j455082K228841L447345L634925N420863O113721K265288k917135
38584D242362l585483l54159J311244K50694M08952L108097M987233L823505O65706
38575A4858151l883898r623877j2707712q040971K679505J0819904J0603638M503335
38567I208075k188465o874373q223222m934321J232779N626788O331431N609237
38559E787929M279524N511o469571r251380n341823J54596J103473j624741l350189
38550a4706671k633104o09714K792377P019009Q594806N595445J522310K55360
38542G829818M95720j96935p4306K284351K533821k892674q394146o130816R91725
$$ plain form
38533 -3553442 -541420 -1779944 -4359485 -1496832 5672882 9443808 7022257 3203323
38525 3203323 1800860 1367857 446535 781464 3151255 5018501 4785904 4368122 5153065
38516 5153065 4954385 1635374 -2947599 -5133120 -3583007 757653 6831938 13389412
38508 13389412 18032835 18432302 14397486 8297214 3964960 4506466 9190249 12729891
38500 12729891 10125336 2431231 -4684477 -7986492 -9096541 -9822286 -9376967 -7754937
38492 -7754937 -7607323 -9951311 -11409715 -9019312 -5184867 -4455891 -7356116 -10624952
38484 -10624952 -11864219 -10893158 -8295878 -5886064 -6810474 -11533941 -15362869 -14031398
38476 -14031398 -10218731 -9628023 -11628702 -9922411 -3239678 1023357 -3187250 -11989425
$$ packed form
38533c553442L012022j238524k579541K862653P169714L770926k421551l818934
38525C203323j402463m33003r21322L34929K369791J867246k32597m17782P84943
38516E153065j98680l319011m582973k185521J550113M340660O074285O557474
38508A3389412M643423L99467m034816o100272m332254N41506M683783L539642
38500A2729891k604555p694105p115708l302015j110049p25745M45319J622030
38492g754937J47614k343988j458404K390403L834445P28976k900225l268836
38484a0624952j239267R71061K597280K409814r24410m723467l828928J331471
38476a4031398L812667N90708k000679J706291O682733M263035m210607q802175
$$ plain form
38468 -11989425 -16971496 -15514144 -11389531 -7951387 -5908909 -6501873 -11231198 -17560694
38460 -17560694 -19563051 -15181399 -9682956 -9002817 -11595948 -10225799 -1428648 9893533
38452 9893533 16178991 15084550 9982605 4491056 -572631 -5159413 -8226245 -9421435
38444 -9421435 -10032229 -10025042 -6150046 3669916 14852478 18977026 13078950 3025897
38436 3025897 -3933597 -7153953 -10750900 -16093638 -19580025 -17306741 -9142277 1726626
38428 1726626 10795027 13811875 9332715 954394 -4978254 -5258982 -2234252 206442
38420 206442 1116285 1896763 3404942 5663558 8829339 12087654 12859019 9884244 6201856
38411 6201856 5703705 6966399 4480398 -3032481 -9705634 -10384135 -7755912 -7848947 -11014916
$$ packed form
38468a1989425m982071J457352M124613L438144K042478n92964m729325o329496
38460a7560694k002357M381652N498443O80139k593131J370149Q797151J1322181
38452I893533O285458j094441n101945n491549n063687m586782l066832j195190
38444i421435o10794P187L874996R819962J1182562M124548n898076j0053053
38436C025897o959494l220356l596947n342738l486387K273284Q164464J0868903
38428A726626R068401L016848m479160q378321n932648k80728L024730K440694
38420B06442R09843P80478J508179K258616L165781L258315P71365k974775l682388
38411F201856m98151J262694k486001p512879o673153o78501K628223r3035l165969
$$ plain form
38402 -11014916 -12279385 -9695262 -7005901 -6934461 -6511708 -1826867 5604796 10413509
38394 10413509 9819289 5753380 1227710 -2959083 -7585434 -12546773 -15837325 -15239412
38386 -15239412 -11458499 -8923972 -11628030 -18009595 -22293530 -21799268 -20272389 -22033432
38378 -22033432 -25337839 -24787871 -19063739 -12659192 -9873613 -10209849 -10615332 -9770244 -8619322
38369 -8619322 -8190468 -8578882 -9686056 -11881492 -15738265 -21282395 -27463150 -32427713
38361 -32427713 -34373640 -32043890 -24981712 -14552124 -4657309 441257 -16716 -2890771
38353 -2890771 -5200976 -6759042 -7994021 -7952301 -6555395 -6203539 -7982559 -8362747 -3618976
38344 -3618976 3708453 7128331 4632849 460015 -1738802 -2658286 -2912772 236266
$$ packed form
38402a1014916j264469K584123K689361P1440M22753M684841P431663M808713
38394A0413509n94220m065909m525670m186793m626351m961339l290552N97913
38386a5239412L780913K534527k704058o381565m283935M94262J526879j761043
38378b2033432l304407N49968N724132O404547K785579l36236m05483Q45088J150922
38369h619322M28854l88414j107174k195436l856773n544130o180755m964563
38361c2427713j945927K329750P062178J0429588R894815N098566m57973k874055
38353b890771k310205j558066j234979M1720J396906L51856j779020l80188M743771
38344c618976P327429L419878k495482m172834k198817r19484k54486L149038
$$ plain form
38336 236266 8425214 17575302 21304037 17497518 9073793 -77996 -7166646 -9810149
38328 -9810149 -6663615 629272 7852255 11351492 10423162 6918004 3143331 136531
38320 136531 -2151882 -3189354 -1616130 2260170 5208705 4647368 2451538 2143314 2993760
38311 2993760 1020299 -3898985 -6723999 -4741988 -1606171 -990649 -684250 2715354
38303 2715354 6774847 6261243 1267672 -3067116 -4154494 -4105524 -4297668 -2979955 453119
38294 453119 3299728 3746124 3654603 4777303 5195088 2509133 -1405006 -2018706 2213778
38285 2213778 8359372 12710273 13624790 10919658 5404198 196809 -120309 5549360
38277 5549360 11648895 10791920 2201017 -7289910 -11594135 -11863521 -12776027 -15428174 -17321666
$$ packed form
38336B36266Q188948R150088L728735l806519q423725r151789p088650k643503
38328i810149L146534P292887P222983L499237r28330l505158l774673l006800
38320A36531k288413j037472J573224L876300K948535n61337k195830l08224Q50446
38311B993760j973461m919284k825014J982011L135817O15522L06399L399604
38303B715354M059493n13604m993571m334788j087378M8970j92144J317713L433074
38294D53119K846609M46396r1521J122700M17785k685955l914139o13700M232484
38285B213778O145594M350901R14517k705132n515460n207389l17118N669669
38277E549360O099535q56975q590903r490927m304225k69386r12506k652147j893492
$$ plain form
38268 -17321666 -17039017 -14509467 -8368177 1266560 7909922 3452454 -10408268 -21754111
38260 -21754111 -22448811 -16719441 -12203772 -9153675 -4741863 -2300964 -7250943 -16224613
38252 -16224613 -19272894 -13113145 -4537106 330386 2815643 5693828 7507551 6812715
38244 6812715 6658698 9965353 13725532 12292706 4674654 -4841773 -11945129 -15322413
38236 -15322413 -15639402 -14394578 -13591851 -14489958 -16228739 -16393099 -13058564 -6496858 513091
38227 513091 4388659 3509164 -1350791 -9734456 -22204136 -36217423 -44273247 -40724016
38219 -40724016 -29236336 -18813977 -13177196 -9297199 -5831353 -5889682 -9585292 -10899044
38211 -10899044 -6188853 -456336 -110110 -3477864 -3923994 310659 4902195 6702176
$$ packed form
38268a7321666K82649K529550O141290R634737O643362m457468j3860722j1345843
38260b1754111o94700N729370M515669L050097M411812K440899m949979q973670
38252a6224613l048281O159749Q576039M867492K485257K878185J813723o94836
38244F812715j54017L306655L760179j432826p618052r516427p103356l377284
38236a5322413l16989J244824Q02727q98107j738781j64360L334535O561706P009949
38227E13091L875568q79495m859955q383665j2469680j4013287q055824L549231
38219d0724016J1487680J0422359N636781L879997L465846n8329l695610j313752
38211a0899044M710191N732517L46226l367754m46130M234653M591536J799981
$$ plain form
38203 6702176 7066644 8016875 9262729 9891208 10321610 11597471 13710320 14519863 10338703
38194 10338703 -339867 -12860983 -19114482 -16335475 -10534472 -8626850 -9983629 -9301198
38186 -9301198 -5429229 -2643310 -3720557 -5893457 -4377831 2648495 12941156 22082494
38178 22082494 26283733 24731424 19401111 12570815 5876332 1676271 2204295 6095410
38170 6095410 9023270 9589423 10919255 14052591 14208558 7586577 -2171095 -9292712
38162 -9292712 -14080964 -19882975 -24811078 -23653999 -16868423 -10615437 -7792343 -5472851
38154 -5472851 -1702070 1595265 3606697 6302690 9310594 8949314 4789861 1883870
38146 1883870 3537096 6355558 5452720 743415 -4680129 -8901690 -11321688 -11720431
$$ packed form
38203F702176L64468R50231J245854O28479M30402J275861K112849Q09543m181160
38194A0338703j0678570j2521116o253499K779007N801003J907622j356779O82431
38186i301198L871969K785919j077247k172900J515626P026326J0292661R141338
38178B2082494M201239j552309n330313o830296o694483m200061N28024L891115
38170F095410K927860N66153J329832L133336J55967o621981r757672p121617
38162i292712m788252n802011m928103J157079O785576O252986K823094K319492
38154e472851L770781L297335K011432K695993L007904l61280m159453k905991
38146A883870J653226K818462r02838m709305n423544m221561k419998l98743
$$ plain form
38138 -11720431 -11605166 -13563413 -17363163 -19667650 -18929505 -16985486 -14784473 -11188532
38130 -11188532 -7474665 -7389916 -10126771 -9257093 -2590575 2712588 -49854 -7461212
38122 -7461212 -12012243 -12903484 -13833934 -14211037 -11038783 -7150605 -8482701 -13555371 -14518737
38113 -14518737 -9921539 -8013976 -14252622 -22741145 -24657459 -19862249 -14988276 -13346013
$$ packed form
38138a1720431J15265j958247l799750k304487P38145J944019K201013L595941
38130a1188532L713867Q4749k736855Q69678O666518N303163k762442p411358
38122g461212m551031q91241r30450l77103L172254L888178j332096n072670r63366
38113a4518737M597198J907563o238646q488523j916314M795210M873973J642263
$$ [...]
##END NTUPLES=NMR SPECTRUM
##END=
