##TITLE=31Pdec_DE-63_35D
 D2O, 64 sc
 15.8.2024
##JCAMPDX= 6.0         $$ Bruker NMR JCAMP-DX V2.0
##DATA TYPE= NMR SPECTRUM
##DATA CLASS= NTUPLES
##ORIGIN= UXNMR, Bruker Analytische Messtechnik GmbH
##OWNER= root
$$ XWIN-NMR		Version 3.5
$$ Thu Aug 15 16:15:40 2024 Russian Standard Time (UT+4h)  she@DPX200
##.OBSERVE FREQUENCY= 81.013821
##.OBSERVE NUCLEUS= ^31P
##.ACQUISITION MODE= SIMULTANEOUS
##.ACQUISITION SCHEME= undefined
##.AVERAGES= 64
##.DIGITISER RES= 17
##SPECTROMETER/DATA SYSTEM= spect
##.PULSE SEQUENCE= zgpg30
##.SOLVENT NAME= CDCl3
##.SHIFT REFERENCE= (INTERNAL, CDCl3, 0, 198.062)
##AUDIT TRAIL= $$ (NUMBER, WHEN, WHO, WHERE, WHAT)
$$ ##TITLE= Audit trail, XWIN-NMR		Version 3.5
$$ ##JCAMPDX= 5.01
$$ ##ORIGIN= Bruker BioSpin GmbH
$$ ##OWNER= she
$$ F:/spectra/data/she/nmr/P31/2/pdata/1/auditp.txt
$$ ##AUDIT TRAIL=  $$ (NUMBER, WHEN, WHO, WHERE, WHAT)
(   1,<2024-08-15 16:14:39.62 +0400>,<she>,<DPX200>,
      <created by zg, POWCHK disabled, PULCHK disabled
       configuration hash MD5:
       00 E9 B6 7A A2 85 ED C7 34 08 36 98 17 FE 4E 26
       data hash MD5: 32K
       56 E5 D7 7D 9B FC 39 C1 1E 11 B5 89 3A BA 35 8F>)
(   2,<2024-08-15 16:14:43.17 +0400>,<she>,<DPX200>,
      <Start of raw data processing
       efp BC_mod = 2 LB = 1.5 FT_mod = 6 PKNL = 1 PHC0 = 2627.566 PHC1 = 205.6881 SI = 64K 
       data hash MD5: 64K
       8B F0 6B 96 40 F3 D7 E7 CA C8 41 F9 55 92 CC 9D>)
(   3,<2024-08-15 16:15:08.34 +0400>,<she>,<DPX200>,
      <pk PHC0 = -199.3552 PHC1 = 457.5998 
       data hash MD5: 64K
       34 7D EB 1D C4 6B D7 38 B0 87 CE 9D 0D 5A 19 B0>)
$$ ##END=
$$ 
$$ hash MD5
$$ 42 81 23 45 1F 5E 27 CE 8B 31 2C AA FE D9 DE BA
##$RELAX= 
##$RELAX= 
##$RELAX= 
##$RELAX= 
##$RELAX= 
##$RELAX= 
##$RELAX= 
##$RELAX= 
$$ Bruker specific parameters
$$ --------------------------
##$DU= <F:/spectra>
##$EXPNO= 2
##$NAME= <P31>
##$PROCNO= 1
##$TYPE= <nmr>
##$USER= <she>
##$AMP= (0..31)
100 100 100 100 100 100 100 100 100 100 100 100 100 100 100 100 100 100 
100 100 100 100 100 100 100 100 100 100 100 100 100 100 
##$AQSEQ= 0
##$AQ_mod= 1
##$AUNM= <au_zg>
##$AUTOPOS= <>
##$BF1= 81.014009
##$BF2= 200.13
##$BF3= 200.13
##$BF4= 200.13
##$BF5= 200.13
##$BF6= 200.13
##$BF7= 200.13
##$BF8= 200.13
##$BYTORDA= 1
##$CFDGTYP= 0
##$CFRGTYP= 5
##$CHEMSTR= <none>
##$CNST= (0..31)
1 1 145 1 1 1 1 1 1 1 1 1 1 1 1 1 1 1 1 1 1 1 1 1 1 1 1 1 1 1 1 1 
##$CPDPRG= <waltz16>
##$CPDPRG1= <>
##$CPDPRG2= <waltz16>
##$CPDPRG3= <>
##$CPDPRG4= <mlev>
##$CPDPRG5= <mlev>
##$CPDPRG6= <mlev>
##$CPDPRG7= <mlev>
##$CPDPRG8= <mlev>
##$CPDPRGB= <>
##$CPDPRGT= <>
##$D= (0..31)
0 1 0 0 0 0 0 0 0 0.06 0 0.03 2e-05 3e-06 0 0 0.0002 0 0 0 0 0 0 0 0 0 
0 0 0 0 0 0 
##$DATE= 1723724079
##$DBL= (0..7)
120 120 120 11 120 120 24 19 
##$DBP= (0..7)
150 150 150 150 150 150 150 150 
##$DBP07= 0
##$DBPNAM0= <>
##$DBPNAM1= <>
##$DBPNAM2= <>
##$DBPNAM3= <>
##$DBPNAM4= <>
##$DBPNAM5= <>
##$DBPNAM6= <>
##$DBPNAM7= <>
##$DBPOAL= (0..7)
0.5 0.5 0.5 0.5 0.5 0.5 0.5 0.5 
##$DBPOFFS= (0..7)
$$ [...]
##$SUBNAM2= <"">
##$SUBNAM3= <"">
##$SUBNAM4= <"">
##$SUBNAM5= <"">
##$SUBNAM6= <"">
##$SUBNAM7= <"">
##$SUBNAM8= <"">
##$SUBNAM9= <"">
##$SW= 400.765351723535
##$SWIBOX= (0..15)
0 1 3 0 0 0 0 0 0 0 0 0 0 0 0 0 
##$SW_h= 32467.5324675325
##$TD= 32768
##$TD0= 1
##$TE= 0
##$TE2= 300
##$TE3= 300
##$TEG= 300
##$TL= (0..7)
0 120 53 12 22 120 120 120 
##$TP= (0..7)
150 150 150 150 150 150 150 150 
##$TP07= 0
##$TPNAME0= <>
##$TPNAME1= <>
##$TPNAME2= <>
##$TPNAME3= <>
##$TPNAME4= <>
##$TPNAME5= <>
##$TPNAME6= <>
##$TPNAME7= <>
##$TPOAL= (0..7)
0.5 0.5 0.5 0.5 0.5 0.5 0.5 0.5 
##$TPOFFS= (0..7)
0 0 0 0 0 0 0 0 
##$TUNHIN= 0
##$TUNHOUT= 0
##$TUNXOUT= 0
##$USERA1= <user>
##$USERA2= <user>
##$USERA3= <user>
##$USERA4= <user>
##$USERA5= <user>
##$V9= 5
##$VALIST= <valist>
##$VCLIST= <CCCCCCCCCCCCCCC>
##$VD= 0
##$VDLIST= <DDDDDDDDDDDDDDD>
##$VPLIST= <PPPPPPPPPPPPPPP>
##$VTLIST= <TTTTTTTTTTTTTTT>
##$WBST= 1024
##$WBSW= 4
##$XGAIN= (0..3)
0 0 0 0 
##$XL= 0
##$YL= 0
##$YMAX_a= 15442
##$YMIN_a= -9516
##$ZGOPTNS= <>
##$ZL1= 120
##$ZL2= 120
##$ZL3= 120
##$ZL4= 120
##$ABSF1= 0
##$ABSF2= 0
##$ABSG= 0
##$ABSL= 0
##$ALPHA= 0
##$AQORDER= 0
##$ASSFAC= 0
##$ASSFACI= 0
##$ASSFACX= 0
##$ASSWID= 0
##$AUNMP= <proc_1d>
##$AZFE= 0.1
##$AZFW= 0.5
##$BCFW= 0
##$BC_mod= 2
##$BYTORDP= 0
##$COROFFS= 0
##$CY= -3
##$DATMOD= 1
##$DC= 0
##$DFILT= <>
##$DTYPP= 0
##$F1P= 0
##$F2P= 0
##$FCOR= 1
##$FTSIZE= 65536
##$FT_mod= 6
##$GAMMA= 0
##$GB= 0
##$INTBC= 1
##$INTSCL= 9.790993e-09
##$ISEN= 30
##$LB= 1.5
##$LEV0= 0
##$LPBIN= 0
##$MAXI= 10000
##$MC2= 0
##$MEAN= 0
##$ME_mod= 0
##$MI= 50
##$NCOEF= 0
##$NC_proc= -8
##$NLEV= 6
##$NOISF1= 182.463
##$NOISF2= 159.3651
##$NSP= 0
##$NTH_PI= 0
##$NZP= 0
##$OFFSET= 198.0616
##$PC= 4
##$PHC0= 2428.211
##$PHC1= 663.2879
##$PH_mod= 1
##$PKNL= yes
##$PPARMOD= 0
##$PSCAL= 0
##$PSIGN= 0
##$REVERSE= no
##$SF= 81.0140089999434
##$SI= 65536
##$SIGF1= 159.3651
##$SIGF2= -187.1042
##$SINO= 113.3802
##$SIOLD= 16384
##$SREGLST= <1H.CDCl3>
##$SSB= 0
##$STSI= 65536
##$STSR= 0
##$SW_p= 32467.5324675325
##$SYMM= 0
##$S_DEV= 0
##$TDeff= 32768
##$TDoff= 0
##$TI= <>
##$TILT= no
##$TM1= 0
##$TM2= 0
##$TOPLEV= 0
##$USERP1= <user>
##$USERP2= <user>
##$USERP3= <user>
##$USERP4= <user>
##$USERP5= <user>
##$WDW= 1
##$XDIM= 65536
##$YMAX_p= 275686910
##$YMIN_p= -22632244
$$ End of Bruker specific parameters
$$ ---------------------------------
##NTUPLES= NMR SPECTRUM
##VAR_NAME=  FREQUENCY,     SPECTRUM/REAL,   SPECTRUM/IMAG
##SYMBOL=    X,             R,               I
##VAR_TYPE=  INDEPENDENT,   DEPENDENT,       DEPENDENT
##VAR_FORM=  AFFN,          ASDF,            ASDF
##VAR_DIM=   65536,         65536,           65536
##UNITS=     HZ,            ARBITRARY UNITS, ARBITRARY UNITS
##FACTOR=    0.49542278885378, 1,            1
##FIRST=     16045.7642231865, 0,            0
##LAST=      -16421.768244346, 0,            0
##MIN=       -16421.768244346, -22632244,    0
##MAX=       16045.7642231865, 275686910,    0
$$ Real data points
##PAGE= N=1
##DATA TABLE= (X++(R..R)), XYDATA
$$ [...]
42386 594339 -555408 610380 2372677 2534399 863762 -877678 -1352118 -1589388 -3597794
42377 -3597794 -7104660 -9240432 -8260230 -6012655 -5265969 -5970345 -6154565 -5414650 -4955733
42368 -4955733 -4674391 -3055874 -272073 1309376 643001 -168778 1234377 4436384 7229838
42359 7229838 8284692 7913009 7385206 8154400 10499574 12510137 11937649 9354401 7495953
42350 7495953 7062649 5776779 2658341 333940 1085391 3135563 3462395 2272855 1735626
42341 1735626 1838416 793618 -1308108 -2532750 -2534734 -2955358 -4294129 -5103058 -4603309
42332 -4603309 -3616431 -2502917 -574451 1891438 3338916 3374098 3469958 4484472 5434456
42323 5434456 5566188 5731325 6632201 7288541 6355695 3820801 691698 -1902189 -3053518
42314 -3053518 -2958092 -3474539 -5848580 -7822130 -5669579 227063 4824499 4839118 2752348
42305 2752348 2342938 3138104 2316268 -161376 -1960624 -2506639 -2923722 -2581504 313697
42296 313697 4524899 6073082 3798696 1282816 1648698 3454488 3913799 3585319 4827060
42287 4827060 7105880 7238604 4194802 808430 -14102 1331425 2556825 2538994 1656061
42278 1656061 463314 -195002 1377772 5953636 11026206 12471988 9359794 5114714
42270 5114714 2651700 484506 -4039970 -9354308 -10950759 -7693800 -3343265 -1177649
42262 -1177649 -546169 -201873 -1643264 -6426061 -12491709 -16160496 -16338960 -14223522 -10497909
42253 -10497909 -5861578 -2936315 -3995830 -7269118 -8805889 -7620380 -5580978 -2735873
42245 -2735873 2810546 9821313 13463627 11841046 8945509 8654085 9550266 8849465 8001786
42236 8001786 10131039 14116874 15744051 13715936 10433027 7429665 4211597 1578580
42228 1578580 1734599 4053963 4619339 1757615 -1188048 -799643 1446430 1903882 484739
42219 484739 439477 3142184 6104652 6529490 4553010 2106266 226507 -1250205 -2273867
42210 -2273867 -2320526 -1492736 -737852 -516224 -76777 1183981 2367578 2433270 2596998
42201 2596998 5363806 10495015 14011819 12874947 9023086 6496855 5796534 4085369
42193 4085369 536541 -2073998 -1996699 -1528498 -3442002 -6609542 -7484993 -4731746 -441010
42184 -441010 2473279 2620106 755660 -524718 1377600 6083750 9917489 9939312 7342054
42175 7342054 5313726 4634279 3423478 531564 -3027824 -5746352 -6713790 -5283500
42167 -5283500 -1764941 1527601 2037141 150814 -1141810 -36198 2364549 4197768
42159 4197768 4672338 3498449 805153 -1683560 -1714485 160691 468147 -2668826 -6986832
42150 -6986832 -9604592 -10915652 -12769909 -14554873 -13875831 -10321111 -6019347 -2811804
42142 -2811804 -1078233 -1064967 -3034269 -5879554 -7599898 -7594295 -6939145 -6258166 -5091264
42133 -5091264 -3668492 -3332611 -4354120 -4999189 -3913553 -2156499 -1620243 -2381819 -2979022
42124 -2979022 -2782264 -2715017 -3543415 -4430109 -3687402 -792562 2534505 3483697 783526
42115 783526 -3753965 -6745462 -6471845 -4230778 -2354655 -1520366 -615671 1048850 2320237
42106 2320237 1528626 -1129472 -3399090 -3499902 -2100150 -949145 -200975 1425591 3965214
42097 3965214 5569397 5136777 3724426 2266798 -205067 -4342629 -8179613 -9390025
42089 -9390025 -8633984 -8028454 -7218981 -4147357 533875 3320697 2811803 1538257 1544004
42080 1544004 1180342 -1682001 -5703260 -7807168 -7295839 -5995004 -5427259 -5783251 -6678097
42071 -6678097 -7128346 -5806335 -3100028 -1801711 -3731651 -6698263 -7118528 -4914347
42063 -4914347 -3238682 -3627440 -4217438 -3370348 -2643269 -4724247 -9652131 -14356225 -15636731
42054 -15636731 -13116890 -9400507 -7323966 -7099033 -6849983 -5941790 -6015249 -7749540 -8704449
42045 -8704449 -6603861 -3177329 -1791469 -2221005 -1282167 1436637 2338282 -541231 -4053883
42036 -4053883 -4169531 -1218523 1359570 1720460 817382 191178 716913 2649469 4918606
42027 4918606 5074232 1904808 -2296942 -3916028 -2196588 592557 3069008 6651637
42019 6651637 12730369 19524761 23242933 21968372 17400851 12761315 9720838 7760206
42011 7760206 6073944 5120447 5687083 6916147 6343561 2295518 -4180949 -9925895 -11901824
42002 -11901824 -9163867 -3569937 1353613 3190042 2643231 2197491 2918996 3730699 3812880
41993 3812880 3881013 4217046 3160844 -713380 -5769785 -8406022 -6860282 -2766233 925867
41984 925867 2563300 2525710 2407055 3473039 5106936 4888351 1142476 -4507755 -8016119
41975 -8016119 -6742994 -2012942 2325360 3526365 1952753 -207942 -1655967 -2888209
41967 -2888209 -4452429 -5374671 -4441887 -2487754 -1717508 -2605225 -3216078 -2257944 -1007988
41958 -1007988 -990171 -1400191 -710354 272687 -781470 -4068599 -6769911 -6220214 -2679128
41949 -2679128 1379652 3792456 4276437 4126343 4414113 4271827 1685931 -3396412 -7894091
41940 -7894091 -8821794 -6710912 -4159980 -1996892 679194 3106588 2674474 -921940
41932 -921940 -3960654 -2898189 1391233 5356876 7405535 8661190 9785667 9523097
41924 9523097 7088087 4295199 3816792 5691969 6868468 4776531 617923 -2004089
41916 -2004089 -1665914 -953203 -2931106 -6954367 -9445849 -8267372 -4706931 -1315846
41908 -1315846 490476 458126 -1063312 -2861521 -3405345 -2648427 -2286031 -3305354 -4313392
41899 -4313392 -3501627 -1481709 -659802 -1986104 -3732239 -3797711 -2103034 -17282 1786731
41890 1786731 3760264 5838938 6646710 5224101 2836563 1708346 2055821 1864569 -75591
41881 -75591 -2595627 -4378522 -5862142 -7412698 -7492422 -5069019 -2468320 -2735651 -4793167
41872 -4793167 -4693228 -1853459 -342472 -2782166 -6452358 -7532335 -6278015 -5283603 -4872142
41863 -4872142 -3389189 -754912 1363531 2303607 2681619 2436726 1252801 621553 2635383
41854 2635383 6458821 8722944 8157469 7233321 7897906 8046268 4466021 -1947174 -6314135
41845 -6314135 -5153238 -49202 4480851 5758054 4926427 4705025 6077363 7605630
41837 7605630 7615771 6240896 4986693 4883083 5708962 6727128 7404208 7329573 6017234
41828 6017234 3124698 -1220474 -6312405 -11001890 -14102882 -14896255 -13294841 -9652671
41820 -9652671 -4638288 833724 5836920 9413333 10218077 7199127 1662911 -2390120
41812 -2390120 -2029413 849945 1847180 93872 -949981 617355 1997270 446810
41804 446810 -2163913 -2794361 -2609539 -4743317 -8242155 -8920887 -5996129 -3293410 -3064392
41795 -3064392 -2787207 244183 4659644 7455373 7963945 7266501 5900742 4188171 2848254
41786 2848254 1387477 -2043232 -7087761 -9667902 -6789491 -1215608 1732329 983615
41778 983615 138646 1598799 3668462 3982617 2840398 1849848 1325929 475659 -1077962
41769 -1077962 -3091862 -5161266 -6558093 -6342856 -4372403 -1758076 83414 464934
41761 464934 -492320 -2102762 -3348040 -3683972 -3852826 -5141336 -7571979 -9551660 -9591780
41752 -9591780 -7689791 -4798934 -1835543 266722 385040 -1879615 -5228605 -7282536
41744 -7282536 -6399622 -2881841 1317744 3865443 3426916 424984 -3347231 -6042409
41736 -6042409 -6924115 -6440746 -5379468 -4106595 -2631823 -1181822 -269157 56703 628216
41727 628216 2189128 4117283 4896810 3979197 2313040 746250 -1017319 -3166231 -4592652
41718 -4592652 -4241683 -2992614 -2693451 -3533318 -3910302 -3094239 -2516300 -3723520 -6178019
41709 -6178019 -8040913 -8539065 -8663531 -9649563 -11271033 -11733367 -9395159 -4920856 -1346593
41700 -1346593 -1062951 -2844656 -3233366 -1228513 65798 -2269144 -6368968 -7382598
41692 -7382598 -3621558 1148414 2200166 -912186 -4601694 -5544371 -3298829 703568
41684 703568 4912099 7929740 8482474 6443097 3559257 2045350 2205832 2165180 274707
41675 274707 -2870457 -5354328 -6278457 -6246852 -5809465 -4746545 -3290181 -2704708 -3476316
41666 -3476316 -3858319 -1995108 738266 668005 -3135932 -6742620 -5981430 -1759039 1517163
41657 1517163 1969892 1776044 2544436 2495195 -154141 -3752529 -5703162 -6391352 -7501040
41648 -7501040 -7691673 -3815638 3415172 8697872 8468595 5164344 3429356 4312613 5216557
41639 5216557 3885825 369136 -3762736 -6282962 -5473959 -2173101 438281 748492
41631 748492 948444 3206138 5276581 3205369 -2337846 -6136338 -5245996 -2384959 -1448611
41622 -1448611 -2668021 -3944566 -4542326 -5217843 -6113054 -6467298 -5621700 -3090537 1292737
41613 1292737 6122044 8489902 6675525 1954711 -3094548 -6769337 -7878512 -5352339
41605 -5352339 -310337 3049911 1329350 -3846862 -7714412 -8017426 -6538411 -5413384
41597 -5413384 -4658584 -3849250 -3823878 -5444395 -7986244 -9683282 -9143101 -6166107 -2302195
41588 -2302195 -376962 -1718953 -3803222 -2724786 1560665 4783052 4096326 1839255
41580 1839255 1814473 3933653 5090857 4034439 2470849 1687092 894770 -524885 -1450194
41571 -1450194 -836155 474648 1016277 734998 538134 537657 112138 -476095 135679 2523182
41561 2523182 5163612 5731443 3488244 -90722 -2844801 -3455232 -1611488 2195998
41553 2195998 6355128 8447986 7125695 3561061 120633 -2203616 -3971287 -5233646
41545 -5233646 -5061793 -3514745 -2226487 -2007233 -1542575 24092 794512 -1357823 -4944059
41536 -4944059 -6320443 -4972288 -4486021 -7244075 -10657214 -10679730 -7499706 -5220267 -6262004
41527 -6262004 -8491609 -8619749 -6588225 -4971882 -4861307 -4384737 -1813666 1573359 3282131
41518 3282131 3369870 4264761 6682010 8022534 6052749 2291549 -111007 -429325 -61312
41509 -61312 637764 2277831 3633342 2334256 -923116 -1989871 1377388 6283269 8546808
41500 8546808 7504530 4992043 1819286 -2004500 -5139682 -6029550 -5308239 -4441508 -2869459
41491 -2869459 498849 3626887 2835161 -1674627 -5156345 -4204850 -428492 2821783
41483 2821783 4360389 4216726 1875608 -1930536 -4008319 -2360097 403341 356955 -2023629
41474 -2023629 -2706303 -346374 1746852 624801 -2342821 -4150775 -4575928 -5692376
41466 -5692376 -8016701 -9303231 -7295649 -2377585 2889186 6177729 7025201 6477991
41458 6477991 5618444 4667652 3448825 2285934 2009727 3155313 5448254 7928195 9247841
41449 9247841 8149812 4380323 -654691 -4529026 -5400586 -3186329 385619 2655524
41441 2655524 1658297 -2208583 -6213464 -7648629 -6133377 -3127962 372776 4620950
41433 4620950 9701650 14565232 17896147 19071095 17846963 14035566 8255960 2420255
41425 2420255 -1415078 -2665537 -2385213 -2075034 -2552466 -3584421 -4287933 -4205201 -4134940
41416 -4134940 -5294913 -7353055 -8136426 -6111092 -2565434 -256393 -91730 -279070 1048792
41407 1048792 3381578 4578876 3452912 918323 -1248745 -2251634 -2737758 -3628925
41399 -3628925 -4742940 -4905130 -3593865 -2021049 -1865362 -2999254 -3348739 -1379195 2001225
41390 2001225 4566355 5145038 4118203 2179424 -158972 -1932324 -1950608 -183162 1984346
41381 1984346 3418304 4389378 5507156 6347914 5986862 4301886 1916660 -594697 -2585780
41372 -2585780 -3124094 -2146115 -1351018 -2479520 -4880389 -6295094 -6001571 -5405112 -5189863
41363 -5189863 -3862931 -190850 4446638 7475672 7891161 6461939 4181446 1825225
41355 1825225 305027 119684 811584 1826691 3226887 4680712 4817645 3021786 1102807
41346 1102807 1564978 4547940 7777024 9109541 7957085 4966414 1806926 489862
41338 489862 1142971 1285195 -607398 -1755949 1805166 9085645 14418581 14367971 11063484
41329 11063484 7606455 3721641 -1684320 -6501419 -7280032 -3912718 261904 2462354
41321 2462354 2535447 1661142 933857 865666 777676 -799242 -3829822 -5844170 -4951977
41312 -4951977 -2816354 -2618842 -4790409 -6942225 -7526373 -7170280 -6518210 -5292298 -3954689
41303 -3954689 -3980972 -5511495 -6449819 -4874620 -1103193 3251377 6944027 9249771 9910264
41294 9910264 9758886 10199670 11285183 11407318 9572770 6807039 4568477 3026892 1823018
41285 1823018 1278831 1692697 2492177 3282404 4649390 6474516 6540636 2906703 -2737710
41276 -2737710 -6354937 -6562853 -6294017 -8441479 -11606987 -12042774 -9026408 -6097079 -6460790
41267 -6460790 -8897339 -9643007 -7510329 -5259576 -5529717 -7054084 -6325397 -2330580 2054015
41258 2054015 3661950 2707699 2034300 3476465 6072976 7809754 8168318 8366896 9396151
41249 9396151 10555691 10365736 8616079 6771297 6153768 6446382 6537198 6189931 5935474
41240 5935474 5673232 4597352 2634088 780746 -500984 -2243586 -5470929 -9325532
41232 -9325532 -11672266 -11472011 -9830780 -8623158 -8620028 -9121762 -8969163 -7565840 -5113533
41223 -5113533 -2274904 229660 1918220 2792830 3380368 4291982 5528869 6301888 5735997
41214 5735997 3849418 1844290 1270550 2481585 3729124 2408318 -2055925 -6979328
41206 -6979328 -9158932 -8684258 -8615493 -10646293 -12758213 -12058574 -8436622 -4084202 -643341
41197 -643341 1505145 2018462 597586 -2006987 -4482945 -6275197 -7330038 -7229557 -6023798
41188 -6023798 -5075133 -5188760 -4698789 -1792387 1814327 2457599 -111072 -2058789 -958365
41179 -958365 1130267 1531114 1083218 2245465 5202052 8226981 10446754 11986288 12475766
41170 12475766 11560830 10131766 9164488 8016069 5602985 2619073 854989 754325
41162 754325 1108128 715944 -844565 -3331608 -5456920 -5337695 -2745789 64811 1145378
41153 1145378 1161719 1312881 678469 -1917618 -4880600 -5721747 -5011395 -5237754 -6413912
41144 -6413912 -6422426 -5418479 -5733514 -6876472 -5101851 274315 4198771 2356773 -2703579
41135 -2703579 -5069339 -2953281 346647 1355072 -660942 -4449113 -7591823 -7465999
41127 -7465999 -4066232 -1099667 -1692957 -3961306 -3868223 -1629960 -1346684 -4067893 -5506957
41118 -5506957 -2425990 2214133 3219811 -18277 -3564030 -4367885 -2789264 -392740
41110 -392740 1950307 3556977 3749835 2830021 1855966 1174979 431409 -40100 411870
41101 411870 756875 -1204431 -5288697 -7826390 -5881788 -1309225 1428397 795014 -613997
41092 -613997 -298351 876688 347263 -2707340 -6456071 -8050067 -5717678 -286342 4872107
41083 4872107 6520402 4870674 3274683 4036977 5743778 5613040 3177555 253078
41075 253078 -1713887 -2527775 -2080258 -270737 1816666 2393578 1277977 572065 2234792
41066 2234792 5556125 7714731 6781971 3952300 2638745 5011381 9403550 11776759
41058 11776759 9951105 5580562 1762919 50681 427958 2394036 4471754 4196543
41050 4196543 860018 -2648269 -3054408 -1065825 -43747 -910299 -1398693 -345906 628783
41041 628783 541001 926726 2838014 4743014 5189550 5025657 4978449 3557661 -6360
41032 -6360 -2848403 -1648503 2572797 5943724 7139061 8063750 9543377 9805985 7883495
41023 7883495 5551744 4633876 4600700 4197726 3657104 3795761 4243218 4136011 3781986
41014 3781986 4173329 5145288 5224458 3462472 755040 -909468 -344902 1711671 3338622
41005 3338622 3295176 1953864 283769 -1534425 -3868200 -6408899 -8115159 -8425435 -7775337
40996 -7775337 -6715562 -5085254 -2312869 1766329 6470660 10470087 12626463 12943604
40988 12943604 12424276 11724399 10492463 8509122 6691536 5973030 5749252 4718339 3041649
40979 3041649 2310554 3271476 4865621 5799270 5834896 5159393 3874317 2890647 3906054
40970 3906054 6993624 9052369 6587384 158886 -5627558 -7324117 -6467736 -6894812
40962 -6894812 -9220880 -10139665 -7416478 -3337330 -1684530 -2751737 -3502629 -2065742
40954 -2065742 297862 1894985 2956736 4337302 5680499 6225125 6231025 6389004 6723647
40945 6723647 7003755 7243085 7024845 5641178 3806287 3608018 5439983 6673274 5144505
40936 5144505 2408863 1423084 2365835 3110700 2600095 1072148 -1953983 -6693215 -10611014
40927 -10611014 -10314815 -6087465 -1508799 1550270 4258785 6824874 7020907 4134481
40919 4134481 988510 28916 197426 -273944 -649072 334343 1634440 1762381 1608360
40910 1608360 2624150 3662090 2524918 -332078 -2515962 -3571967 -5381267 -8652833
40902 -8652833 -11363842 -11210926 -8169970 -4399980 -2504643 -3473782 -5441722 -5351146 -2859972
40893 -2859972 -1146339 -2268300 -3607020 -1648250 2133991 2853680 -620396 -3970991
40885 -3970991 -3793488 -2048884 -2209014 -3840785 -3902855 -1909306 -799787 -2777120 -6498932
40876 -6498932 -8935101 -8578292 -6116599 -2938434 -75028 1591576 1263584 -818946
40868 -818946 -2870698 -3195299 -2464105 -3135424 -6008719 -8617697 -8223391 -5431139 -3230064
40859 -3230064 -2889516 -2584271 -381405 2765781 3727924 426467 -5894363 -11384391 -12765820
40850 -12765820 -10114810 -6217998 -3243076 -1091034 798499 1875390 1878676 2032484 3035076
40841 3035076 3385725 1958130 855045 2829605 6743152 8856075 8347547 8016048 9086771
40832 9086771 9005036 5777265 1299848 -1591380 -2782379 -3432217 -3099216 -854970 2215292
40823 2215292 4091332 4544684 4759555 4943628 4201805 2337718 157524 -1753283 -3318566
40814 -3318566 -4359444 -4640204 -4094465 -2424447 612473 3909029 5394498 4759845 4345229
40805 4345229 5939058 8082644 8174661 5987692 3364397 1698279 1645435 3955623 8064691
40796 8064691 10797193 9260421 4678888 789643 -1206715 -3203689 -5744631 -6372770
40788 -6372770 -3492189 898925 3907939 5132382 5843318 6555968 7039231 7425133 7830072
40779 7830072 7899957 7819516 8431100 9098762 7111750 1335053 -4550674 -4993760 1098463
40770 1098463 8847670 12626840 11302453 7798153 5018757 3524716 2583727 2008069
40762 2008069 2366767 3911295 6004492 7788671 9043473 10052460 10892148 11369090 11561583
40753 11561583 11809115 12030586 11536281 9682598 6419353 2367143 -1050297 -1850811 917014
40744 917014 5536150 8731864 9033804 8009063 7475331 6836822 4655529 1917338 1613619
40735 1613619 4943342 9687930 12944950 14052435 14008368 13354488 12035454 10626770 10111440
40726 10111440 10398581 10253440 8967788 7178133 5707152 4486081 3197698 2300740
40718 2300740 2649565 4374443 6683700 8561946 9327267 8963924 8418799 9023687 10833777
40709 10833777 11981257 10718878 7954386 6696336 8917400 13905230 19714460 25044581
40701 25044581 29310832 31957000 32417269 30326488 25775574 20227866 16950045 18811122
40693 18811122 25033491 31550625 35260875 36462164 36488787 35176839 32380673 30108558
40685 30108558 30630293 33336114 35710988 36774418 37365283 37616491 36654324 34704768 33064971
40676 33064971 31717084 29190873 25237597 21621859 19802123 19757057 21442022 25113574
40668 25113574 29407032 31314842 29390992 25450470 22207295 20866657 21750189 25096659
40660 25096659 29806274 33241787 34002750 33607760 34030765 34929284 34749225 33262019 31506065
40651 31506065 30349487 30422908 32232797 35062300 37101422 37842406 38649031 39692459 38678761
40642 38678761 34728578 31125779 31166328 33111732 32824607 30188394 28955696 30611701
40634 30611701 32362734 31673687 29275118 26812848 24634442 22940573 22318436 22038022
40626 22038022 20419325 17909412 17123850 18725271 20108796 19597677 18933455 19596904 19620676
40617 19620676 16910998 13440987 12790279 14812186 15895577 13811778 9492364 4602314
40609 4602314 345154 -1409044 1081987 6556743 10888213 11276323 8922850 6791563
40601 6791563 6114121 6037216 5551873 4541316 3381835 2428808 1798728 1136445 -319874
40592 -319874 -2980247 -6039265 -7678665 -6716466 -4287037 -3168193 -4550367 -5960564
40584 -5960564 -3809215 2004378 7627252 9752720 8870539 7388883 6574442 6730145 8422375
40575 8422375 11340034 13239435 12386050 10225779 9331781 9422247 8045048 4922655 2757087
40566 2757087 3272981 4996003 5763911 5237130 3974169 2090596 100944 -595508 547344
40557 547344 2178677 2778802 2289080 1220233 -443601 -2403918 -3463368 -3004879 -1974784
40548 -1974784 -1362696 -903716 -349576 -630188 -2347957 -4345888 -5255357 -5283920 -4946109
40539 -4946109 -3455469 -442690 2038092 1920486 827304 2353812 6660250 9860350
40531 9860350 9560919 8072966 8498951 10022559 9436771 6018945 2456299 1242516 2098465
40522 2098465 3184316 3407219 2926410 2236733 1549754 1010813 1046147 2008866 3296961
40513 3296961 3332529 1144102 -2203236 -4586323 -5205436 -5097744 -5304428 -5713583 -5940675
40504 -5940675 -5960988 -5285757 -2998888 343211 2219087 992755 -1844728 -3927146 -5414726
40495 -5414726 -7856414 -10294683 -9577798 -5290440 -1520835 -1751959 -3915044 -3138603 1381495
40486 1381495 5061778 3935936 -346903 -2952446 -1866828 430082 927743 -177671
40478 -177671 -429843 1401180 4016325 5484361 5375756 4732116 4518484 4489939 3425093
40469 3425093 448068 -3661307 -6672646 -6943854 -5154376 -3393061 -2705877 -2488537 -2176848
40460 -2176848 -2035986 -1821961 -365443 2299499 3786104 1989840 -2057590 -5632553
40452 -5632553 -7705369 -8916376 -9061101 -7292082 -4661381 -3568490 -4158181 -4078012 -2743398
40443 -2743398 -2870703 -6086380 -9822866 -11042050 -10714117 -11518721 -12771760 -11237062 -6363092
40434 -6363092 -1238318 1826202 3556975 4958905 5163704 3261899 142569 -2797340
40426 -2797340 -5258206 -7403846 -9034358 -10180763 -11193595 -11683987 -10885761 -9565426
40418 -9565426 -9758759 -11860715 -13836842 -14168789 -13487525 -12172141 -8824597 -3166842 1678753
40409 1678753 2515610 374076 -1179025 -1064467 -1182583 -2402664 -3180921 -2646435 -2416177
40400 -2416177 -4196979 -7293603 -9546149 -9671406 -8077321 -6269951 -5750399 -6687905 -7780691
40391 -7780691 -8285579 -9442029 -12266334 -14781871 -14084407 -11029620 -9678221 -11208600
40383 -11208600 -11661166 -7734021 -2004876 560785 -570615 -1536007 -25999 2270830
40375 2270830 3259683 3214387 2940203 1836521 -524282 -2709839 -3157702 -2432521 -1993700
40366 -1993700 -1531676 500001 3873008 6050107 5304600 3039016 2014648 2958120 3871751
40357 3871751 2528527 -986347 -4200034 -4414729 -1197354 2898072 4360488 1960763
40349 1960763 -2200242 -5214374 -6421535 -7220183 -8440786 -9356905 -9319182 -8724329 -7745111
40340 -7745111 -5738024 -3150467 -2553996 -5754811 -10506327 -12280012 -9460468 -4913448
40332 -4913448 -1991755 -932473 -222838 294141 -338426 -1594635 -1229020 1899702 6028532
40323 6028532 8224009 7292712 4417400 1409076 -873031 -2408273 -3175136 -3061586 -2368495
40314 -2368495 -1739804 -1453385 -1237685 -958446 -1032794 -1905677 -3495202 -5361205 -7012668
40305 -7012668 -7967930 -8187929 -8583752 -10064868 -11643198 -10790935 -6720213 -2132033 -216465
40296 -216465 -786197 -1122357 -2348 1225879 1438151 1353515 1834163 2456277 2609022
40287 2609022 2530252 2400637 1689732 271749 -922725 -1254343 -1441480 -2396089 -3662066
40278 -3662066 -3773952 -1874309 1193856 2996353 1186368 -3722180 -7643396 -6805230
40270 -6805230 -2484255 79452 -2016672 -6089228 -7707901 -5828397 -2898179 -1424257
40262 -1424257 -1703234 -1880754 396456 5049911 8070285 5130415 -2726933 -9627237
40254 -9627237 -11979745 -11860683 -11770546 -9981275 -4429859 1969531 4391021 2751858 1007210
40245 1007210 898741 670582 -627405 -1975364 -3535614 -6597167 -9665432 -8767083 -3168245
40236 -3168245 2586394 4048620 1647626 -1201532 -2129618 -617795 2598650 5259193
40228 5259193 4829131 1508453 -1830904 -3679587 -5587683 -8715657 -11284998 -11208443 -9099090
40219 -9099090 -6908259 -5532556 -5379707 -7113095 -9869513 -10830447 -8862372 -6813776
40211 -6813776 -7791826 -10698196 -11996670 -10638557 -8565127 -7213726 -6212630 -5126092
40203 -5126092 -4092262 -2920596 -1609805 -1425266 -3310635 -5456574 -4786295 -1115390
40195 -1115390 2294626 2895189 1665909 901479 856221 104340 -1530661 -2130887 -306173
40186 -306173 2291511 2381026 -842344 -4414141 -5525316 -5433401 -7324855 -11048956 -13002231
40177 -13002231 -11564747 -9425495 -9230387 -9980966 -9736599 -9043678 -8984395 -8232402 -5384272
40168 -5384272 -2583374 -3242950 -6901369 -9548654 -8696773 -5327031 -1356119 1754555
40160 1754555 2153205 -1265835 -6339344 -9014995 -7902406 -5156687 -2595921 325248
40152 325248 3957188 6537072 6185983 3105783 -1069511 -4548126 -5623770 -3651915
40144 -3651915 -459495 1086116 577204 314903 1504095 2270801 419271 -3617244 -7556812
40135 -7556812 -9549754 -9083748 -7191743 -6188458 -7462772 -9299532 -8989313 -7160148
40127 -7160148 -7085531 -9131559 -9520776 -6314958 -3009592 -3298273 -5208484 -4126251 270053
40118 270053 4008696 4724675 3680570 2146741 -406602 -3758561 -5854560 -5765000 -5371171
40109 -5371171 -6430974 -7623981 -6264514 -2021557 2584186 4925470 4292343 1487888
40101 1487888 -2256488 -5618258 -7454585 -7654837 -7430785 -7843038 -8004596 -5880669 -1442670
40092 -1442670 2214702 2223918 -473529 -2632464 -3171557 -3866981 -5678075 -7098401 -6962033
40083 -6962033 -6255825 -5698270 -4038730 -925600 757937 -1556268 -5542944 -6292639 -2884040
40074 -2884040 561188 842344 -333697 306766 2676378 3846078 2247752 -741278
40066 -741278 -3120192 -4465179 -5472923 -6481335 -7195519 -7432899 -7456423 -7528509 -7491624
40057 -7491624 -6897440 -5382894 -2991084 -447161 1024933 841195 67772 336305 1428537
40048 1428537 1222258 -1130403 -3430780 -3356836 -1889417 -1783720 -3630630 -5904220 -8106994
40039 -8106994 -10710712 -12199725 -9950928 -4977133 -2165056 -3963958 -6901316 -6583315
40031 -6583315 -3487832 -1264321 -1518805 -2989940 -4146722 -4054566 -2276514 -349464 -1597459
40022 -1597459 -6785936 -11664982 -11796143 -8279302 -5551004 -5081065 -4970048 -4564348 -5083753
40013 -5083753 -5868404 -4318771 -342753 2668916 2258491 -583586 -3846386 -6399260
40005 -6399260 -6881726 -4013405 732148 3558301 2823037 850285 316658 1117851 1661862
39996 1661862 923092 -1573118 -5434741 -8500225 -8915677 -8546947 -11018784 -15599752 -17034982
39987 -17034982 -13222459 -9024957 -9665531 -13850319 -16872184 -17536473 -17847807 -17831171 -15245314
39978 -15245314 -10043164 -5439391 -4185695 -6114434 -9204549 -11099695 -10134943 -6832919
39970 -6832919 -3698960 -1831351 853045 5759104 9768603 8675703 3474952 -574475
39962 -574475 -938971 -26101 -90382 -52882 1105608 1518877 -351605 -2231784 -796524
39953 -796524 3394618 6497973 6437213 4937134 4362055 4606777 4058012 2328942 633829
39944 633829 -299695 -1398693 -3676979 -6236213 -6994681 -5411296 -3332003 -2641463 -3025752
39935 -3025752 -2776107 -1089431 1114395 2033197 182117 -4254258 -8629233 -9627106 -6865345
39926 -6865345 -3560789 -2558943 -3142067 -3179474 -2651597 -2723846 -2792783 -1498308 109744
39917 109744 -185209 -1460610 -237553 3869248 6696628 5404317 2542204 1740762 2003059
39908 2003059 -343114 -5442131 -9182676 -8527826 -4744578 -956741 1196475 1789609
39900 1789609 1403473 640789 -338431 -2285145 -5599965 -8374825 -7668197 -3740188 -968163
39891 -968163 -2583165 -6056208 -6438026 -3464822 -1909101 -4396210 -7471542 -6795214 -3258563
39882 -3258563 -798214 -137521 1345533 4200181 5523458 3696412 905891 -428476
39874 -428476 -630440 -530280 609126 2506870 1978437 -3083156 -9575330 -12356455 -10516623
39865 -10516623 -7408133 -5349278 -3791241 -2523665 -3000097 -5455977 -7443825 -6560321
39857 -6560321 -2944491 1547344 4888229 5226867 1830813 -3405899 -7069589 -7715804
39849 -7715804 -7017519 -7098471 -8227795 -9420091 -9593053 -7762505 -3849829 335332 2670302
39840 2670302 3377864 3982680 3720670 168892 -5745940 -8947198 -6504488 -1798225 186617
39831 186617 -793006 -1680026 -1821020 -3339803 -6566273 -8861096 -8503773 -6996647 -6719158
39822 -6719158 -8251075 -10597236 -12392470 -12375502 -10136103 -6926385 -4655637 -3898020 -3916915
39813 -3916915 -4383189 -5474292 -6352291 -5619835 -3931518 -4148805 -7509137 -11080600 -10846872
39804 -10846872 -6669110 -2356562 -836538 -1038829 -291138 1688223 2739686 1591601
39796 1591601 -543078 -1907703 -2052861 -1003107 1651494 5157251 6413068 2909128
39788 2909128 -3256348 -6553217 -3770898 2939952 8924297 11134863 9306072 5443426
39780 5443426 2997691 4269842 7317758 7371732 2665365 -3084672 -5478688 -4605311 -3551001
39771 -3551001 -3890451 -5168734 -7091683 -9212778 -9564853 -6768134 -3053433 -2247509 -4784716
39762 -4784716 -7315699 -7314441 -5586637 -4030259 -3296611 -3026294 -2307555 259984 4809613
39753 4809613 8516172 8165155 4639713 2143759 2458077 2920566 1114776 -1546807 -2747023
39744 -2747023 -2998059 -3833777 -4150567 -1336064 4549487 10061345 11827694 9260617 4120751
39735 4120751 -1122131 -4417652 -4802373 -2598367 877846 3587905 3414605 20825
39727 20825 -3834880 -4576467 -2076712 -46940 -1304472 -4311192 -5613211 -4094766 -1208315
39718 -1208315 1629880 3872058 4878606 4122384 2224640 506133 -181596 746978 4045957
39709 4045957 9365825 14229608 15968179 14406095 11294663 7692419 3663340 144989
39701 144989 -1122169 18127 1604936 2170259 2517002 4031527 6304615 7514192 6659448
39692 6659448 4459411 2124992 24831 -2027426 -3554362 -3425836 -1673211 -510736
39684 -510736 -2080676 -5247420 -6473906 -4601782 -2875826 -4656714 -8580497 -10143210
39676 -10143210 -7439022 -3140957 -792548 -1037201 -1967505 -1814944 -684512 -301284 -2128209
39667 -2128209 -5258705 -6749007 -4920983 -1555542 442413 681660 900194 1755329 2224201
39658 2224201 1903418 1567023 1300375 245893 -1556996 -3145688 -4511079 -6155493 -6797101
39649 -6797101 -4570017 -1035418 -449382 -3601141 -5946317 -4128460 -913211 -492550
39641 -492550 -2008949 -1944509 -674378 -1608341 -4715528 -6095914 -4452233 -3238557 -4973395
39632 -4973395 -7564397 -8287595 -7804021 -7732809 -7364529 -5805656 -4898626 -6537743 -8712208
39623 -8712208 -7845372 -4316718 -2165729 -3326597 -5369136 -5524415 -4048206 -2472041
39615 -2472041 -972285 923833 2750400 3832350 4385609 4541563 3527442 1410359
39607 1410359 557913 3278470 8347647 11840232 11590838 9197974 7326168 6736421 6696466
39598 6696466 6683373 6376899 5138867 3067144 1826804 2709435 4230571 3615396 906445
39589 906445 -417468 2080324 6282067 7946894 5666354 1864880 -499495 -591492 666987
39580 666987 1881387 1782175 -119022 -2923195 -5173554 -6397237 -6980460 -6824633 -5647136
39571 -5647136 -4594017 -5566139 -8312219 -10144236 -9583665 -8373279 -8472921 -9084772 -8728272
39562 -8728272 -8404883 -9817537 -11633741 -10879337 -7717164 -5419205 -5252547 -4849746 -2729050
39553 -2729050 -1100588 -2320759 -5400009 -8299720 -11138130 -14283170 -15401030 -11991041
39545 -11991041 -5871130 -1715703 -1442110 -3099247 -4967899 -7120222 -8470305 -6315027
39537 -6315027 -834997 3095894 1480944 -3347636 -5794501 -4314292 -2495483 -3173890
39529 -3173890 -4842690 -4997239 -4246259 -4763799 -6139422 -5664483 -2835881 -888055 -2330012
39520 -2330012 -4786550 -3769708 956931 4544307 3272733 -862985 -3311568 -2611785
39512 -2611785 -627758 1205801 2789971 3226834 1302359 -1378033 -1018493 3118622
39504 3118622 6745143 5823724 1779890 -813785 -226888 1295173 1526148 756502 279210
39495 279210 511417 1104353 1468689 784651 -1382865 -4158073 -5924993 -5985581 -4911658
39486 -4911658 -3372577 -1598391 5714 817904 894197 1081244 1869010 2707264 2765976
39477 2765976 1973316 1054588 714557 871836 788380 203011 69031 1339772 3104599
39468 3104599 3258423 1394678 -515758 -1087806 -1365391 -2362176 -2645581 -513004 2893320
39459 2893320 5204359 6440764 8119433 9601883 8828363 6554455 6047646 7834528
39451 7834528 8522450 6311929 3974949 3997234 4121676 1072585 -3695402 -5811577 -4292000
39442 -4292000 -2319060 -2134859 -2568428 -1939051 -480776 938614 2279058 3589993 4391532
39433 4391532 4437501 3876377 2475549 24305 -2531376 -3942945 -4585378 -5699302 -6747130
39424 -6747130 -5833113 -3215820 -1885973 -3482086 -5910356 -6669309 -6514165 -7603020 -9463397
39415 -9463397 -9470425 -6891253 -4075775 -3417442 -4939931 -7204082 -8957940 -9286819 -7533573
39406 -7533573 -4113194 -774271 743372 108950 -1813621 -4144108 -6536954 -8810167
39398 -8810167 -10494511 -10963574 -10039221 -8302458 -6479981 -4608208 -2436221 -731305
39390 -731305 -1093133 -3695661 -6168483 -6037594 -3789283 -2091794 -2252167 -3113239 -3543622
39381 -3543622 -4070155 -5206868 -5854479 -4753584 -2453769 -476854 603734 821348 -591208
39372 -591208 -4330577 -8929412 -11467311 -10843886 -8897095 -7728839 -7251791 -6145904 -4096215
39363 -4096215 -2048140 -921254 -957760 -1865625 -2868849 -3055944 -2413900 -2239240 -3910480
39354 -3910480 -7352518 -10913966 -12421675 -10479408 -5828937 -1830747 -2230781 -7257851
39346 -7257851 -12749657 -14334846 -11834912 -8424409 -6382747 -5432161 -4730158 -4276751 -3932785
39337 -3932785 -2847789 -764302 1188726 1725836 743437 -868925 -2017269 -1924291 -734504
39328 -734504 433567 993393 2095442 4818423 7396182 6368809 987997 -5472388
39320 -5472388 -9480405 -10389544 -9149221 -6341227 -3008686 -1201360 -1607526 -2298454 -1785454
39311 -1785454 -1538410 -3175775 -5062189 -4800281 -3667095 -4821930 -7702403 -8293396 -5471449
39302 -5471449 -3205565 -4942700 -8916505 -10967663 -9659119 -6623453 -3730547 -1964179
39294 -1964179 -1819001 -2982830 -4358545 -5421876 -6449376 -6682547 -4161718 1142358
39286 1142358 5748390 6120780 2536697 -2126458 -6079124 -9123897 -10787101 -10497731
39278 -10497731 -9149281 -8271350 -7906162 -7232777 -6827474 -7995133 -9930605 -9976785 -7264299
39269 -7264299 -4086189 -2889216 -3547809 -4434191 -4766114 -4921384 -5349084 -5913193 -5781706
39260 -5781706 -3885148 -353342 2637509 2762926 376758 -1950613 -2813720 -3219029 -4136638
39251 -4136638 -4793394 -4386400 -3797161 -4256973 -5506122 -6485725 -6769782 -6184500 -4234533
39242 -4234533 -1337069 447416 -385211 -2537103 -3523105 -3057765 -3154506 -5069448 -7790910
39233 -7790910 -9634322 -9891282 -8744220 -6924473 -5748675 -6201717 -7500380 -7621148 -5749009
39224 -5749009 -3341859 -2409183 -3615248 -6336335 -9417719 -11296600 -10609423 -7765160
39216 -7765160 -5109510 -4360775 -4437234 -3077251 -241971 1637209 994708 -809766 -1578978
39207 -1578978 -1212129 -1192953 -1782719 -1460466 570120 2867671 3713196 3510389 3869601
39198 3869601 4879161 4968366 3620769 2580588 3515042 5671855 7065120 7284742 7742846
39189 7742846 9245194 10572131 9876543 6755877 2578955 -644187 -1305209 1250891
39181 1250891 6211617 11106312 12917490 10382721 5370910 1246037 -576777 -1778738
39173 -1778738 -4235586 -6906656 -7038935 -3977071 112003 3397089 6118242 8391141
39165 8391141 8473305 4960419 -659503 -5388862 -7705318 -7760371 -5915827 -2965863 -668159
39156 -668159 140887 1084187 3666914 6166794 5825846 3269150 1347910 -8571 -3685870
39147 -3685870 -9536930 -12989000 -11373607 -7862533 -6537619 -6853084 -6130469 -4705493
39139 -4705493 -4745472 -5821274 -5657107 -4356271 -4229987 -5858755 -7552735 -8339293 -8369859
39130 -8369859 -6848576 -3068528 602461 550755 -2738781 -4811249 -3593393 -1868899
39122 -1868899 -1934095 -1640134 1580039 5781416 6969139 4766251 2539087 2819026 5199739
39113 5199739 8117819 10288582 10567141 8384024 4502379 251175 -3621853 -6450627
39105 -6450627 -7032552 -4964191 -1816936 459821 1567875 1981819 1198586 -1231762 -3827320
39096 -3827320 -4574359 -3791137 -3420363 -3712054 -2927958 -488487 1871100 2630454 2159516
39087 2159516 1208255 -305873 -2019530 -2433337 -933979 677132 111427 -2585030 -5243883
39078 -5243883 -6159637 -5543349 -4652907 -4208862 -3749086 -2445222 -672037 -342688 -2835036
39069 -2835036 -6739025 -8775377 -7127983 -2886161 1823030 5724885 8084635 8198263
39061 8198263 6336570 4097807 2590000 970638 -2082559 -6037874 -8897473 -9722918
39053 -9722918 -9620783 -9945501 -10264469 -8728496 -4585151 -49464 1117320 -2434154 -7686633
39044 -7686633 -10410291 -9899549 -8976308 -9388087 -9474047 -7300725 -3927717 -1731877 -962752
39035 -962752 -100192 1170433 1480596 83660 -2109690 -3834127 -4502945 -4149487 -3655477
39026 -3655477 -4685343 -7831883 -11045896 -11604254 -9588154 -7631080 -7168511 -7017496 -6163089
39017 -6163089 -5706347 -6746559 -8043656 -7467819 -4820344 -1797409 147073 660749 -111978
39008 -111978 -1616670 -2652996 -2268295 -976043 -397519 -1706118 -4689739 -7818951 -8851710
38999 -8851710 -6273247 -1052494 3649861 5436476 4799077 3542193 2088647 -231037
38991 -231037 -2966075 -4556915 -4543880 -4064667 -3915344 -3716398 -3443702 -4187844 -6525827
38982 -6525827 -9329518 -11071553 -11361081 -10430310 -8141880 -4509532 -435426 3012201
38974 3012201 5413524 6349473 4907680 1015717 -3453091 -6271901 -7215233 -7649619 -8153776
38965 -8153776 -7902498 -6364602 -4390907 -3407001 -4207972 -6258744 -7437068 -5330301 -292469
38956 -292469 3571019 2706626 -847367 -1435407 2695156 6812979 6155512 2194152 -111055
38947 -111055 694371 1592553 279815 -2013448 -3151510 -2780655 -1637571 -411466 -184900
38938 -184900 -1985520 -4772648 -5683464 -3667659 -1281908 -1184713 -2223136 -1246374 1871467
38929 1871467 3611881 1690684 -1581727 -2175671 588942 3386526 2956894 -527657
38921 -527657 -4363454 -6402555 -6471363 -5456568 -4182930 -3237267 -2925949 -3001207 -3038323
38912 -3038323 -3301915 -4401644 -5712456 -5269603 -2222183 1473979 3089672 2299800 1025850
38903 1025850 644575 1007695 1964955 3816241 5847514 6370248 5170796 4340296 5476301
38894 5476301 7337621 7643101 6187234 4546723 3185147 561730 -4518293 -10690763
38886 -10690763 -14834776 -14988143 -12273782 -9731411 -9136714 -9489465 -9129006 -8389223 -8674241
38877 -8674241 -9528384 -8885662 -6432682 -4354744 -4002176 -4245432 -4291230 -5395879 -7720231
38868 -7720231 -8088860 -4044213 1511770 3262481 403176 -2699147 -2590223 -173124
38860 -173124 2287779 4296088 5961453 6293875 4457440 1309552 -1575636 -3427405
38852 -3427405 -4168810 -3932364 -3236921 -2652939 -2104546 -1528311 -1852676 -3715066 -5703349
38843 -5703349 -6082947 -5834120 -7035028 -8305466 -5688056 871588 5945244 5805530 3591890
38834 3591890 4090181 6377944 5887435 2030669 -807023 380021 3791660 6205270
38826 6205270 6537462 5264656 3112360 1455002 1819029 3801440 5157648 4915028 4789339
38817 4789339 6381677 8303812 7523632 3114673 -2250320 -4523435 -1890920 3520428
38809 3520428 7656438 8621366 8289993 9282046 11222206 11276934 7810978 2026416 -3653771
38800 -3653771 -7282623 -7800077 -5566240 -2585632 -651791 753872 3173472 5972573
38792 5972573 6466891 3573325 -564180 -3133031 -3202755 -1449694 672821 967812 -2102921
38783 -2102921 -6982574 -9793254 -8586472 -5179633 -2047668 363922 2047800 1770776
38775 1770776 -795538 -3275793 -3493762 -2785210 -3841187 -6360734 -7631302 -6780917 -5592110
38766 -5592110 -5228787 -4933263 -4317963 -4389845 -5538284 -6690422 -7392669 -8759617 -11173708
38757 -11173708 -12753974 -11668305 -8888834 -7094082 -7311995 -7929274 -6965760 -4424677
38749 -4424677 -2124094 -1516791 -1968068 -1528339 485561 2416340 2503092 1429705 1208475
38740 1208475 1839717 985629 -2465732 -6148194 -6673599 -3403774 1229618 4428864 5037923
38731 5037923 3425606 608869 -2342426 -4663264 -5979417 -6153618 -5337664 -4100346
38723 -4100346 -2944069 -1669540 129908 1999688 3049427 3582916 4991458 7395893
38715 7395893 8698021 7133210 3869428 1747893 1940461 3083057 3372366 2253312
38707 2253312 123464 -2424252 -4815783 -6697520 -7952128 -7971076 -5477080 -340603
38699 -340603 4662686 5584011 1334252 -5212891 -10591537 -13800464 -15238434 -14380403 -10566820
38690 -10566820 -5397338 -1973644 -1240292 -813308 1623648 5107396 6860589 6029454
38682 6029454 4311365 3154719 2134480 634767 -354610 638907 3255306 5222819
38674 5222819 4589740 1556988 -1657589 -2408024 340544 4817609 7672946 7101340 4373057
38665 4373057 1732677 -256379 -2123724 -3414907 -3417220 -3536319 -6175776 -10561302 -12286845
38656 -12286845 -8601956 -2238673 1777565 1540222 -1321541 -4874344 -7812377 -8147250
38648 -8147250 -4246474 2235629 6740302 6108463 1381645 -3844989 -6549791 -5855196
38640 -5855196 -3233624 -1526265 -2312369 -3956933 -3592067 -1006333 1153903 1124839 -85939
38631 -85939 -949584 -1383660 -1728039 -1902981 -2541433 -4721298 -7312322 -6986653 -2769449
38622 -2769449 1542883 1844838 -1096263 -3406130 -3515666 -2885280 -2413563 -1498749 -545528
38613 -545528 -1258457 -3856952 -6485687 -7991927 -9037235 -9876036 -9410239 -7504716 -6196222
38604 -6196222 -7237219 -9858611 -12059160 -12845802 -12293072 -10721328 -8821500 -7413662
38596 -7413662 -6168394 -3759076 -163425 2516993 2623594 1058755 -392334 -1588899
38588 -1588899 -3297704 -4919450 -4864537 -2889403 -415909 1478239 3043196 4767203
38580 4767203 6565454 8336324 10237042 11891961 12120633 10142734 6713877 3476426
38572 3476426 1235915 -625466 -2843893 -4889120 -5557283 -4796852 -3964464 -3943219 -4060362
38563 -4060362 -3530117 -2762046 -2110856 -639817 2057458 3890984 2571757 -694169 -2578362
38554 -2578362 -2563343 -3365670 -5961841 -7643445 -6443418 -4255591 -3380660 -2747010 -234105
38545 -234105 3446650 6070594 7431955 8714526 9644509 9047473 7239567 5350702 3316317
38536 3316317 923500 -511475 -163539 151266 -1106826 -1880667 62171 2044101 -190824
38527 -190824 -4760057 -5040077 332736 4464542 1471445 -5977130 -11242506 -11814084 -9560430
38518 -9560430 -6366043 -3371591 -2200317 -3208787 -3965036 -2451944 -296127 -26689
38510 -26689 -783968 113001 2622309 4233395 3963397 3123306 2648018 2344969 2272609 2392400
38500 2392400 1555019 -655359 -1989301 -301528 2665467 3588099 2945168 4140703 7223063
38491 7223063 7816869 3555409 -2274072 -5436169 -5861096 -5832540 -5983696 -5915520 -6581409
38482 -6581409 -8802112 -10579190 -8996414 -4508417 -796298 -289066 -1973069 -3887563
38474 -3887563 -5672971 -7691365 -9113992 -8362360 -5205850 -1485475 632254 975203
38466 975203 1544532 3994852 7230514 8467665 6913875 5189437 6103783 8893851 10184060
38457 10184060 8463008 5911287 5216368 6048807 6031609 4411004 3007362 3367096 4587672
38448 4587672 4885415 4148461 3546011 3261154 2302707 557403 -632481 -471406 40843
38439 40843 -450456 -2085312 -4297613 -6643318 -8252927 -7751081 -4994010 -1936764 -515712
38430 -515712 -513918 -708145 -1061083 -2221542 -3795305 -4923600 -5836044 -6863656 -6520172
38421 -6520172 -2854737 3388464 9102500 12400191 13867226 14204923 12923394 9919534
38413 9919534 6291481 2837313 -540910 -3431029 -4783926 -4774615 -4847325 -5241133 -4542746
38404 -4542746 -2530017 -1204791 -1777542 -2835133 -3051483 -3556898 -5609226 -7801525 -8030686
38395 -8030686 -6924141 -6740186 -7613921 -7415490 -5198296 -2639034 -1751964 -2652251 -3817582
38386 -3817582 -3542983 -1170225 2282870 4903388 5870151 6118308 6577114 6854651 6425004
38377 6425004 5671903 4539296 1721616 -3027773 -7146068 -7952919 -6070464 -3968063
38369 -3968063 -2127446 670266 3848350 4866541 2805186 -460312 -3106049 -5019045
38361 -5019045 -6128002 -5558353 -3466940 -1685756 -1421556 -1917051 -2189192 -2303028 -1990008
38352 -1990008 79477 4213565 8312860 9967767 8900080 6325693 3260546 729659
38344 729659 255773 2306270 4942183 5638059 4133261 2260891 1385950 1305321 1426751
38335 1426751 1742146 2530507 4000228 6250921 8772830 9954750 8018598 3014683
38327 3014683 -2400159 -4743470 -2729260 1332372 3567505 2462804 441888 893224
38319 893224 4085772 7130471 7697804 6247695 4436454 3054583 2275830 2369903 2980969
38310 2980969 2859356 1589841 717677 1862809 4331879 5835115 5174147 3184384 1409754
38301 1409754 785417 1168014 1191782 -895988 -5084147 -8618033 -8463220 -4812423 -1111760
38292 -1111760 -396243 -2327541 -4002725 -3110357 -136925 2226126 1851562 -604316 -2638061
38283 -2638061 -3026172 -3014049 -3919970 -4814345 -3851243 -1184747 900524 635652 -1514667
38274 -1514667 -3651836 -4095495 -2487192 -122455 1042481 447139 -424773 -168333 531245
38265 531245 104903 -1454597 -2813500 -3417884 -3774839 -3931311 -3309317 -1877689 64878
38256 64878 2883002 6461840 8467151 6360528 1500790 -1444822 -160491 2697318
38248 2697318 3766433 3264173 3028521 2622226 280776 -3512689 -6286613 -6926927 -6260743
38239 -6260743 -4626930 -1522927 2059614 3504576 1814621 -777793 -1456331 274240
38231 274240 3118470 5904253 7743307 7522225 4935220 1662416 131048 988564 2635227
38222 2635227 3226734 2320214 556102 -1208164 -1896297 -269688 3729204 7709798 8262491
38213 8262491 4593338 -3892 -1555149 49868 1467438 890628 481889 2614791
38205 2614791 5641577 5793765 2432983 -1242801 -2759029 -3062707 -3944480 -5135811 -5382252
38196 -5382252 -4546326 -2905400 157135 4643926 8070622 7505102 3430927 -428445
38188 -428445 -1446115 -577923 -142068 -841838 -1845990 -2378041 -1951226 69551 3682004
38179 3682004 7215320 8280413 6133682 2591049 262343 -24475 86694 -1585546
38171 -1585546 -5221520 -8754262 -10256771 -9811166 -8342537 -5573822 -842888 4328076
38163 4328076 6732352 5386940 3050317 2490285 2919789 2046521 239025 -75196 1335280
38154 1335280 1884727 400907 -809138 350852 2214137 1735999 -839094 -2204911
38146 -2204911 -632168 1886223 2642463 1604889 797148 1422932 2858021 4111015 5170449
38137 5170449 6634609 8539646 9967255 9846606 8088924 5871691 4683922 4983607
38129 4983607 5763210 5461455 3399623 430265 -1869544 -2739219 -2804304 -2852432 -2345749
38120 -2345749 51799 4276176 8047605 8953930 6888642 3721848 988655 -1129823
38112 -1129823 -2715112 -3238402 -2289174 -463818 1026189 1319739 324866 -1236833 -1931315
38103 -1931315 -491717 2775180 5917949 7270920 7067584 6592575 6329354 5879674 5269043
38094 5269043 5014339 4862650 3837907 2041870 1188179 2482412 4880044 6400315 6375889
38085 6375889 5327450 3455032 844302 -1256106 -1239763 575787 2125984 2389805 2258826
38076 2258826 2126471 824689 -1670164 -2596820 175424 4403677 5848586 3893530
38068 3893530 2183388 3695104 7659984 11541289 13377808 11637803 5817096 -1293959
38060 -1293959 -4625510 -2270589 2055506 3991907 3791651 4082516 4671738 3403013 1009529
38051 1009529 806174 3445663 5998451 6999543 8387132 10831220 11099577 6915473
38043 6915473 1351620 -1119939 -789873 -1098240 -2329837 -1360690 2399999 5228682 4607204
38034 4607204 2945621 3607960 5915697 6827403 5812135 4946472 4783136 3171360 -1161329
38025 -1161329 -6038111 -8065280 -6306198 -2773577 -22442 939134 949736 1778162 4645760
38016 4645760 9003915 12890396 14815684 14909026 13916220 11987464 9459467 8003454 9166321
38007 9166321 11753815 12586015 10517924 7853410 6602131 5308459 1755073 -2673909
37999 -2673909 -4369036 -2791362 -1116752 -1131248 -909827 898072 1832427 -407517 -3160714
37990 -3160714 -1771214 3628850 8043296 8224928 5778475 3170991 464209 -2294498
37982 -2294498 -2889321 -104751 3131136 3097610 697923 313763 3549025 7226423 8149873
37973 8149873 7111545 6907148 8492000 10798934 12925974 14536219 14689543 12179048
37965 12179048 7361181 2550128 118935 672100 3168729 6217778 8935641 10993849
37957 10993849 12399962 13308003 13787477 13667787 12801161 11635716 11237276 12246200 13893119
37948 13893119 14728301 14479855 14380462 15259460 16300172 16503303 16309850 16306216 15110101
37939 15110101 10679679 3810416 -1746902 -3326520 -1760599 945597 4262599 7979051
37931 7979051 10263408 9263152 5934527 3216159 2625054 3268609 3768301 3326687 1225591
37922 1225591 -2548852 -5948188 -6207757 -3242638 -10476 1247616 1522023 2884064
37914 2884064 5336775 7099717 7074073 5876083 5028337 5874249 8583098 11620544 13027860
37905 13027860 12727702 12522729 13358955 14097667 13842578 13685945 14591092 15188527 13919923
37896 13919923 12247956 12958333 15480235 15739535 11517314 5730187 2933142 3985498
37888 3985498 5859982 6097468 5678036 7019748 10318697 13198383 13996593 13971937 15119795
37879 15119795 16873058 17098692 16100023 16796960 19961573 22115102 20238940 16210846
37871 16210846 13809137 13269099 12258071 10867572 11452240 13790709 14723029 13364050
37863 13364050 12678918 14441523 16355817 16294499 16072083 18199343 21416916 22584890 21445411
37854 21445411 20608183 21640640 23442480 23921573 21812094 17870566 15352619 17374563
37846 17374563 22326592 24489384 21501758 18252761 19805356 23297752 22166840 17006886
37838 17006886 15867529 22799162 31894193 35410246 33354173 31486068 33002136 36184222
37830 36184222 38577401 39674469 39774739 38998638 37663500 35916321 33121714 29041415
37822 29041415 25282954 24127089 26074491 29648850 33206331 35800908 36912366 36981099
37814 36981099 38055920 42157799 48460584 53328636 53962848 51427723 49500004 50925092
37806 50925092 55326963 60493027 64864526 68365772 71452308 74495526 78210429 83341994
37798 83341994 89131773 93465994 96042220 100089883 108458381 118605129 124708689 125361057
37790 125361057 125844647 130992088 138727608 143598206 144757588 146880233 153661566 163630922
37782 163630922 172848782 179267796 183688971 188389928 195688724 206258920 217854344 226838577
37774 226838577 231851354 235082327 239260169 244390875 248462870 250699773 252821614 256840047
37766 256840047 262335429 266679630 268173706 268341834 270086888 273611389 275686910 273801798
37758 273801798 269531489 266151125 264030425 260722463 255266807 249794916 246247645 243751822
37750 243751822 240443817 236129891 231661773 227024727 221796399 216755286 213264114 211135084
37742 211135084 208482690 203959388 198222460 192847121 188391034 184002114 178831493 173471223
37734 173471223 169520558 167473261 165572101 161572322 155382173 148894079 143259265 137701431
37726 137701431 131413397 125200664 120376467 117153143 115065003 113869627 112846040 110248851
37718 110248851 105084378 98921190 94385940 92066888 90277978 87700517 84764476 82314565
37710 82314565 80322769 78287079 75786829 72364202 67979096 63894578 61900663 62081920
37702 62081920 62394721 61168024 59203470 58667216 60490237 63455721 65372834 64778918
37694 64778918 62085589 59354289 58227477 57868681 55979158 52200948 49092284 48804133
37686 48804133 50139712 50333752 48751147 47188753 47205513 48867507 51559968 54010887
37678 54010887 53747641 48915521 41211603 34989127 32582952 32272675 31713708 31266912 32302182
37669 32302182 34054517 34580366 33893132 33632452 33825058 32395327 28454915 24215042 22708633
37660 22708633 24706812 28389367 30946609 30138986 25733645 20339683 17785079 19632438
37652 19632438 23836066 27296153 28715528 28299164 26117184 22400274 18718161 17070674
37644 17070674 17766190 19372247 20636124 21315604 21386708 20889909 20530799 20850200 20641932
37635 20641932 18044229 13795961 11345203 12344966 13874544 12254025 8363704 6517184
37627 6517184 8487130 11536390 12816234 12791931 12804098 11740829 7712783 1767116 -2740435
37618 -2740435 -4167898 -3722795 -2606410 -322266 3526790 7614982 10060718 10083629 8028439
37609 8028439 5086443 3375646 4528693 7401069 8962014 8424696 8422814 10689572 13015924
37600 13015924 12915014 12046138 13461527 15905973 15229252 11313014 8963162 10633703
37592 10633703 12508207 10339014 5859873 4084720 6277277 8916161 8604408 5177720
37584 5177720 587035 -2771317 -2986297 -176097 3004164 4154369 4035904 5030384 7479171
37575 7479171 9648272 10615546 10705248 9520354 6444213 3229956 3078063 6234695 9032850
37566 9032850 8436104 5382556 2594883 1404813 2199364 5726516 11722903 17598938
37558 17598938 20620897 20754991 19874826 18957051 17500287 14971476 11430705 7366476
37550 7366476 4123618 3648242 6369400 10027372 12069489 12596268 13447652 15041006 15983430
37541 15983430 15598062 14939816 15004370 15416331 15279468 14098453 11513361 7336096 2427970
37532 2427970 -1390641 -2970403 -2849558 -2237891 -1479749 31734 2660360 5637210 7558085
37523 7558085 7910167 7884974 9038664 11134295 12284229 11561277 10243494 9675440 9162806
37514 9162806 7278752 4222379 1341332 -811458 -2183300 -1791203 1176216 5113242
37506 5113242 7199817 7039544 6899775 8021715 9118136 9255352 9550440 10386544 9252203
37497 9252203 3799572 -4175232 -10132961 -11600255 -9671796 -6299716 -2352558 1456162
37489 1456162 3813744 4073801 3253294 2816460 2892578 2384895 749428 -891712 -861409
37480 -861409 847622 2181182 1627678 644509 1992684 5678113 8517920 8532429 7721785
37471 7721785 8817113 10988610 11192623 8800890 6159182 4757514 3587450 1798970
37463 1798970 477882 688556 1729419 2568984 3339160 4101588 3729416 1651756 -526320
37454 -526320 -905250 108968 831131 1143075 2284030 4089929 4533432 2423848 -954827
37445 -954827 -3386309 -3824720 -2781962 -1733759 -2198822 -4168365 -5476180 -4284426 -2241434
37436 -2241434 -3046903 -7148625 -10125949 -7947698 -2022772 3058563 5412684 6895149
37428 6895149 8911195 10102128 8760760 5351014 1649979 -1124647 -2500840 -2374339
37420 -2374339 -1381982 -756197 -1099422 -2011608 -3198183 -4819657 -6365559 -6601702 -5391185
37411 -5391185 -4172288 -3632237 -2354034 783911 4139611 5206265 4331963 4448009 7013194
37402 7013194 10034856 10758048 9152837 7935916 9517955 13284499 15915583 14727473
37394 14727473 10814999 8118470 9023670 11983617 14096765 14419284 13374069 10682165
37386 10682165 6337187 2503936 1475845 2085196 1132195 -1577934 -2895974 -1686417
37378 -1686417 -1045316 -3463440 -6775670 -7323367 -4904652 -2026561 -2212 1508255
37370 1508255 2378193 2235689 2047281 2870701 3470115 1654968 -2143187 -4876119 -4486118
37361 -4486118 -1598620 2152543 5324517 6261627 3895222 -499164 -4193030 -6050582
37353 -6050582 -7007047 -7490239 -6584768 -4206398 -1851819 -401647 734686 1503670 593751
37344 593751 -1820890 -3063490 -1509016 759967 904644 -670737 -1551324 -1262816 -1396904
37335 -1396904 -2397129 -2717575 -1207208 1591234 4497249 6340695 5793999 2551616
37327 2551616 -1258978 -2826966 -2104099 -1583060 -2307246 -2381637 -441452 1642557 1378028
37318 1378028 -537550 -1231356 166452 1511778 935154 -645756 -1038615 276383 1595142
37309 1595142 1004401 -1614293 -4458373 -5345990 -3412901 470252 4655325 7796198
37301 7796198 9121418 8402207 6260473 4155427 3279692 3385129 3240474 2324938 1483762
37292 1483762 1671260 2592225 3041079 2282299 666473 -915986 -1751456 -1566662 -510632
37283 -510632 1010436 2592473 3824125 4009338 2475446 -322867 -2516694 -2551766 -1024688
37274 -1024688 154507 276612 248912 462970 432 -1256626 -1466430 717009 3815173
37265 3815173 5419107 5399640 5250933 5165719 4291324 3408216 4370948 6644855 7446430
37256 7446430 6093398 5043112 5276278 4101826 -25533 -3681612 -2973550 425238
37248 425238 1757101 175957 -1176761 -1352920 -2853521 -6023542 -7028762 -3558963
37240 -3558963 1232257 3142961 2354042 1626068 1479398 407827 -1603718 -2984364 -3374808
37231 -3374808 -3872866 -4812402 -5509910 -5891241 -6275061 -5835479 -3463500 -176257 1433405
37222 1433405 580962 -557077 376847 3249728 6015112 6999562 6233970 5088620 4676059
37213 4676059 4437257 2977000 613138 -323633 1284907 3502796 4348692 4834486 6596549
37204 6596549 8189924 7038307 3969351 1972406 998981 -1553430 -4933013 -4682169
37196 -4682169 117380 4155208 3479467 1557263 3708040 8759760 11086970 8976483
37188 8976483 5868520 3950788 1464921 -2945263 -7298694 -9155399 -8571927 -6841831
37180 -6841831 -4489986 -1727600 739926 2289034 2681490 1706389 -160714 -1141904 -47356
37171 -47356 1658272 1843774 1137651 1520723 2010578 -393735 -4982546 -6816390 -3679259
37162 -3679259 360060 926638 -646363 -757780 -116526 -2364645 -7381886 -10449982 -8418374
37153 -8418374 -3344962 710633 1923510 994685 -550993 -1297927 -653489 476690 601871
37144 601871 -427288 -1261531 -936712 -76260 -157205 -2133674 -5427156 -7751920 -6835799
37135 -6835799 -3223237 -251756 5653 -589138 586379 2550494 2242929 -422232 -2213328
37126 -2213328 -1351070 420488 1198814 1624864 3100146 5479717 7705245 9066090 9078198
37117 9078198 7793675 6656417 7029805 7559399 5587472 1801142 335091 2836312
37109 2836312 5570097 4549369 658489 -2911265 -5539551 -8088483 -9093009 -6094385
37101 -6094385 70762 5839887 9352806 11286788 11947273 10911467 9283261 8826453
37093 8826453 8722305 6556830 2809198 791127 1439554 1864689 293768 -1283092 -1296979
37084 -1296979 -1821634 -4838247 -8162975 -8305286 -5341124 -1875016 1019163 3484181
37076 3484181 4005193 739088 -4679781 -8209288 -8484526 -7788670 -7709056 -7046155 -4907562
37067 -4907562 -2835956 -2303286 -2489106 -2317971 -2793201 -5380002 -9384309 -12640137 -13728496
37058 -13728496 -12071139 -7176130 196430 6962337 9977685 9218395 7038532 4613364
37050 4613364 1135297 -3385668 -6784860 -7255953 -5693826 -4284617 -3688089 -2824027 -944098
37041 -944098 1188559 2100468 916369 -2010347 -5268633 -7345908 -7825220 -7461190 -6846012
37032 -6846012 -5529851 -3020444 -161889 1382751 981174 -342137 -1198641 -1206373 -1010841
37023 -1010841 -1416735 -2567993 -3660581 -3588238 -2233992 -777853 -125610 487482 2286464
37014 2286464 4667997 5573032 4296157 2375823 1162300 152086 -1238028 -1900667
37006 -1900667 -793337 695859 352978 -1272890 -1087649 2445164 7237076 10174851
36998 10174851 10274775 8566654 6214163 3760944 1439206 -592834 -1950907 -1859305 -72065
36989 -72065 2128498 3119018 3138799 3650325 4327022 2983624 -542910 -2936723 -1688187
36980 -1688187 1320762 2954465 3660602 5992638 9555722 11240731 10331484 9572773 10469950
36971 10469950 11114162 9980150 8469220 7762031 6367621 3433988 1633046 3330294
36963 3330294 6051156 5814026 3766439 5064251 11110572 17109359 18330502 15145096
36955 15145096 10431435 5632722 1780355 1257178 4965178 9318936 9501679 5260178
36947 5260178 790873 -734129 107520 1498440 2661316 3004043 1583568 -1313088
36939 -1313088 -3832504 -4861341 -5113441 -5115290 -4082477 -2104544 -1411969 -3410167 -5966168
36930 -5966168 -6050035 -4058643 -2929766 -3645958 -4599317 -5302413 -7301780 -10477113 -11850183
36921 -11850183 -10175070 -8855357 -11252498 -15067103 -15093961 -10722517 -6699808 -6044219
36913 -6044219 -6147407 -3694449 -177712 466359 -2162255 -4576517 -4484726 -3373554 -3763323
36904 -3763323 -6169012 -9417675 -12158470 -13260831 -12224282 -10111690 -8872208 -8886221
36896 -8886221 -8346356 -5956157 -2905003 -860396 696053 3159172 5613355 5446078
36888 5446078 2368715 -544377 -904999 -197559 -1271519 -3991006 -5554281 -4727945 -3518429
36879 -3518429 -4070457 -5713733 -6383046 -5952338 -6546778 -9526430 -13305614 -14731096 -12278301
36870 -12278301 -7566547 -3772553 -2561950 -2524521 -817686 3489896 8068116 9741661
36862 9741661 7909978 4815462 2612372 1356396 280875 -278833 453063 1777203
36854 1777203 1902880 349507 -1488505 -2656234 -4090357 -6718789 -9265683 -9588843
36846 -9588843 -7785178 -6226407 -6253471 -6407440 -4753703 -1755012 362519 383256 -1102710
36837 -1102710 -3341824 -6231449 -9013345 -9583287 -6516934 -1417813 2152421 2517381
36829 2517381 1663262 2359600 4278699 4490005 1876774 -751187 -274604 2169315 2376087
36820 2376087 -1156779 -4800571 -4200810 447921 5092307 6789126 6102225 4889908
36812 4889908 3777215 2483381 1231958 768464 1460963 2870986 3863719 3251795 1256602
36803 1256602 277914 2723813 7543920 10485989 8878287 4777411 1983476 1364967
36795 1364967 1260191 1435178 3590637 7674833 10605818 10021125 7199630 4678285 2757928
36786 2757928 358413 -2041550 -2755338 -1552989 375868 2830190 6392926 9568177
36778 9568177 9052703 4397852 132317 922219 5843137 9806041 9994816 8310413 7341344
36769 7341344 6660915 4539656 1468196 -150242 662224 2114930 1870550 -380787 -2882612
36760 -2882612 -3790846 -2935272 -1792591 -1703278 -2201858 -1734338 -224655 202419 -1897567
36751 -1897567 -4599672 -4544208 -1371091 1628142 1665164 -465431 -2111143 -1746992 845434
36742 845434 5411420 10265189 12017306 8942904 4049671 2120433 3749209 4991283
36734 4991283 3227477 350193 -995158 -1276308 -1993302 -2169775 139510 4227897 7535859
36725 7535859 9271484 10423384 10687377 8458319 4069494 164864 -1781381 -2746511
36717 -2746511 -3321761 -2426646 -78526 1329758 412560 -874304 -486331 164742 -1401206
36708 -1401206 -4270428 -5068060 -2794627 -86484 276086 -1924270 -4843073 -5840298 -2815536
36699 -2815536 3337499 7888985 6464395 257231 -5246401 -6751030 -5743474 -4580870
36691 -4580870 -3427364 -2223991 -2379330 -4321613 -5820898 -5098005 -3711950 -4037815 -5499569
36682 -5499569 -5756554 -4396054 -3027804 -2628118 -3061687 -4432105 -6632814 -8163240 -7539953
36673 -7539953 -5368122 -3111985 -701566 2420832 4918793 5033709 3708119 3110850
36665 3110850 2537630 -516691 -5012338 -6227821 -2416389 1970352 1836895 -2535126
36657 -2535126 -7031668 -8589610 -6311700 -547127 5908788 7732679 2025140 -7232974
36649 -7232974 -12782548 -11968528 -8475781 -6576430 -6599920 -6527918 -5384295 -3770261 -2587565
36640 -2587565 -2262894 -2374947 -1640823 892619 4521038 7536505 9004648 8994434 7599116
36631 7599116 5115672 2782097 1729320 1424491 738250 140698 773801 1571963 -32949
36622 -32949 -3945615 -6573801 -5501494 -2825937 -2092203 -3612092 -4875604 -4490511 -3565186
36613 -3565186 -3610499 -4904237 -6882448 -8655345 -8991014 -7039325 -3504530 -364528 970979
36604 970979 965382 1379401 3522762 6856354 9188551 8601821 5316895 1294155 -1843535
36595 -1843535 -3706154 -4183971 -3067477 -1034532 475318 1164569 2163836 3335207 2016655
36586 2016655 -3560048 -10760319 -14924339 -14915957 -13874096 -14241449 -14583414 -12506757 -8730606
36577 -8730606 -6297839 -6508350 -7400715 -6418101 -3506748 -1064765 -1126044 -2948114 -3597648
36568 -3597648 -1012336 3754666 7556408 8038502 5131425 370703 -4137540 -6332161
36560 -6332161 -5295576 -2308832 204439 1374404 2588409 4853012 6621141 5647449
36552 5647449 2460515 312989 1337153 3970893 4892869 2713279 -1066045 -4177352
36544 -4177352 -5517396 -4971600 -2591492 1151969 4882035 7237342 8390529 9757652
36536 9757652 11887620 13509232 13272964 11629282 9996144 8634914 6718311 4430850
36528 4430850 3410456 4362292 5454085 4410691 1761793 656180 3180404 7786026
36520 7786026 10935965 10826140 8885621 7760905 8401052 9350426 8652356 6154608 3840692
36511 3840692 3815669 5890874 7397976 5940037 2456360 790444 3404377 7930330
36503 7930330 9239370 5270671 -292789 -1948218 1803890 7545108 11218899 11817314
36495 11817314 10691422 8838601 6197772 3115081 1046040 1163619 2840455 4261432
36487 4261432 4531938 4591627 5798025 8088763 9972791 9970477 7602702 3517245 -455232
36478 -455232 -1821643 533174 4613461 6978305 6633501 5980153 7307351 9869469 11465426
36469 11465426 11317157 9783804 6679749 2201962 -1227571 -667334 3573319 7860572
36461 7860572 9221906 7739561 5042945 2609951 1898038 3705859 6333545 6482794
36453 6482794 3365384 107522 -457538 342047 -691891 -3817934 -6177332 -5867790 -4036926
36444 -4036926 -2871498 -3153933 -4026921 -3959034 -1828555 1892871 4940773 5153944 2693394
36435 2693394 -231978 -1672295 -1377538 -427689 -373695 -2416141 -6358276 -10335469 -12256592
36426 -12256592 -11418859 -8409190 -4298338 -857976 -580006 -4716905 -11358422 -16788910
36418 -16788910 -18875640 -18276385 -16712452 -15275731 -14121713 -12477019 -9168583 -4474349
36410 -4474349 -1015265 -1071208 -3324764 -4418888 -3758603 -4201151 -7293056 -10533849 -11005294
36401 -11005294 -9516754 -8979624 -10265184 -12119935 -14096623 -16708016 -18819873 -17751722
36393 -17751722 -12985769 -7766724 -5567666 -6186998 -6834900 -6238429 -5702554 -5966148 -5075224
36384 -5075224 -1002883 4562648 7295848 5552426 2660761 2564909 4702257 5285739 2787285
36375 2787285 -529054 -2641522 -4535026 -7678788 -10894532 -11610773 -9031899 -4434462
36367 -4434462 683356 5033781 6891871 5047687 565758 -3715597 -5712011 -5499590
36359 -5499590 -4534512 -4284009 -5200713 -6101972 -4926852 -1016710 3770150 7052902 8342918
36350 8342918 8433405 7415351 5129893 2978267 2917293 4359917 4220002 944606 -3131941
36341 -3131941 -4583697 -2918196 -741741 -678078 -3048082 -6094254 -7757670 -7488752 -6610728
36332 -6610728 -6563662 -6928058 -6047505 -3529106 -849202 742659 1419680 1326688 -323629
36323 -323629 -3438607 -5800265 -5488063 -3767696 -3623771 -5640917 -7238895 -6329547 -4068032
36314 -4068032 -3086993 -4077678 -5236866 -4737858 -2824318 -1261048 -1136371 -1627103 -1120320
36305 -1120320 656786 2180777 1987168 370991 -1289445 -2380721 -3374381 -4524162
36297 -4524162 -5270692 -5211092 -4828201 -4651764 -4164341 -2332215 695961 3063706 3007763
36288 3007763 1157063 331017 2454906 6037209 7591061 5578419 1994396 -228426
36280 -228426 -278066 770834 2115665 3752165 5324480 5973558 5511402 4620414 3589250
36271 3589250 1818130 -950903 -3608230 -4416347 -2559920 1044353 4090917 4304967
36263 4304967 1351350 -2683667 -5452069 -6740661 -7665623 -7926594 -5861332 -1636767
36255 -1636767 1842523 2560937 2091497 2871794 4425416 4748761 4236138 4983382 6396327
36246 6396327 5070926 121022 -4590818 -5564993 -4378849 -4553018 -5709661 -4475645
36238 -4475645 -509977 2287956 1515589 21154 1922975 6836591 10322860 9236978
36230 9236978 4732107 215176 -2117894 -2519251 -2545840 -3174267 -3826087 -3260033 -1354056
36221 -1354056 633755 1740863 2275638 2628204 2283467 1038306 143992 782026 2121945
36212 2121945 2505572 2014218 1965280 2138662 822064 -1939732 -3464599 -2048702 317951
36203 317951 454659 -2000912 -4704024 -5807802 -5303875 -3697208 -1255257 1243643 2537643
36194 2537643 2236497 1251675 464159 -289847 -1459492 -2580880 -2459758 -556150 2070246
36185 2070246 3486398 2838014 1378552 902369 1243298 512966 -1729064 -3028240 -1123900
36176 -1123900 2535137 4229595 2571847 -269026 -2086269 -3342993 -5435106 -7873947
36168 -7873947 -8755119 -7337387 -4756242 -2358032 -515414 717903 816367 -580503 -2621489
36159 -2621489 -3754687 -3583810 -3481301 -4583874 -5740472 -4847867 -2234027 -932031 -2760257
36150 -2760257 -5812749 -7244872 -6974139 -6611819 -6136472 -4487610 -2753252 -3322961 -5515331
36141 -5515331 -5530048 -2113593 855641 -406520 -4280873 -6269818 -4955752 -2530639
36133 -2530639 -622559 1205840 3030089 3487458 1687098 -1647485 -5202291 -7692562
36125 -7692562 -7649188 -4633399 -958403 -241287 -3459927 -7756905 -9631370 -8091308 -4427023
36116 -4427023 -446307 2428874 3645919 3896536 4180945 4235334 2943999 395789 -1905524
36107 -1905524 -3132255 -3818137 -4071254 -3063661 -1242377 -1108597 -4203378 -8673972 -11488820
36098 -11488820 -12078830 -12216563 -13158395 -14546865 -15474127 -14983622 -12067334 -6948729 -2094151
36089 -2094151 -108615 -523206 -364226 1764670 3813654 3190517 146480 -2784644 -3838563
36080 -3838563 -3362627 -2490089 -1604063 -444988 806469 1181367 -69742 -2300364 -3791906
36071 -3791906 -3464848 -1906984 -484353 91318 -26883 -409509 -455790 635726 3066369
36062 3066369 5594510 6156475 3541254 -1608789 -7041513 -9902386 -8410944 -3595179
36054 -3595179 974776 2206594 258085 -2264578 -3431205 -3407245 -3211699 -3408365 -4128049
36045 -4128049 -5237657 -6120479 -6008041 -4694079 -2442939 414122 2947338 3405770 1146534
36036 1146534 -1556875 -1725283 68325 -45883 -3799857 -7900710 -8316251 -5603235 -3589701
36027 -3589701 -3860223 -4313738 -3103371 -1349302 -989638 -1818658 -2087243 -1083788 247589
36018 247589 997872 1523423 2662261 4193334 4677552 3218032 1155698 1082121 3613157
36009 3613157 6024507 5343859 2429010 1370242 4479816 9347933 11784042 10512289
36001 10512289 7594643 4924655 2132611 -1726430 -5871500 -8204677 -7513852 -4560617
35993 -4560617 -1228544 928698 1561322 1457225 1507924 1539459 615874 -1181455 -2147977
35984 -2147977 -1153828 205495 -746411 -4048443 -6838022 -7285339 -6866239 -7524075 -8363040
35975 -8363040 -7211472 -4438074 -2828013 -3763371 -5541006 -5794349 -4022641 -1444768
35967 -1444768 231394 -353109 -3223601 -6670612 -9004124 -10496401 -11987411 -12039463 -8102649
35958 -8102649 -859269 5413607 7849023 7694801 6799169 4527691 404947 -3138804
35950 -3138804 -3928363 -3860268 -6005969 -9395348 -10456790 -8674765 -6830646 -6088896 -5104339
35941 -5104339 -4214645 -6021669 -10555696 -13965084 -13932551 -12805368 -13131558 -13508985 -11666900
35932 -11666900 -8677301 -6828113 -5754487 -4226378 -3691102 -5949408 -8697555 -7922025
35924 -7922025 -4396435 -3248417 -6396153 -9754829 -9639829 -8038829 -8704565 -10879742
35916 -10879742 -10537655 -6603122 -2414945 -844571 -737699 743133 4063318 7110632
35908 7110632 8261830 8135729 8107868 8244167 7656989 6421076 5781789 6128714 6052315
35899 6052315 4390346 2260623 1747461 3154106 4922844 5782348 5436249 3635187 613453
35890 613453 -1707999 -1439844 -132059 -1790737 -7203353 -11764136 -10996379 -6190750 -2066323
35881 -2066323 -522975 212523 1314991 1880097 1740036 2220523 3102141 1897977 -2210015
35872 -2210015 -6182313 -6810427 -4695274 -2590903 -1503459 -735404 -500103 -1841606 -4397957
35863 -4397957 -6474659 -7193497 -6815748 -5370459 -2844785 -247358 1555338 3446950
35855 3446950 6088436 7124122 3844438 -1360715 -2416714 2194188 6664178 5748334
35847 5748334 1673944 -209575 691116 1299188 1439106 3593686 6659599 5800806 -175708
35838 -175708 -6266098 -8335921 -8573037 -10903258 -14330859 -14660690 -11020684 -7047545 -6186874
35829 -6186874 -8475208 -11525247 -12511259 -9733649 -4392003 -449596 -735313 -3484591
35821 -3484591 -4673091 -3413170 -2767944 -5053030 -8540751 -9653403 -6913390 -1893451
35813 -1893451 2635217 4678893 3890835 1364636 -1273940 -2571008 -1403047 2403618
35805 2403618 7040991 9549349 8814118 6681446 4901684 2515005 -1619331 -5154435
35797 -5154435 -4468508 -388348 1795436 -919144 -5434643 -7165713 -5952345 -5009929
35789 -5009929 -5677411 -6061232 -4549338 -2252422 -1307349 -2139970 -3236988 -3096456 -1781604
35780 -1781604 -500519 48232 386760 1047496 1327464 198040 -1853117 -3091882 -2743141
35771 -2743141 -1818004 -1491617 -1681703 -1581689 -703779 954996 3031111 4849028 5966336
35762 5966336 6575687 6740525 5827393 3794826 2225451 2388971 3097857 2763121 2789894
35753 2789894 5684468 9861494 10241477 5122571 -1285725 -4903976 -6538771 -8100503
35745 -8100503 -8014466 -4413168 -37191 771737 -1562055 -2944065 -2007871 -848086 31913
35736 31913 2468637 5855187 6563034 3748454 1403583 2316554 3715181 1846386 -2093201
35727 -2093201 -4064592 -3308267 -2762989 -4079999 -5430485 -4635262 -2189246 -291072 -56323
35718 -56323 -514563 -107343 1195784 1687940 223613 -1928651 -2787561 -2753310 -3962952
35709 -3962952 -6369137 -6974738 -4192082 -681950 163459 -1085627 -1112715 1176255 3360797
35700 3360797 2947196 -67362 -4185197 -7905009 -9613764 -7831535 -3025901 1543625
35692 1543625 2207490 -1585868 -6713237 -9677148 -10011317 -9691002 -9451699 -7376634 -2267030
35683 -2267030 3063074 4294747 1182377 -1911719 -1626433 707240 2112492 2208055 2334732
35674 2334732 2342652 979392 -1311194 -2518449 -1968371 -1190627 -1746755 -3608387 -5696283
35665 -5696283 -6843061 -6403031 -5025025 -4480147 -5619213 -7049977 -7049817 -5974404 -5143317
35656 -5143317 -4171175 -1649624 1752382 3197082 1112721 -2994163 -6407271 -7323464
35648 -7323464 -5210125 -1059267 2449412 2958215 953798 -1411934 -3766983 -7217207
35640 -7217207 -10606160 -10638153 -7044518 -4184572 -5207841 -7614192 -7573576 -6029274 -6638814
35631 -6638814 -9358217 -10535006 -8959169 -7422092 -7610346 -7562214 -5847367 -4686285 -6257591
35622 -6257591 -8397672 -7095486 -2068869 2967923 5195624 5425502 5782177 6628837 6525949
35613 6525949 4215983 172113 -3371998 -4201902 -2687476 -1991265 -4354464 -7543153
35605 -7543153 -6934636 -1549238 3967355 4609420 795173 -2742301 -2856413 -750297 901254
35596 901254 1372720 1587715 1990596 2216877 2359445 3229608 5119226 7007321 7422841
35587 7422841 5994322 3985495 3163163 4001325 5157510 5040081 3689048 2473944 1996565
35578 1996565 1276437 -567065 -2812296 -4222541 -4952835 -6140786 -7770668 -8213950 -6305094
35569 -6305094 -3031475 -555198 109884 68129 1301263 4485073 7870171 8612191 5772501
35560 5772501 1833474 464664 2725925 6259503 8307336 8406978 7576122 6099721 3589160
35551 3589160 812249 -207574 1464178 4171996 5340878 4262664 2484473 1553497
35543 1553497 1194231 112006 -1948979 -3750375 -4207806 -3761674 -3608824 -4036306 -4283100
35534 -4283100 -3919889 -3439438 -3170477 -2486975 -878050 751014 937605 -218476 -887973
35525 -887973 113256 1671977 1801895 43149 -2437931 -4545084 -5776962 -5376723 -2738552
35516 -2738552 837653 2533434 1360692 -290759 -149211 63714 -3244074 -9737509
35508 -9737509 -14214497 -12462330 -6015546 265133 3668228 4965474 5582457 5785075
35500 5785075 5654059 6033333 7668456 9894081 10592618 7800306 2054301 -2981338 -3655099
35491 -3655099 -604537 1681779 446164 -2084256 -2525253 -1334504 -1423864 -3282239 -4704435
35482 -4704435 -4757098 -4700587 -4972699 -4586391 -4051788 -5568456 -9183225 -11855290 -11874015
35473 -11874015 -11287363 -12048423 -12633324 -11075072 -8900321 -8820621 -10110786 -9673867 -6932544
35464 -6932544 -4449706 -3805900 -3727240 -2692997 -1057367 45382 152789 -666333 -2015441
35455 -2015441 -2964147 -2836536 -2249478 -2334723 -3320516 -5039782 -7898149 -11427352 -12823277
35446 -12823277 -9769641 -4616818 -2697851 -5777433 -9982524 -11342169 -10560478 -10504520
35438 -10504520 -11534064 -11967844 -11495943 -11161306 -10643386 -8359957 -4393306 -998046 426452
35429 426452 1122440 2898170 5508216 7032157 6128114 3114928 -702096 -3951958 -5519888
35420 -5519888 -4728016 -1837180 1561521 3205702 1967122 -839471 -2521247 -1719968
35412 -1719968 389132 1921683 2598356 3378863 4199186 3442411 267196 -3430323 -4599927
35403 -4599927 -2673603 -613245 -1609276 -5317027 -8476075 -9145516 -8840923 -9703506 -10849887
35394 -10849887 -9219932 -3818155 2408829 5353591 3571327 -865965 -4536501 -5479671
35386 -5479671 -4510746 -3889349 -4333854 -3973793 -1312351 1565662 852065 -3879935 -8832969
35377 -8832969 -11058983 -11860386 -13379599 -14138640 -11030707 -4733765 227724 1186316 296507
35368 296507 731426 2214050 2106519 -446027 -3461778 -4819748 -4438234 -3663423 -3644591
35359 -3644591 -4731922 -6804411 -9603249 -12689451 -15134141 -15472799 -12612829 -7271437
35351 -7271437 -2082225 572488 919945 1301488 3040948 4491948 2971676 -1536490
35343 -1536490 -5506027 -5265851 -1047031 2932455 2640433 -1800766 -6623673 -8619622
35335 -8619622 -8056774 -7126828 -6546819 -5219651 -3178058 -2847293 -5975877 -10517526 -12548702
35326 -12548702 -10952332 -8244856 -6728088 -6055836 -5295870 -5031147 -5773241 -6163686 -4953419
35317 -4953419 -3529621 -4055945 -5830803 -6068150 -4120923 -2364196 -2537527 -3598996 -3968671
35308 -3968671 -3813284 -4114405 -5205185 -7138663 -9807940 -11836907 -11329761 -9015248 -8654505
35299 -8654505 -12399913 -17235630 -18233125 -14485407 -9731498 -7580951 -8069182 -8789520 -7667591
35290 -7667591 -4376297 -261207 2819292 4177028 4649487 4977145 4823133 4169912 4278541
35281 4278541 5720603 6663435 5141561 2208914 571235 586384 96598 -1887782 -4010256
35272 -4010256 -5487439 -7511591 -10606841 -12869448 -12462374 -10246481 -8287822 -6940583
35264 -6940583 -5090868 -2609030 -997666 -1618685 -4042357 -6100648 -5542383 -2373545
35256 -2373545 462826 52441 -2599192 -3398170 -631000 2452358 2092763 -825922 -2474865
35247 -2474865 -1700566 -1024551 -2287197 -4228862 -5073233 -4988925 -4723120 -3846634 -2071744
35238 -2071744 -830252 -1538888 -3113771 -3234416 -1826544 -1347842 -3319315 -6210929 -7362134
35229 -7362134 -5649934 -1628430 3457390 7613539 8399466 5177841 610535 -1803808
35221 -1803808 -1563099 -954442 -1205072 -1007892 526323 1708111 685896 -1453614 -1902022
35212 -1902022 337328 3853818 7171508 9831684 11344630 10964709 8911945 6445016
35204 6445016 4347918 2503825 1186376 1391086 3258243 5230818 5519333 3801258
35196 3801258 1158985 -889874 -1073800 835605 3245075 3522158 317491 -5101507
35188 -5101507 -9916647 -11636944 -9200433 -3632929 1826635 3545916 682712 -3824567
35180 -3824567 -6207251 -5500953 -3731822 -3016989 -3341285 -3169090 -1584650 582396 1747424
35171 1747424 1390212 412426 -317772 -907986 -1448564 -1167616 267214 1488705 1066054
35162 1066054 -171878 -262039 830184 1384145 1058708 1453505 3173944 4789619 5447502
35153 5447502 6061663 6921260 6754954 5611627 5895424 8367750 9651811 6542823 841070
35144 841070 -3198711 -4625688 -5509366 -6044382 -4075003 325578 3628747 3444122 1517699
35135 1517699 682669 903648 -140915 -3819104 -8928754 -12519716 -12180358 -8678979 -6092895
35126 -6092895 -7563908 -11135149 -12070768 -9336927 -6898222 -7747144 -9669717 -8805790 -4998428
35117 -4998428 -1194600 852140 1790559 2547542 3308661 4156307 4757678 3709995 28812
35108 28812 -4750502 -7568902 -7103122 -4770952 -2465093 -660006 937070 2199569 2905131
35099 2905131 3566405 5008707 7040365 8025635 6279551 2078825 -2125124 -4081564
35091 -4081564 -4086694 -4176322 -5235558 -6184636 -6147852 -5815705 -5858978 -5418496 -3433370 -534417
35081 -534417 1614235 2198009 1522710 271482 -488730 356849 2296286 3019303 1691598
35072 1691598 1258138 4948574 10951984 13489232 9730175 3079668 -1442839 -2713127
35064 -2713127 -2767154 -2586417 -1118816 2163092 5913807 8334325 8574026 6506361 2317984
35055 2317984 -2982249 -7178589 -7879003 -4599224 50559 2034150 -273127 -4208299
35047 -4208299 -5940757 -5203425 -5158416 -7376249 -9314543 -8061981 -4430171 -1232028 863404
35038 863404 3165424 5752108 7356418 7978997 8583104 8280098 5214312 846005 -334681
35029 -334681 2929296 6012974 4533143 333801 -1727384 -673507 652821 1034220
35021 1034220 2008164 3869539 4620565 3500053 2009741 525435 -2648769 -7374765
35013 -7374765 -10054966 -8091001 -3556674 -238146 998418 1757337 2884024 4031115
35005 4031115 5074542 5808353 5447204 4342671 4667344 7176495 8922918 6992787 3227350
34996 3227350 2021897 4174393 6302134 6193576 5328713 5598796 6596715 7058262 6448404
34987 6448404 4323600 551667 -3067106 -3878704 -1965616 -200091 186625 1277863
34979 1277863 4276155 6512132 5002409 965015 -1674932 -942870 2119377 5773236
34971 5773236 8788641 10206836 9918059 9039968 8401402 7456386 5822747 4539371 4276709
34962 4276709 3778088 2014327 495677 1101256 2731830 2833607 1656845 2147110 5497881
34953 5497881 9323809 10754146 9339760 6444733 3616087 2131055 2525876 3828264
34945 3828264 4330009 3474315 2086648 930665 301695 741670 2474796 4186564 4153248
34936 4153248 2743243 2008810 2546293 2712129 1541352 503210 1266746 3144209 3909012
34927 3909012 2331156 -717822 -2846147 -1645041 3090718 8318271 10323149 8709639
34919 8709639 6335418 5059951 3694305 1030500 -1374073 -1160798 1661479 5234719
34911 5234719 8236299 10043716 9828318 7606660 5387429 5116600 5883203 5230762 3088512
34902 3088512 2244332 4491678 8140257 10161704 9475010 7223540 4814935 2793624
34894 2793624 1300279 725210 1569949 3732366 6109572 7320757 7047441 6209429 5443439
34885 5443439 4011702 939186 -3248758 -6867602 -8920119 -9679083 -9606086 -8786575 -7574554
34876 -7574554 -6774570 -6779897 -7234993 -7797593 -8435796 -8668309 -7525807 -5063642 -3155869
34867 -3155869 -3614286 -5699573 -6647751 -4961981 -2216206 -925245 -1388031 -1778371 -1061379
34858 -1061379 -260929 -275389 38334 2086090 4725045 5282529 3361809 1515625 1478811
34849 1478811 1858505 972995 -621 910345 2518455 1669403 -1607364 -3189459 -256607
34840 -256607 4808621 7656342 7321496 6228911 6055074 6084140 5404372 4336771 3112117
34831 3112117 970188 -2442416 -5906948 -7677776 -6940964 -3928857 213029 3160047
34823 3160047 2540832 -1454786 -5707177 -7680034 -8234004 -9441363 -10810186 -10050504 -7128872
34814 -7128872 -4842734 -4827416 -5317586 -3897843 -618786 2711235 4649159 4422862 1921052
34805 1921052 -1174511 -2029379 -307310 460951 -2437942 -6167064 -5388173 308588 5255753
34796 5255753 4774327 756943 -1293132 937216 4456167 4980550 1775821 -1649632
34788 -1649632 -1443502 2121429 4782668 3390279 -357191 -2682692 -2920876 -3401286 -4757319
34779 -4757319 -4673894 -2077424 489250 487747 -812368 -317741 2423106 4832304 4830624
34770 4830624 3149608 2219105 3596640 6318771 7554852 5493880 1552861 -1297601
34762 -1297601 -2143939 -2426272 -2904770 -2868683 -2751578 -4447844 -7600019 -8553712 -5337518
34753 -5337518 -1284004 -916049 -3957981 -6231971 -5209646 -2018248 887207 1370445
34745 1370445 -1896839 -7622050 -11379570 -9932856 -5609613 -3543792 -5081115 -6960817
34737 -6960817 -6660437 -5136029 -4024204 -3435400 -3269444 -3850491 -4417792 -3503118 -1447322
34728 -1447322 -87434 404055 1532562 2954015 2291302 -583717 -2564301 -2086851 -1478067
34719 -1478067 -2592577 -3492317 -2054171 177849 854441 938337 2468783 4315041 4082347
34710 4082347 2910689 4215315 7972924 10147423 8345949 4838223 2979827 3177279
34702 3177279 3612068 3163100 2406017 2618165 4302599 6156930 5956611 3445941 1406222
34693 1406222 2172961 4108000 3954098 1971040 1560492 3671205 5045093 3184826 -112443
34684 -112443 -2069632 -2980065 -4347536 -5174216 -3411072 -39596 1673704 905803 151459
34675 151459 821187 995093 -906509 -2745431 -1462321 2144528 4267468 3456935 2414986
34666 2414986 3684362 5869485 5771087 2770331 -889233 -3389702 -4780519 -5261932 -4215268
34657 -4215268 -1773855 139938 -449854 -3354314 -6353137 -7124190 -4978847 -1557056
34649 -1557056 163044 -1151569 -2934786 -1134731 4366818 8638932 7499768 2775366
34641 2775366 -347055 -20128 881966 -273616 -2409236 -3049921 -1925811 -866584 -1295542
34632 -1295542 -3009401 -4756184 -5198063 -3874608 -1852308 -897912 -1494741 -2206239 -1447507
34623 -1447507 725636 3116458 4990116 6285004 6527761 4637173 342081 -4640577
34615 -4640577 -7565659 -7061011 -4215340 -941074 2217688 5731717 8900733 9728110
34607 9728110 7632236 4667712 2724190 916635 -2314188 -5597698 -5787368 -2535513
34599 -2535513 1034909 2761314 3817478 5457753 6121224 4124344 1340988 1213552
34591 1213552 3804706 5659812 4609071 2060838 -57778 -2037725 -4593138 -6389326
34583 -6389326 -5616925 -3089716 -1521420 -1839273 -2180606 -869395 1459488 3531340 5548390
34574 5548390 8110586 10022799 9056734 4893278 -45420 -2962760 -3078974 -1773961
34566 -1773961 -1301777 -3169580 -6597525 -8674651 -7367670 -4260755 -2631330 -2854389
34558 -2854389 -2073160 977088 3655356 3610523 2621254 3512669 5265463 4704469 1996242
34549 1996242 602552 1775270 2883400 2069718 1021004 1448294 1948985 829916 -282128
34540 -282128 1416736 5424285 8348146 8253459 6232340 3944307 1981478 950770 1962380
34531 1962380 4966897 7913489 8638167 6929779 4041867 895402 -2244257 -4655180
34523 -4655180 -5008496 -2948895 -144202 1256156 1195985 1761393 4307687 7598667 9639213
34514 9639213 10338393 10925485 11371477 10269676 7331031 4216929 2385261 1574328 991761
34505 991761 594603 444053 44591 -840474 -1743540 -2523915 -3759489 -5491803 -6756469
34496 -6756469 -6984223 -6578006 -5497056 -2906238 798996 3313357 3101276 1294782 -352993
34487 -352993 -1689745 -2739847 -2005087 1373343 5120241 6187266 4764532 3286546
34479 3286546 2135383 -625118 -5233551 -8917151 -9311773 -6931471 -3599517 -533582
34471 -533582 1289721 867962 -1691398 -5072229 -8256628 -10833257 -11942671 -11032309 -9904939
34462 -9904939 -11513063 -15763000 -18742035 -17337946 -12682939 -7836129 -4162254 -1596831
34454 -1596831 -479259 -916507 -1559093 -1041035 125231 597528 168959 -776029 -2567962
34445 -2567962 -5210371 -7055981 -6553878 -4689048 -3798777 -4503992 -5657799 -6735215 -8095903
34436 -8095903 -9106810 -8334502 -6034575 -4552361 -5526941 -7999864 -9825810 -9914674 -8758472
34427 -8758472 -7665327 -7617270 -8104696 -7329740 -4471427 -1127064 817854 1896290 3612052
34418 3612052 4984064 3410986 -792611 -3750686 -3028510 -643408 408088 155209
34410 155209 266966 979274 1946144 4323792 8932917 13346975 13968380 10814204 7507228
34401 7507228 6529009 7127479 7952694 8644860 8056557 4169226 -2355285 -7126259 -6938174
34392 -6938174 -3944454 -2474042 -3174242 -3201701 -1338943 431649 703686 906302 2593799
34383 2593799 4790681 5547239 4430618 1979083 -1719417 -6000010 -8394337 -6821183
34375 -6821183 -2717040 172077 370890 223637 2387553 6505776 10258673 12233604
34367 12233604 12430585 10958616 7888717 4151983 1171683 -662518 -2290174 -4547774
34359 -4547774 -7132309 -9186147 -10277268 -10482234 -9945987 -8700015 -6699791 -3901085
34351 -3901085 -548018 2540519 4285462 4079132 2030237 -1319231 -4917922 -6946737
34343 -6946737 -5829020 -2319347 276665 -622834 -3584694 -4730760 -2976084 -1904208
34335 -1904208 -5038207 -10677339 -13778066 -12460012 -9759783 -8277474 -6224837 -1092566
34327 -1092566 5126146 7911602 6521356 4579803 4208849 3466133 930871 -1073857
34319 -1073857 -612645 -291592 -3311420 -7344082 -7024172 -2044730 2014109 1784403 504601
34310 504601 2192377 5334045 5730376 3009752 494657 -53530 146982 189974 602938
34301 602938 944709 -322538 -2529140 -2383959 1302173 4774796 3626080 -1357123 -5148248
34292 -5148248 -4956498 -3410307 -4621903 -8792305 -12171690 -11806306 -8792554 -6291378
34284 -6291378 -5398857 -4404194 -2031813 305739 541888 -927574 -1749967 -758243 956627
34275 956627 1946062 1822356 765458 -773407 -1652386 -925629 538696 968255 422689
34266 422689 491245 817142 -1162984 -5427914 -7275463 -2944319 4656828 9244868 9015531
34257 9015531 7612540 7838380 8419328 7582724 6015350 4670555 2720301 -286659 -2635838
34248 -2635838 -2904021 -2199530 -1866394 -873811 2035753 5128600 5422884 2847917 93267
34239 93267 -1117342 -1050255 254261 3208251 6350112 6697157 3600142 51218 -1187892
34230 -1187892 -926757 -1502664 -2995374 -3508892 -2450216 -1441269 -1771660 -2439253 -1495087
34221 -1495087 1237244 3513429 2976052 -46328 -2588052 -2330849 -325477 489720 -861094
34212 -861094 -2480417 -2741046 -2608287 -3728691 -5546817 -6071482 -5025489 -4440418 -5749981
34203 -5749981 -7558164 -7107153 -3483406 1244951 4006632 3534615 1148337 -1065725
34195 -1065725 -2416550 -3574624 -4772149 -5097318 -3945221 -2226556 -1302760 -1263864 -1114240
34186 -1114240 -276689 1000139 2482518 4200572 5840483 6753609 6680933 5736191 3687392
34177 3687392 246614 -3651868 -5887653 -5185806 -2536245 61115 1825823 3488467
34169 3488467 5626282 7482255 7643807 5584326 2379227 -97014 -810823 -469709 -615507
34160 -615507 -1822313 -3108624 -3148925 -1596457 888250 3267839 4466088 3830905 1988685
34151 1988685 780395 1550089 3710878 5609545 6385076 6157164 4931673 2718326 637400
34142 637400 257588 1291518 1421217 -661237 -3317375 -4288732 -3849136 -3982412 -5126617
34133 -5126617 -5767061 -5257723 -4967311 -5819045 -6341392 -4558205 -1005668 1490784 920383
34124 920383 -1897948 -4400680 -4777857 -3281206 -1375496 141602 1828187 4131377
34116 4131377 5812937 5004917 1944458 -634876 -578229 1138688 1783131 51925 -3078498
34107 -3078498 -6115807 -8536229 -10649249 -12854659 -15082445 -16561457 -16412929 -14772614
34099 -14772614 -12691087 -10553759 -7725485 -4619955 -3658510 -6276271 -9837802 -9947607
34091 -9947607 -5860536 -1354299 204662 -600284 -1551848 -2337643 -3828173 -5286515 -4744754
34082 -4744754 -1979944 824126 1874504 2014425 3535196 7384108 12090756 15176932
34074 15176932 15232988 12736099 9325700 6629671 5523975 5731478 5810337 4276976 1405711
34065 1405711 -710014 -680830 321700 332801 -590825 -968147 -698184 -1083386 -2162857
34056 -2162857 -2540740 -2369434 -3797468 -7172960 -9351168 -7775653 -4180320 -1848363
34048 -1848363 -851725 1150172 4374291 6244926 5179268 2424304 -181925 -2049604
34040 -2049604 -3045144 -2982354 -2574340 -3057476 -4089800 -3656557 -936867 2206574 3594793
34031 3594793 3327577 2904735 2788314 2179351 794189 -294090 216899 2244004 3916712
34022 3916712 3051170 -485893 -4171678 -5449624 -4810236 -5134971 -7874294 -11133168 -11991573
34013 -11991573 -9612164 -5528247 -2015602 -958256 -3170160 -7458816 -10734177 -10292987
34005 -10292987 -6339934 -1862707 72806 -1149214 -3505657 -4326599 -2602349 437869
33997 437869 2815785 3447366 2227784 -555688 -3929534 -6022515 -5625967 -3914226 -3256206
33988 -3256206 -4219113 -5159563 -5006652 -4778966 -5587623 -6673257 -6692098 -5941525 -5904745 -6992790
33978 -6992790 -7872504 -6997365 -4136897 -420167 2750362 4826380 6198899 7177800 7521175
33969 7521175 7525109 8528945 10806804 11771604 8660780 2927853 -799063 -786696 -285039
33960 -285039 -2109223 -4134843 -2810895 1087759 3511632 2776886 964533 208314 637225
33951 637225 1989459 4339971 6659275 7135246 5762979 4624348 4884230 5410602 5103241
33942 5103241 4630290 4806676 4990874 4375579 3518679 3337683 3648860 3771555 3547915
33933 3547915 2806686 1055224 -1053791 -1188540 1963594 6116956 7329872 4490795
33925 4490795 461507 -1309103 -58028 2495291 4252086 4091239 2227851 92635
33917 92635 -734991 -262603 -349766 -2369729 -4793706 -4242816 514537 6367861 8560061
33908 8560061 5390495 -458508 -5003415 -6294711 -4683410 -1353504 2272801 4537004
33900 4537004 4435470 2605522 701514 -94228 582184 2840392 6346930 9693476 10964770
33891 10964770 9161531 4729062 -793673 -4971064 -5313473 -1579585 3099757 5083010
33883 5083010 4081843 2481235 1175033 -1292492 -4969181 -6964571 -5525938 -3204042
33875 -3204042 -3338080 -4997720 -4400386 -564942 3532800 5414818 5699279 5546812 4327509
33866 4327509 1417873 -1757379 -3469842 -4185684 -5366551 -6623437 -6136822 -3661780
33858 -3661780 -1140476 -39595 200310 405484 -109809 -2353097 -5527218 -7321824 -6077486
33849 -6077486 -1944832 3569937 8244104 9857887 7797856 4164420 1991426 1802865
33841 1802865 1005889 -2540487 -7333595 -9769382 -8366891 -5144039 -2729645 -1309220
33833 -1309220 868176 4570325 8208298 9762515 9519853 9840889 11831755 13379737
33825 13379737 11861768 8173761 6009327 6939066 8519164 8252419 6930932 6040357
33817 6040357 4163987 -708117 -6458896 -8322779 -5337092 -1800241 -1258507 -2216952
33809 -2216952 -1508458 895945 2804434 3418071 3364034 2514644 491426 -1407271 -1346265
33800 -1346265 245323 1255456 1141689 1396027 2638118 3483406 2955541 2127704 2412359
33791 2412359 3681139 5067617 6401345 7714670 8206440 6861361 3690795 -391334
33783 -391334 -4376041 -7063343 -6857288 -3011629 2865881 7690636 9807035 10360640 11258395
33774 11258395 12411565 11993810 9295518 6100222 4589535 4748635 4853038 3959287 2578269
33765 2578269 1056514 -1073383 -3627702 -5152614 -4815071 -3883574 -4154788 -5598693 -6676973
33756 -6676973 -6389743 -4811951 -2131288 1373023 4473423 5535425 4353297 2618424
33748 2618424 2213999 3460075 4935678 4519167 1013712 -4329273 -8132514 -7821391 -4326086
33739 -4326086 -1062213 -331371 -1651280 -3400008 -4673240 -5176077 -4604054 -2981591 -938086
33730 -938086 975484 2793825 4610425 6056314 6653422 6302115 5240419 3924790 2999525
33721 2999525 2861542 3136495 2979329 1886172 -43263 -2219263 -3449079 -2449183 550017
33712 550017 3392092 4459910 4856097 6441167 8371040 7979528 4994515 2070312 522771
33703 522771 -1424577 -4591429 -5954445 -2563328 3422693 6597971 4508269 -429085
33695 -429085 -4570517 -6104969 -4776220 -1301213 2244626 3428779 1783478 -901922
33687 -901922 -2803782 -3426714 -2878555 -1406049 127251 823333 1075506 1810425 2243091
33678 2243091 291122 -4115732 -7976745 -8554420 -6365550 -3886808 -2741197 -3278598
33670 -3278598 -5384503 -8071522 -9396966 -8554249 -7335621 -7881176 -9556747 -9742716 -7373450
33661 -7373450 -4097591 -2143377 -2517816 -4999200 -8151329 -9419890 -7155654 -2957244
33653 -2957244 -356860 -737417 -2154544 -2567313 -2202599 -1830375 -862216 1160804 2917543
33644 2917543 3239044 3420472 5182907 7087542 5783069 1032483 -3059861 -2800800 998028
33635 998028 4765297 6417522 6509738 6315918 6332166 6246193 5270905 2831888 -286784
33626 -286784 -2097263 -1754104 -1203051 -3105580 -7201571 -10146570 -9403685 -6162771 -3597524
33617 -3597524 -2992710 -2744536 -1124923 1093771 1511519 -856503 -4335112 -6482402 -6366938
33608 -6366938 -4585464 -2042020 280764 1122917 41246 -1556171 -2042315 -2130333 -3851686
33599 -3851686 -6667167 -6983330 -2849193 2925868 6232227 6580455 6284462 6095899 4675904
33590 4675904 2120382 957684 2761118 5871599 7501409 6649323 4178061 1306940
33582 1306940 -1207761 -3324363 -5552232 -7726630 -8191902 -5702296 -2009486 -546840
33574 -546840 -2143322 -4057217 -3904077 -2408093 -1239888 -314800 1138571 2578511 3071764
33565 3071764 2969015 2991736 2734798 1620113 269242 -566167 -1322432 -2395442 -2895178
33556 -2895178 -2314549 -2066840 -3373873 -4939057 -4938020 -3982987 -3519575 -2648664 134627
33547 134627 2955872 2277497 -1405763 -3641430 -2529291 -1091697 -1652084 -1955037 433225
33538 433225 3311517 3002342 -21843 -2441182 -3429196 -4637889 -5556978 -3304572 2058624
33529 2058624 5745649 3944458 -895804 -2757243 992707 7214472 11134172 11173832
33521 11173832 9283895 7620187 6090723 3469277 83326 -1976086 -1657526 -609772
33513 -609772 -873136 -1873138 -1401212 859065 2804793 3120585 2943124 3435263 3608768
33504 3608768 2191422 295553 46756 1029794 361908 -3233978 -7250376 -8328039 -6212845
33495 -6212845 -3614658 -2786010 -3434500 -3831173 -2936020 -1206345 104807 237791 -273589
33486 -273589 -245562 538884 1025287 859398 1714021 4957942 8321872 7327363 1157651
33477 1157651 -4889583 -4918147 563676 5415865 5351044 2191437 50078 -282583 -1125573
33468 -1125573 -3313071 -4426526 -2221987 1862012 4088084 2897320 602689 154805
33460 154805 1367695 1684647 278646 -480458 1561966 4961875 6297783 4516110 1953127
33451 1953127 1058828 1694904 2161669 1621155 640138 19053 -123012 -282805 -947508
33442 -947508 -1965045 -2645976 -2749132 -2931268 -3562513 -3616992 -1895988 856749 2399139
33433 2399139 1676288 -150835 -1449907 -1484045 150434 3640929 7642939 9408518 7544793
33424 7544793 3733832 739386 -321721 134403 1595223 3248784 3405936 1093586
33416 1093586 -2022559 -2946256 -720014 2591165 4185217 2783126 -1064423 -5500829
33408 -5500829 -8042844 -7069278 -3330903 546742 2325779 1546989 -1083414 -4672622
33400 -4672622 -8158002 -10167043 -9715727 -7145928 -4084304 -2250070 -2203186 -3283448 -4663520
33391 -4663520 -5963784 -6647145 -5774497 -3407089 -1538531 -2066041 -4158710 -5431877 -5554080
33382 -5554080 -6416613 -8513806 -9903377 -9657534 -9393330 -9775395 -8595528 -4877754 -2019725
33373 -2019725 -3306780 -6419103 -6477943 -3187925 -550254 -185564 197092 1334679 426613
33364 426613 -3579651 -6872870 -5599301 -921264 3209346 4994302 5126046 4208725 2474804
33355 2474804 954855 815068 2128909 4402850 7138223 8968066 8058343 4800479
33347 4800479 2378781 2989733 4998554 5475607 4034411 2434033 1884036 2610863 4684138
33338 4684138 7305833 8564028 7839487 7132545 7981343 8596789 6622195 3466987 2794246
33329 2794246 5126725 6911372 5217960 1039865 -2500958 -3434983 -2093744 -339826
33321 -339826 205908 -57484 638371 2305561 2542888 730804 679214 5922325 13770849
33312 13770849 17851577 16147310 12741637 11453799 11626715 11106774 9671083 7758022
33304 7758022 4750791 545155 -3285543 -5580820 -7114139 -8776641 -10068754 -10582288
33296 -10582288 -11147225 -12314411 -13391040 -13891546 -14039012 -13076911 -9544263 -4419753 -1345601
33287 -1345601 -1932027 -3178474 -1562784 2416892 5819234 7254373 7003308 5107351
33279 5107351 1894406 -1171866 -3571663 -7003583 -12098808 -15752947 -14821268 -10874022
33271 -10874022 -7798936 -5980181 -2863924 1390107 3321565 1707959 -451525 -759612
33263 -759612 -638864 -1956339 -3486543 -3032823 -964282 547151 361241 -1366327 -4458957
33254 -4458957 -8446668 -11865723 -13386579 -13165200 -12074591 -10260860 -7347516 -3336871
33246 -3336871 1505686 6812912 11267343 12542412 9447774 3842437 -663646 -2001278
33238 -2001278 -1178662 -728606 -2074785 -4368927 -5693438 -5270006 -4058771 -2969276 -1426647
33229 -1426647 1251077 3890182 4574509 3344801 1804649 51768 -3640432 -9377241
33221 -9377241 -14184257 -15416216 -13912858 -12264232 -11414515 -10608049 -9384090 -7745244
33213 -7745244 -5290595 -2096183 190244 13210 -1746469 -2867448 -2840969 -2877318 -3043126
33204 -3043126 -1676464 1767034 5268922 6699500 6225839 5096540 3274755 -153063
33196 -153063 -4781038 -8593205 -9897404 -8576958 -5518653 -1934113 560860 482528 -1940193
33187 -1940193 -4335361 -4353791 -2096426 411928 1922981 3048421 4601726 6145854
33179 6145854 6750163 6104445 4163235 799803 -3143843 -5500904 -4917575 -2746474 -1473046
33170 -1473046 -1823098 -2725069 -3276329 -2998562 -1070208 2239102 3912280 1036992 -4397238
33161 -4397238 -6751610 -3873180 770 79747 -3057005 -5580873 -5963216 -5528940 -5153339
33152 -5153339 -4475679 -3632045 -3191356 -2840101 -2180809 -2050274 -2919901 -2977503 -374959
33143 -374959 3331608 4791344 3560902 2359962 2715899 3314640 3022513 2602679 2630733
$$ [...]
##END NTUPLES=NMR SPECTRUM
##END=
