##TITLE=31Pdec_DE-63_35
 D2O, 64 sc
 15.8.2024
##JCAMPDX= 6.0         $$ Bruker NMR JCAMP-DX V2.0
##DATA TYPE= NMR SPECTRUM
##DATA CLASS= NTUPLES
##ORIGIN= UXNMR, Bruker Analytische Messtechnik GmbH
##OWNER= root
$$ XWIN-NMR		Version 3.5
$$ Thu Aug 15 13:46:50 2024 Russian Standard Time (UT+4h)  she@DPX200
##.OBSERVE FREQUENCY= 81.013821
##.OBSERVE NUCLEUS= ^31P
##.ACQUISITION MODE= SIMULTANEOUS
##.ACQUISITION SCHEME= undefined
##.AVERAGES= 64
##.DIGITISER RES= 17
##SPECTROMETER/DATA SYSTEM= spect
##.PULSE SEQUENCE= zgpg30
##.SOLVENT NAME= D2O
##.SHIFT REFERENCE= (INTERNAL, D2O, 0, 198.062)
##AUDIT TRAIL= $$ (NUMBER, WHEN, WHO, WHERE, WHAT)
$$ ##TITLE= Audit trail, XWIN-NMR		Version 3.5
$$ ##JCAMPDX= 5.01
$$ ##ORIGIN= Bruker BioSpin GmbH
$$ ##OWNER= she
$$ F:/spectra/data/she/nmr/P31/2/pdata/1/auditp.txt
$$ ##AUDIT TRAIL=  $$ (NUMBER, WHEN, WHO, WHERE, WHAT)
(   1,<2024-08-15 13:44:58.56 +0400>,<she>,<DPX200>,
      <created by zg, POWCHK disabled, PULCHK disabled
       configuration hash MD5:
       00 E9 B6 7A A2 85 ED C7 34 08 36 98 17 FE 4E 26
       data hash MD5: 32K
       E3 9A FB 4A D1 55 59 D8 E4 E2 95 07 83 0F 53 F8>)
(   2,<2024-08-15 13:45:00.82 +0400>,<she>,<DPX200>,
      <Start of raw data processing
       efp BC_mod = 2 LB = 1.5 FT_mod = 6 PKNL = 1 PHC0 = 2653.51 PHC1 = 121.288 SI = 64K 
       data hash MD5: 64K
       75 38 88 1A 15 EA 14 19 98 5D F8 C2 ED 6A 53 88>)
(   3,<2024-08-15 13:45:35.51 +0400>,<she>,<DPX200>,
      <pk PHC0 = 86.50985 PHC1 = -203 
       data hash MD5: 64K
       60 06 73 79 6A C7 03 B8 D0 AB B3 5B 94 7C 61 A8>)
(   4,<2024-08-15 13:45:41.42 +0400>,<she>,<DPX200>,
      <abs ABSG = 5 
       data hash MD5: 64K
       D9 F8 42 A3 F9 71 E2 D2 99 00 AD E6 51 E6 E4 80>)
$$ ##END=
$$ 
$$ hash MD5
$$ 00 F6 5E 13 A7 06 03 D3 BD AD DF FC C7 23 5A 44
##$RELAX= 
##$RELAX= 
##$RELAX= 
##$RELAX= 
##$RELAX= 
##$RELAX= 
##$RELAX= 
##$RELAX= 
$$ Bruker specific parameters
$$ --------------------------
##$DU= <F:/spectra>
##$EXPNO= 2
##$NAME= <P31>
##$PROCNO= 1
##$TYPE= <nmr>
##$USER= <she>
##$AMP= (0..31)
100 100 100 100 100 100 100 100 100 100 100 100 100 100 100 100 100 100 
100 100 100 100 100 100 100 100 100 100 100 100 100 100 
##$AQSEQ= 0
##$AQ_mod= 1
##$AUNM= <au_zg>
##$AUTOPOS= <>
##$BF1= 81.014009
##$BF2= 200.13
##$BF3= 200.13
##$BF4= 200.13
##$BF5= 200.13
##$BF6= 200.13
##$BF7= 200.13
##$BF8= 200.13
##$BYTORDA= 1
##$CFDGTYP= 0
##$CFRGTYP= 5
##$CHEMSTR= <none>
##$CNST= (0..31)
1 1 145 1 1 1 1 1 1 1 1 1 1 1 1 1 1 1 1 1 1 1 1 1 1 1 1 1 1 1 1 1 
##$CPDPRG= <waltz16>
##$CPDPRG1= <>
##$CPDPRG2= <waltz16>
##$CPDPRG3= <>
##$CPDPRG4= <mlev>
##$CPDPRG5= <mlev>
##$CPDPRG6= <mlev>
##$CPDPRG7= <mlev>
##$CPDPRG8= <mlev>
##$CPDPRGB= <>
##$CPDPRGT= <>
##$D= (0..31)
0 1 0 0 0 0 0 0 0 0.06 0 0.03 2e-05 3e-06 0 0 0.0002 0 0 0 0 0 0 0 0 0 
0 0 0 0 0 0 
##$DATE= 1723715097
##$DBL= (0..7)
120 120 120 11 120 120 24 19 
##$DBP= (0..7)
150 150 150 150 150 150 150 150 
##$DBP07= 0
##$DBPNAM0= <>
##$DBPNAM1= <>
##$DBPNAM2= <>
$$ [...]
##$SUBNAM3= <"">
##$SUBNAM4= <"">
##$SUBNAM5= <"">
##$SUBNAM6= <"">
##$SUBNAM7= <"">
##$SUBNAM8= <"">
##$SUBNAM9= <"">
##$SW= 400.765351723535
##$SWIBOX= (0..15)
0 1 3 0 0 0 0 0 0 0 0 0 0 0 0 0 
##$SW_h= 32467.5324675325
##$TD= 32768
##$TD0= 1
##$TE= 0
##$TE2= 300
##$TE3= 300
##$TEG= 300
##$TL= (0..7)
0 120 53 12 22 120 120 120 
##$TP= (0..7)
150 150 150 150 150 150 150 150 
##$TP07= 0
##$TPNAME0= <>
##$TPNAME1= <>
##$TPNAME2= <>
##$TPNAME3= <>
##$TPNAME4= <>
##$TPNAME5= <>
##$TPNAME6= <>
##$TPNAME7= <>
##$TPOAL= (0..7)
0.5 0.5 0.5 0.5 0.5 0.5 0.5 0.5 
##$TPOFFS= (0..7)
0 0 0 0 0 0 0 0 
##$TUNHIN= 0
##$TUNHOUT= 0
##$TUNXOUT= 0
##$USERA1= <user>
##$USERA2= <user>
##$USERA3= <user>
##$USERA4= <user>
##$USERA5= <user>
##$V9= 5
##$VALIST= <valist>
##$VCLIST= <CCCCCCCCCCCCCCC>
##$VD= 0
##$VDLIST= <DDDDDDDDDDDDDDD>
##$VPLIST= <PPPPPPPPPPPPPPP>
##$VTLIST= <TTTTTTTTTTTTTTT>
##$WBST= 1024
##$WBSW= 4
##$XGAIN= (0..3)
0 0 0 0 
##$XL= 0
##$YL= 0
##$YMAX_a= 15154
##$YMIN_a= -17164
##$ZGOPTNS= <>
##$ZL1= 120
##$ZL2= 120
##$ZL3= 120
##$ZL4= 120
##$ABSF1= 198.0616
##$ABSF2= -202.7028
##$ABSG= 5
##$ABSL= 3
##$ALPHA= 0
##$AQORDER= 0
##$ASSFAC= 0
##$ASSFACI= 0
##$ASSFACX= 0
##$ASSWID= 0
##$AUNMP= <proc_1d>
##$AZFE= 0.1
##$AZFW= 0.5
##$BCFW= 0
##$BC_mod= 2
##$BYTORDP= 0
##$COROFFS= 0
##$CY= -3
##$DATMOD= 1
##$DC= 0
##$DFILT= <>
##$DTYPP= 0
##$F1P= 0
##$F2P= 0
##$FCOR= 1
##$FTSIZE= 65536
##$FT_mod= 6
##$GAMMA= 0
##$GB= 0
##$INTBC= 1
##$INTSCL= 9.790993e-09
##$ISEN= 30
##$LB= 1.5
##$LEV0= 0
##$LPBIN= 0
##$MAXI= 10000
##$MC2= 0
##$MEAN= 0
##$ME_mod= 0
##$MI= 50
##$NCOEF= 0
##$NC_proc= -9
##$NLEV= 6
##$NOISF1= 182.463
##$NOISF2= 159.3651
##$NSP= 0
##$NTH_PI= 0
##$NZP= 0
##$OFFSET= 198.0616
##$PC= 4
##$PHC0= 2740.02
##$PHC1= -81.712
##$PH_mod= 1
##$PKNL= yes
##$PPARMOD= 0
##$PSCAL= 0
##$PSIGN= 0
##$REVERSE= no
##$SF= 81.0140089999434
##$SI= 65536
##$SIGF1= 159.3651
##$SIGF2= -187.1042
##$SINO= 113.3802
##$SIOLD= 16384
##$SREGLST= <1H.CDCl3>
##$SSB= 0
##$STSI= 65536
##$STSR= 0
##$SW_p= 32467.5324675325
##$SYMM= 0
##$S_DEV= 0
##$TDeff= 32768
##$TDoff= 0
##$TI= <>
##$TILT= no
##$TM1= 0
##$TM2= 0
##$TOPLEV= 0
##$USERP1= <user>
##$USERP2= <user>
##$USERP3= <user>
##$USERP4= <user>
##$USERP5= <user>
##$WDW= 1
##$XDIM= 65536
##$YMAX_p= 350516386
##$YMIN_p= -76532823
$$ End of Bruker specific parameters
$$ ---------------------------------
##NTUPLES= NMR SPECTRUM
##VAR_NAME=  FREQUENCY,     SPECTRUM/REAL,   SPECTRUM/IMAG
##SYMBOL=    X,             R,               I
##VAR_TYPE=  INDEPENDENT,   DEPENDENT,       DEPENDENT
##VAR_FORM=  AFFN,          ASDF,            ASDF
##VAR_DIM=   65536,         65536,           65536
##UNITS=     HZ,            ARBITRARY UNITS, ARBITRARY UNITS
##FACTOR=    0.49542278885378, 1,            1
##FIRST=     16045.7642231865, 0,            0
##LAST=      -16421.768244346, 0,            0
##MIN=       -16421.768244346, -76532823,    0
##MAX=       16045.7642231865, 350516386,    0
$$ Real data points
##PAGE= N=1
##DATA TABLE= (X++(R..R)), XYDATA
$$ [...]
40391A4907424m243996n180671m326044j302471J851223K414134P96612r4522
$$ 14907424 10663428 5482757 1156713 -145758 1705465 4119599 4916211 4821689
40383D821689N62310O07618o16644k88910L119003N792906K834301m473907r322988
$$ 4821689 5383999 5991617 5374973 5086063 8205066 13997972 16832273 12358366 3035378
40374C035378p787331l535206k581587n414122o672342k215110N435935R569152
$$ 3035378 -4751953 -8287159 -10868746 -16282868 -22955210 -25170320 -19734385 -10165233
40366a0165233O621972O6190l577711j972260J268164K144884J254787J424768
$$ -10165233 -3543261 -3477071 -7054782 -9027042 -7758878 -5613994 -4359207 -2934439
40358b934439K411603J310504k243387m825787l954683j177817O84840Q78748
$$ -2934439 -522836 787668 -1455719 -6281506 -10236189 -11414006 -10729166 -9850418
40350i850418J95253l77433O05129L835068O547651M507766j280536l792795P59072
$$ -9850418 -9655165 -10032598 -9427469 -5592401 955250 5463016 4182480 389685 1148757
40341A148757O627921O101389K98290l366610k484913j580674l003754l163301
$$ 1148757 7776678 13878067 14176357 10809747 8324834 6744160 3740406 577105
40333E77105J21612K847261J061421k724214l416365m52931K793692M348394M677832
$$ 577105 698717 3545978 4607399 1883185 -1533180 -1986111 807581 5155975 9833807
40324I833807M029220K185452Q9058r78159j273427j685995j847456j015573J00679
$$ 9833807 13863027 16048479 16137537 15159378 13885951 12199956 10352500 9336927 9437606
40315I437606K10637o76060j709463k549078k954438k273458o36264P03961J275375
$$ 9437606 9648243 8972183 7262720 4713642 1759204 -514254 -1150518 -446557 828818
40306H28818J719820J197580k486925p926468q716405j170235Q720188J1002713
$$ 828818 2548638 3746218 1259293 -6667175 -15383580 -16553815 -7833627 3169086
40298C169086L925053m280852o136422k864638j07325O4290k99763J5899l62337
$$ 3169086 7094139 2813287 -3323135 -6187773 -6295098 -6230808 -6530571 -6514672 -6877009
40289f877009k382727m460853m354963j897267J207059L738112N742724O756526
$$ -6877009 -9259736 -13720589 -18075552 -19972819 -18765760 -15027648 -9284924 -2528398
40281b528398N047619K93262m201677m523372j082372K132054L062308K985593
$$ -2528398 2519221 2812483 -1389194 -5912566 -6994938 -4862884 -1800576 1185017
40273A185017K167520j354024o742532q666079m147832K345883M605031K616424
$$ 1185017 3352537 1998513 -4744019 -13410098 -17557930 -15212047 -10607016 -7990592
40265g990592O51747P9893j000857k737631l256810k615036k473732k503548j287779
$$ -7990592 -7338845 -7258952 -8259809 -10997440 -14254250 -16869286 -19343018 -21846566 -23134345
40256b3134345K28326N86264J722852N871035R805881Q263005K593932n69148
$$ -23134345 -22906019 -22319755 -20596903 -14725868 -4919987 3343018 5936950 5367802
40248E367802M64524N83519k560349m476696j978920J408479J841646J064808
$$ 5367802 5832326 6415845 3855496 -621200 -2600120 -1191641 650005 1714813
40240A714813J960667L408809L488024K824764J051488m437429j1723197j2508355
$$ 1714813 3675480 7084289 10572313 13397077 14448565 10011136 -1712061 -14220416
40232a4220416l300852O795765O967163n02150m292732j75363N500379P162147
$$ -14220416 -17521268 -10725503 -3758340 -4260490 -8553222 -8728585 -3228206 3933941
40224C933941N959996L731500n07870n512673o315891j377422M123411N550158
$$ 3933941 9893937 13625437 13117567 7604894 1289003 -88419 4034992 9585150
40216I585150M588780M164276K350813l423463r259491q199849m34350N397555
$$ 9585150 14173930 18338206 20689019 17265556 8006065 -193784 -628134 4769421
40208D769421K811498m547098q213048n432791o55101K205530M110581O256133
$$ 4769421 7580919 3033821 -5179227 -10612018 -11267119 -9061589 -4951008 1305125
40200A305125N904926Q98560m645901m487816Q61682M749297L911092J890529
$$ 1305125 7210051 8108611 3462710 -1025106 -163424 4585873 8496965 10387494
40192A0387494K027101K885739K769052K991550L534850R98906n095231r117193
$$ 10387494 12414595 15300334 18069386 21060936 24595786 25594692 20499461 11382268
40184A1382268p074986k739103j061392n73071J614521K359600k135400p385480
$$ 11382268 4307282 1568179 506787 -66284 1548237 3907837 1772437 -5613043
40176e613043n932873N94652L662144J020852j184728N25419K614848K295618
$$ -5613043 -11545916 -10951264 -7289120 -6268268 -7452996 -6927577 -4312729 -2017111
40168b017111J408274R15787p99322k483464n74946L009456J864839l721563n345950
$$ -2017111 -608837 306950 -492372 -2975836 -3550782 -541326 1323513 -2398050 -7744000
40159g744000J31450M719067K007205k787753k377433M41733j400740o734888
$$ -7744000 -7612550 -2893483 -886278 -3674031 -6051464 -5609731 -7010471 -13745359
40151a3745359q451579n095368j712494q21595j55481J262536J599178J005961
$$ -13745359 -22196938 -27292306 -29004800 -29826395 -29981876 -28719340 -27120162 -26114201
40143b6114201K261732N845868Q622253Q002190M338630m90306m086403m149290
$$ -26114201 -23852469 -18006601 -9384348 -1382158 2956472 2466166 -1620237 -5769527
40135e769527j046672J421859N90075j402979j272875M06882J197289J156842
$$ -5769527 -6816199 -5394340 -4804265 -6207244 -7480119 -7073237 -5875948 -4719106
40127d719106J144711n66278m921707p398835k566167P330854J3810054J2263969
$$ -4719106 -3574395 -4140673 -9062380 -16461215 -19027382 -11696528 2113526 14377495
40119A4377495N918086j44052l817213m424369j646134K183220K787471r04981
$$ 14377495 20295581 20151529 16334316 11909947 10263813 12447033 15234504 14329523
40111A4329523n067540n861779l648541j326385p36334j662009k603711j978167
$$ 14329523 9261983 3400204 -248337 -1574722 -2311056 -3973065 -6576776 -8554943
40103h554943N5126J161076j91851j972813q01635L605944P979684Q763772M610634
$$ -8554943 -8499817 -7338741 -7530592 -9503405 -10305040 -6699096 1280588 10044360 14654994
40094A4654994k546769p330564m761580K995432O982761K290195m914464o091250
$$ 14654994 12108225 4777661 16081 3011513 9994274 12284469 7370005 1278755
40086A278755k421593j368145l840916l513452J304299M164003J092541l196515
$$ 1278755 -1142838 -2510983 -6351899 -9865351 -8561052 -4397049 -3304508 -6501023
40078f501023l343213j057027n07379j342059r87718R8171N719o62364k51910
$$ -6501023 -9844236 -10901263 -11408642 -12750701 -13738419 -13640248 -13634529 -14296893 -14548803
40069a4548803P58659J078682R97115J100758R65127J050729L002746O055733
$$ -14548803 -13790144 -12711462 -11714347 -10613589 -9648462 -8597733 -5594987 460746
40061D60746O474859L050359k02988K74477K337691J767930j562317m454081n114208
$$ 460746 6935605 9985964 9782976 10057453 12395144 14163074 12600757 8146676 3032468
40052C032468m112630k500506j416849j529209j042508K729652P757178P321208
$$ 3032468 -1080162 -3580668 -4997517 -6526726 -7569234 -4839582 2917596 10238804
40044A0238804r24483r819811j1120451n811179r17184J187015M021740Q679141
$$ 10238804 9314321 -505490 -11625941 -17437120 -18354304 -17167289 -13145549 -4466408
40036d466408J0737555O718034r14397o810413p965675n138458j418254K63515
$$ -4466408 6271147 12989181 12074784 5264371 -2701304 -7839762 -9258016 -8994501
40028h994501k2455O52191L433555M949289K039901k626670l648487n80658J755238
$$ -8994501 -9016956 -8364765 -4931210 18079 2057980 -568690 -4217177 -4797835 -3042597
40019c042597L97978k523406l985312l511487j717486R14712K881141K626439
$$ -3042597 -2644619 -5168025 -9153337 -12664824 -14382310 -13467598 -10586457 -7960018
40011g960018J553768K687894N341556M814550p73882o689175p178387k562693
$$ -7960018 -6406250 -3718356 1623200 6437750 5663868 -1025307 -8203694 -10766387
40003a0766387J778442J980423r64436l461605l065938l41578K080161K598444
$$ -10766387 -8987945 -7007522 -7971958 -11433563 -14499501 -14841079 -12760918 -10162474
39995a0162474K597225L971884N163940K421391m236279r283013p925899j917886
$$ -10162474 -7565249 -3593365 1570575 3991966 -244313 -9527326 -17453225 -19371111
39987a9371111L224545N113532N744484O848841P397071O219150M149021J993679
$$ -19371111 -16146566 -11033034 -5288550 1560291 8957362 15176512 19325533 21319212
39979B1319212j374568o443769r985008q058466k418895j06050m299176q816453
$$ 21319212 19944644 13500875 3515867 -4542599 -6961494 -7067544 -11366720 -20183173
39971b0183173n888409K646675P647083N908196M133075P226884R834114N337923
$$ -20183173 -26071582 -23424907 -15777824 -9869628 -5736553 1490331 11324445 16662368
39963A6662368k298784l973400J38458J033769m166127p313607k494619M249121
$$ 16662368 14363584 10390184 10528642 11562411 7396284 82677 -2411942 1837179
39955A837179M253584r06664l068130k06159K186114J059695l11476P22043J739403
$$ 1837179 6090763 5184099 2115969 1909810 4095924 5155619 4844143 5566186 7305589
39946G305589K36152j814953j735385j020507k605254n289249m930662p13999
$$ 7305589 7541741 5726788 3991403 2970896 365642 -4923607 -9854269 -10568268
39938a0568268L363017L927490K304976J746483K648454K503836l39715m583298
$$ -10568268 -7205251 -3277761 -972785 773698 3422152 5925988 5586273 1002975
39930A002975p227109n787765j62319O115640P491766J891892n490572o837441
$$ 1002975 -6224134 -12011899 -12174218 -6058578 1433188 3325080 -2165492 -9002933
39922i002933r25363N190943N188457J156934l82231K363991N172246M690634
$$ -9002933 -9928296 -4737353 451104 1608038 1225807 3589798 8762044 13452678
39914A3452678K471016J395851J324878N7443l040855n889588n664701j523808
$$ 13452678 15923694 17319545 18644423 18701866 15661011 9771423 4106722 2582914
39906B582914M100188P163604N811615K074596j071690l209945n413760o909303
$$ 2582914 6683102 13846706 19658321 21732917 20661227 17451282 12037522 5128219
39898E128219n529209j355379K630150L929032K580282k35880l359096n107388
$$ 5128219 -400990 -1756369 873781 4802813 7383095 7147215 3788119 -1319269
39890a319269m062497j329885J1138j238958k772233k011204M78424J898375N88115
$$ -1319269 -5381766 -6711651 -6700513 -7939471 -10711704 -12722908 -12244484 -10346109 -9757994
39881i757994k279456l780450j890704K266945N207216N041401L765720M082773
$$ -9757994 -12037450 -15817900 -17708604 -15441659 -10234443 -5193042 -1427322 2655451
39873B655451N073132L462731j332079o013203p193686m205983J440693O931045
$$ 2655451 7728583 11191314 9859235 3846032 -3347654 -7553637 -6112944 818101
39865H18101Q969102O560356K727009Q53273J62092k006055m731109m868509l186926
$$ 818101 9787203 16347559 19074568 19927841 20089933 18083878 13352769 8484260 5297334
39856E297334l705993o445815o486032j741968L675918N902185O059957O305041
$$ 5297334 1591341 -4854474 -11340506 -13082474 -9406556 -3504371 2555586 8860627
39848H860627O114059N050281M372450L401450n34454n972327p077517k756203
$$ 8860627 14974686 20024967 24397417 27798867 27264413 21292086 14214569 11458366
39840A1458366N55405o04759o38159M838044R806852O827590p03596m143198k738621
$$ 11458366 12013771 11409012 10770853 15608897 25415749 32243339 31539743 27396545 24657924
39831B4657924j840694k024055j67380J635331r56272m677131l011611R78760
$$ 24657924 22817230 20793175 20625795 22261126 21304854 16627723 13616112 14594872
39823A4594872j504880q530626q504312K22700N241850N15014l406019K244626
$$ 14594872 13089992 4559366 -3944946 -3722246 1519604 2034618 -1371401 873225
39815H73225Q914878M989675m613086o529889j11961L311913p24642m670740k515933
$$ 873225 9788103 14777778 10164692 3634803 3522842 6834755 6110113 1439373 -1076560
39806a076560K394094M617759L321791K37633k457114j643437L276294O776625
$$ -1076560 1317534 5935293 9257084 9494717 7037603 5394166 8670460 15447085
39798A5447085L561243k281163k068306L787239N601884o74687p252954o442812
$$ 15447085 19008328 16727165 14658859 18446098 24047982 23373295 16120341 9677529
39790I677529p79091L211514M275104M075449J646068l422609o689993m389344
$$ 9677529 8898438 12109952 16385056 20460505 22106573 18683964 11993971 7604627
39782G604627l66310j229366o411231r001582n547308M97541M848213O689457
$$ 7604627 7238317 6008951 -402280 -9403862 -14951170 -14453629 -9605416 -2915959
39774b915959O360948L581126l68245k289262q63031J499196J922069K34017k009749
$$ -2915959 3444989 7026115 6657870 4368608 3505577 5004773 6926842 7160859 5151110
39765E151110l561894l477874j056846K795239N439073M865698J404849l047879
$$ 5151110 1589216 -1888658 -2945504 -150265 5288808 10154506 11559355 8511476
39757H511476o002422m810660R29565O541555N470840k090394p121829k577730
$$ 8511476 2509054 -2301606 -1372041 5169514 10640354 8549960 1428131 -1149599
39749a149599O154950P545251L6634n464619j592003M480230K092997o446198
$$ -1149599 5005351 12550602 12587236 7122617 5530614 10010844 12103841 5657643
39741E657643r499753m094792M4985l521448p709045l512256N546836Q936315
$$ 5657643 -3842110 -7936902 -7891917 -11413365 -19122410 -22634666 -17087830 -8151515
39733h151515M823113R08027Q51982m29663n888567r551456n785799Q84520K062887
$$ -8151515 -3328402 -2420375 -1568393 -1998056 -7886623 -17438079 -23223878 -22339358 -20276471
39724b0276471j855606k749675K156375N718607J986660l926741k476583O376943
$$ -20276471 -22132077 -24881752 -22725377 -17006770 -15020110 -18946851 -21423434 -15046491
39716a5046491J2220802Q195294L27925j224229L412591M674415j580481p404725
$$ -15046491 -2825689 5369605 5697530 4473301 7885892 12560307 10979826 3575101
39708C575101m484396L353883N725517O70456l495221j197916K817364J493575
$$ 3575101 -909295 2444588 8170105 8840561 5345340 4147424 6964788 8458363
39700H458363m582576r111111q269909l126986L448541Q406573Q882838M884878
$$ 8458363 3875787 -5235324 -13505233 -16632219 -13183678 -4777105 4105733 8990611
39692H990611R04958J538560N633514P446394L637072l087589p393218o555278
$$ 8990611 9895569 11434129 17067643 24514037 28151109 25063520 17670302 11115024
39684A1115024k173730J854283K834795J472389L16623L7400r10972k200644l28253
$$ 11115024 8941294 10795577 13630372 15102761 15419384 15456784 14545812 12345168 12016915
39675A2016915N717648J0013438N580831n801675j4384198j3971123q261611l676355
$$ 12016915 17734563 27748001 33328832 27527157 13142959 -828164 -9089775 -12766130
39667a2766130l81637N089240J0960775J0277928J050504q650149r414029j844056
$$ -12766130 -13147767 -8058527 2902248 13180176 14230680 5580531 -3833498 -5677554
39659e677554M950171N281093K542809J922908K502887N37712k729712k243317
$$ -5677554 -727383 4553710 7096519 9019427 11522314 12060026 9330314 7086997
39651G086997K471706N622529L261671j405192l181249j798573p42388j658475
$$ 7086997 9558703 15181232 18442903 17037711 13856462 12057889 11315501 9657026
39643I657026k960505k616825q2837L357730M754034J854139l231960n130251
$$ 9657026 6696521 4079696 3996859 7354589 12108623 13962762 10730802 5600551
39635E600551j876179K040938J639390k055229m209912k658882O48094K724542
$$ 5600551 3724372 5765310 7404700 5349471 1139559 -1519323 -871229 1853313
39627A853313J637743k207157m783560j754909M502191N843781J49564l455917
$$ 1853313 3491056 1283899 -3499661 -5254570 -752379 5091402 5240966 1785049
39619A785049K553183J1288296J0297182j41828p834373o679692l122971l458535
$$ 1785049 4338232 15626528 25923710 25781882 17947509 11267817 8144846 4686311
39611D686311n180598m320228k238682p57588J669440M636414M105258L59282
$$ 4686311 -494287 -4814515 -7053197 -7810785 -6141345 -1504931 2600327 2959609
39603B959609j62240M003166M639043l036389j0417776p299074K528686O938683
$$ 2959609 2797369 6800535 11439578 8403189 -2014587 -9313661 -6784975 153708
39595A53708K436680l897397o318424n008537q94317M975578P934694M145633
$$ 153708 2590388 -1307009 -7625433 -12633970 -13528287 -8552709 -618015 3527618
39587C527618k053448l280665o39817j347154n393076m673639L075735R503737
$$ 3527618 1474170 -1806495 -2446312 -3793466 -9186542 -13860181 -10784446 -1280709
39579a280709Q249547L421494J016827o81k417410l638721p33859K536599R40099
$$ -1280709 6968838 10390332 11407159 11406478 8989068 5350347 4616488 7153087 8093186
39570H093186l320607l840554k10933J662434r27091l586809j714593L048406
$$ 8093186 4772579 932025 721092 2383526 1456435 -2130374 -3844967 -796561
39562g96561N431988L213727q24051k800896k011880q54361j229955k350654k514294
$$ -796561 4635427 7849154 7025103 4224207 2212327 1357966 128011 -2222643 -4736937
39553d736937j497144J1706J711304K721455J311560j914102k805824P86953M373587
$$ -4736937 -6234081 -6222375 -4511071 -1789616 -478056 -2392158 -5197982 -4411029 -37442
39544c7442K448259k760881l895917O31765M588217L535481L32798p63983J74672
$$ -37442 2410817 -350064 -4245981 -3614216 974001 4509482 4842280 4078297 4252969
39535D252969J218391J602390N0541m664901r108190o876629J812869P870544
$$ 4252969 5471360 7073750 7124291 2459390 -6648800 -13525429 -11712560 -3842016
39527c842016M803437k618577n648686k772619J293439L435279L476015J281222
$$ -3842016 961421 -1657156 -7305842 -10078461 -8785022 -5349743 -1873728 -592506
39519e92506j864587j909984K547888O164239L492436k802045n829853m169722
$$ -592506 -2457093 -4367077 -1819189 4345050 7837486 5035441 -794412 -4964134
39511d964134j803583l55166K136562N416336O159557L464045M34752l37331N99408
$$ -4964134 -6767717 -7122883 -4986321 430015 6589572 10053617 10488369 10151038 10750446
39502A0750446J284777j23903m232496p986114o024670J663089O806538K989818
$$ 10750446 12035223 11911320 7678824 -307290 -6331960 -4668871 2137667 5127485
39494E127485m489756n801337j143494L06774m637986q358381m461141L351580
$$ 5127485 637729 -5163608 -6307102 -6000328 -10638314 -18996695 -23457836 -20106256
39486b0106256P783770O987394L527193m18310l128199k900355j023158j624979
$$ -20106256 -12322486 -5335092 -1807899 -2226209 -5354408 -8254763 -9277921 -10902900
39478a0902900n508521p565471l588535L207273N902604K355261k891043m246672
$$ -10902900 -16411421 -23976892 -27565427 -24358154 -18455550 -16100289 -18991332 -23238004
39470b3238004o73927L947242N233441L199935J888916L257035L810439J05899
$$ -23238004 -23911931 -19964689 -14731248 -11531313 -9642397 -6385362 -2574923 -2469024
39462b469024m872484n377423j453607J501571J262816J193736L490707N406138
$$ -2469024 -7341508 -12718931 -14172538 -12670967 -11408151 -10214415 -6723708 -1317570
39454a317570L883774j88526l738378m293577r24257M039586N175080M26756m096671
$$ -1317570 2566204 2377678 -1360700 -5654277 -6578534 -2538948 2636132 3062888 -1033783
39445a033783j754654L810939L395860k848824m858459J341562P070232M429845
$$ -1033783 -2788437 1022502 4418362 1569538 -3288921 -1947359 5122873 9552718
39437I552718k619532n836501l670144P72376N593822Q251525M665293l665406
$$ 9552718 6933186 1096685 -2573459 -1801083 3792739 12044264 16709557 13044151
39429A3044151p952739l766391J781832R10055l270660l490419m41409M15797
$$ 13044151 5091412 1325021 3106853 4016908 746248 -2744171 -3185580 -2769783
39421b769783q11996j82721J862982K422820K660772M216886L040550m229305
$$ -2769783 -3581779 -3764500 -1901518 521302 3182074 7398960 10439510 6210205
39413F210205j1362263r824076k258525J369327r50715k286228K10563K154793
$$ 6210205 -5152058 -14976134 -17234659 -15865332 -16816047 -19102275 -18891712 -16736919
39405a6736919J893256L072179O073352O559321M013950K694142K970665J016269
$$ -16736919 -14843663 -11771484 -5698132 861189 4875139 7569281 10539946 11556215
39397A1556215j872973J44125N718618N942271j070533n918897k727856J999175
$$ 11556215 9683242 9827367 15545985 21488256 20417723 14498826 11770970 13770145
39389A3770145R47371l130674m692952m945268o693893p000081k690812K691633
$$ 13770145 14717516 11586842 6893890 1948622 -4745271 -11745352 -14436164 -11744531
39381a1744531M491646M074033M013102K148210k624955m657926L57556O649391
$$ -11744531 -7252885 -3178852 834250 2982460 357505 -4300421 -3942865 2706526
39373B706526O012723L0679l555538k903898j945885j341343J426008M737634
$$ 2706526 8719249 8749928 5194390 2290492 344607 -996736 429272 5166906
39365E166906M289871J088407K67584K463755L480025J958532N51659R3284q05435
$$ 5166906 9456777 10545184 10812768 13276523 16756548 18715080 19266739 19360023 18554588
39356A8554588j341850l99068j228777o568488j0693477n588094N291951R513096
$$ 18554588 17212738 16813670 15584893 9016405 -1677072 -7265166 -1973215 7539881
39348G539881L225166l961866m320862j735521j451949m52429M467051P427770
$$ 7539881 10765047 6803181 2482319 746798 -705151 -1157580 3309471 10737241
39340A0737241J783301p533535r590001k818396L847716M220940J325726L8584
$$ 10737241 12520542 4987007 -4602994 -7421390 -3573674 647266 1972992 2011576
39332B011576K38241l02568j029957K08286L210973M831711K056908m410916r403168
$$ 2011576 2249817 1947249 917292 1125578 4336551 9168262 11225170 6814254 -2588914
39323b588914p561934M28404P542320P861897K414927l919759q242144r491224
$$ -2588914 -10150848 -9722444 -2180124 5681773 8096700 4176941 -4065203 -13556427
39315a3556427n951887J991405Q429921P129292J73555l988252j953050O33527
$$ -13556427 -19508314 -17516909 -9086988 -1957696 -1784141 -5772393 -7725443 -7091916
39307g091916j532658n400516m789565K82835M324137M428784K963102K750353
$$ -7091916 -8624574 -14025090 -18814655 -18531820 -14207683 -9778899 -6815797 -4065444
39299d065444L620437M207264M051641L086120J349582p6723J76659J518023J809785
$$ -4065444 -445007 3762257 7813898 10900018 12249600 12172877 12349536 13867559 15677344
39290A5677344N24400o01116p18812j279079l015693l898982k163252M32485Q37151
$$ 15677344 16201744 15600628 14881816 13602737 10587044 6688062 4524810 4957295 5794446
39281E794446r32849k132156j270437O52621K391751L409447K834607K31805k329749
$$ 5794446 4861597 2729441 1459004 2111625 4503376 7912823 10747430 10979235 8649486
39272H649486j789674J485594L414221J576931j556264k489752j604771j812657
$$ 8649486 6859812 8345406 11759627 13336558 11780294 9290542 7685771 5873114
39264E873114l658356m404049j855222K765792O030475N349187Q29024m947792
$$ 5873114 2214758 -2189291 -4044513 -1278721 4751754 10100941 10929965 5982173
39256E982173q690236q352061l965352K411693P045616O426509R74447l930772
$$ 5982173 -2708063 -11060124 -15025476 -12613783 -5568167 858342 1832789 -2097983
39248b097983l313606J229667L713293K073682M50049K250758N208205N516261
$$ -2097983 -5411589 -4181922 -468629 1605053 2055102 4305860 9514065 15030326
39240A5030326L000414o43330m996510q747230p980032j352423N542602O033504
$$ 15030326 18030740 17387410 12390900 3643670 -4336362 -5688785 -146183 5887321
39232E887321J069876k644359j878592O48614J973063J799706M6616l331631n861611
$$ 5887321 6957197 4312838 2434246 3082860 5055923 6855629 6902245 3570614 -2290997
39223b290997m762682j859088j361347k654553r42385M260614P516099O051744
$$ -2290997 -7053679 -8912767 -10274114 -12928667 -13871052 -9610438 -2094339 3957405
39215C957405L724580L772817L735365J242371q28799M11853K251137Q98036k412128
$$ 3957405 7681985 11454802 15190167 16432538 15603739 16015592 18266729 19164765 16752637
39206A6752637m609473o042012p397517n552019J267352P682100P538527L374175
$$ 16752637 12143164 6101152 -1296365 -6848384 -5581032 2101068 9639595 13013770
39198A3013770J917039K335317j900153r711364j1046758j765834Q779325R909732
$$ 13013770 14930809 17266126 15365973 5654609 -5392149 -7157983 1621342 11531074
39190A1531074K675341m593797q007190q897869p161880j465961N285064P447711
$$ 11531074 14206415 9612618 1605428 -7292441 -14454321 -15920282 -10635218 -3187507
39182c187507M070888j44458j781226k065539k582664k305976p63364j33318j391952
$$ -3187507 883381 738923 -1042303 -3107842 -5690506 -7996482 -8759846 -8893164 -10285116
39173a0285116j467460K308555O928190O807646J486407l650521m782222l938234
$$ -10285116 -11752576 -9444021 -2515831 4291815 5778222 2127701 -2654521 -6592755
39165f592755m121305l777040J31847N515995O488300J733247k837890j886756
$$ -6592755 -10714060 -14491100 -14359253 -8843258 -2354958 -621711 -3459601 -5346357
39157e346357K318660L790815J368091n46792J096138M249643N351163L410985
$$ -5346357 -3027697 763118 2131209 1584417 2680555 6930198 12281361 15692346
39149A5692346m47202m754694p559311o776017k561609J982038L973745L578092
$$ 15692346 15245144 10490450 2931139 -3844878 -6406487 -4424449 -450704 3127388
39141C127388K574831J569391L24224k56025J221150L949853M801104J836181
$$ 3127388 5702219 7271610 7595834 7339809 8560959 12510812 17311916 19148097
39133A9148097k923831n326692l722187q99862o27543k777007l516473p29280
$$ 19148097 16224266 10897574 7175387 6275525 5647982 2870975 -645498 -1374778
39125a374778K833717L376989J172848o18637q06349p02239q33501r32239k531444
$$ -1374778 1458939 4835928 6008776 5390139 4583790 3881551 3048050 2115811 -415633
39116d15633o723537r207233l764438P168008J1926222M160966p556464j0667586
$$ -415633 -7139170 -16346403 -20110841 -12942833 -1016611 3144355 -4412109 -15079695
39108a5079695m582714J703845M334281P349334J1575628J1180362M146142k596302
$$ -15079695 -19662409 -17958564 -13624283 -6274949 5300679 16481041 20627183 18030881
39100A8030881l175291r66327j523498l397243k303012L50857K74028j439847
$$ 18030881 14855590 13889263 12365765 8968522 6665510 7016367 7290395 5850548
39092E850548j44164L778479N104741K282823n08881l65530Q27911Q70932K68401
$$ 5850548 5706384 9484863 14589604 16872427 16363546 15998016 16825927 17696859 17965260
39083A7965260m83611k157624l966096l593423j448018r38705l085436m774599
$$ 17965260 17481649 15324025 11357929 7764506 6316488 5377783 2292347 -2482252
39075b482252l905846k213397j101364J086899M961082P060905M374525o97101
$$ -2482252 -6388098 -8601495 -9702859 -8615960 -3654878 3406027 7780552 7083451
39067G083451k992026n16843M254394P104304M912340j519658o512697m930266
$$ 7083451 4091425 3574582 7828976 14933280 19845620 18325962 11813265 6882999
39059F882999N24473K173866j197543k345415J892391L920883k317258r423946
$$ 6882999 7407472 9581338 8383795 6038380 7930771 11851654 9534396 110450
39051A10450o422732L773121P581235K00280q576886r014744k634953L478333
$$ 110450 -6312282 -2539161 5042074 5242354 -3334532 -12349276 -14984229 -11505896
39043a1505896N433455K776119k734038n610957p83113P737246R383501J679843
$$ -11505896 -6072441 -3296322 -6030360 -11641317 -12424430 -4687184 4696317 6376160
39035F376160n191301l118194K338408J577653m607211q319896p118758m354602
$$ 6376160 1184859 -1933335 405073 1982726 -2624485 -10944381 -18063139 -22417741
39027b2417741n01361O277222J2418967J1389524M427432K25595J877908K033762
$$ -22417741 -22919102 -16641880 -4222913 7166611 11594043 11819638 13697546 15731308
39019A5731308n236165j4195949j4366881m146168P388879J0921024N594573k257828
$$ 15731308 10495143 -3700806 -18067687 -22213855 -14824976 -3903952 1690621 -567207
39011e67207o289506n116896j286678K811838O261500P553460M847727p8584j859517
$$ -567207 -6856713 -11973609 -13260287 -10448449 -4186949 3366511 8214238 8135654 6276137
39002F276137J258916L642097J19412n492495n636328o34450K107461q7741j997068
$$ 6276137 7535053 11177150 11296562 5804067 167739 -466711 1640750 1553009 -444059
38993d44059l39233J137160m43523j322609J905531N391482M034264K28981K66020
$$ -444059 -783292 353868 -89655 -1412264 493267 5884749 9919013 10147994 10414014
38984A0414014M357473O357420K752532l118383o157172n162515k773892j986360
$$ 10414014 14771487 21128907 23881439 20763056 14605884 9443369 6669477 4683117
38976D683117k965517k514779K007069P655942P842300J139022n500348n511737
$$ 4683117 1717600 -797179 1209890 8865832 16708132 17847154 12346806 6835069
38968F835069j161328J066268K47443N04171K744721L323685O18307k922477n609816
$$ 6835069 5673741 6740009 6987452 7491623 10236344 13560029 14178336 11255859 5646043
38959E646043p789474p719667k354896N860488Q996476L815203k976452l690009
$$ 5646043 -2143431 -9863098 -12217994 -6357506 2638970 6454173 3477721 -212288
38951b12288K28609J838007n73165k058126O27466M483293N039993J965929j781694
$$ -212288 16321 1854328 1281163 -776963 -149497 4333796 9373789 11339718 9558024
38942I558024m102653n103862n231815l921791q03795K554064L731666K824335
$$ 9558024 5455371 351509 -4880306 -8802097 -9605892 -7051828 -3320162 -495827
38934d95827K807389M781960N012619K49525n491041m778728K276616O918966
$$ -495827 2311562 7093522 12106141 12355666 6864625 2085897 4362513 11281479
38926A1281479L768212k148470m287573m362446o841320q687528l540018N895000
$$ 11281479 15049691 12901221 8613648 4251202 -2590118 -11277646 -14817664 -8922664
38918h922664R337651L881631j461324O42425N563077N056450m08437m151738
$$ -8922664 414987 4296618 2835294 3477719 9040796 14097246 13688809 9537071
38910I537071l990886l497462m435526m373823j730470J916580N035503P490105
$$ 9537071 5546185 2048723 -2386803 -6760626 -8491096 -6574516 -1539013 5951092
38902E951092Q105626M769868j744365o957646p101861k626521L148478O955818
$$ 5951092 14056718 18826586 17082221 10124575 3022714 396193 3544671 10500489
38894A0500489O931189L276920j602423m922565n622826l759883Q13981O770640
$$ 10500489 17431678 20708598 19106175 14183610 8560784 4800901 5614882 12385522
38886A2385522R611693N492890l052455q774631p945241l856689j364315j380706
$$ 12385522 21997215 27490105 24437650 15663019 7717778 3861089 2496774 1116068
38878A116068k068018j964737N1584M658544R478514R530170L331433l711832
$$ 1116068 -951950 -2916687 -2865103 1793441 11271955 20802125 24133558 20421726
38870B0421726n228230j595154J317379j09672l728147n101108j959549M142566
$$ 20421726 15193496 13598342 14915721 14806049 11077902 5976794 4017245 8159811
38862H159811Q483800O504496j245786q570158j0308776q117644o818599o707305
$$ 8159811 16643611 23148107 21902321 13332163 3023387 -5094257 -11912856 -18620161
38854a8620161l600259L879448J1265335J3379787R485417K703035k891655m193383
$$ -18620161 -22220420 -18340972 -7075637 6304150 15789567 18492602 15600947 11407564
38846A1407564j264411J550916k24915m905009n704002L51009P824680R605383
$$ 11407564 10143153 11694069 11469154 6564145 860143 1211152 9035832 18641215
38838A8641215N512505J056448n08127j105079l150636n549974n820596m094414
$$ 18641215 24153720 25210168 24702041 23596962 20446326 14896352 9075756 4981342
38830D981342k807359k779770j702013K174485O015523M681437k316281q708767
$$ 4981342 2173983 -605787 -2307800 -133315 5882208 10563645 8247364 -461403
38822d61403q402485k639346K501550M187745M622321N330619M329377M64799
$$ -461403 -8863888 -11503234 -9001684 -4813939 -191618 5139001 9468378 9933177
38814I933177l271789l431893p89197J206353J154743N61809P86492J158356K35994
$$ 9933177 6661388 3229495 2440298 3646651 4801394 5363203 6149695 7308051 7544045
38805G544045j943731l136917r54186L661657O254571M118188N21965N05851L172066
$$ 7544045 5600314 2463397 1509211 5170868 11425439 15543627 16065592 16571443 19743509
38796A9743509K495802l638794r910261j0890500p509140l572848p5880L294309
$$ 19743509 22239311 18600517 8690256 -2200244 -9709384 -13282232 -13358112 -10063803
38788a0063803M511687J776918k187621k695327R53033N194470O638349M167371
$$ -10063803 -5552116 -3775198 -5962819 -8658146 -7705113 -2510643 4127706 8295077
38780H295077j242165n606747l437034N467251J2729787R968616m49748q312021
$$ 8295077 7052912 1446165 -1990869 3476382 16206169 26174785 25725037 17413016
38772A7413016q429532m975005k960916j724642J068577M230326N050349L117452
$$ 17413016 8983484 4008479 1047563 -677079 391498 4621824 9672173 12789625
38764A2789625l06427l880144n448173l081249J132992J876817k208943n511320
$$ 12789625 12483198 8603054 3154881 73632 1206624 3083441 874498 -4636822
38756d636822k909083K743918M693300J732775j148995q56047p3326j995655n075395
$$ -4636822 -7545905 -4801987 -108687 1624088 475093 -380954 -454280 -2449935 -7525330
38747g525330n417006k190725J872211M375945N300497N385259M863883M532075
$$ -7525330 -12942336 -15133061 -13260850 -8884905 -3584408 1800851 6664734 11196809
38739A1196809N758047P571599N776447j694541r494095r481651j500898N279764
$$ 11196809 16954856 24526455 30302902 28608361 19114266 9632615 8131717 13411481
38731A3411481M273078j88058p36374J461081n5700m858300n280039J157788P102611
$$ 13411481 17684559 17496501 16760127 18221208 18165508 13307208 8027169 9184957 16287568
38722A6287568O186746J771515M07554J709806K92125n074150r511450q462361
$$ 16287568 22474314 24245829 24653383 26363189 26655314 21581164 12069714 3607353
38714C607353k567527L541536N372003K290130j866056l204641k581292k974430
$$ 3607353 1039826 4581362 9953365 12243495 10377439 7172798 4591506 1617076
38706A617076k781451K383515R992844J0288872J27962r875948q957252j304653
$$ 1617076 -1164375 1219140 11211984 21500856 21628818 11752870 2795618 1490965
38698A490965J064388l525904n666794q72232M469579M599848J972360L5926k679637
$$ 1490965 2555353 -970551 -6637345 -7509577 -3039998 1559850 3532210 3568136 888499
38689H88499o391372n742875J809992R017231P443695n31512n150443k420679
$$ 888499 -5502873 -11245748 -9435756 -418525 7025170 6493658 1343215 -1077464
38681a077464K639052M591352L139382J93290k953178m599994l398706j290975
$$ -1077464 1561588 6152940 9292322 9485612 6532434 1932440 -1466266 -2757241
38673b757241j833433m612267n210593k002499J155526J263758J259628M991602
$$ -2757241 -4590674 -9202941 -14413534 -16416033 -15260507 -13996749 -12737121 -7745519
38665g745519R719634Q521758Q4131q171421q603598k471850K006027j64162n098043
$$ -7745519 1974115 10495873 10580004 2408583 -6195015 -8666865 -6660838 -6825000 -11923043
38656a1923043n268295J456115R789080J3322699J0611448M609117j411883n319393
$$ -11923043 -17191338 -15735223 -5946143 7376556 17988004 22597121 21185238 15865845
38648A5865845n253623q00890M572957N377494L04859n228053m966970O34451
$$ 15865845 10612222 9811332 14384289 19761783 20066642 14838589 9871619 10506070
38640A0506070M947738L060323k875257o602133m530844J131908N027806L871155
$$ 10506070 15453808 18514131 15638874 9036741 4505897 5637805 10665611 14536766
38632A4536766l87986k682733q47873J370069o43475n080006n277092L82293M652485
$$ 14536766 14148780 11466047 10618174 11988243 11344768 6264762 987670 1369963 6022448
38623F022448J123185n773548o092096J642647Q208778O490189M09630k073625
$$ 6022448 7145633 1372085 -4720011 -3077364 5131414 11621603 12031233 9957608
38615I957608O1949J653659j1618k628648l812956l740878k602290N33225N082482
$$ 9957608 10019557 11673216 11661598 9032950 5219994 1479116 -1123174 -589949 4492533
38606D492533P998011O928980K878278r57798j960260R0561K572218J897699k504322
$$ 4492533 12490544 19419524 22297802 21340004 19379744 19470305 22042523 23940222 21435900
38597B1435900o787500p193098m897631l697513l955623k679226N68893K326962
$$ 21435900 14648400 7455302 2557671 -1139842 -5095465 -7774691 -7205798 -4878836
38589d878836R89973l23722J116008L324222L293715J971885J994169K577499
$$ -4878836 -3888863 -4212585 -3096577 227645 3521360 5493245 7487414 10064913
38581A0064913O03745m067104p813437p639211l723329K056215P432939R683159
$$ 10064913 10668658 6601554 -1211883 -8851094 -12574423 -10518208 -3085269 6597890
38573F597890P118719J459586l242507m763877m395861m320792n005859n510957
$$ 6597890 13716609 15176195 11933688 7169811 2773950 -1546842 -6552701 -12063658
38565a2063658m665356j534241L469648P353064O517727J325716l063596k399999
$$ -12063658 -16729014 -18263255 -14793607 -7440543 -922816 402900 -2660696 -5060695
38557e060695J220475K034298j545528m566820k239377L315828N713232K891746
$$ -5060695 -3840220 -1805922 -3351450 -7918270 -10157647 -6841819 -1128587 1763159
38549A763159k46775J175301N303775O424676K713384k434785o279598r666068
$$ 1763159 1516384 2691685 7995460 14420136 17133520 14698735 8419137 -1246931
38541a246931j2641030j1194271k277530R565922J4961019J0040988J178723k495004
$$ -1246931 -13887961 -25082232 -27359762 -17793840 -2832821 7208167 8386890 5891886
38533E891886K15261J833242l577120j1829691j2878734l488511P690052J0089223
$$ 5891886 6107147 7940389 4363269 -7466422 -20345156 -23833667 -16143615 -6054392
38525f054392L912817j174287P94119N360416N527343J532227q18672J435216
$$ -6054392 -2141575 -3315862 -2521743 2838673 8366016 9898243 9079571 10514787
38517A0514787N549290P056297L577816l724123r719175q444917j6636P728413
$$ 10514787 16064077 23120374 26698190 22974067 13254892 4809975 4793339 12521752
38509A2521752Q232385M315480K475666K061709k498190r915634j1684766n376990
$$ 12521752 20754137 25069617 27545283 29606992 27108802 17193168 5508402 131412
38501A31412P18497N39743o51738L115673O357021N87357r482549j0158309Q53339
$$ 131412 849909 1389652 737914 3853587 10210608 10797965 1315416 -8842893 -7989554
38492g989554R818583O506970j580315j511250N803801Q272899J523621n156944
$$ -7989554 1829029 8335999 6755684 5244434 11048235 19321134 20844755 15687811
38484A5687811l350990K682789L769694l35677j932710J926816N172685K538726
$$ 15687811 12336821 15019610 18789304 18453627 16520917 18447733 23620418 26159144
38476B6159144k521559l576797p67402L79096k396496n769667o518974m559376
$$ 26159144 23637585 20060788 19293386 19672482 17275986 11506319 4987345 427969
38468D27969k64786N820727R497299N154595n385553j1695474p102513K051464
$$ 427969 163183 5983910 15481209 20635804 15250251 3554777 -3547736 -1496272
38460a496272M988576O93228l173050k917913k053583k237264k9875M651526N130406
$$ -1496272 3492304 4185532 1012482 -1905431 -3959014 -6196278 -6226153 -1574627 3555779
38451C555779j686687p888969m494551M920262Q129663Q27496p727073p080425
$$ 3555779 1869092 -6019877 -10514428 -5594166 2535497 3362993 -4364080 -11444505
38443a1444505J712637Q649960P016172o23m037301q30753N749452Q620400N714524
$$ -11444505 -9731868 -1081908 5934264 5933641 1896340 1065587 6815039 15435439 21149963
38434B1149963J762030J356101K646223M99776n428915r379184o743502J81201
$$ 21149963 22911993 24268094 26914317 27414093 21985178 12605994 5862492 6043693
38426F043693N105421M736131J440455l12454Q87307J939958q66257o585736r749629
$$ 6043693 11149114 15885245 17325700 17013246 17900553 19840511 18974254 12388518 2638889
38417B638889o942799j485822R31355j7676M23720M186814O984136M533229j269476
$$ 2638889 -4303910 -5789732 -4858377 -4876053 -4452333 -265519 6718617 11251846 9982370
38408I982370n104873m856188k568470l02882J857005M039541N357449M811513
$$ 9982370 4877497 21309 -2547161 -2850043 -993038 3046503 8403952 13215465
38400A3215465K211795j472974l887496k827341M79892J494174j675664m248202
$$ 13215465 15427260 13954286 10066790 7239449 7719341 9213515 7537851 3289649
38392C289649o26414O609671Q594343K001684o060449p603645l725535r11965
$$ 3289649 2663235 9272906 17867249 19868933 13808484 6204839 2479304 1567339
38384A567339r00363J14603L668071O513068O513505N639244N249276L200591
$$ 1567339 666976 781579 4449650 10962718 17476223 23115467 28364743 31565334
38376C1565334j380252m491519k499520J645788J817822k975601p649540p673846
$$ 31565334 30185082 25693563 23194043 24839831 26657653 23682052 16032512 8358666
38368H358666l032917L701384R211027R589949L214760n534907r370597o282866
$$ 8358666 5325749 9027133 18238160 27828109 31042869 25507962 16137365 9854499
38360I854499j175753J600756K873020L958691K650311j993501n013216j297651
$$ 9854499 8678746 10279502 13152522 17111213 19761524 17768023 12754807 11457156
38352A1457156O130532R035531M493630k195840m958631l104525R9858J252595
$$ 11457156 17587688 26623219 31116849 28921009 23962378 20857853 20957711 22210306
38344B2210306j060689m759063n125826m26617M299404L299992j065923j174678
$$ 22210306 21149617 16390554 11264728 10838111 15137515 18437507 17371584 16196906
38336A6196906M293249Q225162N922564J181021j423624l472397p168022q935287
$$ 16196906 20490155 28715317 34637881 35818902 34395278 30922881 23754859 14819572
38328A4819572n013472Q82250K545406J065591K319475O280078O591371J218274
$$ 14819572 9806100 10688350 13233756 14299347 16618822 22898900 29490271 30708545
38320C0708545l683818k795515J092794J954974j173569l963755k786140J316721
$$ 30708545 27024727 24229212 25322006 27276980 26103411 22139656 19353516 20670237
38312B0670237L742685R10089n105277p361858j935240N996207P560073J284845
$$ 20670237 24412922 25323011 20217734 12855876 10920636 16916843 24476916 25761761
38304B5761761n410832o145857k456645N52593J084521Q57455J701810M156267
$$ 25761761 20350929 14205072 11748427 12301020 13385541 14242996 15944806 20101073
38296B0101073O989129O893740J753375m704621n507366L94057N672153M000695
$$ 20101073 27090202 33983942 35737317 31032696 25525330 25919387 31591540 35592235
38288C5592235k069441n819674n101657k453265J240J111043r59195n719422p706586
$$ 35592235 33522794 27703120 22601463 20148198 20149438 21260481 20301286 14581864 6875278
38279F875278k367720O444417J0207408O547324J119461j286358j953391l440635
$$ 6875278 4507558 10951975 21159383 27706707 28826168 27539810 25586419 22145784
38271B2145784m857769m353795k439822l52068J973427M257053M863042L259020
$$ 22145784 17288015 12934220 10494398 10142330 12115757 16372810 21235852 24494872
38263B4494872J048648q69843l283895n184823k836738M666196J1627250J1309986
$$ 24494872 25543520 24673677 21389782 16204959 13368221 18034417 29661667 40971653
38255D0971653M070958l224966n194726k619905K53481L54791k242679m754153
$$ 40971653 45042611 41817645 36622919 34003014 34256495 34611286 32368607 27614454
38247B7614454l942661L63372M222742L784765J60378j974595m67929K017064
$$ 27614454 23671793 24035165 28257907 32042672 32203050 30228455 29760526 31777590
38239C1777590K234017N25404m13833P52169K876931L861429K306358j320387
$$ 31777590 34011607 34537011 34123178 34875347 37752278 41613707 43920065 42599678
38231D2599678m264826l528818L43068K756386K84119m370089n100390k49268
$$ 42599678 38334852 34806034 35149102 37905488 38189607 33819518 28719128 28469860
38223B8469860M872568M619964P6875k711127m18035M263161O886820O176156
$$ 28469860 33342428 37962392 38039267 35328140 34910105 39173266 46060086 52236242
38215E2236242L749638J198837o66846j004582L25056J470441P1010l548617o138975
$$ 52236242 55985880 57184717 56517871 55513289 55838345 57308786 57379796 53831179 47692204
38206D7692204n041990q40189L853014O877466P231565N045668K258745J764476
$$ 47692204 42650214 41810025 45663039 52540505 59772070 64817738 67076483 68840959
38198F8840959L679075L598750k218651j0002105j0836208j849500Q536659J0205555
$$ 68840959 72520034 76118784 73900133 63898028 53061820 51212320 59748979 69954534
38190F9954534L782875j246330L92249M466298N646186M672658L932831J816475
$$ 69954534 73737409 72491079 72883328 77349626 82995812 87668470 91601301 93417776
38182I3417776l051406o350203l729977P55895l19934n307346m681402M099848
$$ 93417776 90366370 84016167 80286190 81042085 80722151 75414805 70733403 74833251
38174G4833251J1726863J0662324N585436M513084O340247M889150N19825j208017
$$ 74833251 86560114 97222438 102807874 107320958 113661205 118550355 119070180 117862163
38166A17862163q2820j337680n254909n263148J520441R052956J0902132Q227240
$$ 117862163 117779343 116441663 111186754 105923606 107444047 116497003 127399135 135626375
38158A35626375N470346K942594j560702o796922q528334m951161J576252P573700
$$ 135626375 141096721 144039315 142478613 135681691 127153357 122202196 123778448 131352148
38150A31352148J0907182J1105930R437858Q220833Q418595Q348466O023272K237024
$$ 131352148 142259330 153365260 162803118 171023951 179442546 187791012 193814284 196051308
38142A96051308J00886J641971N513465Q076304O850388L186711Q97253J679432
$$ 196051308 196152194 197794165 203307630 211383934 218234322 221421033 222318286 223997718
38134B23997718L246094L218032K854504M419173O804699P466215P277999Q908772
$$ 223997718 227243812 230461844 233316348 237735521 244540220 252006435 259284434 268193206
38126B68193206J1114335R901404N467865K350072J929212R65703r92736Q7156
$$ 268193206 279307541 289208945 294676810 297026882 298956094 299921797 298929061 299016217
38118B99016217M061813M009858k483484o778407j416752P098112P149727l57463
$$ 299016217 303078030 307087888 304604404 297825997 296409245 303507357 310657084 310299621
38110C10299621l992465p5037K477308k456289q578632q051668l767627l794782
$$ 310299621 306307156 306232119 308709427 306253138 297674506 289622838 285855211 282060429
38102B82060429q771580j2202470j0924663q520291q329163q458130n611639p73407
$$ 282060429 273288849 261086379 250161716 241641425 233312262 224854132 219242493 218469086
38094B18469086J522675r35510m717882m612339n16574J726835k114863q369649
$$ 218469086 219991761 219056251 214338369 209726030 209209456 210936291 208821428 200451779
38086B00451779r725663m542231J874791M852560M797423L428708L32128m399295
$$ 200451779 190726116 186183885 188058676 192911236 197708659 201137367 201469495 197070200
38078A97070200p831201p548762m984732k987034k338007k825384m943990p503234
$$ 197070200 189238999 181690237 176705505 173718471 171380464 168555080 163611090 156107856
38070A56107856o090018J942665J1962523J5486261R475947m88595o668077o582289
$$ 156107856 150017838 151960503 163923026 179409287 188885234 188396639 181728562 175146273
38062A75146273l573086j917678k399463k163715J269099N985556O942471K038702
$$ 175146273 171573187 169655509 167256046 165092331 166361430 172346986 179289457 181328159
38054A81328159m605895p017274l841441J258638M414781M442438J865984j862104
$$ 181328159 176722264 169704990 165863549 167122187 171536968 175979406 177845390 175983286
38046A75983286l927309j889766K797925N172441K583745j187834k1202O481513
$$ 175983286 172055977 170166211 172964136 178136577 180720322 179532488 179511286 185992799
38038A85992799J1469217Q763245P02187m419263k492287J889781K455563k26248
$$ 185992799 197462016 206225261 206927448 202508185 200015898 201905679 204361242 204134994
38030B04134994o34308K989819O345315N756414K801634O71340k45319n85751
$$ 204134994 203500686 206490505 212835820 218592234 221393868 222065208 221819889 221234138
38022B21234138Q73486M768633P898975O311918R60035k892586j738895L151041
$$ 221234138 222107624 226876257 234775232 241087150 242047185 239154599 237415704 240566745
38014B40566745Q372948J1480167J1480594Q698112M762051J381238r51553k234488
$$ 240566745 248939693 260419860 271900454 280598566 285360617 286741855 285790302 283555814
38006B83555814k031776p71427n01599k004066k438619J076009O283719P728010
$$ 283555814 281524038 280752611 280251012 278246946 275808327 276884336 283168055 290896065
37998B90896065L982271m60031j192717J344641L997410M570094J999486l860416
$$ 290896065 294878336 294418305 293225588 294570229 298567639 303137733 305137219 301276803
37990C01276803j0256154j1886850o248240K579324P898622P296454L582733k4295
$$ 301276803 291020649 279133799 272885559 275464883 283363505 290659959 294242692 294218397
37982B94218397k874415n142586n887717m240094j224530J035438J667397J606335
$$ 294218397 291343982 286201396 280313679 276073585 274849055 275884493 277551890 279158225
37974B79158225J684569J192883o71386k489849j585035K114422M986660L990218
$$ 279158225 280842794 282035677 281364291 278874442 277289407 279403829 284390489 288380707
37966B88380707O45562j130411j3744K138493L696374M535287M494356L496870
$$ 288380707 289026269 287895858 287882114 290020607 293716981 298252268 302746624 306243494
37958C06243494K901949L691941L784689R49888j912413N33723P201945J0153585
$$ 306243494 309145443 312837384 316622073 317571961 315659548 316193271 323395216 333548801
37950C33548801N557141m93464r68674K503446M103799L122315K317365Q25657
$$ 333548801 339105942 338612478 337643804 340147250 344251049 347373364 349690729 350516386
37942C50516386l439757o643634l085513M005286M766547k792218r391238q477127
$$ 350516386 347076629 340432995 337347482 341352768 346119315 343327097 333935859 325458732
37934C25458732m875670m676008m795874J3757O032752N304656j977096q407308
$$ 325458732 320583062 315907054 311111180 311124937 317157689 322462345 320485249 312077941
37926C12077941j0862726j2676677j4775543j3111759o779162j660461k770262
$$ 312077941 301215215 288538538 273762995 260651236 253872074 252211613 249441351
37919B49441351p755352j0776772r158805m196699J032169K827361p42251o889291
$$ 249441351 241685999 230909227 221750422 217553723 218585892 221413253 220671002 213781711
37911B13781711j0505011j0270006q830830o947750l010730O79162j712976r546357
$$ 213781711 203276700 193006694 184175864 177228114 174217384 174896546 173183570 163637213
37903A63637213j3118707o609109K409834L432278j865866l536044O28790K805149
$$ 163637213 150518506 143909397 146319231 149751509 147885643 144349599 144978389 147783538
37895A47783538j119434m898284j947061N078828Q737405O127332K26668m680612
$$ 147783538 146664104 141765820 139818759 144897587 153634992 159762324 159988992 155308380
37887A55308380n993656l770158q93977m02375j914248l092468m205228p066191
$$ 155308380 149314724 145544566 144650589 144248214 142333966 139241498 135036270 127970079
37879A27970079r426059o055564K786975R412039Q199389K435775j479548k139230
$$ 127970079 118544020 112488456 115275431 124687470 132886859 135322634 133843086 131703856
37871A31703856j772117j143144k82835p59096k625334k233678K195929N812658
$$ 131703856 129931739 128788595 128505760 127746664 125121330 122887652 125083581 130896239
37863A30896239L177967l343622o786840n438932l818380m826167o481803o191412
$$ 130896239 134074206 130730584 123943744 118504812 114686432 109860265 103378462 97187050
37855I7187050l339258J977893P977402R637761L607474n421723q826896m823928
$$ 97187050 93847792 95825685 103803087 113440848 117048322 111626599 102799703 97975775
37847I7975775N10923L180759N335798P762158N829410k723099j1711155j3606281
$$ 97975775 98486698 101667457 107003255 114765413 120594823 117871724 106160569 92554288
37839I2554288r000796m026035j296767J330003M684195O218306M197217L74611
$$ 92554288 83553492 79527457 78230690 79560693 84244888 90463194 94660411 95035022
37831I5035022k136597j688630J073809L626014L289319o1567l525055m226128
$$ 95035022 92898425 91209795 92283604 95909618 99198937 99137370 95612315 91386187
37823I1386187j861804K227035O598868R414002Q887337N609261K463249P73830
$$ 91386187 89524383 91751418 98350286 107764288 116651625 122260886 124724135 125497965
37815A25497965j243204m490614o038524k852176L306877P517356P271330M228532
$$ 125497965 124254761 119764147 113725623 110873447 114180324 121697680 128969010 133197542
37807A33197542J385327N25384J737501L810739N588889P487016J0281224J2306798
$$ 133197542 134582869 135108253 136845754 140656493 146245382 153732398 164013622 176320420
37799A76320420J0698890O251124L503642M341378N418048M341693L929698O477776
$$ 176320420 187019310 193270434 196774076 201115454 206533502 210875195 214804893 221282669
37791B21282669Q179194M720521q21580j990790J171086K929413J624107J682415
$$ 221282669 229461863 234182384 233360804 231370014 232541100 235470513 237094620 238777035
37783B38777035N341812Q926214R154725P573164O420605M893664K128088p5834
$$ 238777035 244118847 253045061 262199786 269772950 276193555 281087219 283215307 283139473
37775B83139473j02069J020315J935882K792636L424686K946432K081650K048672
$$ 283139473 283037404 284057719 285993601 288786237 292210923 295157355 297239005 299287677
37767B99287677N50150n758585j3341820j3142037l721566L622877q68463j1292454
$$ 299287677 299837827 294079242 280737422 267595385 263873819 267496696 266628233 255335779
37759B55335779j4116121p001001o33709k608134q603465j1425077j0636179r154246
$$ 255335779 241219658 234218657 233584948 230976814 222373349 210948272 200312093 191157847
37751A91157847o697596k202324J196103n99952o084655r530384q250361m709734
$$ 191157847 184460251 182257927 183454030 182854078 176769423 167239039 158988678 154278944
37743A54278944j956518p33357j225883l956577p750349r572409p838130m031325
$$ 154278944 152322426 151589069 150363186 146406609 138656260 129083851 121245721 117214396
37735A17214396k24987K799383M070314J907482l131001p218010p707927o496272
$$ 117214396 116989409 119788792 123859106 125766588 122635587 115417577 107709650 101213378
37727A01213378o038176m431716J113305P514478Q374388L550396k3731R90298
$$ 101213378 95175202 90743486 91856791 99371269 107745657 111296053 111272322 112262620
37719A12262620J159117m247840j0274010q901371j029944N043192N356643L634182
$$ 112262620 113421737 109173897 98899887 89998516 88968572 94011764 99368407 103002589
37711A03002589L283372K809686L96778k742503n426808q016650r207852o364103
$$ 103002589 106285961 109095647 109492425 106749922 101323114 93306464 84098612 77734509
37703G7734509j214534p0014n155084j0233248q695344k275503K375128K655128
$$ 77734509 76519975 76449961 71294877 61061629 52366285 50090782 52465910 55121038
37695E5121038J145967J41465l86856n49578j20738K56860J92967P81402K393448
$$ 55121038 56267005 56408470 56021614 55472036 55351298 55608158 55801125 56582527 58975975
37686E8975975L052213J551508p6459j82825q90975m001575o200695l394005K008054
$$ 58975975 62028188 63579696 63503237 63320412 62429437 58427862 52227167 48833162 50841216
37677E0841216L759128Q66845j769337j703878j844595l947503n153128l395942
$$ 50841216 54600344 55467189 53697852 51993974 50149379 46201876 41048748 37652806
37669C7652806j272585j542416k862989l094368l189486m301723m097151j0970
$$ 37652806 36380221 34837805 31974816 28880448 25690962 21389239 17292088 17281118
37661A7281118N645082P668045M370923p74836l271343j234092L983909Q371585
$$ 17281118 22926200 30594245 34965168 34190332 30918989 29684897 33668806 42040391
37653D2040391P426921N06228p237943r610749n987206j138655J132960J383073
$$ 42040391 49467312 49973540 42735597 33124848 27137642 25998987 27131947 28515020
37645B8515020J173641l17908l992413p247426o222699j527534J676680P37485
$$ 28515020 29688661 29370753 25378340 18130914 11908215 10380681 12057361 12794846
37637A2794846m26515K656482P268904O656055N33545l421379p00165L099529
$$ 12794846 12368331 15024813 22293717 28949772 29483317 26061938 25361773 28461302
37629B8461302Q86835n061203p185950m525012k780175l478031j551774M608042
$$ 28461302 29348137 24286934 17100984 12575972 9795797 6317766 4765992 9374034
37621I374034Q726863O151450J143487l92587M026k357912o126997o140852k668275
$$ 9374034 18100897 24252347 25395834 25003247 25007273 22649361 16522364 10381512 7713237
37612G713237j151610k940525k992134J702364O914695P031059K248982k868824
$$ 7713237 6561627 3621102 628968 2331332 9246027 16277086 18526068 15657244
37604A5657244n366219n615360m682116k804863m38755J077791R00020L62802
$$ 15657244 10291025 4675665 -6451 -2811314 -3250069 -2172278 -1272258 -909456
37596i09456K120742O465589R185475N582674k745750q131784n899884m14843
$$ -909456 1211286 7676875 16862350 22445024 19699274 11567490 5667606 5252763
37588E252763J190455j012749q00224L890016P085738L033476n543357j0338214
$$ 5252763 6443218 5430469 4630245 8520261 15605999 18639475 13096118 2757904
37580B757904o880340J145453O273464M603959r78546m404295l073225k5548R48452
$$ 2757904 -4122436 -2976983 3296481 7900440 6921894 2517599 -555626 -581174 367278
37571C67278K44778M37535J390210Q52692j108478k115758j473325k30277K250107
$$ 367278 612056 1049591 2439801 3292493 2184015 68257 -1405068 -1635345 614762
37562F14762O882627R909459N525166m521483j0155992n686342K104176L635633
$$ 614762 7497389 17406848 22932014 18410531 8254539 2568197 4672373 8308006
37554H308006m17983k323413j42803O44217k448362m934656l460716j088508j326323
$$ 8308006 7890023 5566610 5423807 6068024 3619662 -1314994 -4775710 -5864218 -7190541
37545g190541k184393j38340L766054N880806N482971M506333L608285K249821
$$ -7190541 -9374934 -9513274 -5747220 133586 5616557 10122890 13731175 15980996
37537A5980996J450181K644412M174013K512976k487839o509792n966726k251235
$$ 15980996 17431177 20075589 24249602 26762578 24274739 17764947 11798221 9546986
37529I546986K47548r92533m406922n984857l076034K319332M673154J261637
$$ 9546986 9794534 8802001 4395079 -1589778 -4665812 -2346480 2326674 3588311
37521C588311l472729l119651J445164K774930j699615m637051L69049P818460
$$ 3588311 115582 -3004069 -1558905 1216025 -483590 -5120641 -4751592 3066868
37513C066868P457189p5752l740202J027699N336235J023169o473987o855605
$$ 3066868 10524057 10448305 6708103 7735802 13072037 14095206 7621219 765614
37505G65614p83813K359780j79371j448365K446708N890832L351463k121605m639325
$$ 765614 -18199 2341581 2162210 713845 3160553 9051385 12402848 10281243 5641918
37496E641918l977879l181700k099418J052549M534563M844032K007228j118561
$$ 5641918 1664039 -1517661 -3617079 -2564530 1970033 6814065 8821293 7702732
37488G702732l004250l046733L08790O094468Q082348J937569o337049o445486
$$ 7702732 4698482 1651749 1960539 8055007 16137355 18074924 11737875 5292389
37480E292389J550117O319976R55009p990144j0954548p952906m875220k649873
$$ 5292389 6842506 13162482 14117491 6127347 -4827201 -12780107 -17655327 -20305200
37472b0305200K149446Q330860R669716M158178k360128l755981p04903J734555
$$ -20305200 -18155754 -9824894 -155178 4003000 1642872 -2113109 -2818012 -1083457
37464a083457N69102l023379n875814n459540j755731K446903M280604M131908
$$ -1083457 -514355 -3537734 -9413548 -14873088 -16628819 -14181916 -9901312 -5769404
37456e769404M617709O131330N870777K223639k358171m543196m153351k975516
$$ -5769404 -1151695 4979635 10850412 13074051 10715880 6172684 2019333 -956183
37448i56183j344611J273826L259250J828371k315486m259229p11639N149410
$$ -956183 -2300794 -1026968 2232282 4060653 1745167 -2514062 -3225701 1923709
37440A923709O985544K903830k470856l825958j045198J808819J750393o98534
$$ 1923709 8909253 11813083 9342227 5516269 4471071 6279890 8030283 7331749
37432G331749l374260m523702l175870J06473K253591n7303n658193q536046m613984
$$ 7331749 3957489 -566213 -3742083 -3635610 -1382019 -1439322 -7097515 -15633561 -20247545
37423b0247545K419017M869524L20488n525040n753913K00936O801012Q566278
$$ -20247545 -17828528 -12959004 -12638516 -18163556 -23917469 -23716533 -16915521 -8349243
37415h349243N020301N45944j021L778147P327494O617925L433159K823512N425138
$$ -8349243 -3328942 -2782998 -2784019 994128 8321622 14939547 18372706 21196218 26621356
37406B6621356N831717K54396p431614j0423920p719373m265665l162006k013145
$$ 26621356 32453073 32707469 25275855 14851935 7132562 2866897 -295109 -2308254
37398b308254J739028N407172L969544k863298r325528r866952n098650l21369
$$ -2308254 -569226 4837946 8807490 5944192 -3381336 -13248288 -18346938 -18668307
37390a8668307J105595J103940K881016N360373M259604j164388n454271l208618
$$ -18668307 -17562712 -16458772 -13577756 -8217383 -3957779 -5122167 -10576438 -13785056
37382a3785056L610534P374168L598711m194483q854206p040444j447916L144912
$$ -13785056 -10174522 -2800354 798357 -3396126 -12250332 -19290776 -20738692 -17593780
37374a7593780M723276M909089N695188O330221M473137Q8078l684189m200382
$$ -17593780 -12870504 -7961415 -2266227 4063994 8537131 8625209 4941020 740638
37366G40638k022272J017818M105899N946368L646651l407735j0108403j0111293
$$ 740638 -1281634 -263816 3842083 9788451 13435102 10027367 -81036 -10192329
37358a0192329l476349L678933O812594O456744M422318J335161j090982j45734
$$ -10192329 -13668678 -9989745 -3177151 3279593 7701911 9037072 7946090 7800356
37350G800356L436619N180425L122078L19385j038319l186825p109866q375153
$$ 7800356 11236975 16417400 19539478 19858863 18820544 15633719 8523853 148700
37342A48700l791601J835324J869396k018370k772641N31342J622882k245552
$$ 148700 -3642901 -1807577 61819 -1956551 -4729192 -4197850 -2574968 -4820520
37334d820520n935095m951677j961960j340775k221610j132750J934623M289144
$$ -4820520 -10755615 -15707292 -17669252 -19010027 -21231637 -22364387 -20429764 -16140620
37326a6140620N166392N796084O118241M717871J536452j824343m246196n675387
$$ -16140620 -10974228 -5178144 940097 5657968 7194420 5370077 1123881 -4551506
37318d551506n805973l876682j49192L245096L604084M06995l068013k277756
$$ -4551506 -10357479 -14234161 -14383353 -11138257 -7534173 -7127178 -10195191 -12472947
37310a2472947L062565P398327N548361o88517n086193n131649l748952l241192
$$ -12472947 -9410382 -2012055 3536306 2847789 -2238404 -7370053 -11119005 -14360197
37302a4360197k134367R57862M581920P114319Q405966P388591K276268m907933
$$ -14360197 -16494564 -15536702 -10954782 -3840463 4565503 11954094 14230362 9322429
37294I322429q353664n635540r87571J030234Q51942K28549j658805m492945m290150
$$ 9322429 968765 -4666775 -5654346 -4624112 -3772170 -3543621 -5202426 -9695371 -13985521
37285a3985521M14458M486961L936516K994885O504512R764666N041382m573849
$$ -13985521 -13571063 -9084102 -5147586 -2152701 4351811 14116477 19157859 14584010
37277A4584010q145043l298583Q09562j489507m691660l120001P299K75969O20656
$$ 14584010 6438967 3140384 3949946 2460439 -2231221 -5351222 -5343923 -5067954 -4447298
37268d447298M644298P601206K858950o060324q715992k271065M869746M976636
$$ -4447298 197000 7798206 10657156 4596832 -4119160 -6390225 -1520479 3456157
37260C456157L25183j775706J131144M971278N328600K519553L73074J065508
$$ 3456157 3781340 2005634 3136778 8108056 13436656 15956209 16329283 17394791
37252A7394791K212347O3550m894752p826698n839727j905083o30256k228322
$$ 17394791 19607138 19670688 14775936 6949238 1109511 -795572 -1425828 -3654150
37244c654150l266419j992423l136Q93561Q43400P75905R75238J135466O30226
$$ -3654150 -6920569 -8912992 -8916128 -8022567 -7179167 -6403262 -5428024 -4292558 -3662332
37235c662332j114851l314659l398288K63637N101554N904463R84459m480999
$$ -3662332 -4777183 -8091842 -11490130 -11226493 -6124939 -220476 763983 -3717016
37227c717016l539213L830410R552059P026251j43376k958416J70111J383794
$$ -3717016 -7256229 -3425819 6126240 13152491 13009115 10050699 10220810 11604604
37219A1604604l796462q327082m058435M971580Q032051L715717Q07590L387005
$$ 11604604 7808142 -518940 -4577375 394205 8426256 12141973 12949563 16336568
37211A6336568N246291J646330k987864l786219l492195n742320p225558l510428
$$ 16336568 21582859 23229189 20241325 16455106 12962911 7220591 -4967 -3515395
37203c515395K550274N089430L771056J916043K12579j625330j216322K061432
$$ -3515395 -965121 4124309 7895365 9811408 10023987 8398657 7182335 9243767
37195I243767L343207l23961l602268j353811J791012m90892l812602k25620O181174
$$ 9243767 12586974 12263013 8660745 7306934 9097946 8607054 4794452 4568832 10750006
37186A0750006M437316m066492o306107R53474N423123n89519q425278q363601
$$ 10750006 15187322 11120830 4814723 5768197 11191320 10601801 2176523 -6187078
37178f187078l953422k111817J068P239488J4081822J1905045L221563k455604
$$ -6187078 -10140500 -12252317 -12251249 -5011761 9070061 20975106 24196669 21741065
37170B1741065l091431l980952o121267n395050k092587j234193l274811l340445
$$ 21741065 18649634 14668682 8547415 3152365 1059778 -174415 -3449226 -6789671
37162f789671l41398J374905M82258P99326L138731K648794k676289p319819n855590
$$ -6789671 -7131069 -5756164 -5273906 -4474580 -1335849 1312945 -1363344 -8683163 -14538753
37153a4538753k52637M121841N737653O367408O351616M257772n2393m622954
$$ -14538753 -14791390 -10669549 -4931896 1435512 7787128 12044900 11992507 7369553
37145G369553p078000o079960k303098J489276K817651K213643J983163K511641
$$ 7369553 291553 -5788407 -8091505 -6602229 -3784578 -1570935 412228 2923869
37137B923869K091591K56000j541066k795740m391200n395869k751698L915688
$$ 2923869 5015460 5271460 3730394 934654 -3456546 -8852415 -11604113 -7688425
37129g688425R643799Q851562J819175n341927o931149k854787K238655M175758
$$ -7688425 1955374 10806936 12626111 7284184 353035 -2501752 -263097 3912661
37121C912661K969390J104395p55588m118756q481401r811166n358987K001019
$$ 3912661 6882051 7986446 7230858 3112102 -5369299 -15180465 -20539452 -18538433
37113a8538433O699004O447096L289696L00168n27224J258221L761639L874079
$$ -18538433 -11839429 -5392333 -2102637 -1802469 -2329693 -1071472 2690167 6564246
37105F564246J217388j153519j870416l535269o832108o869720o45681N925389
$$ 6564246 7781634 6628115 4757699 1222430 -5609678 -12479398 -13125079 -7199690
37097g199690N534806J082504J302794O281990P007528J62578o459476o359851
$$ -7199690 -1664884 -582380 720414 7002404 14009932 14172510 7713034 1353183
37089A353183l079663j884380r21806K985997O410579M702511P39865O79400L806523
$$ 1353183 -1726480 -3610860 -4532666 -1546669 4863910 9566421 10306286 10985686 14792209
37080A4792209L915289n93219m741322m997977l436519k874332k369556O40758
$$ 14792209 18707498 18114279 13372957 8374980 4938461 2064129 -305427 335331
37072C35331O153427J0756205J0137740K987906o609221j1988403j0392891n272995
$$ 335331 6488758 17244963 27382703 30370609 23761388 11772985 1380094 -3892901
37064c892901j466358o54833k415686n746008p333425k858320O100414J0561617
$$ -3892901 -5359259 -6014092 -8429778 -14175786 -21509211 -24367531 -18267117 -7705500
37056g705500M773345m690248o538229J98872N213974J143958p151807r414207
$$ -7705500 -2932155 -7622403 -14160632 -13961760 -8747786 -7603828 -14755635 -24169842
37048b4169842k172521P966918J1279807M370814o064626r396609k278344P820370
$$ -24169842 -26342363 -18375445 -7095638 -2724824 -8789450 -18186059 -20464403 -12644033
37040a2644033J1867095R137024M818483J324649k540926n771880n093490j052211
$$ -12644033 -776938 8360086 13178569 14503218 11962292 6190412 1096922 44711
37032D4711J384037m06393l614682m707836l355756q29851J766418K773119R11593
$$ 44711 1428748 1022355 -2592327 -7300163 -10655919 -11485770 -9719352 -6946233 -6034640
37023f034640k255291l689735k690681l97397L282694P921291R188294L311447
$$ -6034640 -8289931 -11979666 -14670347 -15067744 -11785050 -3863759 5324535 8635982
37015H635982n401683q376547m831594k521561m636059m556125K006280Q005707
$$ 8635982 3234299 -5142248 -9973842 -12495403 -17131462 -21687587 -19681307 -11675600
37007a1675600N390855j788052l334412J612590M221878K65422l819123j091994
$$ -11675600 -6284745 -8072797 -11407209 -9794619 -5572741 -5307319 -9126442 -10218436
36999a0218436O075889R740797O377554R3104k703913n763M200716M681566J003148
$$ -10218436 -4142547 5598250 11975804 12068908 9364995 9359232 13559948 18241514 19244662
36990A9244662k444687k552849j082306j091764k830977n148251p739774r274866
$$ 19244662 16799975 14247126 13164820 12073056 9242079 4093828 -3645946 -12920812
36982a2920812o702498j26970M839584M126507J672860L386745P096411N281540
$$ -12920812 -19623310 -19750280 -14910696 -10784189 -9111329 -5724584 1371827 6653367
36974F653367l095516j0576961j1557964p897614k901742L233634R064333R636193
$$ 6653367 3557851 -7019110 -18577074 -26474688 -29376430 -26142796 -17078463 -7442270
36966g442270L385574l435925m320710j043879L23554r71838m67957L123707N434116
$$ -7442270 -4056696 -7492621 -11813331 -12857210 -12533656 -13505494 -13973451 -10849744 -5415628
36957e415628L141686j110925k240228J204083N827116P062852L547748j475121
$$ -5415628 -2273942 -3384867 -5625095 -4421012 1406104 8468956 12016704 10541583
36949A0541583l346838j055460J937115K464224J203903J65999o93698j835357
$$ 10541583 7194745 6139285 8076400 10540624 11744527 11910526 11216828 9381471
36941I381471j739210J78670M27574l969748q951397p182230J325191Q148019
$$ 9381471 7642261 7820931 8248505 4278757 -4672640 -11854870 -10529679 -2381660
36933b381660P612422L347626R74065J0645k291863l853113r10916M313936N709621
$$ -2381660 5230762 8578388 9552453 9563098 7271235 3418122 2507206 6821142 12530763
36924A2530763K240423j198287j915096k513738m845310o465836n154404k234694
$$ 12530763 14771186 13572899 11657803 9144065 4298755 -2167081 -7321485 -9556179
36916i556179P37444M027556O200031L637185k986981o649882l026617K579415
$$ -9556179 -8818735 -4791179 1408852 5046037 2059056 -4590826 -7617443 -5038028
36908e038028K740968j310955k855211q52612k64816k231544k176142J185914
$$ -5038028 -2297060 -3608015 -6463226 -7315838 -7580654 -9812198 -11988340 -10802426
36900a0802426K820070K26805j681791J143197M577624K748121k478457m438098
$$ -10802426 -7982356 -7755551 -9437342 -8294145 -3716521 -968400 -3446857 -7884955
36892g884955j561415J569916J926221J310365J807890K626797K554801K090539
$$ -7884955 -9446370 -7876454 -5950233 -4639868 -2831978 -205181 2349620 4440159
36884D440159J780521Q76460j151023l443167m895568n163215m115928j622930
$$ 4440159 6220680 7097140 5946117 2502950 -2392618 -7555833 -11671761 -13294691
36876a3294691J568894L704773L409077J032780j432701j988083p90698l45009
$$ -13294691 -11725797 -8021024 -4611947 -3579167 -5011868 -6999951 -7790649 -8135658
36868h135658k248803m217111k686984J597939L868363K221698N42488K287606
$$ -8135658 -10384461 -14601572 -17288556 -15690617 -11822254 -9600556 -9058068 -6770462
36860f770462M930862M036860M0836l026245l441915k255658L16011M288116O867889
$$ -6770462 -1839600 2197260 2238096 -788149 -4230064 -6485722 -6169711 -1881595 4986294
36851D986294M964906M35287j842957j132671j419180m485739p147701o393904
$$ 4986294 9951200 10386487 8543530 7410859 5991679 1505940 -5641761 -12035665
36843a2035665l057868N48560K563574P80409m900654q372328k064152J1535227
$$ -12035665 -15093533 -14544973 -11981399 -11200990 -16101644 -24473972 -26538124 -15002897
36835a5002897J9438528J3669278J762928l770399j738913q71261n121676q844304
$$ -15002897 4435631 18104909 19867837 16097438 14358525 13487264 8365588 -478716
36827d78716o900471k020061O82924J171706K662704N390108N998052K434696
$$ -478716 -7379187 -9399248 -8716324 -7544618 -4881914 508194 6506246 8940942
36819H940942k930239n488023l214687P77951J268276k695876n802001k950407
$$ 8940942 6010703 522680 -2692007 -1914056 -645780 -3341656 -9143657 -12094064
36811a2094064L334522N288063p598o467321o757906j354650L173486L358589
$$ -12094064 -8759542 -3471479 -3479077 -9946398 -16704304 -18058954 -14885468 -11526879
36803a1526879K445893M247166O867018N387116n83054n544005n107228j476803
$$ -11526879 -9080986 -4833820 2033198 7420314 6837260 1293255 -3813973 -5290776
36795e290776K93501n10471k53483K448387M104081J645526k822907m849203l111035
$$ -5290776 -4997275 -5507746 -5761229 -3312842 791239 2436765 -386142 -5235345 -8346380
36786h346380K67540L237323N061050N014831K514372j526287n241860p471592
$$ -8346380 -8078840 -4841517 219533 5234364 7748736 6222449 980589 -6491003
36778f491003p518085m274252K142990Q313435R620916N093220j397082n159168
$$ -6491003 -14009088 -18283340 -16140350 -7826915 1794001 6887221 5490139 330971
36770C30971m723635j908670N46566R15281p87972l250156n146497n799543m584833
$$ 330971 -4392664 -6301334 -5754768 -4839487 -5627459 -8877615 -14024112 -19823655 -24408488
36761b4408488r89881L823433O885038O377850L697532J067898j485245m662728
$$ -24408488 -25398369 -21574936 -14689898 -8312048 -4614516 -3546618 -5031863 -9694591
36753i694591o839488n550189j475851K133704L883367M965458N458024L590730
$$ -9694591 -16534079 -22084268 -23560119 -21426415 -17543048 -12577590 -7119566 -3528836
36745c528836k95606k637423j405455R09741J219226K37832N32174K241520L380732
$$ -3528836 -3824442 -6461865 -7867320 -6957579 -5738353 -5500521 -4968347 -2726827 653905
36736F53905K875757Q57574k544473o120342o878145l532413O36079K015210K572152
$$ 653905 3529662 4387236 1842763 -4277579 -11155724 -14688137 -14052058 -12036848 -9464696
36727i464696O711747J2345032J1258896J033230r057344r162409k014750J597418
$$ -9464696 -2752949 9592083 20850979 21884209 12826865 3664456 1649706 3247124
36719C247124j498913l784494n60939K169982j607038o281786k120385Q714092
$$ 3247124 1748211 -2036283 -2597222 -427240 -2034278 -8316064 -10436449 -1722357
36711a722357J3222504N554794m701895o039911O5836L653602J006001k341546
$$ -1722357 11500147 17054941 12353046 6313135 6378971 10032573 11038574 8697028
36703H697028j623521J106979J867378L79582j245967j923400j592985j40084
$$ 8697028 7073507 8180486 10047864 10427446 9181479 7258079 5665094 5525010
36695E525010J940630L270173L005128J416019j042184l618875m523245k697675
$$ 5525010 7465640 10735813 13740941 15156960 14114776 10495901 5972656 3274981
36687C274981l49988q70499l753050m700466j808867J599331K008958M16383m20046
$$ 3274981 2924993 2054494 -1698556 -6399022 -8207889 -6608558 -4599600 -4183217 -4603263
36678d603263o02961j760095l104897k451401j90301J140932R12889R34234J926138
$$ -4603263 -5206224 -6966319 -10071216 -12522617 -12712918 -11571986 -10659097 -9724863 -7798725
36669g798725K453896J846824J424956J954798K370834K118256K265198K637904
$$ -7798725 -5344829 -3498005 -2073049 -118251 2252583 4370839 6636037 9273941
36661I273941L50810n952750j1880213j0964253k865925N216454O677735K617523
$$ 9273941 9624751 3672001 -8208212 -19172465 -22038390 -16821936 -10144201 -7526678
36653g526678r85687r40433J200687L314230M838842M660533J075679m408872
$$ -7526678 -8512365 -9452798 -8252111 -4937881 -99039 4561494 5637173 1228301
36645A228301o833980m118821p97894k026210o116776p207768l932178o42163
$$ 1228301 -5605679 -9724500 -10522394 -12548604 -18665380 -25873148 -29805326 -30447489
36637c0447489k17380n21727J037381L839751O495362Q899326R938433P193081
$$ -30447489 -30664869 -31186596 -30149215 -26309464 -19814102 -10914776 -976343 6216738
36629F216738J534078j790820K4710K802062J493725k217288l172788j319960
$$ 6216738 7750816 5959996 5984706 8786768 10280493 8063205 4890417 3570457
36621C570457j389005m664723o689180m004623J566360O733640J0423546J1668332
$$ 3570457 2181452 -2483271 -9172451 -13177074 -11610714 -4877074 5546472 17214804
36613A7214804Q118053R4991o847431p570955m297039m011695q962474j3287153
$$ 17214804 25332857 25427848 18580417 11009462 6712423 2700728 -6261746 -19548899
36605a9548899j0452017j550980O013261P060234L584225J129885K358312N508430
$$ -19548899 -30000916 -31551896 -25538635 -18478401 -14894176 -13764291 -11405979 -5897549
36597e897549P814235Q135519O214847J719863m493703r413730r994890o256199
$$ -5897549 1916686 10052205 16267052 17986915 13493212 4079482 -5915408 -12171607
36589a2171607j288047J870696K747880K855989L177231K749394K12862l351675
$$ -12171607 -13459654 -11588958 -8841078 -5985089 -2807858 -58464 154398 -3197277
36581c197277m486567j359972L502930O221549O017784M210862M12373n930002
$$ -3197277 -7683844 -9043816 -5540886 680663 6698447 10909309 11321682 5391680
36573E391680j0832220q535943n14095M288266J427608k604643n58372M602020
$$ 5391680 -5440540 -13976483 -14490578 -10202312 -8774704 -11379347 -11937719 -7335699
36565g335699N487365K398585J278409K397196N45610m147546n266446j255991
$$ -7335699 -1848334 550251 1828660 4225856 4771466 623920 -4642526 -5898517
36557e898517J747762Q26631Q73515M221989M788628j164731o430282l225567
$$ -5898517 -4150755 -3324124 -2450609 1771380 6560008 5395277 -1035005 -4260572
36549d260572L845546M461237j583805m748721m14884N661357O720440K371501
$$ -4260572 -415026 4046211 2462406 -2286315 -2701199 2960158 9680598 12052099
36541A2052099m043425q941180q725434k701374L470807L084517k253757m512436
$$ 12052099 8008674 -932506 -9657940 -12359314 -8888507 -5803990 -8057747 -12570183
36533a2570183p85516L890883N968087P513447Q661778M753027m277037r588044
$$ -12570183 -13355699 -9464816 -3496729 4016718 12678496 17431523 13154486 3566442
36525C566442n080988K820754M100343j173895n412909n280527k837828J390511
$$ 3566442 -1514546 1306208 5406551 4232656 -1180253 -6460780 -9298608 -7908097
36517g908097P400423J0034581M067862n525710p988373k155206K243170L95802
$$ -7908097 -507674 9526907 13594769 8069059 80686 -2074520 168650 564452
36509E64452r19337L420438P335585M376253m96996O85492M815130K776357m519558
$$ 564452 -354885 3065553 10401138 14777391 14280395 14965887 19781017 22557374 18037816
36500A8037816o536823K0951N197758L37523r326510j2290237o107885J085192
$$ 18037816 11500993 11521944 16719702 17057225 7730715 -4559522 -10667407 -9582215
36492i582215K484758L13697N46901L867810N206251J591147l091531l404980
$$ -9582215 -7097457 -6783760 -6236859 -2369049 2837202 4428349 1336818 -2068162
36484b068162n4194J798935R50794J352806M072355M660107J632522N71226M170968
$$ -2068162 -2122356 -323421 627373 1980179 6052534 10712641 12345163 12916389 17087357
36475A7087357N005040l321454j3216170j2268322k384389K778674q14992k523834
$$ 17087357 22092397 18770943 5554773 -6713549 -9097938 -6319264 -7134256 -9658090
36467i658090L504630P713983J341683q421471r411553j919532N429114J0065706
$$ -9658090 -6153460 1560523 2902206 -5519265 -14930818 -16850350 -11421236 -1355530
36459a355530J3978262J3198757K312697j2201120j6161732o688402L820208N062247
$$ -1355530 12622732 25821489 28134186 15933066 -228666 -6917068 -3096860 1965387
36451A965387L54779k491722k476000k362323j679693J031379L644724L494994
$$ 1965387 2320166 -171556 -2647556 -5009879 -6689572 -5658193 -2013469 1481525
36443A481525J817222J026503N27107j029328j965181J84560M318448O640839
$$ 1481525 3298747 4325250 4852357 3823029 1857848 2042408 6360856 13001695
36435A3001695M891135L5821m896268o675344m372214o90509J038638R57974J149495
$$ 13001695 17892830 17928651 13032383 6357039 1984825 1294316 2332954 3290928 4440423
36426D440423J009003j487956m410909l489529K01438N58508l542942n196675
$$ 4440423 5449426 3961470 -449439 -3938968 -3737530 -3179022 -6721964 -11918639
36418a1918639J05063P233438R186440O430063L147659m48582n371038p818362
$$ -11918639 -11813576 -4580138 4606302 11036365 14184024 13735442 8364404 546042
36410E46042l846484K316941K633039k851183o075586l338087j36673j506830
$$ 546042 -3300442 -983501 1649538 -1201645 -7277231 -10615318 -10751991 -12258821
36402a2258821m090739j883964M385630Q212143N868570K85754l404767l483654
$$ -12258821 -16349560 -18233524 -13847894 -5635751 232819 518573 -2886194 -6369848
36394f369848j770992L21944L500890P566835R050407M957427k033456o005206
$$ -6369848 -8140840 -7818896 -4318006 3248829 12299236 17256663 15223207 9218001
36386I218001n441423l950922k904090O56689O509175Q387903L266742k551354
$$ 9218001 3776578 -174344 -3078434 -2421745 4087430 12475333 15742075 13190721
36378A3190721k786135j128240l989577p902391m226161N513742R782496L516393
$$ 13190721 10404586 9276346 5286769 -2615622 -6841783 -1328041 8454455 11970848
36370A1970848n404129q888768q809156r932670j0396255n602839L100831R656945
$$ 11970848 6566719 -2322049 -11131205 -21063875 -31460130 -37062969 -33962138 -24305193
36362b4305193J0754458P791661L511164J37802r45856m15511l54000q59922K20105
$$ -24305193 -13550735 -5759074 -2247910 -2110108 -3055964 -3471475 -3825475 -4685397 -4465292
36353d465292K832872L473670O32470j951996m53902L395232M938555K804186
$$ -4465292 -1632420 1841250 2473720 521724 67822 3463054 8401609 11205795
36345A1205795k93530j366941L14563K898974K892479j208620n311752l417881
$$ 11205795 10912265 9545324 9859887 12758861 15651340 14442720 9130968 5713087
36337E713087L443318O577093J090958o608402p538788k507998M38298j385120
$$ 5713087 9156405 15733498 16824456 10216054 2677266 169268 607566 -777554
36329g77554k444886J132939N594522N879838K800418K96418j128627l886300
$$ -777554 -3222440 -2089501 3505021 9384859 12185277 12481695 11353068 7466768
36321G466768p436668p322152j364518O030743Q378120M784504J80782j932044
$$ 7466768 30100 -7292052 -8656570 -2625827 5752293 10536797 10717579 8785535
36313H785535l127009m973506m813326p16320K929081R64591l243866j486398
$$ 8785535 5658526 685020 -4128306 -4844626 -1915545 -950954 -4194820 -5681218
36305e681218O188566J0162173N425509r37995j070563K047766J002424l532823
$$ -5681218 507348 10669521 16095030 15157035 14086472 16134238 17136662 13603839
36297A3603839m881740k061346j089838n019431r615895r837219n378877R52682
$$ 13603839 8722099 6660753 5570915 551484 -9064411 -18901630 -24280507 -23327825
36289b3327825N913868O406645J726258l963877n032090q76579L995352O144619
$$ -23327825 -17413957 -11007312 -9281054 -13244931 -18277021 -19153600 -15158248 -9013629
36281i013629N894972M167309R21826k569598l798472k613443j767875k929040
$$ -9013629 -3118657 1048652 1970478 -599120 -4397592 -7011035 -8778910 -11707950
36273a1707950m595986m407626j267809M480282J0313647J1742593O715772o57311
$$ -11707950 -16303936 -20711562 -21979371 -17499089 -7185442 4557151 11272923 10615612
36265A0615612m299648l394439j623594n44982R62559J527940j591328n509567
$$ 10615612 6315964 2921525 1297931 752949 1715508 3243448 1652120 -3857447
36257c857447l358703M405489P741080P66459q572897q914553r87964M453557
$$ -3857447 -7216150 -2810661 4930419 5696878 -2876019 -11790572 -12778536 -8324979
36249h324979J667499m315124o403101l479696J322330N397082P798082Q598980
$$ -8324979 -6657480 -10972604 -17375705 -20855401 -19533071 -14135989 -6337907 2261073
36241B261073Q509657P531533M309701j109182n107639m421324j325066p46338
$$ 2261073 10770730 18302263 22611964 21502782 16395143 11973819 10648753 9902415
36233I902415k570436j929894J990012L302411j383667o430441m942692O66076
$$ 9902415 7331979 5402085 7392097 10694508 9310841 2880400 -2062292 -1396216
36225a396216K332821j194726k812822J372141O070600N417111J429852q64032
$$ -1396216 936605 -258121 -3070943 -1698802 4371798 9788909 11218761 10354729
36217A0354729j804287m296332o001410j980920N808219R381968O037101J510309
$$ 10354729 8550442 4254110 -1747300 -3728220 2079999 11461967 17499068 19009377
36209A9009377k37115k823303q907059j2880989q624990J93273M650304K442360
$$ 19009377 18772262 15948959 7041900 -5839089 -14464079 -14270806 -9620502 -7178142
36201g178142j534182m184237o545810q106007o053427q24634L590143N528376
$$ -7178142 -8712324 -12896561 -19442371 -27548378 -33601805 -34426439 -30836296 -25307920
36193b5307920O442250N789736J448032m009662m196809J867292P479952P584760
$$ -25307920 -18865670 -13075934 -11627902 -15637564 -19834373 -17967081 -10487129 -2902369
36185b902369M605058K410128N11832k245702l854532l110449k488755l090702
$$ -2902369 1702689 4112817 4624649 2378947 -1475585 -4586034 -7074789 -10165491
36177a0165491j751777K546054M769804J602857k065564o46381K925357K743822
$$ -10165491 -11917268 -9371214 -4601410 -2998553 -5064117 -5710498 -2785141 -41319
36169d1319N07256J800697M536017J115141p894443j1962933n013367O153010
$$ -41319 465937 2266634 6802651 7917792 23349 -11939584 -16952951 -10799941
36161a0799941J1196095P785233O00561n411213p032619l158708K457010K860482
$$ -10799941 396154 8181387 8781948 3370735 -3661884 -6820592 -4363582 -1503100
36153a503100l398527q645401n529689K984233P961321O410168L184926J988230
$$ -1503100 -4901627 -13547028 -19076717 -16092484 -8131163 -1720995 1463931 3452161
36145C452161O36938l281453p029870o277098j575381J888969N15469l734934
$$ 3452161 4089099 807646 -6222224 -12499322 -14074703 -12185734 -11670265 -15405199
36137a5405199n797472k996654K243023N050698L357411m6250j166491M25393
$$ -15405199 -21202671 -24199325 -21956302 -16905604 -13548193 -13594443 -14760934 -14335541
36129a4335541J977574K011586J734205J549654m79194m331667n144118J116877
$$ -14335541 -12357967 -10346381 -8612176 -7062522 -7541716 -11873383 -17017501 -15900624
36121a5900624J0405316J4063181R816528M041742J647741j88020m515326p030988
$$ -15900624 -5495308 8567873 18384401 22426143 24073884 23885864 19370538 12339550
36113A2339550k795737L570060L010838l961598p306842k517003L000859J782481
$$ 12339550 9543813 13113873 16124711 12163113 4856271 2339268 5340127 7122608
36105G122608l121461m358243j072777K189437L084481K432019P15268j403775
$$ 7122608 4001147 -357096 -1429873 759564 3844045 6276064 6991332 5587557
36097E587557j673272L78334J470344j96622j463839l16955p53410n511340q665013
$$ 5587557 3914285 4292619 5762963 5566341 4102502 3785547 3032137 -2479203 -11144216
36088a1144216l681614M533462N446865n81270k304757M511184R802150M288654
$$ -11144216 -14825830 -10292368 -4845503 -5426773 -7731530 -3220346 6581804 10870458
36080A0870458o788272j1420833o558408N10381L097857J486219k06296R43453
$$ 10870458 4082186 -7338647 -13897055 -13386674 -10288817 -8802598 -9008894 -8065441
36072h065441M459125O874420M998160j13660l934285l755252r78753K005267
$$ -8065441 -3606316 3268104 8266264 8152604 4218319 463067 -515686 1489581
36064A489581L967824L527296j86922m512522n193204k620824j438417k492512
$$ 1489581 5457405 8984701 8797779 4285257 -907947 -3528771 -4967188 -7459700
36056g459700j042272M262962P021732K410104m679030o655167l777070j238551
$$ -7459700 -8501972 -4239010 2782722 5192826 513796 -6141371 -9918441 -11156992
36048a1156992J20852K479548L463275j043004p406854o963263M25142M575273
$$ -11156992 -11036140 -8556592 -5093317 -6136321 -13543175 -20506438 -20081296 -15506023
36040a5506023K61414m066176J061874J1097632J3310414M750455m137540m304814
$$ -15506023 -15244609 -19310785 -18248911 -7151279 6159135 10909590 6772050 2467236
36032B467236R33211K833022m07317l334711k520900l37364N88609J375315L037234
$$ 2467236 3400447 6233469 5826152 2491441 -29459 -366823 221786 1597101 4634335
36023D634335K800899j598062o195441m419193L527930R472474P056956q07321
$$ 4634335 7435234 5837172 -358269 -4777462 -1249532 8222942 15279898 14472577
36015A4472577o496252o769512m294288j982688M42306M039577P525946Q000785
$$ 14472577 7976325 1206813 -3087475 -5070163 -4627857 -588280 6937666 14938451
36007A4938451M135414k097614o958350q066684n786845j844349K085144M061973
$$ 14938451 19073865 16976251 10017901 1951217 -3835628 -5679977 -3594833 467140
35999D67140K515612r33884j654426J907532M553363J193334m450288m237689
$$ 467140 2982752 2048868 394442 2301974 6855337 8048671 3598383 -639306
35991f39306J569210L394057l447052j0881241r101099J59901P104131O746403
$$ -639306 929904 4323961 876909 -10004332 -19105431 -18945530 -11841399 -5094996
35983e094996K514675m32193k5884K958082N373937L397959k436801o070013l717724
$$ -5094996 -2580321 -3012514 -3038398 -80316 5293621 8691580 6254779 184766 -3532958
35974c532958L5845j155819n642968o766672l465458q95278j318531j644414n13477
$$ -3532958 -3497113 -4652932 -10295900 -17062572 -20528030 -21423308 -22741839 -24386253 -24899730
35965b4899730o96004k584445j747250L891189R332691Q448518J492665n881355
$$ -24899730 -25595734 -28180179 -29927429 -26036240 -16703549 -8255031 -6762366 -12643721
35957a2643721q616308n591447M77280M942599N015303K458959R37647J355415
$$ -12643721 -21260029 -26851476 -26374196 -21431597 -16416294 -13957335 -13019688 -11664273
35949a1664273K232067L121672L869486K178144k947931o666088l588028K908561
$$ -11664273 -9432206 -6310534 -2441048 -262904 -3210835 -9876923 -13464951 -10556390
35941a0556390M106858o51341k401525L084029Q096188N059630j950503m532104
$$ -10556390 -6449532 -7100873 -9502398 -6418369 1677819 6737449 4786946 254842
35933B54842k728771k552284m712205m155690O65422N437109O970482O715436
$$ 254842 -2473929 -5026213 -9738418 -13894108 -13228686 -7791577 -821095 5894341
35925E894341O592059N826055K991590j649548o241393q118890n632493r60074
$$ 5894341 12486400 18312455 21304045 19654497 13413104 5294214 -338279 -1298353
35917a298353J025974j019779k581397j05886L131654K126368j951125m100667
$$ -1298353 -272379 -1292158 -3873555 -3979441 -847787 1278581 -672544 -4773211
35909d773211l371138k612994k017844O57301L916218L263210r71465k785211
$$ -4773211 -8144349 -10757343 -12775187 -12117886 -8201668 -4938458 -5909923 -8695134
35901h695134M91059L834227K063334k823899n413049m606589l581513l762679
$$ -8695134 -8204075 -4369848 -2306514 -5130413 -10543462 -15150051 -18731564 -22494243
35893b2494243k695387J839746P910721J0831197Q207085K786453p54788j578442
$$ -22494243 -25189630 -23349884 -15439163 -4607966 3599119 6385572 5630784 4052342
35885D052342k941661n978151o684683j945191M507059O542005M148179K515887
$$ 4052342 1110681 -4867470 -11552153 -13497344 -8990285 -2448280 1699899 4215786
35877D215786L565893L804750Q85436k882766m753320m794970l610314r76837
$$ 4215786 7781679 11586429 12471865 9589099 4835779 40809 -3569505 -4546342
35869d546342J797051K116606J71850j006068o78806j249450k679380j317727
$$ -4546342 -2749291 -632685 -460835 -1466903 -2145709 -3395159 -6074539 -7392266
35861g392266L099765M601093o89354p529381p756720p57346O866456R956053
$$ -7392266 -4292501 308592 -380762 -7910143 -15666863 -16424209 -9557753 398300
35853C98300Q528621M407115r29127n115783n568903k512065P71976J324137q39970
$$ 398300 8926921 13334036 12404909 7289126 1720223 -791842 -19866 1304271 464301
35844D64301l104715k666773L71343K142723n76824m937105m631229R30053M716136
$$ 464301 -2640414 -5307187 -4935844 -2793121 -3369945 -8307050 -12938279 -12008226 -7292090
35835g292090K007583k726789l240282j178403k201268n775535o198752k418725
$$ -7292090 -5284507 -8011296 -11251578 -12429981 -14631249 -20406784 -26605536 -29024261
35827b9024261O28012O49888Q65374K894527L517775J193654j4109L282652P974895
$$ -29024261 -28396249 -27746361 -26880987 -23986460 -20468685 -19275031 -19289140 -16006488 -8031593
35818h031593Q793959N324302J171012j380738k568969k884270k601597k445617
$$ -8031593 762366 6086668 7257680 5876942 3307973 423703 -2177894 -4623511
35810d623511k618190k309524j505080j435513j901852o06659K947915N429119
$$ -4623511 -7241701 -9551225 -11056305 -12491818 -14393670 -15000329 -12052414 -6623295
35802f623295M049611P85989o03620P5334K06513r89681j997809k427491l392017
$$ -6623295 -2573684 -1787695 -2391315 -2315981 -2109468 -3099149 -5096958 -7524449 -10916466
35793a0916466m470155l548379l50585K710614M274526N974324Q779694R593260
$$ -10916466 -15386621 -18935000 -19285585 -16574971 -12300445 -6326121 2453573 12046833
35785A2046833M701192l727136q103258m371140J868738J794783m712041q256989
$$ 12046833 16748025 13020889 4917631 546491 2415229 4210012 -502029 -8759018
35777h759018k758655N699109P180592J513821k712038j255382J037077m25432
$$ -8759018 -11517673 -5818564 1362028 2875849 163811 -1091571 -54494 -479926
35769d79926l099659k968767j141544n30976o07187K7554j91045k389819l693928
$$ -479926 -3579585 -6548352 -7689896 -8220872 -8828059 -8800505 -8991550 -11381369 -15075297
35760a5075297j974171n13344k283638l086037K536926J0851735J2389436N435844
$$ -15075297 -17049468 -17562812 -19846450 -22932487 -20395561 -9543826 2845610 8281454
35752H281454j677474k699926n92691m76563k123197k729963j885712k86462K330528
$$ 8281454 6603980 3904054 3311363 2834800 711603 -2018360 -3904072 -4190534 -1860006
35743a860006M831982M012236n83141m289780k798985K320161N792189M250128
$$ -1860006 2971976 6984212 6401071 2111291 -687694 1632467 7424656 11674784
35735A1674784j533343p397513q071589k088311M971812O135916K237056K48153
$$ 11674784 10141441 2743928 -5327661 -7415972 -2444160 3691756 5928812 6176965
35727F176965K008707J807671k616595n007746j347706K244472n47429n071785
$$ 6176965 8185672 9993343 7376748 2369002 1021296 3265768 2718339 -2353446
35719b353446l247404K693442L907534m41118k498491J026180M668632M318087
$$ -2353446 -5600850 -2907408 1000126 559008 -1939483 -913303 3755329 8073416
35711H073416K746920K753777K269637p44340m487427o945868q123037o972593
$$ 8073416 10820336 13574113 15843750 15099410 10611983 3666115 -4456922 -11429515
35703a1429515j836045M225699M754114p79628m950044k869388J147393J276874
$$ -11429515 -13265560 -9039861 -4285747 -5065375 -10015419 -12884807 -11737414 -10460540
35695a0460540j088921j237751Q59288J896809J356608J245212K108577L455128
$$ -10460540 -11549461 -12787212 -11927924 -10031115 -8674507 -7429295 -5320718 -1865590
35687a865590N549544O954881L660044m555172j0147379o206555L252164P785650
$$ -1865590 3683954 10638835 14298879 9743707 -403672 -6610227 -3358063 4427587
35679D427587M293307m30986j169169j130271m554967q367693o241408J697018
$$ 4427587 8720894 8289908 7120739 5990468 1435501 -6932192 -13173600 -11476582
35671a1476582Q067800P048764Q01388l758094k684925J826733N044917M589624
$$ -11476582 -3408782 3639982 4441370 683276 -2001649 -174916 4870001 9459625
35663I459625J321369k774716n753007n819266k854468K67890M52824j301768
$$ 9459625 10780994 8006278 2253271 -3565995 -6420463 -6152573 -5699749 -7001517
35655g001517j164482J494030K807550O15467j621896K05998M689660O829533
$$ -7001517 -8165999 -6671969 -3864419 -3248952 -4870848 -4664850 24810 6854343
35647F854343M443237q5203l175846k937668J9195K742749K255115r02793l268955
$$ 6854343 11297580 11212377 8036531 5098863 5118058 7860807 10115922 9213129 5944174
35638E944174l467248l492596l738050j309817L779918N698049Q97386n072031
$$ 5944174 2476926 -1015670 -4753720 -6063537 -2283619 3414430 4311816 -760215
35630g60215m894500k66343J711188M39174J662146N874493O027337p43977p057351
$$ -760215 -5654715 -5921058 -4209870 -3770696 -2108550 3765943 9793280 9049303 1991952
35621A991952n455206J097379L986644M29663m789890o825885n464567l068134
$$ 1991952 -3463254 -2365875 1620769 2050432 -2739458 -9565343 -15029910 -18098044
35613a8098044j364566o87401n60031m99138m67918k20762J226383M082160O284072
$$ -18098044 -19462610 -20150011 -20710042 -21209180 -21677098 -21897860 -20671477 -16589317 -10305245
35604a0305245N511497K376286n14391k169414l336730l608379j664481J599337
$$ -10305245 -4793748 -2417462 -2931853 -5101267 -8437997 -12046376 -13710857 -12111520
35596a2111520L477680L242768K400495J247524j077440k975295j293033L074444
$$ -12111520 -8633840 -5391072 -2990577 -1743053 -2820493 -5795788 -7088821 -4014377
35588d014377M894206J735818k514121l354117j304150L64817K07422j399182
$$ -4014377 879829 2615647 101526 -3252591 -4556741 -4191924 -3984502 -5383684
35580e383684l755156m984425k541075L022163P257974O927831L655453R29692
$$ -5383684 -9138840 -14123265 -16664340 -13642177 -6384203 543628 4199081 5128773
35572E128773J40999J098696L383325N275457M250932M43807k986641m161585
$$ 5128773 5269772 6368468 9751793 15027250 19278182 19721989 16735348 12573763
35564A2573763m128320l576560k001945q17599k119813l359866K17689N937499
$$ 12573763 8445443 4868883 2866938 2049339 -70474 -3430340 -3212651 2724848
35556B724848M629720m714057r987240k644156Q462315R123976l82780q038069
$$ 2724848 7354568 2640511 -7346729 -9990885 -1528570 7595406 7212626 -825443
35548h25443q316466n960863l749882Q81047O209033N275775j956302n726252
$$ -825443 -9141909 -15102772 -18852654 -17971607 -11762574 -6486799 -8443101 -14169353
35540a4169353n73943O198937N709330M4964k576416J39535L665705M299335K153049
$$ -14169353 -14743296 -8544359 -2835029 -2790065 -5366481 -5226946 -1561241 2738094 4891143
35531D891143j196173l614237k808528P63425L339805K935967K391689M393447
$$ 4891143 3694970 80733 -2727795 -1964370 1375435 4311402 6703091 11096538
35523A1096538O317267L847097k220487o635508o217129k621912Q03591K377812
$$ 11096538 17413805 21260902 19040415 12404907 6187778 3565866 4369457 6747269
35515F747269K452469K076703J379272p15818m038184n280382j663994L616315
$$ 6747269 9199738 11276441 12655713 11939895 7901711 2621329 957335 4573650
35507D573650L967337j385293n543879l764758k16270r21509m323329m403749
$$ 4573650 8540987 7155694 1611815 -2152943 -2369213 -3290722 -7614051 -12017800
35499a2017800l25339L203368L874493L901225M138035K170096j948916l274797
$$ -12017800 -12343139 -9139771 -5265278 -1364053 2773982 4944078 2995162 -279635
$$ [...]
##END NTUPLES=NMR SPECTRUM
##END=
