##TITLE=31Pdec_DE-63_34R
 D2O, 64 sc
 15.8.2024
##JCAMPDX= 6.0         $$ Bruker NMR JCAMP-DX V2.0
##DATA TYPE= NMR SPECTRUM
##DATA CLASS= NTUPLES
##ORIGIN= UXNMR, Bruker Analytische Messtechnik GmbH
##OWNER= root
$$ XWIN-NMR		Version 3.5
$$ Thu Aug 15 13:55:44 2024 Russian Standard Time (UT+4h)  she@DPX200
##.OBSERVE FREQUENCY= 81.013821
##.OBSERVE NUCLEUS= ^31P
##.ACQUISITION MODE= SIMULTANEOUS
##.ACQUISITION SCHEME= undefined
##.AVERAGES= 64
##.DIGITISER RES= 17
##SPECTROMETER/DATA SYSTEM= spect
##.PULSE SEQUENCE= zgpg30
##.SOLVENT NAME= D2O
##.SHIFT REFERENCE= (INTERNAL, D2O, 0, 198.062)
##AUDIT TRAIL= $$ (NUMBER, WHEN, WHO, WHERE, WHAT)
$$ ##TITLE= Audit trail, XWIN-NMR		Version 3.5
$$ ##JCAMPDX= 5.01
$$ ##ORIGIN= Bruker BioSpin GmbH
$$ ##OWNER= she
$$ F:/spectra/data/she/nmr/P31/2/pdata/1/auditp.txt
$$ ##AUDIT TRAIL=  $$ (NUMBER, WHEN, WHO, WHERE, WHAT)
(   1,<2024-08-15 13:54:52.32 +0400>,<she>,<DPX200>,
      <created by zg, POWCHK disabled, PULCHK disabled
       configuration hash MD5:
       00 E9 B6 7A A2 85 ED C7 34 08 36 98 17 FE 4E 26
       data hash MD5: 32K
       F8 7C DD A6 AF A9 13 48 96 34 88 67 C8 6A 30 FF>)
(   2,<2024-08-15 13:54:54.78 +0400>,<she>,<DPX200>,
      <Start of raw data processing
       efp BC_mod = 2 LB = 1.5 FT_mod = 6 PKNL = 1 PHC0 = 2740.02 PHC1 = -81.71195 SI = 64K 
       data hash MD5: 64K
       AC B6 65 D2 91 1B D7 B3 15 30 12 74 79 88 43 21>)
(   3,<2024-08-15 13:55:17.48 +0400>,<she>,<DPX200>,
      <pk PHC0 = -57.43568 PHC1 = 143.8 
       data hash MD5: 64K
       6E 19 FB A6 D8 8F 97 1A F2 74 EB 1C B7 FD 04 3D>)
$$ ##END=
$$ 
$$ hash MD5
$$ 6C DA 1E 12 51 2D 19 AB 24 1E 81 A7 A6 04 DA 75
##$RELAX= 
##$RELAX= 
##$RELAX= 
##$RELAX= 
##$RELAX= 
##$RELAX= 
##$RELAX= 
##$RELAX= 
$$ Bruker specific parameters
$$ --------------------------
##$DU= <F:/spectra>
##$EXPNO= 2
##$NAME= <P31>
##$PROCNO= 1
##$TYPE= <nmr>
##$USER= <she>
##$AMP= (0..31)
100 100 100 100 100 100 100 100 100 100 100 100 100 100 100 100 100 100 
100 100 100 100 100 100 100 100 100 100 100 100 100 100 
##$AQSEQ= 0
##$AQ_mod= 1
##$AUNM= <au_zg>
##$AUTOPOS= <>
##$BF1= 81.014009
##$BF2= 200.13
##$BF3= 200.13
##$BF4= 200.13
##$BF5= 200.13
##$BF6= 200.13
##$BF7= 200.13
##$BF8= 200.13
##$BYTORDA= 1
##$CFDGTYP= 0
##$CFRGTYP= 5
##$CHEMSTR= <none>
##$CNST= (0..31)
1 1 145 1 1 1 1 1 1 1 1 1 1 1 1 1 1 1 1 1 1 1 1 1 1 1 1 1 1 1 1 1 
##$CPDPRG= <waltz16>
##$CPDPRG1= <>
##$CPDPRG2= <waltz16>
##$CPDPRG3= <>
##$CPDPRG4= <mlev>
##$CPDPRG5= <mlev>
##$CPDPRG6= <mlev>
##$CPDPRG7= <mlev>
##$CPDPRG8= <mlev>
##$CPDPRGB= <>
##$CPDPRGT= <>
##$D= (0..31)
0 1 0 0 0 0 0 0 0 0.06 0 0.03 2e-05 3e-06 0 0 0.0002 0 0 0 0 0 0 0 0 0 
0 0 0 0 0 0 
##$DATE= 1723715691
##$DBL= (0..7)
120 120 120 11 120 120 24 19 
##$DBP= (0..7)
150 150 150 150 150 150 150 150 
##$DBP07= 0
##$DBPNAM0= <>
##$DBPNAM1= <>
##$DBPNAM2= <>
##$DBPNAM3= <>
##$DBPNAM4= <>
##$DBPNAM5= <>
##$DBPNAM6= <>
##$DBPNAM7= <>
##$DBPOAL= (0..7)
0.5 0.5 0.5 0.5 0.5 0.5 0.5 0.5 
##$DBPOFFS= (0..7)
$$ [...]
##$SUBNAM3= <"">
##$SUBNAM4= <"">
##$SUBNAM5= <"">
##$SUBNAM6= <"">
##$SUBNAM7= <"">
##$SUBNAM8= <"">
##$SUBNAM9= <"">
##$SW= 400.765351723535
##$SWIBOX= (0..15)
0 1 3 0 0 0 0 0 0 0 0 0 0 0 0 0 
##$SW_h= 32467.5324675325
##$TD= 32768
##$TD0= 1
##$TE= 0
##$TE2= 300
##$TE3= 300
##$TEG= 300
##$TL= (0..7)
0 120 53 12 22 120 120 120 
##$TP= (0..7)
150 150 150 150 150 150 150 150 
##$TP07= 0
##$TPNAME0= <>
##$TPNAME1= <>
##$TPNAME2= <>
##$TPNAME3= <>
##$TPNAME4= <>
##$TPNAME5= <>
##$TPNAME6= <>
##$TPNAME7= <>
##$TPOAL= (0..7)
0.5 0.5 0.5 0.5 0.5 0.5 0.5 0.5 
##$TPOFFS= (0..7)
0 0 0 0 0 0 0 0 
##$TUNHIN= 0
##$TUNHOUT= 0
##$TUNXOUT= 0
##$USERA1= <user>
##$USERA2= <user>
##$USERA3= <user>
##$USERA4= <user>
##$USERA5= <user>
##$V9= 5
##$VALIST= <valist>
##$VCLIST= <CCCCCCCCCCCCCCC>
##$VD= 0
##$VDLIST= <DDDDDDDDDDDDDDD>
##$VPLIST= <PPPPPPPPPPPPPPP>
##$VTLIST= <TTTTTTTTTTTTTTT>
##$WBST= 1024
##$WBSW= 4
##$XGAIN= (0..3)
0 0 0 0 
##$XL= 0
##$YL= 0
##$YMAX_a= 16736
##$YMIN_a= -13330
##$ZGOPTNS= <>
##$ZL1= 120
##$ZL2= 120
##$ZL3= 120
##$ZL4= 120
##$ABSF1= 0
##$ABSF2= 0
##$ABSG= 0
##$ABSL= 0
##$ALPHA= 0
##$AQORDER= 0
##$ASSFAC= 0
##$ASSFACI= 0
##$ASSFACX= 0
##$ASSWID= 0
##$AUNMP= <proc_1d>
##$AZFE= 0.1
##$AZFW= 0.5
##$BCFW= 0
##$BC_mod= 2
##$BYTORDP= 0
##$COROFFS= 0
##$CY= -3
##$DATMOD= 1
##$DC= 0
##$DFILT= <>
##$DTYPP= 0
##$F1P= 0
##$F2P= 0
##$FCOR= 1
##$FTSIZE= 65536
##$FT_mod= 6
##$GAMMA= 0
##$GB= 0
##$INTBC= 1
##$INTSCL= 9.790993e-09
##$ISEN= 30
##$LB= 1.5
##$LEV0= 0
##$LPBIN= 0
##$MAXI= 10000
##$MC2= 0
##$MEAN= 0
##$ME_mod= 0
##$MI= 50
##$NCOEF= 0
##$NC_proc= -9
##$NLEV= 6
##$NOISF1= 182.463
##$NOISF2= 159.3651
##$NSP= 0
##$NTH_PI= 0
##$NZP= 0
##$OFFSET= 198.0616
##$PC= 4
##$PHC0= 2682.584
##$PHC1= 62.08805
##$PH_mod= 1
##$PKNL= yes
##$PPARMOD= 0
##$PSCAL= 0
##$PSIGN= 0
##$REVERSE= no
##$SF= 81.0140089999434
##$SI= 65536
##$SIGF1= 159.3651
##$SIGF2= -187.1042
##$SINO= 113.3802
##$SIOLD= 16384
##$SREGLST= <1H.CDCl3>
##$SSB= 0
##$STSI= 65536
##$STSR= 0
##$SW_p= 32467.5324675325
##$SYMM= 0
##$S_DEV= 0
##$TDeff= 32768
##$TDoff= 0
##$TI= <>
##$TILT= no
##$TM1= 0
##$TM2= 0
##$TOPLEV= 0
##$USERP1= <user>
##$USERP2= <user>
##$USERP3= <user>
##$USERP4= <user>
##$USERP5= <user>
##$WDW= 1
##$XDIM= 65536
##$YMAX_p= 344228925
##$YMIN_p= -145115431
$$ End of Bruker specific parameters
$$ ---------------------------------
##NTUPLES= NMR SPECTRUM
##VAR_NAME=  FREQUENCY,     SPECTRUM/REAL,   SPECTRUM/IMAG
##SYMBOL=    X,             R,               I
##VAR_TYPE=  INDEPENDENT,   DEPENDENT,       DEPENDENT
##VAR_FORM=  AFFN,          ASDF,            ASDF
##VAR_DIM=   65536,         65536,           65536
##UNITS=     HZ,            ARBITRARY UNITS, ARBITRARY UNITS
##FACTOR=    0.49542278885378, 1,            1
##FIRST=     16045.7642231865, 0,            0
##LAST=      -16421.768244346, 0,            0
##MIN=       -16421.768244346, -145115431,   0
##MAX=       16045.7642231865, 344228925,    0
$$ Real data points
##PAGE= N=1
##DATA TABLE= (X++(R..R)), XYDATA
$$ [...]
$$ plain form
40421 -15468899 -18641075 -19353094 -15484247 -6796856 91550 -1763572 -8995975 -11387330
40413 -11387330 -6891524 -5095754 -12342984 -21317339 -21805479 -15886189 -13961681 -18511453
40405 -18511453 -20698459 -13554862 -1061721 8165096 10569525 8130776 3568012 -1199119
40397 -1199119 -4102800 -3641131 -63691 5160719 9928488 11384325 7569210 222474
40389 222474 -6001709 -8135141 -7124944 -5133790 -3010058 -1286524 -1148482 -2885849
40381 -2885849 -5221919 -7300057 -9424634 -10999260 -10320445 -7924064 -7568972 -11671121
40373 -11671121 -17582356 -20554407 -19062280 -15447661 -12608988 -11604176 -11288397 -9226607
40365 -9226607 -4529465 -479922 -1898106 -8876316 -16144235 -19983561 -21842469 -22781183
$$ packed form
40421a5468899l172176p12019L868847Q687391O888406j855122p232403k391355
40413a1387330M495806J795770p247230q974355m88140N919290J924508m549772
40405a8511453k187006P143597J2493141R226817K404429k438749m562764m767131
40397a199119k903681M61669L577440N224410M767769J455837l815115p346736
40389B22474o224183k133432J010197J991154K123732J723534J38042j737367
40381b885849k336070k078138k124577j574626O78815K396381L55092m102149
40373a1671121n911235k972051J492127L614619K838673J004812L15779K061790
40365i226607M697142M049543j418184o978210p267919l839326j858908r38714
$$ plain form
40357 -22781183 -19186903 -8696109 3382099 9555032 9860274 9869889 10428203 6673147
40349 6673147 -2040238 -8446044 -6706166 -309722 2941886 291515 -4860435 -8324140
40341 -8324140 -8340801 -5373397 -1607735 293810 -340989 -2083513 -4511626 -9107893 -15748034
40332 -15748034 -21047844 -22430353 -21505683 -20873694 -19774755 -16144611 -11372135 -9065285
40324 -9065285 -9321395 -7977193 -2524960 4275156 8426533 9941336 11332494 12072289
40316 12072289 8334835 -378086 -7510210 -6128314 1487733 5413592 600913 -6582754
40308 -6582754 -7742111 -4553208 -5677528 -13184308 -19037732 -16675633 -10155363 -8239187
40300 -8239187 -13345378 -20309117 -23624297 -22144297 -17976485 -13994601 -12015944 -11426364
$$ packed form
40357b2781183L594280J0490794J2078208O172933L05242R615N58314l755056
40349F673147q713385o405806J739878O396444L251608k650371n151950l463705
40341h324140j6661K967404L765662J901545o34799j742524k428113m596267o640141
40332a5748034n299810j382509R24670O31989J098939L630144M772476K306850
40324i065285k56110J344202N452233O800116M151377J514803J391158P39795
40316A2072289l737454q712921p132124J381896P616047L925859m812679p183667
40308f582754j159357L188903j124320p506780n853424K362099O520270J916176
40300h239187n106191o963739l315180J480000M167812L981884J978657N89580
$$ plain form
40292 -11426364 -10276577 -8819443 -9993832 -14587022 -18166648 -15590096 -7102159 2641409
40284 2641409 10170091 14997996 17160000 16324848 13065711 8326234 1949176 -5871075
40276 -5871075 -12394737 -14482319 -12556033 -9450812 -5558663 1416916 11280443 19385031
40268 19385031 21600999 18952070 15597508 13865757 12861236 10764080 6995507 2643238
40260 2643238 -446780 -1503650 -1984228 -3953978 -7143693 -8898407 -7457588 -3894893
40252 -3894893 -126633 3534297 7559828 10950680 11606703 9228782 6651318 7104525
40244 7104525 10017673 10685692 5522440 -2699200 -7065942 -4836481 -1091029 -1841089
40236 -1841089 -5575628 -5455724 579615 6227935 4843325 -2303899 -8317620 -9183753
$$ packed form
40292a1426364J149787J457134j174389m593190l579626K576552Q487937R743568
40284B641409P528682M827905K162004q35152l259137m739477o377058p820251
40276e871075o523662k087582J926286L105221L892149O975579R863527Q104588
40268A9385031K215968k648929l354562j731751j004521k097156l768573m352269
40260B643238l090018j056870m80578j969750l189715j754714J440819L562695
40252c894893L768260L660930M025531L390852O56023k377921k577464M53207
40244G104525K913148O68019n163252q221640m366742K229461L745452p50060
40236a841089l734539J19904O035339N648320j384610p147224o013721q66133
$$ plain form
40228 -9183753 -7282414 -7331804 -11156529 -16281766 -18182170 -14315620 -7277585 -3256996
40220 -3256996 -5650143 -10846424 -12495759 -9432064 -6241603 -5557817 -4029267 1038525
40212 1038525 4591220 -762512 -12646868 -18701300 -11535159 948222 5081851 -1765400
40204 -1765400 -9863923 -11185104 -7779775 -5027018 -3532172 -1553465 -6475 273142
40196 273142 2475098 8981430 14877273 12829948 3836602 -3344796 -4186539 -3419296 -5920671
40187 -5920671 -8787750 -6842453 -1561066 929993 -1589955 -6089158 -10248633 -14443017
40179 -14443017 -17613349 -16401652 -10358468 -3960010 -591052 2483574 9662275 19512177
40171 19512177 25855070 25798975 22501361 19225857 14857798 7625093 -276565 -5478933
$$ packed form
40228i183753J901339m9390l824725n125237j900404L866550P038035M020589
40220c256996k393147n196281j649335L063695L190461O83786J528550N067792
40212A038525L552695n353732j1884356o054432P166141J2483381M133629o847251
40204a765400q098523j321181L405329K752757J494846J978707J546990K79617
40196B73142K201956O506332N895843k047325q993346p181398q41743P67243k501375
40187e920671k867079J945297N281387K491059k519948m499203m159475m194384
40179a4443017l170332J211697O043184O398458L368958L074626P178701R849902
40171A9512177O342893n6095l297614l275504m368059p232705p901658n202368
$$ plain form
40163 -5478933 -8679570 -12874668 -17405481 -18252336 -14324926 -9119092 -5480348 -3274657
40155 -3274657 -3460366 -8975187 -18257405 -22765940 -16128885 -2922504 6651588 8632655
40147 8632655 6684112 3679093 -1408836 -8018049 -11771607 -9943289 -4773536 577613
40139 577613 5495751 9464793 10080822 6260901 694639 -3359192 -5617020 -7350716
40131 -7350716 -8871529 -10420252 -13195587 -17079573 -19036631 -16104744 -9035449 -1413847
40123 -1413847 3917994 6569444 7835721 8880833 8731449 4559620 -4087390 -12360835
40115 -12360835 -14861100 -12720912 -11427415 -11729058 -8818390 -2057220 1546097 -2434500
40107 -2434500 -8533480 -10036529 -9439353 -12818852 -17625970 -15030034 -3558078 7881297
$$ packed form
40163e478933l200637m195098m530813q46855L927410N205834L638744K205691
40155c274657j85709n514821r282218m508535O637055J3206381R574092J981067
40147H632655j948543l005019n087929o609213l753558J828318N169753N351149
40139E77613M918138L969042O16029l819921n566262m053831k257828j733696
40131g350716j520813j548723k775335l883986j957058K931887P069295P621602
40123a413847N331841K651450J266277J045112j49384m171829q647010q273445
40115a2360835k500265K140188J293497l01643K910668O761170L603317l980597
40107b434500o098980j503049N97176l379499m807118K595936J1471956J1439375
$$ plain form
40099 7881297 11683442 9431248 6476558 4978002 5099536 7866412 12947468 16621973
40091 16621973 15175520 8850308 995207 -4928738 -6935493 -5701633 -4942005 -7966030
40083 -7966030 -13095448 -15105054 -11726836 -5875074 -1112025 1650660 2418236 1111461
40075 1111461 -481846 267776 2303051 1399002 -3089320 -6581525 -6838987 -8099044 -13624689
40066 -13624689 -18779848 -17181052 -10591205 -6327575 -6418460 -5960876 -2352735 321341
40058 321341 -1661625 -5108340 -3789109 3606540 12027100 15214849 10720178 1221415
40050 1221415 -7500468 -10754719 -8460945 -4325856 -1353700 826819 3779864 6750482
40042 6750482 6652449 1409624 -7467908 -15928009 -20788933 -21702420 -19637149 -14510193 -5878292
$$ packed form
40099G881297L802145k252194k954690j498556J21534K766876N081056L674505
40091A6621973j446453o325212p855101n923945k006755J233860P59628l024025
40083g966030n129418k009606L378218N851762M763049K762685P67576j306775
40075A111461j593307P49622K035275r04049m488322l492205k57462j260057n525645
40066a3624689n155159J598796O589847M263630r0885M57584L608141K674076
40058C21341j982966l446715J319231P395649Q420560L187749m494671r498763
40050A221415q721883l254251K293774M135089K972156K180519K953045K970618
40042F750482r8033n242825q877532q460101m860924r13487K065271N126956Q631901
$$ plain form
40033 -5878292 4389508 12397923 15884962 15680269 12921711 7523283 848089 -3302368
40025 -3302368 -3375701 -3338573 -7612396 -14512185 -18853875 -19778495 -20982126 -23324306 -22719216
40016 -22719216 -16979228 -9875719 -5554532 -2685025 2373825 9151712 13390669 12472704
40008 12472704 7626710 1571287 -3604571 -6715385 -7615197 -6981482 -5158464 -2101108
40000 -2101108 993021 1762669 -559090 -4263609 -7892743 -11313923 -13013320 -10084557
39992 -10084557 -3505912 533150 -1255456 -3369098 567238 6675609 5070731 -5259070
39984 -5259070 -13822137 -12764604 -6259658 -2315748 -2125366 -2914528 -5581002 -12129988
39976 -12129988 -18679017 -18607329 -11883996 -5017909 -2146116 -2122714 -4135012 -9369895 -15903524
$$ packed form
40033e878292J0267800Q008415L487039k04693k758558n398428o675194m150457
40025c302368p3333L7128m273823o899789m341690r24620j203631k342180O05090
40016b2719216N739988P103509M321187K869507N058850O777887M238957r17965
40008A2472704m845994o055423n175858l110814q99812O33715J823018L057356
40000b101108L094129P69648k321759l704519l629134l421180j699397K928763
39992a0084557O578645M039062j788606k113642L936336O108371j604878j0329801
39984e259070q563067J057533O504946L943910J90382p89162k666474o548986
39976a2129988o549029P1688O723333O866087K871793K3402k012298n234883o533629
$$ plain form
39967 -15903524 -18617551 -16646249 -14799658 -14688652 -11134620 -2088648 4524533 1238079
39959 1238079 -6343704 -6228886 2883824 10504839 10147739 6572925 5062654 3052799
39951 3052799 -2338928 -6471909 -4398813 -476639 -2318143 -8184318 -9062086 -2443648
39943 -2443648 4308074 5399094 3868782 4825706 7774263 9332838 8674810 6394316
39935 6394316 2047401 -3102479 -4474688 93143 5839006 7354924 7239557 12512058
39927 12512058 22840952 28684720 23269498 11564763 3801285 3066496 3606133 497183
39919 497183 -3549116 -3003863 1695960 4095551 626595 -4264153 -4460600 -768039 1299056
39910 1299056 991500 3683948 11612065 19116724 20356140 16841661 13072162 9184789
$$ packed form
39967a5903524k714027J971302J846591J11006L554032R045972O613181l286454
39959A238079p581783J14818R112710P621015l57100l574814j510271k009855
39951C052799n391727m132981K073096L922174j841504n866175q77768O618438
39943b443648O751722J091020j530312R56924K948557J558575o58028k280494
39935F394316m346915n149880j372209M567831N745863J515918j15367N272501
39927A2512058J0328894N843768n415222j1704735p763478p34789N39637l108950
39919D97183m046299N45253M699823K399591l468956m890748j96447L692561K067095
39910A299056l07556K692448P928117P504659J239416l514479l769499l887373
$$ plain form
39902 9184789 3547856 -973568 -300217 3213847 3559884 812777 900018 5401856 9046636
39893 9046636 8874917 8450665 10069618 9836893 4857465 -527361 -727724 3380464 7443877
39884 7443877 10097973 11507173 9477642 2748590 -4757622 -8497613 -9715308 -12089209
39876 -12089209 -14620744 -13775013 -10589582 -9159335 -9246843 -7082139 -3187021 -2550939 -6087381
39867 -6087381 -8330963 -5742484 -1965895 -2142281 -6044316 -9401224 -9064243 -5077124
39859 -5077124 -267460 1121422 -2822827 -8526584 -10422260 -8067694 -6597619 -9744404
39851 -9744404 -15955701 -21812800 -25342769 -25271143 -21162430 -15415249 -11272142 -8048137
39843 -8048137 -2438338 4992384 9740634 10709175 11683430 13531905 11407089 3310869
$$ packed form
39902I184789n636933m521424O73351L514064L46037k747107Q7241M501838L644780
39893I046636j71719m24252J618953k32725m979428n384826k00363M108188M063413
39884G443877K654096J409200k029531o729052p506212l739991j217695k373901
39876a2089209k531535Q45731L185431J430247q7508K164704L895118O36082l536442
39867f087381k243582K588479L776589j76386l902035l356908L36981L987119
39859e077124M809664J388882l944249n703757j895676K354566J470075l146785
39851i744404o211297n857099l529969P1626M108713N747181M143107L224005
39843h048137N609799P430722M748250R68541R74255J848475k124816q096220
$$ plain form
39835 3310869 -4516644 -5646153 -2162078 -150142 -456021 510739 3714233 6781123
39827 6781123 8490905 9207701 8363676 5635369 3031959 2152971 1369187 -687950 -1445395
39818 -1445395 1541672 5403338 5836191 4345141 6463151 13675233 21579354 25275964
39810 25275964 22826788 14928106 5324193 -59836 1198631 4625666 5112356 4167831
39802 4167831 6068229 9612839 10261151 8761091 10408593 15989315 20283605 20019926
39794 20019926 17115661 13684653 10108901 8467436 11176122 15144320 13757870 5936903
39786 5936903 -3085119 -10779247 -19566576 -28317129 -30015607 -21927616 -11083844 -5104841
39778 -5104841 -3533348 -2506208 -1871355 -2620228 -2743481 -1062557 -561432 -2860150 -3992191
$$ packed form
39835C310869p827513j129509L484075K011936l05879R66760L203494L066890
39827F781123J709782P16796q44025k728307k603410q78988p83784k057137p57445
39818a445395K987067L861666M32853j491050K118010P212082P904121L696610
39810B5275964k449176p898682r603913n384029J258467L427035M86690r44525
39802D167831J900398L544610O48312j500060J647502N580722M294290k63679
39794B0019926k904265l431008l575752j641465K708686L968198j386450p820967
39786E936903r022022p694128q787329q750553j698478Q087991J0843772N979003
39778e104841J571493J027140O34853p48873j23253J680924N01125k298718j132041
$$ plain form
39769 -3992191 -905378 2361554 625674 -4405465 -7787938 -9241545 -11489743 -14165674
39761 -14165674 -15404439 -16378197 -18223333 -17575913 -11581612 -4552720 -2953311 -6150249
39753 -6150249 -8834241 -10100833 -12614573 -14710184 -11675790 -4500156 383367 286253
39745 286253 -1709867 -3570500 -5755420 -6147082 -1823501 3466020 2208479 -4942789
39737 -4942789 -8859719 -5802035 -2346483 -2954047 -2439460 3164578 7192122 2150383
39729 2150383 -7594652 -11995484 -9761782 -7624069 -8133272 -7393065 -3884413 -794614
39721 -794614 1064874 4802782 9987595 10441157 2718547 -8117202 -14543462 -14953394
39713 -14953394 -13189056 -12753058 -14544046 -18176154 -22350789 -24871075 -24856337 -24527285 -26632833
$$ packed form
39769c992191L086813L266932j735880n031139l382473j453607k248198k675931
39761a4165674j238765r73758j845136O47420N994301P028892J599409l196938
39753f150249k683992j266592k513740k095611L034394P175634M883523r7114
39745B86253j996120j860633k184920l91662M323581N289521j257541p151268
39737d942789l916930L057684L455552o07564N14587N604038M027544n041739
39729B150383r745035m400832K233702K137713n09203P40207L508652L089799
39721g94614J859488L737908N184813M53562p722610j0835749o426260m09932
39713a4953394J764338M35998j790988l632108m174635k520286J4738L29052k105548
$$ plain form
39704 -26632833 -30139217 -30551614 -25288574 -17091041 -10483282 -5785230 746585 10194669
39696 10194669 17350459 16609727 9829698 4455309 4075078 5127312 4033518 2989493
39688 2989493 5704706 10972647 14391648 14068873 10611306 3641643 -6542599 -14733539
39680 -14733539 -14112084 -5254596 2790202 2858206 -2384910 -5652709 -5357524 -6951923 -14876276
39671 -14876276 -26457920 -34464365 -34116973 -27173805 -19983377 -17581530 -19067062 -18890799
39663 -18890799 -13021110 -3254085 4995080 8172566 7021388 4822014 4932055 9226118
39655 9226118 16429184 21632669 19914310 11842306 3702158 717246 1566829 1470751 -1013300
39646 -1013300 -3277236 -3700131 -3396080 -2575360 512877 5103904 6403410 1885141 -3888654
$$ packed form
39704b6632833l506384m12397N263040Q197533O607759M698052O531815R448084
39696A0194669P155790p40732o780029n374389l80231J052234j093794j044025
39688B989493K715213N267941L419001l22775l457567o969663j0184242q190940
39680a4733539O21455Q857488Q044798O8004n243116l267799K95185j594399p924353
39671a4876276j1581644q006445L47392O943168P190428K401847j485532J76263
39663a8890799N869689R767025Q249165L177486j151178k199374J10041M294063
39655I226118P203066N203485j718359q072004q140148k984912Q49583r6078k484051
39646a013300k263936m22895L04051Q20720L088237M591027J299506m518269n773795
$$ plain form
39637 -3888654 -4685464 -582424 3842013 7331659 12343555 18162075 19850467 15484550
39629 15484550 8955219 3376188 -3022324 -11237870 -16768349 -15231651 -9148957 -4194334
39621 -4194334 -1458593 1314858 3098983 552353 -4830203 -6717689 -2355350 3924848
39613 3924848 7194868 7604787 7707406 8272138 9441557 12592066 17690076 21096001 19351052
39604 19351052 13874499 9126774 7125664 6357847 5239287 3828735 2311680 436711
39596 436711 -1118823 -1032451 253847 290186 -1983905 -3870890 -1462672 5811825 14255247
39587 14255247 19309007 18898814 13550235 4777521 -5549322 -15151035 -22376251 -27456527
39579 -27456527 -31380030 -33213863 -30221363 -21721169 -11404203 -4188537 -1705327 -2501513
$$ packed form
39637c888654p96810M103040M424437L489646N011896N818520J688392m365917
39629A5484550o529331n579031o398512q215546n530479J536698O082694M954623
39621d194334K735741K773451J784125k546630n382556j887486M362339O280198
39613C924848L270020M09919J02619N64732J169419L150509N098010L405925j744949
39604A9351052n476553m747725k001110p67817j118560j410552j517055j874969
39596D36711j555534Q6372J286298L6339k274091j886985K408218P274497Q443422
39587A4255247N053760m10193n348579q772714j0326843r601713p225216n080276
39579b7456527l923503j833833K992500Q500194J0316966P215666K483210p96186
$$ plain form
39571 -2501513 -5397562 -9842404 -13477073 -13133587 -9560003 -7782066 -10108474 -11369380
39563 -11369380 -5134725 6242236 12467133 7643883 -1984307 -5647601 -978048 4733206
39555 4733206 5347314 3020966 2881037 4895276 5017547 2110169 -1079981 -3478685 -7438547
39546 -7438547 -13583768 -17819361 -15808020 -7744513 3220142 14337039 22758425 25141974
39538 25141974 21540407 17210454 16385658 16252818 11698886 4124870 -360745 -727225
39530 -727225 -2098885 -6025293 -6865852 -1250952 4930842 3908912 -3820039 -11550715
39522 -11550715 -15016234 -13913287 -8163950 961549 7771496 6934675 1319936 -906015
39514 -906015 2379953 4632898 762160 -5913102 -9555938 -9542818 -8399194 -5974134 -601719
$$ packed form
39571b501513k896049m444842l634669L43486L573584J777937k326408j260906
39563a1369380O234655J1376961O224897m823250r628190l663294M669553N711254
39555D733206O14108k326348j39929K014239J22271k907378l190150k398704l959862
39546g438547o145221m235593K011341Q063507J0964655J1116897Q421386K383549
39538B5141974l601567m329953q24796j32840m553932p574016m485615l66480
39530g27225j371660l926408q40559N614900O181794j021930p728951p730676
39522a1550715l465519J102947N749337R125499O809947q36821n614739k225951
39514i06015L285968K252945l870738o675262l642836J3120J143624K425060N372415
$$ plain form
39505 -601719 5756771 7993504 3443586 -5406566 -13242832 -15463673 -11231213 -5242181
39497 -5242181 -4511091 -10555829 -16604593 -15804090 -10119200 -6559529 -6194383 -3351039 3506843
39488 3506843 7029439 993753 -10004850 -16363068 -16191305 -16349843 -21521112 -27941514
39480 -27941514 -29399237 -25165061 -19556167 -16381801 -16313770 -18030486 -19485033 -18657091
39472 -18657091 -14861747 -9291712 -3518548 2029586 7604332 13125657 18251734 22256140
39464 22256140 23208320 19236976 12251507 8388710 11649228 17756749 17784324 8666162
39456 8666162 -2691626 -7265727 -3807310 894467 140511 -6342720 -13464281 -16131223
39448 -16131223 -13349635 -8211531 -4283330 -1910304 1370527 6608947 11163176 12013918
$$ packed form
39505f01719O358490K236733m549918q850152p836266k220841M232460N989032
39497e242181P31090o044738o048764Q00503N684890L559671L65146K843344O857882
39488C506843L522596o035686j0998603o358218J71763j58538n171269o420402
39480b7941514j457723M234176N608894L174366O8031j716716j454547Q27942
39472a8657091L795344N570035N773164N548134N574746N521325N126077M004406
39464B2256140R52180l971344o985469l862797L260518O107521K7575r118162
39456H666162j1357788m574101L458417M701777p53956o483231p121561k666942
39448a6131223K781588N138104L928201K373026L280831N238420M554229Q50742
$$ plain form
39440 12013918 10189289 9726247 12484304 16183860 17949190 17599809 16314334 13958911
39432 13958911 9821840 5255792 3403092 5642334 9293751 9657079 4492597 -3397844
39424 -3397844 -8281908 -7063722 -2971620 -2397188 -7168644 -11491827 -8607770 374332
39416 374332 7083940 5641406 -989431 -5721223 -5837509 -4225757 -3632325 -2905633 743399
39407 743399 7919093 16181824 21796650 22186447 17882922 12156043 7793659 4841850
39399 4841850 2823818 3683266 9325112 16661715 19171439 14522419 7044695 1256777
39391 1256777 -2767247 -5140288 -2447559 6476245 14697479 13965011 6049386 603288
39383 603288 1928238 4984568 5644233 7079221 12285243 17054120 15893327 10067078
$$ packed form
39440A2013918j824629m63042K758057L699556J765330l49381j285475k355423
39432A3958911m137071m566048j852700K239242L651417L63328n164482p890441
39424c397844m884064J218186M092102N74432m771456m323183K884057Q982102
39416C74332O709608j442534o630837m731792j16286J611752N93432P26692L649032
39407G43399P175694Q262731N614826L89797m303525n726879m362384k951809
39399D841850k018032Q59448N641846P336603K509724m649020p477724n787918
39391A256777m024024k373041K692729Q923804Q221234p32468p915625n446098
39383F03288J324950L056330O59665J434988N206022M768877j160793n826249
$$ plain form
39375 10067078 4074306 -1672932 -8324284 -12415491 -9954693 -4820286 -4919722 -10110070
39367 -10110070 -12065474 -7497176 -3365078 -5682236 -10489329 -10901226 -7235133 -4279391
39359 -4279391 -2987701 -1346884 -454690 -2917407 -6488617 -5614024 645713 7367398
39351 7367398 10540364 10318403 7437667 1689741 -4764244 -7370627 -4752084 -843104
39343 -843104 532181 347177 2011627 6937970 13673612 18834944 18363953 11452877 4012130
39334 4012130 3682128 9666245 12620065 7584378 1532443 3108378 9557722 10709835
39326 10709835 3441389 -5041183 -7794980 -5416681 -2080276 -126691 -70341 -1160907
39318 -1160907 -368940 4902440 11617405 12771508 5887245 -3944569 -10711326 -12843748
$$ packed form
39375A0067078n992772n747238o651352m091207K460798N134407r9436n190348
39367a0110070j955404M568298M132098k317158m807093m11897L666093K955742
39359d279391J291690J640817Q92194k462717l571210Q74593O259737O721685
39351G367398L172966k21961k880736n747926o453985k606383K618543L908980
39343h43104J375285j85004J664450M926343O735642N161332m70991o911076p440747
39334D012130l30002N984117K953820n035687o051935J575935O449344J152113
39326A0709835p268446q482572k753797K378299L336405J953585N6350j090566
39318a160907P91967N271380O714965J154103o884263r831814o766757k132422
$$ plain form
39310 -12843748 -10708688 -4267971 3793898 7667975 5301020 1861444 2404857 4885378
39302 4885378 4817026 3002551 3137966 4790353 4881100 3978954 4554847 4305113 -1560589
39293 -1560589 -11112823 -15845560 -11856993 -4904828 -1912701 -2836526 -4018359 -4740940
39285 -4740940 -6270332 -7589401 -6286881 -2305201 1914303 3958992 2803310 -430826
39277 -430826 -2060373 1117720 7130945 10341995 9231650 9024180 14220623 22235901
39269 22235901 27562421 28768936 27681390 24964706 21174624 19708156 23533708 30222195
39261 30222195 34798817 36356204 37153146 36313751 30129776 19046800 9170680 5420749
39253 5420749 7114983 11168959 15370549 17189414 13790361 5719977 -2481616 -7284723
$$ packed form
39310a2843748K135060O440717Q061869L874077k366955l439576N43413K480521
39302D885378o8352j814475J35415J652387R0747r02146N75893k49734n865702
39293a560589r552234m732737L988567O952165K992127r23825j181833p22581
39285d740940j529392j319069J302520L981680M219504K044689j155682l234136
39277d30826j629547L178093O013225L211050j110345k07470N196443Q015278
39269B2235901N326520J206515j087546k716684l790082j466468L825552O688487
39261C0222195M576622J557387P96942q39395o183975j1082976r876120l749931
39253E420749J694234M053976M201590J818865l399053q070384q201593m803107
$$ plain form
39245 -7284723 -9075303 -8945114 -6389034 -2271902 -204987 -1724369 -3025299 11008
39237 11008 5750583 9211236 8655723 6078732 2473957 -3177996 -10174227 -14985630 -14991451
39228 -14991451 -11151518 -6233515 -2091617 725911 2167021 2370898 1709190 921256
39220 921256 1117025 2691474 3957473 2598160 -495076 -1027911 2922855 6961157 5466168
39211 5466168 -488304 -4196303 -2344820 1016139 775301 -2644286 -5444792 -6357839
39203 -6357839 -6851672 -6729260 -3449562 3412877 10022348 12666958 12879179 15781922 23261050
39194 23261050 30816642 32408537 27338947 20847120 18347426 20536144 23881150 24098111
39186 24098111 18956393 9727086 829143 -3502251 -3097171 -1058894 1072260 4561897
$$ packed form
39245g284723j790580J30189K556080M117132K066915j519382j300930L036307
39237A1008N739575L460653n55513k576991l604775n651953o996231m811403n821
39228a4991451L839933M918003M141898K817528J441110K03877o61708p87934
39220I21256J95769J574449J265999j359313l093236n32835L950766M038302j494989
39211E466168n954472l707999J851483L360959k40838l419587k800506r13047
39203f357839m93833J22412L279698O862439O609471K644610K12221K902743P479128
39194B3261050P555592J591895n069590o491827k499694K188718L345006K16961
39186B4098111n141718r229307q897943m331394M05080K038277K131154L489637
$$ plain form
39178 4561897 8728326 8779157 2058147 -6067456 -7466073 -1806196 2832582 496846
39170 496846 -5861572 -9696061 -8984815 -6337990 -3895669 -1642239 240333 370861 -2027267
39161 -2027267 -5661168 -7814411 -6165123 -471528 7073873 13425633 16628248 16132938
39153 16132938 12430193 7520900 4162482 2384585 -1734316 -10495884 -18961226 -19453066
39145 -19453066 -11679160 -3409155 -211021 33298 589394 150976 -2411057 -3285641 606208
39136 606208 5426600 6254542 5832281 10339615 18372134 21770642 17217265 9864124 4764127
39127 4764127 1636777 -315549 721860 4575046 7230743 7104764 8272358 13911185
39119 13911185 21029713 25487229 27995205 30897254 32945032 32262282 31307484 33252806
$$ packed form
39178D561897M166429N0831o721010q125603j398617N659877M638778k335736
39170D96846o358418l834489P11246K646825K442321K253430J882572J30528k398128
39161b027267l633901k153243J649288N693595P545401O351760L202615m95310
39153A6132938l702745m909293l358418j777897m118901q761568q465342m91840
39145a9453066P773906Q270005L198134K44319N56096m38418k562033q74584L891849
39136F06208M820392Q27942m22261M507334Q032519L398508m553377p353141n099997
39127D764127l127350j952326J037409L853186K655697j25979J167594N638827
39119A3911185P118528M457516K507976K902049K047778o82750r54798J945322
$$ plain form
39111 33252806 35338089 31472344 20822395 8873571 64823 -6024857 -10688504 -12655382
39103 -12655382 -10273560 -4362179 2442286 7426125 8549342 5588424 1144867 -1116107
39095 -1116107 290442 4067397 8042864 10075879 8052841 1559977 -6408016 -11511929
39087 -11511929 -12193338 -10486719 -9069173 -8865616 -9026677 -7982011 -5328630 -3597587
39079 -3597587 -6119669 -11416016 -12564861 -5505632 4455417 8893569 7316343 6618594
39071 6618594 10139079 13341193 11598600 6728040 3227266 2269280 2181616 1555456 -535651
39062 -535651 -4306609 -7060357 -4618835 2326060 6565420 2626347 -5599125 -9122900
39054 -9122900 -4573191 2338226 3412904 -3981445 -14589859 -19629995 -14923929 -5885234
$$ packed form
39111C3252806K085283l865745j0649949j1948824q808748o089680m663647j966878
39103a2655382K381822N911381O804465M983839J123217k960918m443557k260974
39095a116107J406549L776955L975467K033015k023038o492864p967993n103913
39087a1511929o81409J706619J417546K03557j61061J044666K653381J731043
39079c597587k522082n296347j148845P059229R961049M438152j577226o97749
39071F618594L520485L202114j742593m870560l500774r57986q7664o26160k091107
39062e35651l770958k753748K441522O944895M239360l939073q225472l523775
39054i122900M549709O911417J074678p394349j0608414n040136M706066R038695
$$ plain form
39046 -5885234 -2432443 -7841042 -15477021 -18056408 -16155542 -14446725 -13554022 -10739584
39038 -10739584 -6163281 -2657789 -151151 4072248 9270755 10687375 6542569 1294936
39030 1294936 85539 3489100 9581811 17434047 25470337 29147531 24439906 13260590
39022 13260590 2351746 -3785591 -6819490 -10666199 -15449332 -17370311 -14322441 -9362807
39014 -9362807 -7095591 -7936225 -8267658 -5791400 -1889264 1676406 5152484 8406735
39006 8406735 9293792 6946680 4231699 3949888 4603576 3272801 1055165 1751267 5934878
38997 5934878 10272093 12687043 14448989 16516773 17195513 14752234 10035689 5322054
38989 5322054 2037204 121825 -1454360 -3223025 -3263077 1582502 10344380 15954926
$$ packed form
39046e885234L452791n408599p635979k579387J900866J708817Q92703K814438
39038a0739584M576303L505492K506638M223399N198507J416620m144806n247633
39030A294936j209397L403561O092711P852236Q036290L677194m707625j1179316
39022A3260590j0908844o137337l033899l846709m783133j920979L047870M959634
39014i362807K267216q40634l31433K476258L902136L565670L476078L254251
39006H406735Q87057k347112k714981k81811O53688j330775k217636O96102M183611
38997E934878M337215K414950J761946K067784O78740k443279m716545m713635
38989E322054l284850j915379j576185j768665m0052M845579Q761878N610546
$$ plain form
38981 15954926 12422413 2628156 -5275901 -8090767 -9014429 -9557532 -6801163 -358525
38973 -358525 4528550 4574553 4051239 8341583 15615194 19547237 17764274 13324882 9828270
38964 9828270 9114047 12104293 17669823 21507731 19950207 14566192 9951673 7575536
38956 7575536 4883521 14672 -5635865 -9368559 -9129791 -4147243 3439228 8135392
38948 8135392 5805910 -809015 -4443112 -1859455 2877687 4593298 3371643 2867877
38940 2867877 4675395 6961459 7562117 5982299 2559804 -2136912 -6354543 -7292851
38932 -7292851 -4002113 157983 -25795 -5599305 -11361636 -11781403 -8050321 -6336268
38924 -6336268 -8897692 -10445656 -5188132 5257948 13649065 14992434 9954986 2039860
$$ packed form
38981A5954926l532513r794257p904057k814866r23662n43103K756369O442638
38973c58525M887075M6003n23314M290344P273611L932043j782963m439392l496612
38964I828270p14223K990246N565530L837908j557524n384015m614519k376137
38956G575536k692015m868849n650537l732694K38768M982548P586471M696164
38948H135392k329482o614925l634097K583657M737142J715611j221655n03766
38940B867877J807518K286064O00658j579818l422495m696716m217631r38308
38932g292851L290738M160096j83778n573510n762331m19767L731082J714053
38924f336268k561424j547964N257524J0446080Q391117J343369n037448p915126
$$ plain form
38916 2039860 -5165302 -8488071 -6634990 -2206225 115738 -1432400 -3830759 -2881145
38908 -2881145 2646314 10627351 17712558 21431988 21736420 21081234 21784249 22966745 21540963
38899 21540963 16591347 10885438 6994634 3872367 -582239 -4794115 -4524278 721043
38891 721043 5145246 3000710 -3745434 -7012158 -2090772 7058964 12795833 11305337
38883 11305337 3488110 -8421786 -21344199 -30156085 -30671186 -24324742 -16657553 -10949900
38875 -10949900 -6612218 -3676353 -4233778 -8021285 -10858538 -9770953 -6331915 -3085899
38867 -3085899 -409605 1063801 -543982 -3749223 -2780622 4131384 9516617 5488588
38859 5488588 -4837687 -10886590 -8149951 -2082076 1114056 1656465 3334761 8474399
$$ packed form
38916B039860p205162l322769J853081M428765K321963j548138k398359R49614
38908b881145N527459P981037P085207L719430L04432o55186P03015J182496j425782
38899B1540963m949616n705909l890804l122267m454606m211876K69837N245321
38891G21043M424203k144536o746144l266724M921386R149736N736869j490496
38883A1305337p817227j1909896j2922413q811886n15101O346444P667189N707653
38875a0949900M337682K935865n57425l787507k837253J087585L439038L246016
38867c085899K676294J473406j607783l205241R68601O912006N385233m028029
38859E488588j0326275o048903K736639O067875L196132N42409J678296N139638
$$ plain form
38851 8474399 17052840 26890791 33547298 33310749 27238345 19746655 13477549 8575145
38843 8575145 6017957 7084333 9346023 7781052 1034162 -6842726 -11350521 -10931741
38835 -10931741 -5898270 1511898 6105653 4023976 -1186959 -2047190 2342803 5112020
38827 5112020 2706171 720555 5146044 13520077 19555475 22126251 24271514 26230447
38819 26230447 24939577 19395928 12448811 7554468 5992906 6327108 5318316 1339618
38811 1339618 -2207748 -55932 7082609 11921297 9938639 4826362 1826429 604074
38803 604074 -1250320 -2562641 -1789958 -1823389 -5509317 -9520597 -9026208 -5912835 -5596391
38794 -5596391 -7515396 -6134295 -802256 2718434 1290066 -1546135 -1831261 282021
$$ packed form
38851H474399Q578441R837951O656507k36549o072404p491690o269106m902404
38843H575145k557188J066376K261690j564971o746890p876888m507795M18780
38835a0931741N033471P410168M593755k081677n210935q60231M389993K769217
38827E112020k405849j985616M425489Q374033O035398K570776K145263J958933
38819B6230447j290870n543649o947117m894343j561562L34202j008792l978698
38811A339618l547366K151816P138541M838688j982658n112277k999933j222355
38803F04074j854394j312321P72683l3431l685928m011280M94389L113373L16444
38794e596391j919005J381101N332039L520690j428368k836201k85126K113282
$$ plain form
38786 282021 3583233 7710115 10288191 7711514 1145175 -3231769 -2530750 -916027
38778 -916027 -2155599 -3276377 118149 5931381 8063676 5093187 1920532 2971805
38770 2971805 7098274 9751940 8183609 3744947 -192602 -2003446 -2799369 -3237029
38762 -3237029 -1136780 5169948 12267315 14380495 11102306 8464223 10890312 15741438
38754 15741438 17939669 16616198 14372286 12828791 12332205 13936459 17689764 19853486
38746 19853486 15880120 6907130 340823 2271238 10509667 16483821 13752807 3823295
38738 3823295 -6424245 -11779847 -11751806 -7556163 170079 8677635 11807414 6205016
38730 6205016 -2582656 -5627285 -2387762 -1425698 -7981481 -16561063 -18976078 -14715096
$$ packed form
38786B82021L301212M126882K578076k576677o566339m376944P01019J614723
38778i16027j239572j120778L394526N813232K132295k970489l172655J051273
38770B971805M126469K653666j568331m438662l937549j810844p95923m37660
38762c237029K100249O306728P097367K113180l278189k638083K426089M851126
38754A5741438K198231j323471k243912j543495m96586J604254L753305K163722
38746A9853486l973366q972990o566307J930415Q238429N974154k731014r929512
38738C823295j0247540n355602K8041M195643P726242Q507556L129779n602398
38730F205016q787672l044629L239523R62064o555783q579582k415015M260982
$$ plain form
38722 -14715096 -9026220 -4821247 -1750493 -417178 -1595161 -2449810 1003614 7885204
38714 7885204 13651875 17189737 21634042 27348744 29306781 23890470 14361050 6572464
38706 6572464 2028581 -1727121 -5817199 -8494240 -8202008 -5394655 -1340504 2585368
38698 2585368 4043394 457503 -7684781 -15176593 -15866704 -8925699 -201952 3980870
38690 3980870 3749529 4660825 9989059 16634488 19807467 19137619 17627716 16455945 14432093
38681 14432093 12169036 12886654 17628624 22265133 21250649 13325795 2486932 -5612848
38673 -5612848 -7573236 -4086964 940189 4037950 5680837 9103537 15249894 20856897
38665 20856897 22811733 22450549 23385056 26369984 28806997 28613121 25933869 21290484
$$ packed form
38722a4715096N688876M204973L070754J333315j177983q54649L453424O881590
38714G885204N766671L537862M444305N714702J958037n416311r529420p788586
38706F572464m543883l755702m090078k677041K92232K807353M054151L925872
38698B585368J458026l585891q142284p491812o90111O941005Q723747M182822
38690C980870k31341R11296N328234O645429L172979o69848j509903j171771k023852
38681A4432093k263057P17618M741970M636509j014484p924854j0838863q099780
38673e612848j960388L486272N027153L097761J642887L422700O146357N607003
38665B0856897J954836l61184R34507K984928K437013j93876k679252m643385
$$ plain form
38657 21290484 15093971 9772160 9422640 15228487 22761491 25839593 22338417 14922084
38649 14922084 7337171 2056232 756201 4228560 10738209 15950593 15847523 9860198
38641 9860198 1326327 -4817222 -5571645 -2249959 1062630 2312269 3723358 7689861
38633 7689861 11851763 11429790 6288821 2088850 3219742 7584427 10087844 8801188
38625 8801188 5866334 4557302 7171037 13372892 18758561 17929016 11482901 6929940
38617 6929940 9441229 14700305 14946533 9213925 2588028 -2106622 -5603613 -6804337
38609 -6804337 -3401670 2030320 3879413 2558174 4212436 9181320 8983575 -517738
38601 -517738 -10393677 -10037368 -2046078 2029593 -2289828 -8299516 -8595665 -2566616 6319332
$$ packed form
38657B1290484o196513n321811l49520N805847P533004L078102l501176p416333
38649A4922084p584913n280939j300031L472359O509649N212384j03070n987325
38641I860198q533871o143549p54423L321686L312589J249639J411089L966503
38633G689861M161902m21973n140969m199971J130892M364685K503417j286656
38625H801188k934854j309032K613735O201855N385669q29545o446115m552961
38617F929940K511289N259076K46228n732608o625897m694650l496991j200724
38609f804337L402667N431990J849093j321239J654262M968884j97745r501313
38601e17738r875939L56309P991290M075671m319421o009688k96149O029049Q885948
$$ plain form
38592 6319332 14180834 17024722 13292915 7683894 7635558 14252198 20760962 21600031 19115702
38583 19115702 19037118 22483822 25055429 22109333 13338260 3479918 -1021947 1881196
38575 1881196 6764066 6413362 1089798 -1192429 5076241 15832280 22942873 23739203
38567 23739203 21804685 20427919 19466602 18482258 19130527 22767934 27684781 30539716
38559 30539716 29752952 25960698 19518179 9710371 -2373874 -11909131 -14108846 -10108446
38551 -10108446 -6386330 -7105654 -9398775 -8053249 -2522602 3507604 7811769 11447245
38543 11447245 15584190 19835961 23752216 27104855 28582109 26970253 23939781 23058231
38535 23058231 25567204 29293893 31715826 31705040 28613367 22800955 17149202 14625758
$$ packed form
38592F319332P861502K843888l731807n609021m8336O616640O508764Q39069k484329
38583A9115702p8584L446704K571607k946096q771073r858342m501865K903143
38575A881196M882870l50704n323564k282227O268670J0756039P110593P96330
38567B3739203j934518j376766r61317r84344O48269L637407M916847K854935
38559C0539716p86764l792254o442519r807808j2084245r535257k199715M000400
38551a0108446L722116p19324k293121J345526N530647O030206M304165L635476
38543A1447245M136945M251771L916255L352639J477254j611856l030472q81550
38535B3058231K508973L726689K421933j0786l091673n812412n651753k523444
$$ plain form
38527 14625758 13917639 11117876 6512076 5586789 11454803 19901733 24426626 23479483
38519 23479483 20516252 19389172 21661542 25882993 27534515 22517814 13010646 6982196
38511 6982196 9143637 15054825 17201895 14189578 10177991 7503373 4512508 4696
38503 4696 -4393804 -6802145 -7288269 -7140557 -7637466 -9068142 -9529458 -6035120 1325809
38494 1325809 8082964 10533855 10180795 10199033 9897625 6880176 3016216 3091805 7699818
38485 7699818 12445888 15069389 18798674 26808823 36858203 43514753 43363137 36755583
38477 36755583 26947156 18808694 15836494 16636373 16082254 11272644 4855810 1612953
38469 1612953 3383071 8110880 12324245 13957183 14090664 15858511 20003715 22349573
$$ packed form
38527A4625758p08119k799763m605800r25287N868014Q446930M524893r47143
38519B3479483k963231j127080K272370M221451J651522n016701r507168o028450
38511F982196K161441N911188K147070l012317m011587k674618k990865m507812
38503D696m398500k408341m86124J47712m96909j430676m61316L494338P360929
38494A325809O757155K450891l53060J8238l01408l017449l863960P5589M608013
38485G699818M746070K623501L729285Q010149J0049380O656550j51616o607554
38477C6755583r808427q138462k972200P99879n54119m809610o416834l242857
38469A612953J770118M727809M213365J632938J33481J767847M145204K345858
$$ plain form
38461 22349573 18487991 10362269 4499107 3772414 5234822 6570586 9374473 14024265
38453 14024265 16740423 15525786 14652113 18602969 24811646 27389388 25795159 24810934
38445 24810934 27374326 32161046 37170433 41055183 41759149 38558505 34774176 33573953
38437 33573953 31948918 24963515 15978773 15133049 25108649 35512232 36230727 30866658
38429 30866658 30782561 39414990 49131542 51964350 47152990 38361635 29240988 22651500
38421 22651500 19473021 16867782 11709571 6670115 8391052 17866052 27181874 28703169
38413 28703169 23683531 18391948 15281161 12562927 10122251 10501942 14413662 19597494
38405 19597494 24252493 28057217 30121608 30008568 30795213 36356278 44479089 47499541
$$ packed form
38461B2349573l861582q125722n863162p26693J462408J335764K803887M649792
38453A4024265K716158j214637q73673L950856O208677K577742j594229r84225
38445B4810934K563392M786720N009387L884750P03966l200644l784329j200223
38437C3573953j625035o985403q984742q45724R975600J0403583P18495n364069
38429C0866658q4097Q632429R716552K832808m811360q791355r120647o589488
38421B2651500l178479k605239n158211n039456J720937R475000R315822J521295
38413B8703169n019638n291583l110787k718234k440676L79691L911720N183832
38405A9597494M654999L804724K064391j13040P86645N561065Q122811L020452
$$ plain form
38397 47499541 42152724 34548821 32163940 34482865 35497985 32736380 29349262 28768725
38389 28768725 31502948 36468270 41755396 44585128 43950330 42764630 43991485 45479506
38381 45479506 42748201 36398275 31890479 31532037 31845099 30293953 29225162 30350359
38373 30350359 30474186 27126322 24444528 27838400 34997862 38153822 34862957 30855601
38365 30855601 30951067 32238082 29326894 22895086 18748286 19519497 21642387 21735142 22300454
38356 22300454 27433905 34477744 35269953 27371422 18954983 17950449 20134927 15150559
38348 15150559 3084248 -3610104 3049959 15800309 22730946 21830168 18951577 17418675
38340 17418675 17671650 22692337 33952826 43742425 41506745 28481963 17172142 14915339
$$ packed form
38397D7499541n346817p603903k384881K318925J015120k761605l387118n80537
38389B8768725K734223M965322N287126K829732o34798j185700J226855J488021
38381D5479506k731305o349926m507796l58442L13062j551146j068791J125197
38373C0350359J23827l347864k681794L393872P159462L155960l290865m007356
38365C0855601R5466J287015k911188o431808m146800P71211K122890R2755N65312
38356B2300454N133451P043839P92209p898531q416439j004534K184478m984368
38348A5150559j2066311o694352O660063J2750350O930637r00778k878591j532902
38340A7418675K52975N020687J1260489R789599k235680j3024782j1309821k256803
$$ plain form
38332 14915339 16788662 17073178 18205217 23584169 29988673 33667201 37233980 43477823
38324 43477823 48067984 46188387 41768131 41680043 44240607 42558660 37246365 36077516
38316 36077516 40868485 43907320 39519875 31607332 27082497 28168837 33488735 40492793
38308 40492793 44271039 40328771 31789723 27827645 31419244 34890212 31978270 27756304
38300 27756304 30262712 37676154 41479261 38909676 34561379 31922080 31130711 33705938
38292 33705938 41026300 47746970 45069079 32879068 21572816 18709323 20137519 18228376
38284 18228376 13143414 10656972 12923743 17293621 22090592 28005133 34339563 38461618
38276 38461618 39458468 39283382 39982775 41902098 44207321 45102184 42480739 36969969 33355502
$$ packed form
38332A4915339J873323K84516J132039N378952O404504L678528L566779O243843
38324D3477823M590161j879597m420256q8088K560564j681947n312295j168849
38316C6077516M790969L038835m387445p912543m524835J086340N319898P004058
38308D0492793L778246l942268q539048l962078L591599L470968k911942m221966
38300B7756304K506408P413442L803107k569585m348297k639299p91369K575227
38292C3705938P320362O720670k677891j2190011j1306252k863493J428196j909143
38284A8228376n084962k486442K266771M369878M796971N914541O334430M122055
38276C8461618R96850j75086O99393J919323K305223Q94863k621445n510770l614467
$$ plain form
38267 33355502 35648416 41060505 42650602 38659530 35467040 39327692 48182340 54567860
38259 54567860 54884923 52553019 52433350 55211060 58176661 59289845 58751309 57754871 57639503
38250 57639503 59868439 64636320 68947205 68356129 62372553 56332330 55177176 56586488
38242 56586488 54247944 48107605 46380517 54597878 66895427 73107271 72106345 71934748
38234 71934748 76754418 80269250 75128236 63897364 55753024 54664325 56046697 54891812
38226 54891812 52431788 52926354 57114495 61772149 64381547 65261004 64897462 61882246
38218 61882246 55530622 49473242 49772247 58136603 68595389 73066845 70028940 65856132
38210 65856132 67389850 75039132 83801621 88957298 89115473 85286171 79573678 74735550
$$ packed form
38267C3355502K292914N412089J590097l991072l192490L860652Q854648O385520
38259E4567860L17063k331904j19669K777710K965601J113184n38536r96438j15368
38250E7639503K228936M767881M310885n91076n983576o040223j155154J409312
38242E6586488k338544o140339j727088Q217361J2297549O211844j000926j71597
38234G1934748M819670L514832n141014j1230872q144340j088699J382372j154885
38226E4891812k460024M94566M188141M657654K609398Q79457l63542l015216
38218F1882246o351624o057380K99005Q364356J0458786M471456l037905m172808
38210F5856132J533718P649282Q762489N155677J58175l829302n712493m838128
$$ plain form
38202 74735550 72980185 74397435 77308970 80169079 82303520 83208157 82656479 81687312
38194 81687312 82125726 84785306 89308813 95698734 103866174 110897781 111456040 103572952
38186 103572952 92773560 87264250 88914951 91850256 90696047 87167176 86390694 89118140
38178 89118140 90958998 88598278 83500440 79213086 78108812 81704938 90788876 102623805
38170 102623805 110420609 109280263 102133663 96653001 96300758 97672901 97371212 97798379
38162 97798379 103416033 113343822 121006217 121041581 114525288 107376054 105198519 109487185
38154 109487185 116987439 122325380 122695606 120523248 120486439 123746808 126607941 125509224
38146 125509224 121765317 119861614 121841959 125202250 126734569 127193354 130752744 139422610
$$ packed form
38202G4735550j755365J417250K911535K860109K134441R04637n51678r69167
38194H1687312M38414K659580M523507O389921Q167440P031607N58259p883088
38186A03572952j0799392n509310J650701K935305j154209l528871p76482K727446
38178H9118140J840858k360720n097838m287354j104274L596126R083938J1834929
38170A02623805P796804j140346p146600n480662l52243J372143l01689M27167
38162I7798379N617654R927789P662395L5364o516293p149234k177535M288666
38154A09487185P500254N337941L70226k172358l6809L260369K861133j098717
38146A25509224l743907j903703J980345L360291J532319M58785L559390Q669866
$$ plain form
38138 139422610 148874888 151517124 144636187 134331601 129599823 132919504 138705219 140982946
38130 140982946 139751217 138568748 138812156 139187977 139182099 139457244 139236735 136752301 132927675
38121 132927675 131631021 134965186 140551499 144651262 145729462 143762095 139015537 134074164
38113 134074164 134514795 143562353 156734009 165415287 166137094 163490973 163457215 166780713
38105 166780713 170036712 170680137 169297938 168401819 170307383 174961420 179063653 178965624
38097 178965624 175314406 172902481 174763746 178618401 180880529 181852960 184260655 188346624
38089 188346624 191674152 192994576 193161755 192621750 191312200 191151903 195050171 202365812
38081 202365812 208537225 210842725 211617940 213618696 215085393 212887779 208834156 208481510
$$ packed form
38138A39422610R452278K642236o880937j0304586m731778L319681N785715K277727
38130A40982946j231729j182469K43408L75821n878K75145k20509k484434l824626
38121A32927675j296654L334165N586313M099763J078200j967367m746558m941373
38113A34074164M40631R047558J3171656Q681278P21807k646121l3758L323498
38105A66780713L255999O43425j382199q96119J905564M654037M102233r8029
38097A78965624l651218k411925J861265L854655K262128R72431K407695M085969
38089A88346624L327528J320424J67179n40005j309550j60297L898268P315641
38081B02365812O171413K305500P75215K000756J466697k197614m053623l52646
$$ plain form
38073 208481510 213384305 218456382 218929535 217035914 218627922 224446901 228643710 227009980
38065 227009980 223366108 224636598 231085360 235626188 233614792 229323337 229891658 235805546
38057 235805546 241586813 244375019 246512188 249080919 248444509 242359430 235544828 234739705
38049 234739705 240236534 246664768 251090715 255600773 261550132 266102797 266824226 266261588
38041 266261588 268689331 274136737 278875860 280999862 282261322 284128635 285066703 283250589
38033 283250589 279943002 278129269 278839283 280891219 283777420 288376650 294267445 298570772
38025 298570772 298999254 296668080 294206115 292234513 289927441 288412374 290673713 297237276
38017 297237276 304260489 307495025 306789770 305262306 305235123 306732129 309258536 313069768
$$ packed form
38073B08481510M902795N072077M73153j893621J592008N818979M196809j633730
38065B27009980l643872J270490O448762M540828k011396m291455N68321N913888
38057B35805546N781267K788206K137169K568731o36410o085079o814602q05123
38049B34739705N496829O428234M425947M510058N949359M552665P21429n62638
38041B66261588K427743N447406M739123K124002J261460J867313R38068j816114
38033B83250589l307587j813733P10014K051936K886201M599230N890795M303327
38025B98570772M28482k331174k461965j971602k307072j515067K261339O563563
38017B97237276P023213L234536p05255j527464k7183J497006K526407L811232
$$ plain form
38009 313069768 318386985 324500147 329942017 333005871 332416747 328517852 323888016 321901714
38001 321901714 324082365 328739269 332035128 330696428 324784632 318316244 316122534 319186559
37993 319186559 323841213 326383563 327350220 329783137 334204802 337467456 336660453 332337575
37985 332337575 327313631 323630682 321471637 320148796 319260615 318951906 319242424 319335022 318520773
37976 318520773 318303368 322137920 331129851 340727192 344228925 339922454 332556653 327266439
37968 327266439 324673340 323320719 323975471 328128425 333354045 334046206 327924134 319372859
37960 319372859 314593634 314842562 316378022 316379011 316472820 319500901 324479810 326814382 323566704
37951 323566704 317018808 312210539 311698089 313563946 314117342 311502999 306493715 300550903
$$ packed form
38009C13069768N317217O113162N441870L063854n89124l898895m629836j986302
38001C21901714K180651M656904L295859j338700n911796o468388k193710L064025
37993C19186559M654654K542350R66657K432917M421665L262654q07003m322878
37985C32337575n023944l682949k159045j322841q88181l08709K90518R2598q14249
37976C18520773k17405L834552Q991931R597341L501733m306471p365801n290214
37968C27266439k593099j352621O54752M152954N225620O92161o122072q551275
37960C19372859m779225K48928J535460R89R3809L028081M978909K334572l247678
37951C23566704o547896m808269n12450J865857N53396k614343n009284n942812
$$ plain form
37943 300550903 294025608 286825702 280671026 279252005 284417593 292493572 296763720 294643806
37935 294643806 290290758 288424015 287869208 284390334 278418722 275344559 277382210 279490539
37927 279490539 276032164 268634106 264189056 266570034 273344419 279630468 281859035 278052131
37919 278052131 268292199 256469788 248810746 248341632 252047885 255050040 256032987 256451991
37911 256451991 255906659 251889229 244512970 238128933 236264519 237074184 236125473 232195337
37903 232195337 227574451 223579630 219219630 214633494 212372969 213630268 215930194 216826037
37895 216826037 217727924 221205806 225850361 227101044 223089288 216934647 212785957 211673412
37887 211673412 211663164 210074699 205007816 196873116 189670908 188951772 196366537 206502966
$$ packed form
37943C00550903o525295p199906o154676j419021N165588Q075979M270148k119914
37935B94643806m353048j866743n54807l478874n971612l074163K037651K108329
37927B79490539l458375p398058m445050K380978O774385O286049K228567l806904
37919B78052131r759932j1822411p659042m69114L706253L002155R82947M19004
37911B56451991n45332m017430p376259o384037j864414Q09665r48711l930136
37903B32195337m620886l994821m360000m586136k260525J257299K299926Q95843
37895B16826037R01887L477882M644555J250683m011756o154641m148690j112545
37887B11673412j0248j588465n066883q134700p202208p19136P414765J0136429
$$ plain form
37879 206502966 210805704 205547138 195598567 189457130 190213954 192557892 190030211 183817257
37871 183817257 180896736 183458762 185142430 180522709 173699391 172404172 176720395 179874079
37863 179874079 178445814 174734882 169432363 160032602 148412786 142162267 144406152 148774968
37855 148774968 148994038 147223040 147282066 145873004 138586397 130318694 130227682 137800632 143091019
37846 143091019 141219440 137934366 138589004 139608561 135157377 126372943 119115477 116457246
37838 116457246 117708795 121771094 127108237 130365415 129002236 124643244 121354091 121394158
37830 121394158 124115931 127346729 128327969 125520223 121401144 121024594 125394844 128779463
37822 128779463 125669047 118149513 112655945 111227978 110469228 108273899 106389793 105454613
$$ packed form
37879B06502966M302738n258566r948571o141437P56824K343938k527681o212954
37871A83817257k920521K562026J683668m619721o823318j295219M316223L153684
37863A79874079j428265l710932n302519r399761j1619816o250519K243885M368816
37855A48774968K19070j770998N9026j409062p286607q267703r1012P572950N290387
37846A43091019j871579l285074O54638J019557m451184q784434p257466k658231
37838A16457246J251549M062299N337143L257178j363179m358992l289153M0067
37830A21394158K721773L230798R81240k807746m119079l76550M370250L384619
37822A28779463l110416p519534n493568j427967p58750k195329j884106r35180
$$ plain form
37814 105454613 102351597 95115589 87178399 83644481 85324646 89404260 94530263 101578695
37806 101578695 109399908 113629780 111995866 108755773 110748274 119002470 126798080 127221486
37798 127221486 120835785 113965293 110462704 107828956 101884093 92924943 85541028 83236381
37790 83236381 84771846 85768932 82991563 76883262 70441121 66060071 63796632 62772853
37782 62772853 63525760 67892207 76469167 86970692 95450766 99034870 97901299 95145526
37774 95145526 94086523 94775483 93760456 88431836 80857377 75763463 75417784 78420629
37766 78420629 82750242 87154463 89594981 87691947 82007080 76387902 73689572 73212472
37758 73212472 73330348 74037337 75330644 75578315 73562188 70252167 66867598 63303033
$$ packed form
37814A05454613l103016p236008p937190l533918J680165M079614N126003P048432
37806A01578695P821213M229872j633914l240093J992501Q254196P795610M23406
37798A27221486o385701o870492l502589k633748n944863q959150p383915k304647
37790H3236381J535465R97086k777369o108301o442141m381050k263439j023779
37782F2772853P52907M366447Q576960J0501525Q480074L584104j133571k755773
37774I5145526j059003O88960j015027n328620p574459n093914l45679L002845
37766G8420629M329613M404221K440518j903034n684867n619178k698330m77100
37758G3212472J17876P06989J293307K47671k016127l310021l384569l564565
$$ plain form
37750 63303033 60166742 59748980 62569875 65443450 65763894 65361717 66979024 69374049
37742 69374049 69921995 70121188 73721032 80099313 84081352 82470112 77007483 71024970
37734 71024970 66911620 66441776 69213290 70832044 67371261 61844192 60973397 64834352
37726 64834352 65895550 60484966 54791525 55546472 60469415 63311241 63721928 65521174
37718 65521174 68155217 67128543 62135339 58148619 57749839 57868161 55376542 51200819
37710 51200819 47340528 44116687 42357548 44415431 50302211 55662811 56354276 53121441
37702 53121441 49478023 46800049 43994273 40712423 38238469 37339670 36924013 35031596
37694 35031596 30752775 25769857 23950957 27728460 34504594 38970144 39970628 42185211
$$ packed form
37750F3303033l136291m17762K820895K873575L20444m02177J617307K395025
37742F9374049N47946J99193L599844O378281L982039j611240n462629n982513
37734G1024970m113350m69844K771514J618754l460783n527069q70795L860955
37726F4834352J061198n410584n693441P54947M922943K841826M10687J799246
37718F5521174K634043j026674m993204l986720l98780J18322k491619m175723
37710E1200819l860291l223841j759139K057883N886780N360600O91465l232835
37702E3121441l643418k677974k805776l281850k473954q98799m15657j892417
37694C5031596m278821m982918j818900L777503O776134M465550J000484K214583
$$ plain form
37686 42185211 48896797 56081800 57314647 52601643 48000636 47358956 49118621 51233259
37678 51233259 53798291 55215782 51289254 41785415 33537949 32253265 34432091 32933986
37670 32933986 28157758 26839091 30398898 32322916 29172268 26783460 30967865 37883731
37662 37883731 39751546 36239589 33509870 34263068 35574501 35582155 35358913 33964328 28619931
37653 28619931 21196281 17717068 18920088 17917434 10858742 3556485 2607502 5893021
37645 5893021 8374224 12205231 22659451 36829110 45443258 45521289 42819046 40912382
37637 40912382 36288468 26976470 18455823 16550117 19989923 24268335 27991674 31059838
37629 31059838 31260249 27945856 25500168 27727172 31527347 31351554 27410532 23935796
$$ packed form
37686D2185211O711586P185003J232847m713004m601007o41680J759665K114638
37678E1233259K565032J417491l926528r503839q247466j284684K178826j498105
37670C2933986m776228j318667L559807J924018l150648k388808M184405O915866
37662C7883731J867815l511957k729719P53198J311433P654k23242j394585n344397
37653B8619931p423650l479213J203020j002654p058692p302257r48983L285519
37645E893021K481203L831007J0454220J4169659Q614148P8031k702243j906664
37637D0912382m623914r311998q520647j905706L439806M278412L723339L068164
37629C1059838K00411l314393k445688K227004L800175j75793l941022l474736
$$ plain form
37621 23935796 21525776 17537416 12914714 12029373 15577636 19584459 21920704 23963904
37613 23963904 25259235 23192217 19622197 20780323 27324512 31356919 28253826 25186484
37605 25186484 30820594 40836755 42069550 29744712 12979244 2730769 1006398
37598 1006398 3572598 7201568 10905883 14005190 16375560 18532340 19626524 17667531
37590 17667531 13046075 8919871 6537127 3600788 -314061 -357489 7501857 19183321
37582 19183321 25910972 24425623 19858381 18227098 19634388 19949100 16479497 10468481
37574 10468481 5470549 4109662 5363111 5057289 508071 -5828721 -9547645 -10487930
37566 -10487930 -12232763 -15194158 -14819485 -8937113 -2463736 -588759 -480396 4602235
$$ packed form
37621B3935796k410020l988360m622702q85341L548263M006823K336245K043200
37613B3963904J295331k067018l570020J158126O544189M032407l103093l067342
37605B5186484N634110J0016161J232795j2324838j6765468j0248475j724371
37598A006398K566200L628970L704315L099307K370370K156780J094184j958993
37590A7667531m621456m126204k382744k936339l914849m3428P859346J1681464
37582A9183321O727651j485349m567242j631283J407290L14712l469603o011016
37574A0468481m997932j360887J253449l05822m549218o336792l718924r40285
37566a0487930j744833k961395L74673N882372O473377J874977J08363N082631
$$ plain form
37558 4602235 14255508 20172676 17311153 10290963 6333295 6526293 7510816 7950276 8690015
37549 8690015 8760765 6205985 2277135 444323 1055932 851458 -1565343 -3323033 -1456374
37540 -1456374 3556537 9518586 14775342 17597861 16641275 13815673 13441687 16265983
37532 16265983 17613877 14450913 10945938 12913407 19432052 24940768 27701290 30301586
37524 30301586 32525529 30442892 23940491 18983440 19454195 21670264 20457058 16473614
37516 16473614 13574488 12422415 11145912 9677514 8881037 7338513 3486660 -712181
37508 -712181 -2823136 -5025843 -10714086 -16849081 -15921376 -6409298 4411690 9845783
37500 9845783 10787920 11261601 12377727 14151910 18354558 24656082 27514473 22518865
$$ packed form
37558D602235R653273N917168k861523p020190l957668J92998R84523M39460P39739
37549H690015P0750k554780l928850j832812O11609k04474k416801j757690J866659
37540a456374N012911N962049N256756K822519r56586k825602l73986K824296
37532A6265983J347894l162964l504975J967469O518645N508716K760522K600296
37524C0301586K223943k082637o502401m957051M70755K216069j213206l983444
37516A6473614k899126j152073j276503j468398p96477j542524l851853m198841
37508g12181k110955k202707n688243o134995R27705R512078J0820988N434093
37500I845783R42137M73681J116126J774183M202648O301524K858391m995608
$$ plain form
37492 22518865 13900489 10150155 12663506 13846076 7238905 -4562347 -13461058 -14495004
37484 -14495004 -9706330 -5278623 -5442041 -7944603 -6112281 2945258 13756881 19117140
37476 19117140 19558685 21317685 25356464 24847860 15923041 5129794 1646237 5900706
37468 5900706 10997911 12803173 12761246 11672082 7083108 -1248126 -8099327 -8536906 -4789376
37459 -4789376 -4209591 -10747255 -20431547 -25543730 -22134509 -12978157 -3831815 1970757
37451 1970757 4546737 4463916 1529820 -2641393 -3739440 960439 8993146 16014143
37443 16014143 21204012 26027228 29010505 26790336 20819031 17573109 19490116 20394169
37435 20394169 14160688 4586531 1313563 7355317 15963078 19805479 18124396 13703684
$$ packed form
37492B2518865q618376l750334K513351J182570o607171j1801252q898711j033946
37484a4495004M788674M427707j63418k502562J832322R057539J0811623N360259
37476A9117140M41545J759000M038779n08604q924819j0793247l483557M254469
37468E900706N097205J805262m1927j089164m588974q331234o851201m37579L747530
37459d789376N79785o537664r684292n112183L409221R156352R146342N802572
37451A970757K575980q2821k934096m171213j098047M699879Q032707P020997
37443A6014143N189869M823216K983277k220169n971305l245922J917007R04053
37435B0394169o233481r574157l272968O041754Q607761L842401j681083m420712
$$ plain form
37427 13703684 7953463 2149657 -239944 3130719 9361620 13236431 13593529 13415032
37419 13415032 14022689 13165361 9715462 6350217 5347485 5019157 3656900 4354743 10902153
37410 10902153 19573898 20845435 11499698 421143 -1563190 5334047 11591998 11397175
37402 11397175 8570328 9217057 13687116 18116007 19979968 18830315 14229308 6956998
37394 6956998 1273877 2157014 9470031 16997652 18132003 11625478 1832268 -5508624
37386 -5508624 -7665026 -6219341 -4497044 -3782385 -2791003 -870184 222625 -943367
37378 -943367 -2721701 -2609536 -1169707 -1151956 -2963659 -3562300 -456697 4999371 9117401
37369 9117401 9666524 7683102 5981079 5820574 5117251 1271594 -3880528 -4488414 2089150
$$ packed form
37427A3703684n750221n803806k389601L370663O230901L874811L57098j78497
37419A3415032O07657q57328l449899l365245j002732l28328j362257O97843O547410
37410A0902153Q671745J271537r345737j1078555j984333O897237O257951j94823
37402A1397175k826847O46729M470059M428891J863961j149653m601007p272310
37394F956998n683121Q83137P313017P527621J134351o506525r793210p340892
37386e508624k156402J445685J722297P14659R91382J920819J092809j165992
37378i43367j778334J12165J439829J7751j811703n98641L105603N456068M118030
37369I117401N49123j983422j702023j60505p03323l845657n152122o07886O577564
$$ plain form
37360 2089150 11000465 15775059 16160193 16081191 15747147 11418118 2938603 -4248518 -6036187
37351 -6036187 -3609001 1209263 9109703 18637577 23363001 18600906 8190355 229152
37343 229152 -2019138 -1208507 81499 2130319 5725409 10660443 16240950 20712417
37335 20712417 21229239 17136432 12121964 10164698 10347121 8579320 3432993 -2704203
37327 -2704203 -7227187 -8943868 -7100262 -2148655 3003833 5500402 5860600 6455446
37319 6455446 7900235 9467192 11079444 11776801 8896879 3068249 1006827 7356879
37311 7356879 16120601 17575994 12327562 9717672 12084714 10761478 993137 -8833821
37303 -8833821 -8885273 -1263691 5231803 7685924 8768498 8496664 4709959 -607073 -3122676
$$ packed form
37360B089150Q911315M774594L85134p9002l34044m329029q479515p187121j787669
37351f036187K427186M818264P900440R527874M725424m762095j0410551p961203
37343B29152k248290Q10631J290006K048820L595090M935034N580507M471467
37335B0712417N16822m092807n014468j957266J82423j767801n146327o137196
37327b704203m522984j716681J843606M951607N152488K496569L60198N94846
37319F455446J444789J566957J612252O97357k879922n828630k061422O350052
37311G356879Q763722J455393n248432k609890K367042j323236r768341r826958
37303h833821n1452P621582O495494K454121J082574k71834l786705n317032k515603
$$ plain form
37294 -3122676 -3066429 -3686152 -3990503 40064 7242191 11028920 8281494 2849724 -711387
37285 -711387 -1581389 52618 4626111 10350647 13659605 14502037 16680298 20849433 21841374
37276 21841374 15878646 6417804 -552624 -3643193 -4865415 -4250012 -132993 6447134
37268 6447134 11637847 13121101 12041618 10687544 10176666 10193063 9436534 6770796 3326535
37259 3326535 2705276 7307608 14820084 20031892 20056785 16300523 11341059 5702372 -1253806
37250 -1253806 -8258091 -11765728 -9569798 -4016757 134058 1486705 3608283 9258412
37242 9258412 15175024 15975428 12178051 9747125 10974701 10945431 6070220 1636913 5426569
37233 5426569 15819692 22386839 18961818 10872220 6987617 8981393 12098673 13372519
$$ packed form
37294c122676N6247o19723l04351M030567P202127L786729k747426n431770l561111
37285g11387q70002J634007M573493N724536L308958Q42432K178261M169135R91941
37276B1841374n962728r460842o970428l090569j222222O15403M117019O580127
37268F447134N190713J483254j079483j354074n10878J6397p56529k665738l444261
37259C326535o21259M602332P512476N211808K4893l756262m959464n638687o956178
37250a253806p004285l507637K195930N553041M150815J352647K121578N650129
37242I258412N916612Q00404l797377k430926J227576k9270m875211m433307L789656
37233E426569J0393123O567147l425021q089598l884603J993776L117280J273846
$$ plain form
37225 13372519 13993741 14464617 12835006 9385122 8735402 13926427 20886464 22654294
37217 22654294 18117798 12811156 11208755 12277246 13746359 16707517 23014217 30619914
37209 30619914 34910855 33706169 28330678 20674343 12069506 4812302 1861668 3971006
37201 3971006 8441063 11294528 10270935 6309508 2902206 3045963 5965769 8249768
37193 8249768 8966081 10852704 14430318 14593332 7465603 -1928355 -4714148 -57633
37185 -57633 4192849 3206576 919970 1900353 3908930 2940196 752796 1714720 4934512
37176 4934512 5308524 1506713 -2199468 -2520569 -1385046 -2120316 -4280436 -4358635 -434204
37167 -434204 5616391 10415002 12347539 11859536 9482080 5758754 3603656 7631181
$$ packed form
37225A3372519O21222M70876j629611l449884o49720N191025O960037J767830
37217B2654294m536496n306642j602401J068491J469113K961158O306700P605697
37209C0619914M290941j204686n375491p656335q604837p257204k950634K109338
37201C971006M470057K853465j023593l961427l407302J43757K919806K283999
37193H249768P16313J886623L577614J63014p127729r393958k785793M656515
37185e7633M250482r86273k286606R80383K008577r68734k187400R61924L219792
37176D934512L74012l801811l706181l21101J135523p35270k160120p8199L924431
37167d34204O050595M798611J932537m88003k377456l723326k155098M027525
$$ plain form
37159 7631181 18282848 28727720 31530807 27295059 22569627 20544716 19595372 20499562
37151 20499562 27072109 36872572 38977550 26794891 8091752 -3679844 -4391467 9152
37143 9152 4023052 6939148 8724548 8890652 9609890 14031599 20510130 23010000 18222482
37134 18222482 8997800 526278 -4059465 -4999951 -5837933 -10684415 -18234683 -20557818
37126 -20557818 -12079226 2378899 13422434 18445262 21012121 21498651 16941861 9818805
37118 9818805 7582942 11328104 13401714 9506132 5077116 5348200 7018950 5807247
37110 5807247 5248832 10164119 16375134 15689469 8720194 4405625 7098875 11418316
37102 11418316 11152496 7414653 5534652 7589053 10505173 10015535 5304996 192221
$$ packed form
37159G631181J0651667J0444872K803087m235748m725432k024911r49344R04190
37151B0499562O572547R800463K104978j2182659j8703139j1771596p11623M400619
37143I152M013900K916096J785400J66104P19238M421709O478531K499870m787518
37134A8222482r224682q471522m585743r40486q37982m846482p550268k323135
37126b0557818Q478592J4458125J1043535N022828K566859M86530m556790p123056
37118I818805k235863L745162K073610l895582m429016K71084J670750j211703
37110E807247n58415M915287O211015o85665o969275m314569K693250M319441
37102A1418316k65820l737843j880001K054401K916120m89638m710539n112775
$$ plain form
37094 192221 -909407 1167137 590524 -5594656 -12329241 -12420566 -5773676 910281 2599628
37085 2599628 342850 -2267606 -3143280 -1826670 953649 2723040 788139 -4428049
37077 -4428049 -9169265 -10197732 -7646094 -3853893 -780842 1165088 2969895 6021348
37069 6021348 10512636 14828391 16985885 16275465 13224455 9004578 5359330 3710616
37061 3710616 3621152 3615874 3923739 6052552 8863274 8286025 2904299 -3235358 -5930242
37052 -5930242 -5961592 -6006166 -5750240 -4099103 -3069748 -4195710 -3532127 3237618 11818396
37043 11818396 12780100 4938361 -1953872 -754361 3276047 1008340 -6988907 -11680678
37035 -11680678 -8457183 -2793025 -2438566 -8484511 -16139389 -21319504 -23450226 -22922263
$$ packed form
37094A92221j101628K076544n76613o185180o734585r1325O646890O683957J689347
37085B599628k256778k610456q75674J316610K780319J769391j934901n216188
37077d428049m741216j028467K551638L792201L073051J945930J804807L051453
37069F021348M491288M315755K157494p10420l051010m219877l645248j648714
37061C710616q9464n278L07865K128813K810722n77249n381726o139657k694884
37052e930242l1350m4574K55926J651137J029355j125962O63583O769745Q580778
37043A1818396R61704p841739o892233J199511M030408k267707p997247m691771
37035a1680678L223495N664158L54459o045945p654878n180115k130722N27963
$$ plain form
37027 -22922263 -19336680 -13572755 -9004943 -7744946 -6767996 -1333384 7688133 13896212
37019 13896212 13829101 10914188 8791628 5767847 23543 -4578779 -4228177 -3179285
37011 -3179285 -8274748 -17183395 -20581435 -16129182 -11445793 -11253586 -10541104 -4816889
37003 -4816889 983668 474537 -3312198 -2871512 1490428 2324388 -3127297 -8933264 -9037300
36994 -9037300 -4202101 1127981 4587193 6480979 7494337 7818798 7227991 5166067
36986 5166067 1892766 -344028 1099354 5978203 10676257 11570222 8232956 3182288
36978 3182288 -741238 -2257548 -1246823 2510028 8656228 13879835 12549254 2588426
36970 2588426 -10102770 -16462265 -13866794 -8021773 -4999171 -4903149 -4355954 -1365104
$$ packed form
37027b2922263L585583N763925M567812J259997R76950N434612R021517O208079
37019A3896212o7111k914913k122560l023781n744304m602322L50602J048892
37011c179285n095463q908647l398040M452253M683389J92207P12482N724215
37003d816889N800557n09131l786735M40686M361940Q33960n451685n805967j04036
36994i037300M835199N330082L459212J893786J013358L24461n90807k061924
36986E166067l273301k236794J443382M878849M698054Q93965l337266n050668
36978C182288l923526j516310J010725L756851O146200N223607j330581r960828
36970B588426j2691196o359495K595471N845021L022602R6022N47195K990850
$$ plain form
36962 -1365104 4245479 11695447 17987251 18889819 14029868 8358684 5823969 4446484
36954 4446484 907294 -2917610 -2376952 2746013 7859092 9690912 8969513 7369741
36946 7369741 5425444 3731380 3241293 3729040 3825801 2708025 424520 -2860105 -6604519
36937 -6604519 -9734393 -11771397 -12682395 -10979275 -4909058 2873092 5614293 686125
36929 686125 -5794481 -6605958 -2873108 -1262760 -4068029 -7321010 -7398220 -4370034 367961
36920 367961 4942609 6316241 3646141 1439183 4102900 8186437 6068146 -2679086
36912 -2679086 -9875445 -9448619 -3508421 3332718 9283966 13068428 12743482 10079973
36904 10079973 10706241 16322262 21387683 20902590 16878273 13483529 10530554 6391503
$$ packed form
36962a365104N610583P449968O291804R02568m859951n671184k534715j377485
36954D446484l539190l824904N40658N122965N113079J831820p21399j599772
36946G369741j944297j694064m90087M87747R6761j117776k283505l284625l744414
36937f604519l129874k037004r10998J703120O070217P782150K741201m928168
36929F86125o480606q11477L732850J610348k805269l252981p7210L028186M737995
36920C67961M574648J373632k670100k206958K663717M083537k118291q747232
36912b679086p196359M26826N940198O841139N951248L784462l24946k663509
36904A0079973O26268N616021N065421m85093m024317l394744k952975m139051
$$ plain form
36896 6391503 3233200 3696615 4900842 1390007 -6873177 -14078602 -15886245 -13498511
36888 -13498511 -10437358 -8408360 -6989920 -5375622 -3488059 -1757265 58187 2985353
36880 2985353 6373391 6437829 344654 -8427971 -12401019 -8361778 -40874 7505094
36872 7505094 11872853 11478826 5526617 -2392332 -6409493 -6717390 -9979345 -18121225
36864 -18121225 -23141184 -18173863 -7929169 -1721905 -900466 -539115 61344 -2960262
36856 -2960262 -9190789 -12701930 -10404023 -5908000 -4331578 -7507815 -14072474 -20275694
36848 -20275694 -21616711 -17765635 -14461111 -16317966 -19973886 -19412395 -15267170 -12160845
36840 -12160845 -9272572 -2170640 6612910 8479125 2354654 -1357924 5427650 17554746
$$ packed form
36896F391503l158303M63415J204227l510835q263184p205425j807643K387734
36888a3498511L061153K028998J418440J614298J887563J730794J815452K927166
36880B985353L388038O4438o093175q772625l973048M039241Q320904P545968
36872G505094M367759l94027n952209p918949m017161l07897l261955q141880
36864a8121225n019959M967321J0244694O207264Q21439L61351O00459l021606
36856b960262o230527l511141K297907M496023J576422l176237o564659o203220
36848b0275694j341017L851076L304524j856855l655920N61491M145225L106325
36840a2160845K888273P101932Q783550J866215o124471l712578O785574J2127096
$$ plain form
36832 17554746 24210807 22103282 16072229 10486476 5239474 -1411002 -9827303 -18315836
36824 -18315836 -23777337 -23824990 -18603778 -9432163 2818667 15133654 20596378 14881017
36816 14881017 3687580 -2607783 -1843645 -963566 -3604063 -4857966 -764334 5105803
36808 5105803 8677587 11778594 16514962 19561779 17472144 12127097 5755858 -3451618
36800 -3451618 -14827094 -20698994 -16214987 -8642063 -8210965 -13472288 -14933056 -10620751
36792 -10620751 -8104750 -11594699 -16446155 -17588881 -15340322 -11344484 -6035301 -1760946
36784 -1760946 -1509819 -2918059 -643485 3473907 686429 -10680366 -19532706 -16145215
36776 -16145215 -5628610 -169250 -2423407 -4805577 -3125958 -2320093 -7408188 -15595972
$$ packed form
36832A7554746O656061k107525o031053n585753n247002o650476q416301q488533
36824a8315836n461501m7653N221212R171615J2250830J2314987N462724n715361
36816A4881017j1193437o295363P64138Q80079k640497j253903M093632N870137
36808E105803L571784L101007M736368L046817k089635n345047o371239r207476
36800c451618j1375476n871900M484007P572924M31098n261323j460768M312305
36792a0620751K516001l489949m851456j142726K248559L995838N309183M274355
36784a760946K51127j408240K274574M117392k787478j1366795q852340L387491
36776a6145215J0516605N459360k254157k382170J679619Q05865n088095q187784
$$ plain form
36768 -15595972 -20673195 -21060104 -19722053 -18207765 -14540505 -7125162 1869105 8439771
36760 8439771 11025191 11162807 9767682 4681980 -6126043 -19442975 -27441422 -24974534
36752 -24974534 -15291541 -6916408 -4914600 -6567137 -6044483 -1769239 2574505 3485353
36744 3485353 1189628 -2833311 -8198404 -12752290 -10960456 -682142 9966475 9440297
36736 9440297 -2449996 -13245342 -13879084 -9177428 -8003270 -9905276 -8874784 -5188524
36728 -5188524 -4105850 -5061136 -2076248 4486247 5880409 -2171420 -11848191 -12693118
36720 -12693118 -3593884 8579471 17979665 23169465 24526965 22669307 18777710 14314236
36712 14314236 10863694 10173566 12085411 12723068 8403720 1707335 -705905 2582759
$$ packed form
36768a5595972n077223l86909J338051J514288L667260P415343Q994267O570666
36760H439771K585420J37616j395125n085702j0808023j3316932p998447K466888
36752b4974534R682993Q375133K001808j652537N22654M275244M343744R10848
36744C485353k295725m022939n365093m553886J791834J0278314J0648617n26178
36736I440297j1890293j0795346o33742M701656J174158j902006J030492L686260
36728e188524J082674r55286K984888O562495J394162q051829r676771q44927
36720a2693118R099234J2173355R400194N189800J357500j857658l891597m463474
36712A4314236l450542o90128J911845O37657m319348o696385k413240L288664
$$ plain form
36704 2582759 5401884 2952673 -1903713 -4700942 -7257523 -14572705 -25942985 -33560673
36696 -33560673 -29864681 -14620214 4052189 14838596 12039881 715404 -9226632
36689 -9226632 -14236912 -18335086 -23002573 -23008633 -15915987 -8766845 -8603129 -10990377 -5789636
36680 -5789636 7835445 19569226 20599287 12067759 1284427 -4730177 -2183584 6826538
36672 6826538 13637465 10517949 515243 -4653551 1911902 14920356 24247525 25349928
36664 25349928 20441133 13525923 7563797 4205356 3314837 3370114 3411659 3550730 3396050
36655 3396050 2001587 -151570 -1246778 -810073 -280112 -380150 17980 1821575 4443874
36646 4443874 7112226 9631738 11465607 11712779 10074727 6348379 -257282 -9001557
$$ packed form
36704B582759K819125k449211m856386k797229k556581p315182j1370280p617688
36696c3560673L695992J5244467J8672403J0786407k798715j1324477r942036
36689i226632n010280m098174m667487o060P092646P149142J63716k387248N200741
36680e789636J3625081J1733781J030061q531528j0783332o014604K546593R010122
36672F826538O810927l119516j0002706n168794O565453J3008454R327169J102403
36664B5349928m908795o915210n962126l358441q90519N5277M1545J39071j54680
36655C396050j394463k153157j095208M36705N29961j00038L98130J803595K622299
36646D443874K668352K519512J833869K47172j638052l726348o605661q744275
$$ plain form
36638 -9001557 -15778783 -16681188 -13146470 -10283350 -10257885 -10944648 -11017668 -11916688 -13820406
36629 -13820406 -14076692 -11499620 -8590293 -7652512 -8054066 -8914736 -10748408 -12530842 -11295678
36620 -11295678 -7473657 -6722240 -12703357 -21013788 -24228086 -20832937 -15474416 -12110752
36612 -12110752 -10609422 -9067997 -6354464 -2949788 -1212217 -3287056 -7046902 -6811259
36604 -6811259 -717341 5660323 6564825 3841001 2839415 3267353 233314 -6600153
36596 -6600153 -11255494 -9542894 -3566664 3039382 9435150 15435633 19550423 21402801
36588 21402801 22458730 22412665 18621143 11402616 6024192 6224609 8915321 8867390 6048499
36579 6048499 4290753 4563944 4158835 2066730 764237 1712268 2542640 588287 -2882439
$$ packed form
36638i001557o777226r02405L534718K863120K5465o86763p3020q99020j903718
36629a3820406k56286K577072K909327R37781m01554q60670j833672j782434J235164
36620a1295678L822021P51417n981117q310431l214298L395149N358521L363664
36612a2110752J501330J541425K713533L404676J737571k074839l759846K35643
36604f811259O093918O377664R04502k723824j001586M27938l034039o833467
36596f600153m655341J712600N976230O606046O395768O000483M114790J852378
36588B1402801J055929m6065l791522p218527n378424K00417K690712m7931k818891
36579F048499j757746K73191m05109k092105j302493R48031Q30372j954353l470726
$$ plain form
36570 -2882439 -4043627 -1462656 1813234 1403620 -3580676 -9187493 -10375490 -5992532
36562 -5992532 585477 5585315 8241001 9711980 10520822 10685269 11067367 12272809 12526722
36553 12526722 8939383 1512876 -5706280 -8403013 -6124179 -2106304 319107 662113
36545 662113 1092341 3670797 7623694 9668825 7546224 2622477 -2070385 -5730203
36537 -5730203 -9760896 -13750012 -14008321 -7958105 1293140 6928887 5057343 -1753629
36529 -1753629 -7441477 -7984641 -4300299 -938435 -2125753 -8163140 -15300116 -19362502
36521 -19362502 -19170237 -16130884 -11804499 -7443637 -4862229 -5023807 -5609354 -2789435
36513 -2789435 3531154 8766655 9419136 7135176 4705040 768490 -7518666 -17936049
$$ packed form
36570b882439j161188K580971L275890m09614m984296n606817j187997M382958
36562e992532O578009M999838K655686J470979Q08842J64447L82098J205442K53913
36553A2526722l587339p426507p219156k696733K278834M017875K425411L43006
36545F62113M30228K578456L952897K045131k122601m923747m692862l659818
36537e730203m030693l989116k58309O050216R251245N635747j871544o810972
36529a753629n687848n43164L684342L361864j187318o037387p136976m062386
36521a9362502J92265L039353M326385M360862K581408j61578n85547K819919
36513b789435O320589N235501O52481k283960k430136l936550q287156j0417383
$$ plain form
36505 -17936049 -24072487 -23174485 -18856750 -14729662 -9699378 -2411511 3415133 2784489
36497 2784489 -2881786 -6511073 -4305760 -216590 -82739 -4073422 -7123121 -5398057
36489 -5398057 -63051 5175355 8555651 11472455 15586866 19579488 19889664 15244368
36481 15244368 9225277 6343247 5808649 2000063 -7463947 -16691663 -17707932 -10659082
36473 -10659082 -3998238 -3764281 -6460853 -5047389 1128140 6532692 8040613 8214004
36465 8214004 9470636 10156164 9064910 9469053 14093989 18642441 15748114 5103236
36457 5103236 -5077435 -7624867 -3712756 574617 1574825 308044 175013 4062832
36449 4062832 11458728 17242702 16021079 9007727 3598138 4428209 8233531 9811164
$$ packed form
36505a7936049o136438Q98002M317735M127088N030284P287867N826644o30644
36497B784489n666275l629287K205313M089170J33851l990683l049699J725064
36489e398057N335006N238406L380296K916804M114411L992622L10176m645296
36481A5244368o019091k882030n34598l808586r464010r227716j016269P048850
36473a0659082O660844K33957k696572J413464O175529N404552J507921J73391
36465H214004J256632O85528j091254M04143M624936M548452k894327j0644878
36457E103236j0180671k547432L912111M287373J000208j266781j33031L887819
36449D062832P395896N783974j221623p013352n409589Q30071L805322J577633
$$ plain form
36441 9811164 9092243 8551355 7205616 2495230 -3909203 -7739174 -8657475 -9742601 -10834677
36432 -10834677 -8330517 -2589896 192204 -4118471 -12350351 -19087905 -22768270 -24083807
36424 -24083807 -22635993 -18969343 -16619742 -18038174 -20775329 -21211965 -19465751 -16765823
36416 -16765823 -11065150 -792399 9008038 10928515 5634213 1695574 3672779 6515618
36408 6515618 4517835 677 -1452020 40831 107136 -2235268 -4500672 -7007149
36400 -7007149 -12585226 -19265845 -19770248 -11457170 -1719395 1219719 -406927 2500020
36392 2500020 12153022 19665113 16124975 3394164 -8967885 -14601414 -14909390 -14554818
36384 -14554818 -16137155 -19240476 -21743362 -21275677 -17404556 -13099709 -12222831 -14669653
$$ packed form
36441I811164p18921n40888j345739m710386o404433l829971r18301j085126j092076
36432a0834677K504160N740621K782100m310675q231880o737554l680365j315537
36424b4083807J447814L666650K349601j418432k737155m36636J746214K699928
36416a6765823N700673J0272751R800437J920477n294302l938639J977205K842839
36408F515618j997783m517158j452697J492851O6305k342404k265404k506477
36400g007149n578077o680619n04403Q313078R737775K939114j626646K906947
36392B500020R653002P512091l540138j2730811j2362049n633529l07976L54572
36384a4554818j582337l103321k502886M67685L871121M304847Q76878k446822
$$ plain form
36376 -14669653 -15660806 -11117185 -2576989 4408490 5747337 1538067 -5395132 -11761944
36368 -11761944 -15028719 -14320184 -10663058 -5701422 -522912 3549036 4373951 1441977
36360 1441977 -1784863 -1040167 2873205 4799293 3310001 4290504 12871612 24406396
36352 24406396 28598367 22187279 12402507 6661490 3886891 -900815 -7510046 -10951247
36344 -10951247 -9032995 -4741696 -1264309 1064077 2157457 566568 -3565218 -6856332
36336 -6856332 -6491098 -3961269 -2755650 -3477766 -3565138 -1480386 941860 946473 -1452100
36327 -1452100 -3157944 -1520807 2160878 3560344 413644 -4246533 -5483408 -2508724
36319 -2508724 852168 1822468 2116814 4410253 7539445 7486078 2463348 -4708737 -9493860
$$ packed form
36376a4669653r91153M543621Q540196O985479J338847m209270o933199o366812
36368a1761944l266775P08535L657126M961636N178510M071948Q24915k931974
36360A441977l226840P44696L913372J926088j489292R80503Q581108J1534784
36352B4406396M191971o411088r784772n741017k774599m787706o609231l441201
36344a0951247J918252M291299L477387K328386J093380j590889m131786l291114
36336f856332L65234K529829J205619p22116q7372K084752K422246M613k398573
36327a452100j705844J637137L681685J399466l146700m660177j236875K974684
36319b508724L360892R70300K94346K293439L129192n3367n022730p172085m785123
$$ plain form
36310 -9493860 -10369231 -10570735 -14547084 -22011055 -26947597 -24783927 -19289070 -18454789 -23431275
36301 -23431275 -26124450 -19437154 -5622445 8028992 17555005 22759565 23142838 18417678
36293 18417678 11073941 3974399 -3071139 -10471667 -14948235 -13556527 -9879478 -10153768
36285 -10153768 -13567995 -12608482 -4155580 5376644 8152429 3686396 -2965929 -8134867
36277 -8134867 -11712977 -14477871 -15672963 -13070207 -5731823 2426198 4287500 -1818020
36269 -1818020 -7448110 -3394642 7572911 13753361 10071507 3115743 -675802 -3546331
36261 -3546331 -9164295 -14178703 -13157768 -7243849 -1979068 306857 911339 426801
36253 426801 -1224348 -2678567 -3102324 -4036773 -6016522 -6495564 -4646027 -4351912 -8000695
$$ packed form
36310i493860q75371k01504l976349p463971m936542K163670N494857Q34281m976486
36301b3431275k693175O687296J3814709J3651437R526013N204560L83273m725160
36293A8417678p343737p099542p045538p400528m476568J391708L677049k74290
36285a0153768l414227R59513Q452902R532224K775785m466033o652325n168938
36277h134867l578110k764894j195092K602756P338384Q158021J861302o105520
36269a818020n630090M053468J0967553O180450l681854o955764l791545k870529
36261c546331n617964n014408J020935N913919N264781K285925O04482m84538
36253D26801j651149j454219m23757r34449j979749m79042J849537K94115l648783
$$ plain form
36244 -8000695 -11224739 -9230274 -4971599 -5052094 -10203922 -15915995 -19974554 -22713573
36236 -22713573 -21870287 -14810942 -5411341 -1494542 -4644594 -8479628 -7579847 -2574308
36228 -2574308 3901291 10391756 14854161 15069014 11948004 8146493 3603318 -2594002
36220 -2594002 -6919088 -4653457 1595235 3799625 -242865 -4845388 -6665391 -8745552
36212 -8745552 -11987733 -11420626 -5440974 -849794 -2900838 -7010213 -6655188 -3571474
36204 -3571474 -3012607 -3788328 -925927 4890384 8269300 7897843 7553276 9169309 10932434
36195 10932434 11892756 13002384 13509971 11104344 6050091 1382590 -1189836 -2540298
36187 -2540298 -3727362 -5089623 -6727477 -7359081 -4707265 -188438 -431603 -9292791
$$ packed form
36244h000695l224044J994465M258675q0495n151828n712073m058559k739019
36236b2713573Q43286P059345R399601L916799l150052l835034Q99781N005539
36228b574308O475599O490465M462405K14853l121010l801511m543175o197320
36220b594002m325086K265631O248692K204390m042490m602523j820003k080161
36212h745552l242181N67107N979652M591180k051044m109375L55025L083714
36204c571474N58867p75721K862401N816311L378916l71457l44567J616033J763125
36195A0932434R60322J109628N07587k405627n054253m667501k572426j350462
36187b540298j187064j362261j637854o31604K651816M518827k43165q861188
$$ plain form
36179 -9292791 -20278209 -22590571 -14221973 -3727890 1133964 1275780 1745684 4091097
36171 4091097 5658065 3937340 -206181 -2874640 -1138504 2337029 985799 -6898418
36163 -6898418 -14192508 -13946835 -9382719 -8943839 -13381338 -15156560 -10550301 -4634772
36155 -4634772 -2551262 -3130704 -4104320 -6830980 -11515287 -13521464 -9987539 -6112901
36147 -6112901 -9106910 -18103783 -25129108 -24898073 -19540695 -14409356 -12687786 -13678713
36139 -13678713 -13667423 -8917939 110340 8239672 10836135 8401793 4670678 2256623
36131 2256623 2007321 4088237 6828033 6459558 1121611 -6257760 -11652269 -14601526
36123 -14601526 -16280456 -15421584 -10564348 -4751866 -2808045 -4261282 -4103596 -1040838
$$ packed form
36179i292791j0985418k312362Q368598J0494083M861854J41816M69904K345413
36171D091097J566968j720725m143521k668459J736136L475533j351230p884217
36163f898418p294090K45673M564116M38880m437499j775222M606259N915529
36155d634772K083510n79442r73616k726660m684307k006177L533925L874638
36147f112901k994009q996873p025325K31035N357378N131339J721570r90927
36139a3678713J1290M749484R028279Q129332K596463k434342l731115k414055
36131B256623k49302K080916K739796l68475n337947p379371n394509k949257
36123a4601526j678930Q58872M857236N812482J943821j453237J57686L062758
$$ plain form
36115 -1040838 356198 -2658058 -6382969 -6774883 -5818613 -7699668 -11712068 -13654258
36107 -13654258 -12547697 -11183478 -10502536 -8098172 -3039155 1913264 4552360 6393806
36099 6393806 9463126 12530746 13049049 10973347 8190567 5659135 3523358 2435251
36091 2435251 1869391 -1158830 -7659715 -12004810 -6977885 5736338 15462066 15335372
36083 15335372 10410126 9443391 12961875 14601000 11290371 6056395 1954079 -723823
36075 -723823 -1119585 2346401 7252807 7455843 785263 -7155834 -9327123 -4413276 4264202
36066 4264202 13419511 20370645 21842245 16213636 6213834 -3200531 -9145216 -11566796
36058 -11566796 -11211489 -8926815 -6110326 -4123229 -3630771 -4870455 -6951882 -6662862
$$ packed form
36115a040838J397036l014256l724911l91914R56270j881055m012400j942190
36107a3654258J106561J364219O80942K404364N059017M952419K639096J841446
36099F393806L069320L067620N18303k075702k782780k531432k135777j088107
36091B435251n65860l028221o500885m345095N026925J2714223R725728j26694
36083A5335372m925246r66735L518484J639125l310629n233976m102316k677902
36075g23823l95762L465986M906406K03036o670580p941097k171289M913847Q677478
36066D264202R155309O951134J471600n628609r999802r414365n944685k421580
36058a1566796L55307K284674K816489J987097M92458j239684k081427K89020
$$ plain form
36050 -6662862 -1077433 7138982 10483720 5631285 -1084405 -973118 6091774 12191238
36042 12191238 11868909 7832198 5792532 7206101 8465730 5258296 -3149416 -12763303
36034 -12763303 -18003376 -17080381 -13506978 -11118543 -9499343 -6802647 -4982893 -7887604
36026 -7887604 -14588458 -19169709 -18279489 -15255156 -15146661 -18633673 -22701768 -24791515
36018 -24791515 -24022638 -19961535 -12467417 -2517966 7543341 14159962 13693070 5742398
36010 5742398 -4468747 -9862969 -8921979 -7102036 -9671270 -15545728 -19720876 -19157611
36002 -19157611 -14085017 -6166659 1356529 3773523 -473573 -5736247 -4141121 4392879
35994 4392879 11076950 9371029 3768078 3703031 10553468 15691485 12367673 5063219
$$ packed form
36050f662862N585429Q216415L344738m852435o715690J11287P064892O099464
36042A2191238l22329m036711k039666J413569J259629l207434q407712r613887
36034a2763303n240073R22995L573403K388435J619200K696696J819754k904711
36026g887604o700854m581251Q90220L024333J08495l487012m068095k089747
36018b4791515P68877M061103P494118R949451J0061307O616621m66892p950672
36010E742398j0211145n394222R40990J819943k569234n874458m175148N63265
36002a9157611N072594P918358P523188K416994m247096n262674J595126Q534000
35994D392879O684071j705921n602951o5047O850437N138017l323812p304454
$$ plain form
35986 5063219 3646714 10619821 18392820 18784229 11069086 -256281 -11415155 -20310700
35978 -20310700 -24866012 -24620043 -22804702 -23140309 -24932712 -24521407 -21182091 -17981957
35970 -17981957 -16504100 -14457043 -9742072 -3727847 1093682 4022036 5096056 3674404
35962 3674404 48722 -3481086 -4951580 -4607292 -3350343 -1537887 -538705 -2655101
35954 -2655101 -7501971 -11159375 -11219700 -9876124 -9402578 -8013528 -4194739 -1887659 -5679554
35945 -5679554 -12644707 -15401662 -13007169 -12125314 -16154782 -19928660 -18241788 -13611859
35937 -13611859 -11018363 -9841707 -6806569 -3445667 -3819389 -6251563 -4371755 2887638
35929 2887638 8644114 7694317 3473893 1884961 2406729 184627 -5355409 -9334149
$$ packed form
35986E063219j416505O973107P772999L91409p715143j1325367j1158874q895545
35978b0310700m555312K45969J815341l35607j792403M11305L339316L200134
35970a7981957J477857K047057M714971O014225M821529K928354J074020j421652
35962C674404l625682l529808j470494L44288J256949J812456R99182k116396
35954b655101m846870l657404o0325J343576M73546J389050L818789K307080l791895
35945e679554o965153k756955K394493Q81855m029468l773878J686872M629929
35937a3611859K593496J176656L035138L360902l73722k432174J879808P259393
35929B887638N756476r49797m220424j588932N21768k222102n540036l978740
$$ plain form
35921 -9334149 -8845497 -7071080 -8390476 -12290013 -14220795 -11121718 -4457718 1623928
35913 1623928 4134519 3492099 2302652 1812066 410509 -3085807 -5829732 -3698874
35905 -3698874 2014561 4271396 -1250771 -10162612 -14660353 -12586193 -7852808 -3863233
35897 -3863233 -1190174 -1134600 -6086932 -14626323 -20586656 -19848905 -15430287 -13435856 -16056988
35888 -16056988 -20469976 -22332751 -18461244 -8850358 1339586 4639459 -407519 -6151496
35880 -6151496 -5066519 88412 426406 -6010313 -11546763 -10006233 -4579525 -2057036
35872 -2057036 -4245496 -8884605 -15203874 -23607125 -31559698 -34513828 -31114300 -24441260
35864 -24441260 -17981426 -12917989 -9415798 -7738630 -7095785 -5554292 -2720619 -1398421
$$ packed form
35921i334149M88652J774417j319396l899537j930782L099077O664000O081646
35913A623928K510591o42420j189447m90586j401557l496316k743925K130858
35905c698874N713435K256835n522167q911841m497741K074160M733385L989575
35897c863233K673059N5574m952332q539391n960333P37751M418618J994431k621132
35888a6056988m412988j862775L871507R610886J0189944L299873n046978n743977
35880f151496J084977N154931L37994o436719n536450J540530N426708K522489
35872b057036k188460m639109o319269q403251p952573k954130L399528O673040
35864b4441260O459834N063437L502191J677168O42845J541493K833673J322198
$$ plain form
35856 -1398421 -4810030 -12024139 -17372371 -15628657 -7890430 -1091800 -599684 -4313047
35848 -4313047 -6044077 -3988171 -2497197 -4657937 -6979543 -4515492 1332822 4371712
35840 4371712 2194345 -1025018 -1016136 988227 1044728 -1676139 -4380872 -4828855 -3773145
35831 -3773145 -3304178 -4190566 -5224058 -4651879 -2052192 1191245 3342903 3854378 2931006
35822 2931006 228874 -4587019 -10060847 -13557777 -14537307 -15792954 -19996046 -25718771
35814 -25718771 -28420820 -25389633 -18495004 -11643815 -6503692 -1880352 2773035 4762131
35806 4762131 665865 -8753145 -18057762 -22424181 -21721152 -17961834 -11008026 -348458
35798 -348458 9598526 10714073 25365 -15502124 -25855528 -28100069 -26965295 -26634475
$$ packed form
35856a398421l411609p214109n348232J743714P738227O798630M92116l713363
35848d313047j731030K055906J490974k160740k321606K464051N848314L038890
35840D371712k177367l219363Q882K004363N6501k720867k704733m47983J055710
35831c773145M68967q86388j033492N72179K599687L243437K151658N11475r23372
35822B931006k702132m815893n473828l496930r79530j255647m203092n722725
35814b5718771k702049L031187O894629O851189N140123M623340M653387J989096
35806D762131m096266r419010r304617m366419P03029L759318O953808J0659568
35798c48458R946984J115547j0688708j5527489j0353404k244541J134774L30820
$$ plain form
35790 -26634475 -25662229 -20803446 -12884482 -6412882 -4141911 -4231530 -3529594 -2208421 -3139911
35781 -3139911 -6599976 -8111618 -3720655 3961938 8032363 5486165 142856 -2923310
35773 -2923310 -2402388 832619 6182814 11477686 12264470 6882229 -120516 -3500935
35765 -3500935 -3907393 -4515094 -3747769 1987852 9082227 8077914 -3435660 -15843720
35757 -15843720 -19250616 -15043286 -11290080 -11036743 -10885810 -8578041 -5852250 -4150968
35749 -4150968 -2476967 -317879 699087 -1130148 -6001274 -12917756 -19520559 -22354578
35741 -22354578 -19859807 -14552231 -9872365 -5911459 -1173781 2669260 1913022 -3268788
35733 -3268788 -7904059 -7899177 -3522730 2853101 8620476 10057979 4251160 -6002587
$$ packed form
35790b6634475R72246M858783P918964O471600K270971q9619P01936J321173r31490
35781c139911l460065j511642M390963P682593M070425k546198n343309l066166
35773b923310N20922L235007N350195N294872P86784n382241p002745l380419
35765c500935m06458o07701P67325N735621P094375j004313j1513574j2408060
35757a5843720l406896M207330L753206K53337J50933K307769K725791J701282
35749d150968J674001K159088J016966j829235m871126o916482o602803k834019
35741b2354578K494771N307576M679866L960906M737678L843041p56238n181810
35733c268788m635271M882M376447O375831N767375J437503n806819j0253747
$$ plain form
35725 -6002587 -13003559 -12511066 -8441484 -6973573 -9078006 -11690758 -13241535 -14132139
35717 -14132139 -13582758 -10118724 -4833989 -1097808 -929335 -3546769 -6945319 -9258483
35709 -9258483 -9667231 -9770792 -12534271 -17660968 -19899893 -15227898 -7500069 -5187582
35701 -5187582 -11615631 -21547644 -27298577 -25215342 -16570439 -6041318 -24946 -2622170
35693 -2622170 -11337117 -18979167 -20973027 -18856656 -16473930 -15942543 -18109236 -23090081
35685 -23090081 -28253314 -28924842 -23813112 -17401450 -14572124 -15092244 -15614048 -14383373
35677 -14383373 -11139649 -5347173 1390062 3486900 -2860934 -12742822 -16352677 -10256202
35669 -10256202 -692501 4834607 4742286 1028449 -5122810 -12114337 -15980893 -14021934
$$ packed form
35725f002587p000972M92493M069582J467911k104433k612752j550777q90604
35717a4132139N49381L464034N284735L736181J68473k617434l398550k313164
35709i258483m08748j03561k763479n126697k238925M671995P727829K312487
35701e187582o428049r932013n750933K083235Q644903J0529121O016372k597224
35693b622170q714947p642050j993860K116371K382726N31387k166693m980845
35685b3090081n163233o71528N111730O411662K829326n20120n21804J230675
35677a4383373L243724N792476O737235K096838o347834r881888l609855O096475
35669a0256202R563701N527108r2321l713837o151259o991527l866556J958959
$$ plain form
35661 -14021934 -9117171 -7177027 -10770404 -17248658 -22074485 -21983848 -16277311 -7661883
35653 -7661883 -991551 1425324 2648995 6690414 12048826 13010478 7434225 -428264
35645 -428264 -6026446 -9956880 -15021578 -20474746 -22375852 -18610413 -10800440 -1622859
35637 -1622859 7202867 13986227 16482656 13613929 6929275 -481754 -6193313 -9421863
35629 -9421863 -10632804 -10841269 -11055179 -11905154 -13642981 -16441829 -20588207 -26231731 -32599277
35620 -32599277 -37231704 -36785423 -30068224 -20535578 -14256887 -14364796 -18424378 -22020329
35612 -22020329 -23423458 -23193625 -20868131 -15178917 -7563325 -2428628 -2530034 -5913216
35604 -5913216 -8796353 -10027613 -11201320 -13502728 -16228963 -18058176 -18330641 -17078819
$$ packed form
35661a4021934M904763J940144l593377o478254m825827R0637N706537Q615428
35653g661883O670332K416875J223671M041419N358412R61652n576253p862489
35645d28264n598182l930434n064698n453168j901106L765439P809973R177581
35637a622859Q825726O783360K496429k868727o684654p411029n711559l228550
35629i421863j210941k08465k13910q49975j737827k798848m146378n643524o367546
35620c2599277m632427M46281O717199R532646O278691j07909m059582l595951
35612b2020329j403129K29833K325494N689214P615592N134697j01406l383182
35604e913216k883137j231260j173707k301408k726235j829213k72465J251822
$$ plain form
35596 -17078819 -14806054 -12274179 -9812934 -6978958 -3611558 -1068553 -1487403 -5384390
35588 -5384390 -10291537 -12243506 -9163402 -3289736 -266 -3237831 -11618767 -19466802
35580 -19466802 -21728481 -17334848 -8375859 1912869 9579671 10654128 4043715 -6310871
35572 -6310871 -13777193 -14058340 -7771453 978333 7480688 8808357 5295242 -43345
35564 -43345 -4566860 -8397691 -12770348 -16534116 -16301759 -10781822 -3554442 -284587 -3408852
35555 -3408852 -10016587 -14661929 -14092764 -9784219 -6285415 -6869719 -10518556 -13200896
35547 -13200896 -12160142 -8900284 -7859848 -11772533 -18055528 -20525396 -15806544 -7452267
35539 -7452267 -1875661 -590158 495280 3483350 4426494 -77127 -5834678 -5893213 -930784
$$ packed form
35596a7078819K272765K531875K461245K833976L367400K543005m18850l896987
35588e384390m907147j951969L080104N873666L289470l237565q380936p848035
35580a9466802k261679M393633Q958989J0288728P666802J074457o610413j0354586
35572f310871p466322k81147O286887Q749786O502355J327669l513115n338587
35564d3345m523515l830831m372657l763768K32357N519937P227380L269855l124265
35555c408852o607735m645342N69165M308545L498804n84304l648837k682340
35547a3200896J040754L259858J040436l912685o282995k469868M718852Q354277
35539g452267N576606J285503J085438K988070R43144m503621n757551n8535M962429
$$ [...]
##END NTUPLES=NMR SPECTRUM
##END=
