##TITLE=31Pdec_DE-63_34
 D2O, 64 sc
 14.8.2024
##JCAMPDX= 6.0         $$ Bruker NMR JCAMP-DX V2.0
##DATA TYPE= NMR SPECTRUM
##DATA CLASS= NTUPLES
##ORIGIN= UXNMR, Bruker Analytische Messtechnik GmbH
##OWNER= root
$$ XWIN-NMR		Version 3.5
$$ Wed Aug 14 14:08:32 2024 Russian Standard Time (UT+4h)  she@DPX200
##.OBSERVE FREQUENCY= 81.013821
##.OBSERVE NUCLEUS= ^31P
##.ACQUISITION MODE= SIMULTANEOUS
##.ACQUISITION SCHEME= undefined
##.AVERAGES= 64
##.DIGITISER RES= 17
##SPECTROMETER/DATA SYSTEM= spect
##.PULSE SEQUENCE= zgpg30
##.SOLVENT NAME= CDCl3
##.SHIFT REFERENCE= (INTERNAL, CDCl3, 0, 198.062)
##AUDIT TRAIL= $$ (NUMBER, WHEN, WHO, WHERE, WHAT)
$$ ##TITLE= Audit trail, XWIN-NMR		Version 3.5
$$ ##JCAMPDX= 5.01
$$ ##ORIGIN= Bruker BioSpin GmbH
$$ ##OWNER= she
$$ F:/spectra/data/she/nmr/P31/2/pdata/1/auditp.txt
$$ ##AUDIT TRAIL=  $$ (NUMBER, WHEN, WHO, WHERE, WHAT)
(   1,<2024-08-14 14:07:09.64 +0400>,<she>,<DPX200>,
      <created by zg, POWCHK disabled, PULCHK disabled
       configuration hash MD5:
       00 E9 B6 7A A2 85 ED C7 34 08 36 98 17 FE 4E 26
       data hash MD5: 32K
       73 4E CC 2C CB 6D EA 31 8D 9D 44 AA 0C 47 99 0D>)
(   2,<2024-08-14 14:07:11.87 +0400>,<she>,<DPX200>,
      <Start of raw data processing
       efp BC_mod = 2 LB = 1.5 FT_mod = 6 PKNL = 1 PHC0 = 2662.508 PHC1 = 107.488 SI = 64K 
       data hash MD5: 64K
       45 08 C9 0D 98 42 65 22 01 96 E3 82 F3 10 E3 E1>)
(   3,<2024-08-14 14:07:58.39 +0400>,<she>,<DPX200>,
      <pk PHC0 = -8.997797 PHC1 = 13.80001 
       data hash MD5: 64K
       9B BA 6E 81 A0 E3 B2 FE 88 66 DD D6 D8 61 19 1B>)
$$ ##END=
$$ 
$$ hash MD5
$$ E2 7A 26 85 7B E6 B1 01 20 BE D7 A6 D1 3C 97 77
##$RELAX= 
##$RELAX= 
##$RELAX= 
##$RELAX= 
##$RELAX= 
##$RELAX= 
##$RELAX= 
##$RELAX= 
$$ Bruker specific parameters
$$ --------------------------
##$DU= <F:/spectra>
##$EXPNO= 2
##$NAME= <P31>
##$PROCNO= 1
##$TYPE= <nmr>
##$USER= <she>
##$AMP= (0..31)
100 100 100 100 100 100 100 100 100 100 100 100 100 100 100 100 100 100 
100 100 100 100 100 100 100 100 100 100 100 100 100 100 
##$AQSEQ= 0
##$AQ_mod= 1
##$AUNM= <au_zg>
##$AUTOPOS= <>
##$BF1= 81.014009
##$BF2= 200.13
##$BF3= 200.13
##$BF4= 200.13
##$BF5= 200.13
##$BF6= 200.13
##$BF7= 200.13
##$BF8= 200.13
##$BYTORDA= 1
##$CFDGTYP= 0
##$CFRGTYP= 5
##$CHEMSTR= <none>
##$CNST= (0..31)
1 1 145 1 1 1 1 1 1 1 1 1 1 1 1 1 1 1 1 1 1 1 1 1 1 1 1 1 1 1 1 1 
##$CPDPRG= <waltz16>
##$CPDPRG1= <>
##$CPDPRG2= <waltz16>
##$CPDPRG3= <>
##$CPDPRG4= <mlev>
##$CPDPRG5= <mlev>
##$CPDPRG6= <mlev>
##$CPDPRG7= <mlev>
##$CPDPRG8= <mlev>
##$CPDPRGB= <>
##$CPDPRGT= <>
##$D= (0..31)
0 1 0 0 0 0 0 0 0 0.06 0 0.03 2e-05 3e-06 0 0 0.0002 0 0 0 0 0 0 0 0 0 
0 0 0 0 0 0 
##$DATE= 1723630029
##$DBL= (0..7)
120 120 120 11 120 120 24 19 
##$DBP= (0..7)
150 150 150 150 150 150 150 150 
##$DBP07= 0
##$DBPNAM0= <>
##$DBPNAM1= <>
##$DBPNAM2= <>
##$DBPNAM3= <>
##$DBPNAM4= <>
##$DBPNAM5= <>
##$DBPNAM6= <>
##$DBPNAM7= <>
##$DBPOAL= (0..7)
0.5 0.5 0.5 0.5 0.5 0.5 0.5 0.5 
##$DBPOFFS= (0..7)
$$ [...]
##$SUBNAM2= <"">
##$SUBNAM3= <"">
##$SUBNAM4= <"">
##$SUBNAM5= <"">
##$SUBNAM6= <"">
##$SUBNAM7= <"">
##$SUBNAM8= <"">
##$SUBNAM9= <"">
##$SW= 400.765351723535
##$SWIBOX= (0..15)
0 1 3 0 0 0 0 0 0 0 0 0 0 0 0 0 
##$SW_h= 32467.5324675325
##$TD= 32768
##$TD0= 1
##$TE= 0
##$TE2= 300
##$TE3= 300
##$TEG= 300
##$TL= (0..7)
0 120 53 12 22 120 120 120 
##$TP= (0..7)
150 150 150 150 150 150 150 150 
##$TP07= 0
##$TPNAME0= <>
##$TPNAME1= <>
##$TPNAME2= <>
##$TPNAME3= <>
##$TPNAME4= <>
##$TPNAME5= <>
##$TPNAME6= <>
##$TPNAME7= <>
##$TPOAL= (0..7)
0.5 0.5 0.5 0.5 0.5 0.5 0.5 0.5 
##$TPOFFS= (0..7)
0 0 0 0 0 0 0 0 
##$TUNHIN= 0
##$TUNHOUT= 0
##$TUNXOUT= 0
##$USERA1= <user>
##$USERA2= <user>
##$USERA3= <user>
##$USERA4= <user>
##$USERA5= <user>
##$V9= 5
##$VALIST= <valist>
##$VCLIST= <CCCCCCCCCCCCCCC>
##$VD= 0
##$VDLIST= <DDDDDDDDDDDDDDD>
##$VPLIST= <PPPPPPPPPPPPPPP>
##$VTLIST= <TTTTTTTTTTTTTTT>
##$WBST= 1024
##$WBSW= 4
##$XGAIN= (0..3)
0 0 0 0 
##$XL= 0
##$YL= 0
##$YMAX_a= 12280
##$YMIN_a= -9096
##$ZGOPTNS= <>
##$ZL1= 120
##$ZL2= 120
##$ZL3= 120
##$ZL4= 120
##$ABSF1= 0
##$ABSF2= 0
##$ABSG= 0
##$ABSL= 0
##$ALPHA= 0
##$AQORDER= 0
##$ASSFAC= 0
##$ASSFACI= 0
##$ASSFACX= 0
##$ASSWID= 0
##$AUNMP= <proc_1d>
##$AZFE= 0.1
##$AZFW= 0.5
##$BCFW= 0
##$BC_mod= 2
##$BYTORDP= 0
##$COROFFS= 0
##$CY= -3
##$DATMOD= 1
##$DC= 0
##$DFILT= <>
##$DTYPP= 0
##$F1P= 0
##$F2P= 0
##$FCOR= 1
##$FTSIZE= 65536
##$FT_mod= 6
##$GAMMA= 0
##$GB= 0
##$INTBC= 1
##$INTSCL= 9.790993e-09
##$ISEN= 30
##$LB= 1.5
##$LEV0= 0
##$LPBIN= 0
##$MAXI= 10000
##$MC2= 0
##$MEAN= 0
##$ME_mod= 0
##$MI= 50
##$NCOEF= 0
##$NC_proc= -9
##$NLEV= 6
##$NOISF1= 182.463
##$NOISF2= 159.3651
##$NSP= 0
##$NTH_PI= 0
##$NZP= 0
##$OFFSET= 198.0616
##$PC= 4
##$PHC0= 2653.51
##$PHC1= 121.288
##$PH_mod= 1
##$PKNL= yes
##$PPARMOD= 0
##$PSCAL= 0
##$PSIGN= 0
##$REVERSE= no
##$SF= 81.0140089999434
##$SI= 65536
##$SIGF1= 159.3651
##$SIGF2= -187.1042
##$SINO= 113.3802
##$SIOLD= 16384
##$SREGLST= <1H.CDCl3>
##$SSB= 0
##$STSI= 65536
##$STSR= 0
##$SW_p= 32467.5324675325
##$SYMM= 0
##$S_DEV= 0
##$TDeff= 32768
##$TDoff= 0
##$TI= <>
##$TILT= no
##$TM1= 0
##$TM2= 0
##$TOPLEV= 0
##$USERP1= <user>
##$USERP2= <user>
##$USERP3= <user>
##$USERP4= <user>
##$USERP5= <user>
##$WDW= 1
##$XDIM= 65536
##$YMAX_p= 282199402
##$YMIN_p= -207410636
$$ End of Bruker specific parameters
$$ ---------------------------------
##NTUPLES= NMR SPECTRUM
##VAR_NAME=  FREQUENCY,     SPECTRUM/REAL,   SPECTRUM/IMAG
##SYMBOL=    X,             R,               I
##VAR_TYPE=  INDEPENDENT,   DEPENDENT,       DEPENDENT
##VAR_FORM=  AFFN,          ASDF,            ASDF
##VAR_DIM=   65536,         65536,           65536
##UNITS=     HZ,            ARBITRARY UNITS, ARBITRARY UNITS
##FACTOR=    0.49542278885378, 1,            1
##FIRST=     16045.7642231865, 0,            0
##LAST=      -16421.768244346, 0,            0
##MIN=       -16421.768244346, -207410636,   0
##MAX=       16045.7642231865, 282199402,    0
$$ Real data points
##PAGE= N=1
##DATA TABLE= (X++(R..R)), XYDATA
$$ [...]
42297 3436634 9183208 10665450 8751679 5169289 1556933 -1389286 -3510985 -4210901
42289 -4210901 -3338281 -2829134 -5247618 -10023797 -12965363 -10588864 -3997699 2072660
42281 2072660 3324151 -1054530 -8516690 -16099320 -23191160 -30332285 -35306554 -33424776
42273 -33424776 -23909454 -13323886 -8875430 -9801730 -9633569 -6095225 -3509461 -4739980
42265 -4739980 -6407922 -5016357 -3261795 -5662618 -10414237 -10804752 -4692205 1849785
42257 1849785 2148472 -2584719 -5029312 -973486 6013550 9715837 8736851 6727562
42249 6727562 6319962 5904588 3138530 -1010673 -3658228 -3934976 -3584565 -4448269 -6870400
42240 -6870400 -9882062 -11799684 -11596012 -10612709 -11371692 -13593879 -13658840 -9842295 -5421579
42231 -5421579 -3670159 -2335975 2803294 10683987 16122319 17545624 18507354 21158833
42223 21158833 23136436 22219325 19720716 17522898 15548902 13946804 14176549 16070907
42215 16070907 17265605 17220117 17896995 18568546 14864723 6507989 1310950 6211169 17388978
42206 17388978 24759759 24048813 18744003 12113637 4521939 -1434558 -1009803 4801059
42198 4801059 8071953 4832076 1718143 6302850 14997701 17631822 12144269 6963585
42190 6963585 8042097 11010769 9565236 5345191 3801169 4277190 1178390 -6215357
42182 -6215357 -11794794 -11263853 -6996178 -2584044 1914888 6307662 7014830 2261913
42174 2261913 -2951686 -2405576 2771886 6183887 5473413 4089720 4082618 2870799 -1510190
42165 -1510190 -6813538 -10312681 -12188724 -12906285 -10635419 -4069872 4465113 10982519
42157 10982519 13163650 10512015 3931201 -3085949 -5868517 -3848757 -2084995 -4766008
42149 -4766008 -9351995 -10210189 -6143389 -785589 3098454 5763644 7455667 7309322
42141 7309322 5988176 6022051 8103348 9703067 9164555 9033174 12715844 18646647 20658992
42132 20658992 15272396 6833966 3188555 6449835 10542874 9103836 3495253 302716
42124 302716 2291307 5545165 5641327 2939769 534187 141785 1733337 4459228 5995057
42115 5995057 3541288 -2286060 -6820406 -6929935 -5216982 -6343611 -11130955 -16564197
42107 -16564197 -19556929 -18429072 -13178572 -7047729 -5085551 -7849288 -9464962 -5971043
42099 -5971043 -2378156 -5997218 -15430039 -22897656 -25732957 -27503284 -27873542 -20677836
42091 -20677836 -5150565 9055226 13138694 9450091 5533832 3522395 1414385 -77139
42083 -77139 575181 27784 -5897827 -13669459 -14921375 -8061438 -376888 2280820 1582581
42074 1582581 1013643 474020 -533821 100210 3083746 5200309 4847516 5922512 11252576
42065 11252576 15717751 12233713 2802040 -3244677 -2240830 -770866 -5038602 -11509891
42057 -11509891 -12497490 -7338268 -2738079 -3237209 -6176426 -6850628 -5039871 -4437805 -7301598
42048 -7301598 -11548235 -12985261 -9662337 -3808312 772402 3170217 6057072 11070441
42040 11070441 15179602 14138645 8915192 5407327 6906754 9878144 9131382 4559271
42032 4559271 -192045 -3866562 -8420932 -13987335 -17165101 -15906413 -13074023 -12796475
42024 -12796475 -15168402 -16939382 -16181097 -13799734 -11165185 -8817204 -7385377 -7301622
42016 -7301622 -7276103 -5486163 -3039845 -3791848 -9181845 -15264790 -16927308 -13770702 -9832166
42007 -9832166 -8543761 -10060462 -12613011 -13999143 -12272438 -7728914 -4205803 -5521286
41999 -5521286 -10086817 -11948790 -8272336 -3002571 -1466705 -3957017 -6930670 -8392504
41991 -8392504 -9170846 -9952929 -9753684 -7154231 -1624610 5491901 10125165 7627153 -1758449
41982 -1758449 -11097368 -13358784 -8941092 -4004625 -2488495 -3017176 -2866247 -1169111
41974 -1169111 1942381 6027248 9811439 12712205 16369259 21219522 22547774 15267383
41966 15267383 3162754 -2593564 3294649 13413092 17246849 13207373 7351194 4300238
41958 4300238 4329496 6437171 8778538 7513514 383244 -8958484 -14477024 -15305867 -15600490
41949 -15600490 -16955568 -15642422 -8829302 252712 5874918 6513558 5700103 6918604
41941 6918604 9365436 9169158 4247916 -2980529 -8496790 -11457100 -14131593 -17370184
41933 -17370184 -19083814 -18044737 -15999054 -14295205 -11470848 -6391954 -822859 3565358
41925 3565358 7515893 10702439 9834653 4432313 771916 4395441 11165771 11961848
41917 11961848 4950629 -2811861 -5103639 -1770998 5031798 12955772 17302994 13635379
41909 13635379 4449225 -2304841 -2921818 -849554 997763 4241842 9276382 12268038
41901 12268038 11308314 9617107 9047710 6378455 285862 -4013000 -2486558 635561
41893 635561 -298577 -2891237 -962273 4948875 8536144 7265945 4093107 761933
41885 761933 -3795903 -8423467 -9585216 -7508094 -7190789 -11386890 -16386513 -16519019 -10387775
41876 -10387775 -1942594 2608778 -534093 -8480714 -12697708 -7362921 3874053 12147130
41868 12147130 12917133 7881369 -449335 -10624840 -19347721 -22563379 -20515379 -17138718
41860 -17138718 -13823132 -8627052 -2200159 1447153 1812442 3315837 6777374 5834447
41852 5834447 -2885641 -11260089 -8795829 2004750 7205028 -783549 -13410888 -16952570
41844 -16952570 -8919268 621315 2198882 -2931328 -6536421 -4140418 661060 1867132
41836 1867132 -1765796 -6447987 -8482476 -7699948 -6434511 -6860365 -9216909 -11469853
41828 -11469853 -11225596 -9098505 -8938449 -12812938 -17244737 -17469852 -14441114 -13650095 -17007276
41819 -17007276 -20299839 -19843568 -17241238 -15309993 -13461548 -10580602 -9153894 -12112045
41811 -12112045 -17400004 -20048093 -18882560 -17257711 -17381272 -17717735 -16446312 -14010698
41803 -14010698 -11194606 -7595074 -3368421 -107407 1411347 2236974 2626154 707284
41795 707284 -4198503 -8917848 -9936390 -8520308 -9161490 -12864748 -15070326 -11526760
41787 -11526760 -4004269 1657387 1990032 -1178031 -3410005 -1888459 2429903 5750997
41779 5750997 5202835 2475867 2303267 6028789 8816619 5917885 -212889 -3069812
41771 -3069812 -1344849 -30047 -1942869 -3641890 -1734984 2002687 4979548 8387524
41763 8387524 13206480 15948536 13737893 10285399 10919693 14302006 15450288 14778046
41755 14778046 16588744 19509557 16782739 7170148 -2316000 -6781884 -9012694 -11601815
41747 -11601815 -11290259 -6175767 -1780863 -3347744 -7100743 -6247346 -1968464 -865552
41739 -865552 -3665006 -4348094 -361405 3522755 3096118 702435 829298 3738946 6155724
41730 6155724 5936839 4032933 2976975 4219511 6087285 4825589 -797933 -6696795
41722 -6696795 -7358564 -2011985 5029254 9319477 9419636 6308114 2569785 1432242
41714 1432242 3618728 5639145 4042328 590095 -118140 2532167 4706560 4393962
41706 4393962 3811744 4727599 5611761 5192709 5185556 7036486 8646787 7053519 2970365
41697 2970365 520442 2814775 8515938 12410166 10025173 2953396 -1777604 -14778
41689 -14778 3641942 2211701 -3020818 -4208578 621378 3983978 414457 -5298295
41681 -5298295 -6195067 -3880404 -4694238 -8834525 -10639498 -8341383 -6447432 -7791474
41673 -7791474 -9239731 -7223520 -2945645 389399 2281252 4317170 6790367 8040840
41665 8040840 6407141 2052325 -2378227 -3206034 472892 4688048 4612680 896001 -448003
41656 -448003 4899792 14890354 24121024 28887682 28071306 22018368 13341091 7185791
41648 7185791 7377206 12018562 15042724 12859057 8215789 6718606 10278442 14973037
41640 14973037 15422787 10472848 3778230 -825234 -2919185 -3773497 -2870256 1419472
41632 1419472 8079628 13060389 13660182 11495705 9889263 9818572 10098537 10470154 12190956
41623 12190956 15313255 17225770 15178674 9705763 4384114 1916681 1184581 -1002929
41615 -1002929 -5346515 -8278300 -5532795 2773588 11308760 13975244 9260874 1497527
41607 1497527 -3260296 -3231785 -2662589 -6524466 -13747649 -17990692 -15814841 -11132656 -9363113
41598 -9363113 -10100333 -9412371 -7291292 -7438554 -9947838 -10136106 -6368733 -3483527 -5028534
41589 -5028534 -6817001 -3117012 3904324 6570297 2185592 -4224263 -7457458 -7317603
41581 -7317603 -5431218 -1757380 3320986 6725638 5326342 -587078 -7940811 -13523545
41573 -13523545 -15263296 -13114351 -9981482 -9677398 -12424976 -14242658 -12279463 -8661184
41565 -8661184 -6984692 -6877638 -4815750 527316 6424373 9643003 9997003 10034778 12090310
41556 12090310 15540729 16778479 13080329 6864236 3845615 5646917 7084906 3580089
41548 3580089 -1426956 -885438 5477444 10563751 10004521 7363315 7324221 8840776 8690181
41539 8690181 7753564 8769345 10149301 7500366 919936 -4168244 -4365089 -2368382
41531 -2368382 -2069759 -3052827 -2421658 222770 2247432 1222619 -3222229 -9670183 -15390850
41522 -15390850 -17791317 -17138553 -16460025 -16772486 -14293875 -5700068 5082380 9804454
41514 9804454 6028920 -71532 -2522871 -2591010 -4028490 -5631150 -3775423 -100555
41506 -100555 -606955 -6951379 -13807719 -16046257 -13959879 -9589771 -2476253 7486978
41498 7486978 16078236 17724811 11569837 2168779 -4792726 -5842892 -916554 6149784
41490 6149784 9756910 7659603 2864323 -1110977 -4334793 -7367320 -7468715 -2497135
41482 -2497135 3664396 5147317 2686661 2495695 6571343 10054860 9352112 7036477
41474 7036477 6512833 7235213 8132090 10662274 14685855 15845183 11618939 6304223 4988395
41465 4988395 5436556 1312501 -8399930 -18396903 -24207930 -25251093 -21665892 -13752063
41457 -13752063 -5082054 -1114651 -3180062 -7523288 -11242135 -15218657 -19834945 -21986967
41449 -21986967 -19080527 -13082043 -7624446 -2935562 3358015 11077842 15882210 13670070
41441 13670070 5487721 -3061174 -7472774 -8457907 -9273743 -10077649 -8109495 -3762113
41433 -3762113 -1902402 -4465609 -6206886 -2587105 1809996 -647815 -8321683 -11972109
41425 -11972109 -8719713 -6051428 -9692461 -15228597 -15905647 -12391715 -9759391 -9748298
41417 -9748298 -11150674 -13667981 -16203042 -15072784 -9217511 -3744062 -2956925 -3653962
41409 -3653962 -1621034 -837149 -7783013 -18757650 -22435305 -15436224 -6278297 -1999009
41401 -1999009 149814 3951241 5748594 1038777 -6627567 -10602084 -11193094 -13622112
41393 -13622112 -18070486 -18862998 -13519320 -6619110 -3286180 -3157211 -2558971 296382
41385 296382 3915011 5505620 3445500 -932165 -3863669 -2859415 334790 1975654
41377 1975654 884778 -1205691 -3107084 -5165869 -6825412 -6183370 -2817601 1378564
41369 1378564 5067955 8800269 12443745 13956987 12674247 11669640 14227101 19053504
41361 19053504 21509429 19201561 14175756 9645202 6732130 5101392 5045922 7413010
41353 7413010 11745500 15531296 16038272 13192818 10071386 9271338 8730480 3222477 -8463513
41344 -8463513 -19591628 -21536373 -13327303 -2236431 5348894 10113792 15268220 19534900
41336 19534900 18865529 13723113 9803133 10487466 12536609 11579589 8635947 7483880
41328 7483880 7537865 4345059 -2539738 -7332387 -6406988 -4755280 -9180605 -17031146 -17747367
41319 -17747367 -6579943 8476952 16148393 14110184 8038417 2037836 -4246122 -10179983
41311 -10179983 -12182004 -9085777 -4984709 -3833188 -3850674 92453 10110969 23070902
41303 23070902 33037275 34648096 26528995 13625089 4163573 1754364 1934868 -1344959
41295 -1344959 -7910342 -12975363 -14529263 -14968797 -16181341 -17460369 -18822825 -22277649
41287 -22277649 -28006393 -32118287 -30317138 -22517299 -12842527 -6185755 -4892237 -7121858
41279 -7121858 -8321282 -6015475 -2901517 -3168774 -6511509 -8857652 -8467354 -7144199
41271 -7144199 -5128319 137154 8232702 13648966 12790863 9146287 7538594 6702879
41263 6702879 2552163 -3498061 -5235999 -417779 6106721 8897035 7804697 6294169
41255 6294169 6965528 10017788 13745613 15167558 11820518 4215874 -4212809 -10010164
41247 -10010164 -11998348 -11141478 -9247074 -7501776 -5440385 -2031372 1676495 2819782
41239 2819782 1006912 -19561 2471052 5662648 5388076 3023122 3497033 7152413
41231 7152413 8943010 6595273 4409106 6596484 10957648 12239442 8860130 3262181
41223 3262181 -2231962 -6899217 -10353846 -12427029 -13552871 -13678097 -12121715 -10011792
41215 -10011792 -10771160 -15606180 -20052174 -18178487 -9787117 -612631 4602938 6420982
41207 6420982 7504531 7974659 6050977 1859925 -2001339 -3929219 -5233244 -7201847
41199 -7201847 -7661613 -3033587 6090425 14262531 17592373 18393742 20885432 24261373
41191 24261373 23749496 17819726 10360260 5326722 2890982 1736481 1489274 1255351
41183 1255351 -1023958 -5664543 -10080310 -12069266 -11712203 -8771491 -1652594 8855203
41175 8855203 18064352 22238478 22008992 18658927 11135386 569765 -6471998 -5180689
41167 -5180689 -548198 -1992098 -10980652 -19942280 -23004673 -21658111 -19382953 -16966082
41159 -16966082 -14772569 -14058960 -13935047 -12039202 -10093553 -13165318 -20765849 -24743017
41151 -24743017 -20197564 -12940965 -10730653 -12012767 -10117092 -4918789 -2281918 -3468835
41143 -3468835 -3333351 426870 3760282 3939729 4066128 6821633 9356675 8279942 5305958
41134 5305958 3823854 3470756 2423150 2010052 4197995 6620935 5374492 1961426
41126 1961426 2289587 8036342 13224328 11167159 2337616 -6098611 -7180445 -134194
41118 -134194 9178603 13790580 12730384 11703135 15208862 20013128 19669980 13861002
41110 13861002 8562283 7259495 7110688 4729112 683650 -3625767 -8605335 -13128477
41102 -13128477 -13143812 -7400405 -829866 1756643 1866105 2934201 3554662 1072438 -714464
41093 -714464 5186536 17969094 27703719 26481851 16183620 4181280 -3851942 -5465708
41085 -5465708 -875384 6091650 9766205 8144443 4754101 3770531 5689895 8718007
41077 8718007 11261595 11527276 7691234 474677 -6582894 -10656293 -11339415 -8645794
41069 -8645794 -2821325 3097288 4762726 2383129 1286617 4666860 9615404 12363416
41061 12363416 13031781 12478749 9169572 2972334 -2175939 -3596645 -3849376 -4929663
41053 -4929663 -2887274 5969502 17185848 23093894 22910621 21172920 18788133 13726765
41045 13726765 9066490 10941562 17534971 19162027 12319011 5780249 8381424 17171063
41037 17171063 22735855 21192249 15451939 8431720 907868 -5670528 -9191029 -9332896
41029 -9332896 -7136735 -3245177 1014337 2565900 -391506 -5375421 -8193150 -7695168
41021 -7695168 -6024381 -5253009 -5580938 -5694615 -3434620 2280422 8719448 10683393 6604597
41012 6604597 1172702 -399349 1604002 3972341 6696737 12233512 19562688 23361003
41004 23361003 19930029 11252811 2680561 -1311208 736423 6694033 12050042 13954350
40996 13954350 14348595 16915493 20964855 21381638 15662954 8140737 5166830 8006603
40988 8006603 12761445 15985767 17594019 18420978 17851159 15408215 13081631 13924930 18401500
40979 18401500 23556520 26002852 24524805 19698771 12905072 6749124 4510128 7017043
40971 7017043 10997751 12500304 11144205 9049763 6905415 4153703 2191368 3379724
40963 3379724 6619615 8014396 6894868 6823328 8754465 7893689 945300 -7212252 -8665471
40954 -8665471 -2138370 6645707 12453087 14008805 11516092 5999055 1191240 1243067
40946 1243067 5387930 8644716 8865107 9364857 13014967 17179078 16865777 10690841 1890101
40937 1890101 -4654565 -5046216 1528044 11281727 18173275 19563510 17986852 16124937
40929 16124937 12790256 6397595 -234680 -2526558 -389202 2216593 3585260 5776122
40921 5776122 9223599 10605662 8497564 7012363 9862791 13749018 12790257 8200623
40913 8200623 7649143 14255194 22101609 25474675 27265535 33199499 41248530 43200833
40905 43200833 35915645 25105034 17283091 13213544 10813293 9497407 8883578 7192106
40897 7192106 4140393 2364531 3077505 3526796 2050516 2185411 7193260 13297180 14015542
40888 14015542 9771676 7091696 8385246 8974988 5939775 3727496 7125078 13118926
40880 13118926 14846740 11542677 9523919 13242446 19262273 20565261 14671568 5861243
40872 5861243 173936 -492466 744136 -63264 -3326321 -5654615 -3213861 4800095
40864 4800095 14954931 21271218 19714560 12752355 8314902 11777434 19367623 22234820
40856 22234820 17212373 10393393 8753401 11261354 11006862 4427875 -4660737 -9808897
40848 -9808897 -7963855 -463178 9328961 17691108 21345012 19073784 13184363 8242258
40840 8242258 7476387 10607631 15205039 19066245 20609814 18610530 13912878 10771285
40832 10771285 13302032 19766497 23400041 20714212 16232957 16418535 21396597 26248095
40824 26248095 28630602 30578215 33261784 34686343 33401600 30397664 26117329 19677882
40816 19677882 12936911 11166467 16447717 23493695 25729604 23278068 21008402 20435059
40808 20435059 18339038 13274704 8786590 8625371 12059098 15799293 18097403 18914035
40800 18914035 18023465 15386824 12330643 10151710 8264445 5857611 4655613 7098008
40792 7098008 11495926 12275620 6908330 185877 -1014740 4309383 11390166 16517324
40784 16517324 20040771 22651906 22909419 20266332 17434935 17332047 19674030 22563812
40776 22563812 25400087 28017172 28876759 26751994 23010900 20107147 19087481 20292702
40768 20292702 24360841 30139611 34038488 34717879 36232610 42621464 51179586 55473358
40760 55473358 53677702 49304484 44899244 40389952 37141978 37742832 41166014 43644688
40752 43644688 45128258 49152418 55155231 57262069 53156527 48308141 48300524 52261102
40744 52261102 56976285 61849005 65851313 65193001 59143169 53618702 53781652 57017108
40736 57017108 58104767 56931863 55576311 52412840 45961842 40700173 41425740 44806254
40728 44806254 44405754 41506100 42239982 45939481 46256510 43424953 44672524 50769033
40720 50769033 52972556 47350324 42163587 44974075 50825696 50696314 45161449 41401142
40712 41401142 41129712 39945454 36301801 33478564 33582516 35910744 40449318 46976553
40704 46976553 51173782 47812268 38624339 31868582 32819569 38693350 43671752 44811370
40696 44811370 42139768 37219719 33268907 33086357 35107747 34685100 30868114 28548493
40688 28548493 31719609 37758714 41280342 41245976 40891708 41954166 42403948 39967893 35480904
40679 35480904 32113045 32398383 36109888 40287282 41615319 39488711 36479288 35459076
40671 35459076 36816981 38488285 37572704 32055917 22948977 14996640 12553555 13867949
40663 13867949 12857526 8347700 7194229 14281629 23504039 25055660 19414164 16389228
40655 16389228 20449795 25324017 25219340 22959711 22502341 21150561 15978278 11663999
40647 11663999 13402700 16535321 13062690 5998736 6270779 14970258 19712976 12071297
40639 12071297 -924487 -7856512 -7427534 -5476867 -4060963 -1171603 2840465 5924889
40631 5924889 8737238 11897821 11361376 3320193 -8009686 -14441415 -14748392 -14594164
40623 -14594164 -15818877 -13405461 -4773897 4850819 9614345 10328141 11134293 13111705
40615 13111705 14786009 15592730 15159634 11864402 5998850 2574719 6980960 18203301
40607 18203301 29306308 34573457 33758442 29356152 22622047 13976316 5764060 1940942
40599 1940942 4045828 8675081 10446333 7256358 1384812 -4113877 -7989877 -9766926
40591 -9766926 -9008162 -6746112 -5050955 -3823496 -775668 4014430 7160987 7674168
40583 7674168 9092159 12464960 12366938 5565167 -1063036 791808 7405849 7728754 585541
40574 585541 -3206951 2368914 9741987 10028396 5424361 3415112 5444167 8080722
40566 8080722 10496172 13913313 16793724 16682884 14722546 13323532 11452311 6865517
40558 6865517 1049553 -2476868 -3054421 -2175958 100603 4037394 7328834 7146949 3581882
40549 3581882 -1726713 -7682411 -11479521 -8321397 1850726 10925717 11552885 6533721
40541 6533721 3340068 2431315 -1351999 -7618011 -9427099 -4150419 2457003 4980347
40533 4980347 4555330 4041900 2929886 47284 -3251239 -5226487 -5424968 -2932842 2533468
40524 2533468 6736102 3971337 -3583474 -5708298 2614991 13183120 15100384 9083870
40516 9083870 4877793 6855893 9173767 5437273 -2685697 -8598409 -8790619 -5279647
40508 -5279647 -2064234 -1340502 -2484622 -3112784 -1092973 3265102 6291464 3188460
40500 3188460 -6878819 -17677110 -20445935 -13545286 -5714540 -6868232 -16701129 -25448599
40492 -25448599 -25068926 -16051406 -3694363 7561028 14804619 16094432 12171353 6494423
40484 6494423 1544203 -3148301 -8226778 -12259287 -13670447 -12568441 -9432215 -4688219
40476 -4688219 -914006 -2094679 -8292615 -14006206 -14800750 -13193018 -14630815 -19373839
40468 -19373839 -22052925 -18858178 -12236692 -8149061 -10215585 -16348024 -20176495 -16672744
40460 -16672744 -7352581 1159383 4365365 3951947 3994739 5852917 8478453 10958071
40452 10958071 12135138 9980177 4363065 -1143317 -3115805 -2651758 -3211644 -5393821
40444 -5393821 -6683316 -5472325 -2795094 -864437 -1728110 -5693690 -9057971 -6068604
40436 -6068604 3651999 12373258 13146354 8848604 7110488 8704660 8237842 5501511
40428 5501511 7198821 15017705 20441497 16619853 8869653 6701782 10037244 11033359
40420 11033359 7114102 3929587 5202438 7244553 5979678 3269670 2328436 1173516
40412 1173516 -4492312 -13800081 -20370145 -19096765 -10508387 1012725 10553614 14602859
40404 14602859 12859517 8962896 7253292 8082805 8161796 5800455 3180690 2433498 2331980
40395 2331980 990023 -454355 413954 3400055 6339018 8351939 9455519 8151213
40387 8151213 3333872 -1697723 -1537271 4027115 9038154 9376109 7815748 8500970 10082732
40378 10082732 8377177 3498069 -281253 -1033639 -1237113 -2965992 -4889085 -5495445
40370 -5495445 -6191956 -8715909 -11160323 -9446356 -2864768 3974504 6014012 3682416
40362 3682416 2314681 5513228 10819540 13096806 10686025 6263213 2680066 572112
40354 572112 -272317 16799 715227 1419443 3606446 8293662 12300432 10959037 5232997
40345 5232997 1402701 2065212 2722386 74564 -2183369 -649986 192088 -5225595 -12685899
40336 -12685899 -12281410 -2315235 8456376 12618442 11141272 8007685 5083323 4325086
40328 4325086 8163544 14264017 15625240 9803969 3285899 2712671 6161855 7586053
40320 7586053 5939691 4584782 4506851 4023183 4009435 7688234 14657234 19572763 18282677
40311 18282677 12558352 7554908 6393192 8017090 8995106 6750945 1787107 -2907967
40303 -2907967 -4804052 -3980591 -2681551 -3790450 -9201083 -17404401 -22629908 -19597099
40295 -19597099 -10455250 -3951143 -5745446 -12453397 -17401939 -18520383 -16771962 -10508482
40287 -10508482 2183421 16399425 22329396 16392029 6183058 1794537 4952125 8960139
40279 8960139 7358364 434812 -5876941 -6257691 -1825937 87855 -6424559 -18115485
40271 -18115485 -24764396 -20377456 -10231206 -4766552 -7704533 -12636561 -11396222 -3673727
40263 -3673727 3052956 2437103 -3699729 -8333533 -8100724 -6491748 -7458210 -9110447 -7156867
40254 -7156867 -2747459 -1792918 -5712123 -7894094 -2570769 6436095 10567016 8416373
40246 8416373 7244578 11850773 17193210 15600857 8190117 4228586 9381898 18824482
40238 18824482 23697133 21518255 17577544 17488315 21310042 25051774 25496043 22397358
40230 22397358 17278948 11522342 5695891 289520 -3377540 -3908066 -1992401 -646457
40222 -646457 -1906016 -4200447 -4852119 -4292131 -5095075 -7195302 -7635629 -5993506 -6416181
40213 -6416181 -11996220 -19970814 -25340695 -27104698 -27791292 -28410656 -27303869 -23282606
40205 -23282606 -16876557 -8929731 -674285 5501320 8387043 10413066 14292128 17578789
40197 17578789 14836796 5970602 -1938082 -3091040 288909 2069861 -90953 -4046234
40189 -4046234 -7391202 -8727437 -6487653 -612033 4981157 5269892 113279 -5293834
40181 -5293834 -6603661 -4632612 -2746484 -2268997 -2035331 -1073270 -107329 -896330 -4844402
40172 -4844402 -11445526 -17364493 -18269796 -13108144 -5965812 -1969096 -1382862 409729
40164 409729 6489193 13810382 16561852 12893744 6164927 -28862 -5363043 -10549693
40156 -10549693 -14252117 -14541629 -12132818 -9665652 -8160766 -6496117 -4340220 -2994777
40148 -2994777 -2541849 -697796 3635955 7370077 6116089 -508328 -8455492 -13921661
40140 -13921661 -16479082 -17265514 -16100962 -11843561 -4786448 2602208 7301114 7630450
40132 7630450 4038202 -1255685 -5819653 -9094828 -12506517 -16363506 -17290917 -11207452
40124 -11207452 346307 9426969 9623260 3318294 -1765151 -2344716 -2345511 -5789630 -11082256
40115 -11082256 -14310585 -14766099 -14102568 -12392685 -8658815 -4105455 -1256240 -214074
40107 -214074 1125344 3252663 4469267 4345663 4735294 6500581 7738106 6372721 2763413
40098 2763413 -918465 -2419282 -674347 2575727 2971021 -1589137 -6522953 -5195086
40090 -5195086 1288107 3874481 -2315178 -10410977 -10737412 -3964245 149719 -4354423
40082 -4354423 -13526673 -20317888 -22239824 -20549737 -16134475 -9538330 -3056585 521295
40074 521295 1283299 2250391 5203769 7511797 4787134 -2769676 -8461659 -5951445 2585220
40065 2585220 8582638 8082980 6555743 10264762 16879490 19299433 16116235 12280095
40057 12280095 10093979 6024174 -1917151 -9238049 -10777474 -7724607 -5248467 -5520327
40049 -5520327 -6454717 -5835566 -3524238 -229866 3353621 6267462 7777993 8040059 7511059
40040 7511059 6491923 5829168 6681757 8826363 10855951 12693286 15344256 16968198
40032 16968198 12804148 2055514 -8330112 -11306482 -9179092 -10022570 -15309418 -17280601
40024 -17280601 -10234662 1175329 8408878 9741889 10091289 12517121 14710550 13711789
40016 13711789 10362235 8110689 9391385 13612329 17397252 17184078 13191628 10130208
40008 10130208 11830657 15799400 15921497 10357804 3172742 -2654688 -9497728 -19345783
40000 -19345783 -27162610 -24977256 -12168444 2577892 10591372 11415262 10421827 11139316
39992 11139316 12429259 11911249 9678234 8405535 10757348 16543646 22007512 22689843
39984 22689843 17776392 11037057 6904478 6373636 7267474 7487122 7221472 8822939 14844439
39975 14844439 24657890 32663001 32603800 25320673 19228412 20152805 23588150 21508467
39967 21508467 14522441 10761961 12902208 13836995 8123415 980004 528331 5777377
39959 5777377 8857051 6608952 3147826 1734226 883798 -509405 -394497 1635092
39951 1635092 1891341 -1562689 -4439586 -1670618 5046888 9128123 7306960 2478992
39943 2478992 -999282 -1615483 -410242 588245 -1009539 -6491487 -14021517 -19384983
39935 -19384983 -19569901 -14926186 -7868141 -766637 4743013 7958106 9412188 10048593
39927 10048593 9650348 7196665 3316969 957435 2127104 4541066 3128256 -4574225
39919 -4574225 -15152244 -21803693 -19920617 -10484534 1030558 8505634 8926310 4197786
39911 4197786 -135879 633834 5825477 9946772 9044107 5492220 4433206 6421684
39903 6421684 7239765 5532768 6024345 12010107 18436063 17749876 10946586 6532196 7877155
39894 7877155 8070062 805848 -8638124 -8907221 2954157 17768877 24772994 21591451
39886 21591451 13251757 5547142 1474845 1372310 3674167 6184561 8049320 9987555
39878 9987555 12107848 12874117 11206923 8249976 5706670 3579419 1285918 252152
39870 252152 3098234 9647424 15290114 14706092 7224158 -2083299 -6970024 -5714550
39862 -5714550 -2081264 -607368 -1750352 -2665949 -2078571 -2161804 -4801078 -8039669 -8263714
39853 -8263714 -4963626 -1098512 1089181 2336604 3791274 4251348 1688827 -3368418
39845 -3368418 -7755089 -9003167 -7413495 -4449223 -527101 4143479 7197362 4981572
39837 4981572 -2850924 -10940866 -12554043 -6377443 2473151 8115096 8721489 5692139
39829 5692139 894811 -3612243 -5348309 -3459650 -70094 2275586 3397547 3999890
39821 3999890 3367302 1446724 1417769 5984503 11898297 13064491 9426023 7424403 10036793
39812 10036793 11980672 8133273 1496788 -2225214 -3814569 -7862823 -13424752 -14729320
39804 -14729320 -11012119 -8507159 -10965885 -14470803 -14657955 -13726687 -16063458 -20821068
39796 -20821068 -23631772 -23288078 -22006178 -20385965 -16834396 -11967035 -9296598 -10264358
39788 -10264358 -11692861 -10050250 -6364191 -4863884 -7316505 -10330345 -8894729 -2191835
39780 -2191835 4990311 7338960 4951942 2777672 4259390 7645633 9356099 8623274
39772 8623274 6931628 4786538 1725781 -1367631 -2584673 -1411388 1198128 4704388
39764 4704388 8608181 10433410 6895507 -1955964 -11587140 -16916510 -16327581 -11692975
39756 -11692975 -6280923 -3395928 -5316313 -11756318 -19354228 -23397130 -20695417 -11778179
39748 -11778179 -930717 6738810 9217156 8057903 4809333 -852862 -8032007 -12470329
39740 -12470329 -10878863 -5750120 -2038404 -232649 2797824 6745911 7227015 3118417
39732 3118417 -987331 -1869093 -2108232 -4296324 -5554171 -2177258 3847404 7763442
39724 7763442 8938150 10048947 11269085 10246749 7027138 4442543 3785592 3829640 3766333
39715 3766333 3616493 2462633 128662 -103299 5172301 13615599 18977819 18825627 15940571
39706 15940571 12122518 6265804 -211500 -2099388 2343729 7696993 8577330 6618649
39698 6618649 6597980 9263881 12196519 14618649 16621632 16066839 11364906 5716656 3396332
39689 3396332 2904650 -537217 -5916047 -6146229 1551940 10819040 14795301 14642191 15127840
39680 15127840 15784001 12571227 6651225 4771774 9731965 16055894 17936606 16865562
39672 16865562 17100843 17116583 11821180 2320690 -3461175 -1899388 680046 -2408939
39664 -2408939 -7811094 -7342946 -811164 3469619 731971 -4389228 -5577215 -2492425
39656 -2492425 1802222 5605938 7129953 3137870 -5990181 -13183538 -11995857 -4967690
39648 -4967690 247747 1298443 2169413 4851575 6265099 4384088 1777238 820748
39640 820748 -143701 -3113625 -6308674 -6656557 -4003923 -400293 2735000 4545666 3972207
39631 3972207 1482746 -208611 455489 1403538 293278 -1400576 -590579 2624809 5934730
39622 5934730 9743059 16926410 27139255 35250126 37046337 33431051 27228418 19059387
39614 19059387 9232122 1010157 -2140185 -1526604 -1442350 -2604664 -1549050 2696487
39606 2696487 5769712 4026849 -449131 -4101205 -7619021 -12804090 -16401409 -13383844
39598 -13383844 -6061279 -3337883 -8840211 -15251197 -13754895 -4817885 4237489 8733022
39590 8733022 9158967 7052726 3809803 2540212 6021446 12520209 17357714 18509256
39582 18509256 17236342 14120501 9230473 6002811 9112311 16767118 20523599 15907994
39574 15907994 8862643 7797438 12755098 16986992 16786101 14566639 13024217 11332725
39566 11332725 8169373 4832079 3590824 4970571 7758808 10001993 9159603 3129740
39558 3129740 -7264678 -17492969 -22239940 -19358913 -11136111 -2340883 2980191 3825464
39550 3825464 2140805 396056 -612101 -1275390 -1263966 406584 3194340 4492582 2451898
39541 2451898 -1492523 -4298872 -5174636 -6161137 -8614023 -10792080 -9996759 -5758750 519678
39532 519678 7655677 14062604 16202448 11527034 3588250 159280 3932281 8484928
39524 8484928 6912246 1688382 1270154 8262388 16196143 18374490 15033476 10263400
39516 10263400 6211659 2897536 478665 -1233640 -3275159 -4994604 -3164550 3449999
39508 3449999 10274907 11131852 5965142 1437570 3189896 9527136 13858116 12280239
39500 12280239 7381546 4441606 5138623 6700666 7169779 8633388 13100968 17574656
39492 17574656 17118020 12066416 8121498 9036722 12892763 15843978 15469052 10116119
39484 10116119 80181 -9195611 -10772664 -5893873 -4628858 -12955524 -24066015 -27239421
39476 -27239421 -21028939 -12282049 -5974077 -2286921 -866900 -1224886 -502600 3021743
39468 3021743 5676596 3599380 244041 1709423 6114430 5781505 -268628 -4700903
39460 -4700903 -3767138 -1837256 -1561851 1305064 8676345 14005663 11631403 5602014
39452 5602014 2361570 324735 -5447079 -12464737 -13511302 -8363887 -4722021 -7424934
39444 -7424934 -13391856 -17718088 -18826800 -16772580 -12076441 -7758029 -7618510 -10676280
39436 -10676280 -11625073 -8743034 -7044755 -10738609 -16173974 -16167920 -9497404 -2367240 -731824
39427 -731824 -3979427 -6925635 -6394040 -4499202 -5355780 -9264792 -11496446 -7766942 26564
39418 26564 5302588 3906255 -1954333 -6891093 -7307105 -2511824 6482517 16658451
39410 16658451 22599607 19840893 10012946 762095 -1420946 2470613 6555637 8073634
39402 8073634 9645554 12971000 14191662 8833059 -851880 -7641229 -7848026 -4211415
39394 -4211415 -519328 2227304 3605344 2757240 1962894 6565536 17315496 26108255
39386 26108255 24174347 12831931 1591898 -3406059 -4410818 -5725022 -7408785 -7136779
39378 -7136779 -4642472 -1479579 1763027 5296857 7762053 6464025 956479 -4869892
39370 -4869892 -6172398 -2965817 -630293 -3136004 -7814541 -9878095 -10246328 -13593155
39362 -13593155 -18736645 -17865123 -8355813 931721 512786 -7234457 -12727082 -12738510 -11878494
39353 -11878494 -12521844 -11555512 -7724248 -4861075 -5761432 -8678740 -11967402 -16755959
39345 -16755959 -22457652 -24517332 -19789345 -10712761 -2002187 3292489 3007745 -4013503
39337 -4013503 -14218395 -20060235 -17962527 -12532018 -10056588 -10957270 -11319261 -8564739
39329 -8564739 -2847476 3855721 7448544 4321862 -2919572 -6653104 -4461858 -3165948
39321 -3165948 -8245467 -14783242 -15390211 -12179768 -12177563 -13786903 -7965600 6828931 20274435
39312 20274435 23449476 19022755 14823499 13553948 13075924 12033489 10520749 8096298
39304 8096298 4889702 2684949 2357854 2398853 2011407 3094419 6889604 11086642 12562604
39295 12562604 10892859 7287121 2597394 -1457946 -1847246 2042821 6163374 6090823
39287 6090823 2122313 -2133453 -4458249 -4923173 -4021002 -2833351 -3658696 -7492045 -11772044
39278 -11772044 -13300311 -12610537 -12895615 -15261856 -17475629 -16967178 -13109583 -7298119
39270 -7298119 -2619633 -2156131 -5358206 -7483432 -5146713 -793549 1332691 1601585
39262 1601585 3014443 4369822 1300402 -5463304 -8916453 -5220932 722602 2487592
39254 2487592 761530 624411 3330284 5750988 6473240 7394472 9073866 8848765 5130897
39245 5130897 642101 -657795 1622006 4201625 4058140 1103987 -2780551 -5971445
39237 -5971445 -7465838 -5759017 422653 8749419 12349742 5702256 -8058573 -18949284
39229 -18949284 -20774933 -17079310 -14547554 -14042311 -12115093 -8667966 -7296797 -8305103
39221 -8305103 -7113694 -1212763 6096829 11279115 15518621 20754291 24563180 23589830
39213 23589830 19573188 16747872 14541536 8752656 439525 -2626029 3484356 11619861
39205 11619861 11754111 3945917 -2192114 -445851 4857032 6146244 2503197 -1155620
39197 -1155620 -1980783 -1858540 -2845629 -4176225 -4820964 -5546536 -6430478 -5116167 -399863
39188 -399863 4378870 5055539 2886056 3237073 7814077 12124284 12052617 9210524 7200248
39179 7200248 5872607 3215563 876043 2911152 9008580 13243711 10951508 3813810
39171 3813810 -3176147 -6959814 -7041162 -3793949 1176479 4773346 5281657 4659061 5820821
39162 5820821 8547733 10212697 9554328 7223768 3515245 -1233574 -4294704 -2475405
39154 -2475405 2609310 4884697 1527505 -2873506 -2784300 465667 1479972 -419554
39146 -419554 -613815 2384301 3713002 192730 -3157355 390547 8737346 12778345
39138 12778345 8796988 3416213 3858721 7740465 6715739 -2048097 -12667595 -18420432
39130 -18420432 -18523482 -15901422 -11965622 -6645314 -1878541 -1500120 -6776354 -13774875
39122 -13774875 -16500420 -12472566 -4731012 1521472 3685488 2858320 805123 -2547074
39114 -2547074 -7573902 -12187067 -13005267 -9651081 -5747627 -4423095 -4589476 -3587448
39106 -3587448 -2197140 -4130270 -10323737 -16362401 -17050492 -12043996 -5327752 -120394
39098 -120394 3580894 6416608 6952732 3234794 -3700165 -9674075 -11348359 -9621260
39090 -9621260 -8525050 -11061889 -16290032 -19977690 -18005869 -10135304 -1101399 2940802
39082 2940802 75545 -5937315 -10583644 -13259724 -15139422 -14545614 -8833780 -746255
39074 -746255 2430077 -1476430 -5173496 -1325736 6953940 10316420 6053780 656891
39066 656891 -519557 214566 -1066620 -2815448 -1037647 4193912 9808530 15168630
39058 15168630 21598657 27079707 26287254 17701833 7754135 5203798 11777590 19944483
39050 19944483 20695794 13179783 5440220 4872189 9542314 11415274 7168041 1769332
39042 1769332 712899 3278312 5816597 7347883 8157736 6592564 2106163 -1304841
39034 -1304841 -24972 3080663 3277421 2497883 6031164 11798403 11616620 4248522 -1735449
39025 -1735449 -1168172 411054 -2400349 -5128507 -1887508 3164339 1863267 -4877397
39017 -4877397 -9422653 -10143899 -12105261 -16007155 -16191128 -10733485 -4716421 -1234432
39009 -1234432 2874254 9384670 14331601 15339037 16640976 21770742 26535861 24692363
39001 24692363 16857882 8903632 4484804 3447405 4810984 7140697 8264120 8115505
38993 8115505 9340838 12049867 11422340 4343295 -4983126 -10223009 -10311805 -7333952 -1227879
38984 -1227879 7342329 12367280 8215425 -1651010 -8625955 -10337340 -10985744 -11608673
38976 -11608673 -8649102 -2974441 -1631747 -7718924 -15609648 -19461262 -20023638 -19581328
38968 -19581328 -16624385 -10184952 -4074539 -1703435 -860234 1636360 3920891 2439886
38960 2439886 -2099945 -6798681 -11446362 -16841231 -21451241 -24456729 -28740662 -35470966
38952 -35470966 -38911684 -32938875 -20452869 -9866404 -4147102 -294181 1940297 -745215
38944 -745215 -6914774 -9726011 -6728133 -2895392 -1126624 2781801 11462404 19239928
38936 19239928 19892623 15644454 11892704 7568140 -1391786 -11704350 -14676442 -8751292
38928 -8751292 -2557878 -3521983 -9466987 -13839180 -13724495 -9552043 -1947969 6626837
38920 6626837 10824317 8131951 3530672 3611285 7584118 9311711 7407491 7156437 11340522
38911 11340522 15261553 13990551 9549014 6491368 4199387 -951846 -8055192 -12265450
38903 -12265450 -12180121 -10701177 -8167941 -969081 10562496 18485905 15979944 6579612
38895 6579612 311324 2126123 7605239 9079434 3148597 -6919531 -13781437 -12002305
38887 -12002305 -3639724 3412987 4550853 3637652 6294647 10925302 11240527 6150142
38879 6150142 1465062 1619285 5064074 8916667 12838454 16078434 15599344 10666179
38871 10666179 5692240 4804539 6373416 6635286 6100502 7808115 10871984 10879756 6600403
38862 6600403 1558013 -1942148 -5875340 -11525766 -15267999 -12705125 -4966247 2442609
38854 2442609 6125327 7261294 8239864 9933947 12382146 14958776 14945242 9169258 -833591
38845 -833591 -7927344 -6665268 70086 4806494 4702398 3459098 4700040 7962910
38837 7962910 12131707 18181124 25777294 30695925 29433402 24624270 22444050 25412651
38829 25412651 30360495 32651619 29943858 22654724 13423040 5802041 1262163 -2185286
38821 -2185286 -6648971 -10764982 -11880701 -10786880 -11034239 -13476166 -14332455 -9417513
38813 -9417513 1428993 14220296 23574561 26077426 22884511 18772522 17131735 16790772
38805 16790772 15370539 13864558 14897019 17817427 19139719 17315701 13785643 9834923
38797 9834923 5746242 2542852 1204493 837674 1057511 4777073 13959876 23685405
38789 23685405 26263961 21448764 16813364 17285619 20192377 21751375 21985707 21005292
38781 21005292 16835812 10248985 6179786 6975475 9520953 12088190 17680258 26338758
38773 26338758 30972700 27267748 22171809 24794080 32574701 34556606 26574587 15714450
38765 15714450 10095679 10528507 12522814 11476145 5629457 -2095101 -5483115 -1626570
38757 -1626570 4955442 7912677 6626087 4615350 3486304 3302783 5904920 11839751
38749 11839751 16381963 15143519 11742484 12901010 17478229 18268051 14132921 11753782
38741 11753782 14187868 16060796 12951792 8398266 7816856 10941964 13906573 14700965
38733 14700965 13823438 12888909 13993815 16957454 17259308 11632230 5130185 5749176 11744002
38724 11744002 12690443 5138404 -1864560 -762742 4041432 5530071 5370058 7906567
38716 7906567 9850604 5766601 -411041 488201 8735680 14746573 12304530 4864807
38708 4864807 -2339320 -9306231 -17809170 -26144031 -30499710 -28933110 -22322920 -13497213
38700 -13497213 -6351352 -3870471 -5963135 -9835291 -12189549 -10771373 -5603014 85519
38692 85519 2269845 1075511 1046029 4902598 9975312 12858269 14078251 15332558 15858476
38683 15858476 15113573 15191406 16301858 14036611 6722370 1500584 5747474 15045793
38675 15045793 18057711 12585183 8128038 11314071 17088932 17608617 13060157 9117008
38667 9117008 8367650 8978806 9163344 9030956 9151966 9664717 10233804 10233251 9944026 10893362
38657 10893362 13012970 12920796 8401023 3015083 1457806 1485278 -3232969 -12094227 -16693858
38648 -16693858 -13066235 -7598495 -6848862 -7918283 -4311674 3830966 11688141 18176878
38640 18176878 25488294 32122307 33173407 27576222 19666446 13001940 7191309 1639504
38632 1639504 -1769924 -1337570 2055320 6568492 11071646 14105359 13481816 8626692
38624 8626692 2198905 -1815186 -1154669 3791463 11061730 18371187 23626436 24869362
38616 24869362 20673783 11880141 2927164 -523234 3296353 10474708 15654222 16684835
38608 16684835 14153108 8749342 1866293 -2758435 -1834982 2846475 5964738 5955195 7667198
38599 7667198 15498103 26117922 31388918 28120571 21732932 19265577 21511489 24386490
38591 24386490 26121938 29156770 34499947 38040875 35044953 26282455 16966042 10813897
38583 10813897 7842641 7011019 7643158 8060200 5902191 905669 -4502658 -7791126
38575 -7791126 -7730883 -3599497 4121778 11917392 15264062 13702678 11407168 11695585 13496633
38566 13496633 14230479 13391572 11930858 10677796 10577165 11749928 11397517 6275651 -1229463
38557 -1229463 -3762185 1573093 8470991 9525978 5255021 929401 -1897053 -5358093
38549 -5358093 -9357130 -11442233 -11234505 -9689519 -5184533 3953465 13625912 16781148
38541 16781148 12787818 8685405 10003127 15044600 19119851 19403132 14405976 4106781
38533 4106781 -7014401 -11825780 -8259151 -1405727 4126494 9407981 16117526 21318091
38525 21318091 21603866 18750055 16718013 15878275 14525062 13446764 14184327 14641917 11308329
38516 11308329 4891443 -371086 -1936893 317755 6679410 15726392 21092648 16441911
38508 16441911 4518865 -4387134 -4745625 -1504314 -1297278 -3117684 -1745593 3213199
38500 3213199 6628772 4846596 -436086 -4774187 -4605477 1184664 10589371 19313191
38492 19313191 24257713 26137521 27177527 27045199 23455443 16653007 10603175 8697967
38484 8697967 10087514 11498759 11365763 10661475 10394213 10101938 9148238 8067161 7481574
38475 7481574 6467726 3775636 883767 1706812 7604981 14243584 16142295 13835638
38467 13835638 13273562 17535929 22693783 23924769 22556122 23536335 27747665 30871504
38459 30871504 29528499 24923646 20086995 16869873 16501214 19809340 25159892 28674590
38451 28674590 28375407 26220356 24562650 22947565 20585928 19792613 23770552 31763653
38443 31763653 39062225 41531229 38273263 30837432 22406688 17067306 16628481 17739339
38435 17739339 14919814 7221058 -551450 -4050323 -4189969 -4263121 -4646568 -2835588 2213884
38426 2213884 7832816 9738017 5761140 -1709130 -6485143 -3304283 6838610 17020875
38418 17020875 21122483 19170781 15207920 12031402 10307708 11076905 15437635 21694835
38410 21694835 26054906 27089626 26912532 26858495 24870745 19396393 13567256 12174048
38402 12174048 15354551 18753610 20114750 21914740 25604174 26709228 19805502 7245924
38394 7245924 -1679549 -1471685 3463566 5855691 5508605 7997572 14805208 19873584
38386 19873584 17447489 9661182 3745246 3885667 8494342 14087823 18766375 21863292
38378 21863292 22765238 21440625 19402125 19290577 23038076 29688173 34877565 33837649
38370 33837649 26112479 16601584 10860026 9977326 10949051 10954553 9675682 8139052 7128270
38361 7128270 6659840 5785115 3358604 233477 -296539 3752894 9582276 12310948 10795548
38352 10795548 8064343 6172180 4182161 2139524 3151603 8913838 15905035 19143161
38344 19143161 18027653 15626517 13916033 13224731 15048275 20832756 27755279 30366106
38336 30366106 28115804 27092993 31388517 36242447 34044657 25136167 17732445 17411836
38328 17411836 21411966 24235175 24232826 22334250 18549396 13783447 12299701 17366477
38320 17366477 25312115 28583777 24985559 19691056 17399686 16997931 15866872 15098074
38312 15098074 16951148 20164378 21824027 22191377 23835082 26914972 28989232 29228405
38304 29228405 29582825 31700493 35318556 39287208 41246522 37061927 24858666 10151172
38296 10151172 2476970 4872850 10141554 9914005 4423048 552388 2752124 9214705
38288 9214705 15476142 18426323 17294742 13524242 9932715 8418591 8687028 10111285
38280 10111285 13412399 18741135 23533223 24732894 22487577 19565018 17827366 17234656
38272 17234656 17260417 16933983 14633673 10703813 9152915 13067855 18893368 19681096 14653801
38263 14653801 11100928 15008856 23726113 30326035 31717372 29391629 25300075 21103107
38255 21103107 19645226 22695442 27364308 28293466 24024106 18821942 17619667 20685925
38247 20685925 23425696 20490144 10913467 464274 -2474455 4717709 15902980 23342845
38239 23342845 25617810 25603835 23576347 17751722 10450861 7294800 9280562 11332396
38231 11332396 10387205 9302615 10338382 10651003 8167067 6709716 10389130 17188915
38223 17188915 23206937 28888153 34882398 35993777 27552467 15507192 11118117 15928383
38215 15928383 20957080 21532519 22982814 28418419 31031278 25415480 18816412 22099157
38207 22099157 33777419 42024217 40871656 36005733 34098303 34063059 31747551 27871097
38199 27871097 27009736 30759890 35274995 35816767 32375822 29678164 31000354 33114755
38191 33114755 30067710 21991935 16075113 16823440 19698854 18315240 14281784 14300425
38183 14300425 19436641 23503184 22170016 18171092 16282431 17658142 20740323 23996666
38175 23996666 25912695 25286759 23319470 23075367 25482162 27905058 27726113 25386919
38167 25386919 23080279 22352150 23668511 26449965 28820462 28866140 26634207 23922416
38159 23922416 22552544 23780957 27658695 31163943 29634355 23313670 19586918 23914557
38151 23914557 31188855 32530950 28758843 28697114 33948498 34974194 25807525 14183616
38143 14183616 11328092 17959148 26560162 32564389 36679165 39537076 40554080 40403063
38135 40403063 39629688 36493011 30323175 24807786 23843119 26579021 30605831 36864663
38127 36864663 46370763 55018305 57491431 54325819 49589991 43919122 36132528 29519563
38119 29519563 28784839 31371408 29746050 23117667 19294344 23005781 29565186 33045813
38111 33045813 34071173 35397162 35521683 32028116 27487047 26653217 29730293 32746246
38103 32746246 33383696 32833319 32646617 32832401 32830854 32086883 29723694 25267664 19780244
38094 19780244 15551419 14900213 19121830 27164701 34941518 37707817 34382655 28744229
38086 28744229 25650710 26620001 29278325 30530596 30346260 32534950 40372377 50754533
38078 50754533 55366952 50187122 41445465 38536971 42980393 48839099 52262830 54516997
38070 54516997 55856755 53415697 47293676 42730936 43004814 45060006 45632218 47057560
38062 47057560 52581350 59530674 62246646 59955027 57378706 58462514 62737433 66960916
38054 66960916 67722525 63606870 57186685 53618509 55227640 59156991 62217642 65373934
38046 65373934 70460733 75143634 75559236 72910249 73140717 79632817 89115111 95252658
38038 95252658 94336108 87526145 79348841 74043082 72307195 71975736 71934290 73167950 75202228
38029 75202228 75077436 72540595 72982346 80966502 92691573 99393315 97576218 91861214
38021 91861214 88074296 87655918 89275562 91921033 94724781 96278547 95715716 93326966
38013 93326966 89879673 86669474 85737927 87937917 91009773 91805378 90442628 90099833
38005 90099833 92455449 95280596 95081523 90949090 85725851 84066900 88482814 96270251
37997 96270251 101615689 101908276 100206396 100176218 101426662 102207363 103280038 105098396 104266537
37988 104266537 98405104 92640724 94763270 104236549 112412362 114252648 113351984 113836207
37980 113836207 114171892 112378035 111306628 113846795 117126408 116572303 112967711 110926069
37972 110926069 112473757 116338578 121786797 128833220 135602844 139427518 140393048 140948327
37964 140948327 142468482 144647047 147393703 150695498 153382182 154571543 155526014 157616000
37956 157616000 159520788 159295185 158249831 159512760 163146560 165884695 165628331 163176011
37948 163176011 159583612 155194730 151795076 152339876 157155776 162856115 166215754 167114023
37940 167114023 166982869 166786401 167477376 169985132 173552881 176330468 178544029 182316632
37932 182316632 187154919 189143644 187093050 186139782 191498308 200937872 207618570 208893037
37924 208893037 207957337 207833754 208697835 211068001 216160099 221651681 222248224 217192603
37916 217192603 213048237 215845042 223942896 231854707 237397120 240902977 240940472 236601662
37908 236601662 232150578 233393466 239874150 245901533 248822566 250643327 251686404 249367802
37900 249367802 244613473 242820848 245814689 248959867 249407513 250883708 255956599 259854216
37892 259854216 258086913 255004599 257425781 263476365 265701450 262966209 261056814 262443605
37884 262443605 263786444 264049737 266895572 272886781 276469998 273951594 269016316 267390332
37876 267390332 270547548 276596970 282199402 281741293 271045332 255426882 247871272 254179930
37868 254179930 264870119 267177569 260681934 254926826 255179283 257708052 257507401 253856662
37860 253856662 248366836 243293748 242121924 246620460 252522450 252774498 246300143 239649526
37852 239649526 238807018 242977791 247690703 250369321 250877374 249629014 247813380 247839965
37844 247839965 251301431 257052278 262388982 265450405 265804105 263521161 258548946 251063842
37836 251063842 242625150 236752180 236619465 240982090 244187468 242463730 238893034 239481399
37828 239481399 245279414 251491571 253793641 251987857 247450474 241075212 234993955 232539369
37820 232539369 234040363 235151002 231812851 225227071 219866039 218006725 218178345 217779693
37812 217779693 215315313 210982165 206701507 204600953 203908074 200596556 192109649 181301378
37804 181301378 173220620 168832638 165094431 161219570 161003806 167065213 175795149 181057950
37796 181057950 181181906 179008411 176198707 171827434 166972489 165717141 168731903 169781807
37788 169781807 163176416 152506353 146782105 148732964 152728464 154951166 159033288 168041979
37780 168041979 176257631 174838859 163424580 150795395 144774722 145751807 149317404 150461454
37772 150461454 145223694 133642327 122934633 123050982 135502460 149243730 151340568
37765 151340568 140783422 128789121 125677615 130196272 132696618 126713756 115058300
37758 115058300 104698171 98356052 93400715 87728390 83167225 82206073 84441746 88009739
37750 88009739 91783193 94057250 92262373 87374647 85667192 91357114 99485948 101568945
37742 101568945 97214450 93839716 94650585 93881632 86366561 75665935 68870440 68175673
37734 68175673 71800921 78956671 88681195 96582262 98143601 94092976 88348198 82096756
37726 82096756 74205311 66127609 61321442 59833679 58151081 55181129 54170524 57301351
37718 57301351 62048096 64847833 65440777 65255236 63712097 58946023 51425784 44592978
37710 44592978 41612500 42453698 44240905 43927346 40708684 36403477 33879412 35025510
37702 35025510 39474503 44427593 46300752 44277936 42296711 45217726 52110027 55880315
37694 55880315 51551288 42761745 37427842 38654341 43006993 46403856 47886156 47937656
37686 47937656 47108489 47118246 49884554 53991242 54686897 48911587 38699954 29094199 24671600
37677 24671600 27916405 37421889 46607587 48059178 41721830 36080750 38614655 47422648
37669 47422648 54897190 57078179 55839866 53921774 52342502 52211122 54806684 59151250
37661 59151250 62621582 64421304 65451576 64519152 58575461 48298343 39897926 38560743
37653 38560743 42209907 44446088 42174494 37624949 33814108 30983458 27723828 23336124
37645 23336124 18206663 13034104 8450225 5168559 4489133 8381592 17629466 29111017
37637 29111017 36665944 36631557 31583091 26671227 23398618 19791774 16007495 15817698
37629 15817698 21267975 28960784 33749224 34195113 32612903 31540252 32020664 33602960
37621 33602960 33958975 30300385 23734280 20443795 25007142 33450050 36981600 32797420
37613 32797420 26982047 25419691 26096749 23454920 17215180 12540106 12556189 15015995
37605 15015995 16974163 19147716 23628865 29554465 33732915 34879444 34809391 35117175
37597 35117175 34794739 32481650 29656403 29384764 31889808 33249659 29339980 20056891
37589 20056891 9212494 1523597 78803 4722320 11525460 15687820 16913694 20244991
37581 20244991 29173629 39718195 44768957 43020786 39231033 36189307 32059213 26928645
37573 26928645 25770212 30827848 35796602 33285785 25508016 21546575 24889720 29668900
37565 29668900 29969087 27129709 25220430 23857871 19754891 13221126 8814454 9424044
37557 9424044 12596354 13717484 11323512 8302208 8643675 13945668 22749162 31960653
37549 31960653 38178891 38743093 33508567 25921641 20582487 18905072 18649947 18248017
37541 18248017 18976466 21195033 21591508 17871065 14054375 16104101 22751095 26074524
37533 26074524 22338639 16975959 16189929 18445291 18493695 16140202 15492217 17232967 17380289
37524 17380289 13936944 9877029 8307852 8755092 9954932 12577694 16595055 18959301
37516 18959301 17295916 14205623 14465699 18523253 21722143 20008488 13896206 6524342
37508 6524342 187931 -4480909 -7917683 -11160969 -14408896 -15514576 -12068677 -5951883
37500 -5951883 -3195507 -7190673 -14201642 -18289397 -18500718 -17239430 -13263149 -2518083
37492 -2518083 12815339 22399113 19345071 9859946 5849487 9930939 13751681 10904698
37484 10904698 5107132 3281825 5870471 8268469 8554898 8732177 9452394 8403293
37476 8403293 4707312 1225779 827821 2809653 4662795 5433522 5444101 4187442 813301
37467 813301 -3783129 -7207733 -7719616 -4817936 1473369 9620609 15195500 13635027
37459 13635027 5811487 -1409403 -2126367 2470542 6497439 6160800 1999804 -3806857
37451 -3806857 -8951182 -10487918 -6616489 290800 5393566 6959207 7529401 8856917
37443 8856917 9050238 6326077 2342423 -461131 -1938983 -2135162 869424 7618117
37435 7618117 14311696 17074110 17196531 18084422 19083236 17397302 14491814 14204476 14783286
37426 14783286 10122077 701246 -4137540 957747 8511804 8236344 1276218 -2864745
37418 -2864745 -1151350 -580979 -6338893 -13688560 -14805272 -8689216 -361800 6622783
37410 6622783 12553521 17615084 19410191 15380560 6172802 -4063035 -10463785 -11031941
37402 -11031941 -8092414 -5852775 -6203935 -7555357 -7835470 -7057306 -5979831 -3884485
37394 -3884485 283326 5229021 7907656 6966061 3955077 952305 -1304614 -2569746
37386 -2569746 -2392717 -1317775 -1062140 -2148158 -2871383 -2060696 -1016807 -538872 1987011
37377 1987011 8930236 16764424 18459212 12251082 4105976 -4971 -557407 -1168770
37369 -1168770 -2626807 -3426890 -3290447 -2439072 315866 4757407 6473701 1581433 -6538181
37360 -6538181 -9756176 -4514974 5170483 13837501 19599358 22923038 24721168 26465551
37352 26465551 28335289 26693272 17758399 4756002 -3379635 -2411578 2351498 3697855
37344 3697855 665275 -3413077 -6424765 -7561039 -5917511 -3016826 -3311327 -8014824
37336 -8014824 -11628202 -9206993 -4226978 -3932605 -8831755 -12401835 -10372126 -4970275
37328 -4970275 53280 3784461 6817267 9499828 12409056 15604027 16993653 14172420
37320 14172420 8189556 3319333 3190062 8489464 16664404 21696150 17225642 4176788
37312 4176788 -7005787 -6837954 1897006 8363741 7491019 3459315 736323 -704522
37304 -704522 -739646 2384958 6571179 6045345 338659 -3123299 876424 8191393 12043656
37295 12043656 11590615 9705805 7424939 5311694 5760335 9089234 11509627 11543493 13682657
37286 13682657 20271033 24809027 20444426 11266708 7195347 9978889 12242232 9198551
37278 9198551 3485469 -1312780 -4414177 -4683495 -782369 4622134 7198543 8031096
37270 8031096 11587959 16182157 14581239 6075617 -642079 -565990 -322888 -7347302 -17801267
37261 -17801267 -22204783 -18258471 -10951301 -3578204 3741229 8609383 7151393 691966
37253 691966 -4154894 -3109407 1929896 6608151 7851942 4314104 -2682468 -8577650
37245 -8577650 -9826741 -8688827 -9923080 -13116855 -13153169 -8739481 -5023244 -5705575 -7490444
37236 -7490444 -5718243 -1812314 -1071098 -5100759 -10177249 -12369851 -11558763 -10641169 -12369273
37227 -12369273 -16378467 -18530653 -14901668 -7526099 -3541730 -6312945 -10132481 -7454775
37219 -7454775 666218 6360411 6473665 6276782 9840416 12459248 7284250 -3980001
37211 -3980001 -12741367 -14809151 -14325541 -15589385 -16464983 -13167783 -7679257 -5590166
37203 -5590166 -8018488 -10299486 -8828207 -5022497 -1235983 3444527 10594992 18079022
37195 18079022 21562746 19654486 15004561 10512039 6455993 1441746 -5258885 -12241711
37187 -12241711 -15937431 -13060906 -4695301 3223775 5824322 4830122 5412017 8307228
37179 8307228 8972750 4939068 -445196 -3605025 -6024899 -10507506 -15073190 -14939037
37171 -14939037 -9283224 -1858353 4780710 11502337 18267811 21409332 17626466 8809346
37163 8809346 701141 -2660975 -2018904 -939637 -1690810 -3045651 -2118040 1602136 4968153
37154 4968153 4814229 1723813 -1493214 -3840155 -5880639 -6181724 -1992281 5565280
37146 5565280 10832012 10370592 7153760 5094094 2510760 -4411944 -13291669 -16235225
37138 -16235225 -9858008 -285190 3950012 926512 -4960968 -9520565 -11752416 -11837318
37130 -11837318 -9802292 -6578012 -3944591 -2577759 -1573157 -371767 247589 -258842
37122 -258842 -834922 63501 2623999 5534534 7159403 6541054 3963627 924919 -1169853
37113 -1169853 -2608263 -4796578 -7855905 -10141102 -10709993 -10512805 -9985698 -7578355 -2899818
37104 -2899818 564102 -724950 -4686547 -5620444 -1952819 1986734 2684534 1626535
37096 1626535 1024013 -100770 -2339700 -2429188 2117134 7713207 9044356 6832728 5936804
37087 5936804 6816008 4845879 -1481002 -7428203 -8857303 -7522973 -7331042 -9047571
37079 -9047571 -10815696 -10802871 -7788696 -2289200 1932662 1465938 -604629 2750402 11794647
37070 11794647 17619696 13942391 5681852 1076165 740817 767249 1689856 6072998 10107349
37061 10107349 6800936 -2788487 -9808954 -9946875 -7967219 -8575283 -10296936 -10948888
37053 -10948888 -12012077 -13899079 -13233153 -9217482 -7041118 -9867289 -12437893 -8685373
37045 -8685373 -1883722 -413471 -5447015 -9569213 -7329971 -1263543 3368245 4818842
37037 4818842 4239909 2755605 1370160 1364528 2771674 3613628 1749340 -3193981 -9789617
37028 -9789617 -15610849 -18328973 -17687017 -16553096 -18328740 -22556037 -24188444 -18278309
37020 -18278309 -5466954 7470977 13205383 10836191 6872177 7647248 11168497 9555250
37012 9555250 436086 -8117417 -7364296 400824 4852028 1147267 -5117562 -7117427
37004 -7117427 -5165550 -2761577 910895 8859439 18478203 22166667 17205779 10135872
36996 10135872 8041306 8873190 5035913 -4988330 -14026252 -15865791 -12403917 -8919388
36988 -8919388 -6976694 -5860621 -6911832 -10777479 -12830400 -7784522 1947558 8927958
36980 8927958 11648989 15729424 22912509 26604645 21958736 13546363 8016284 4977487
36972 4977487 1065128 -2086988 -1096332 1629631 1304505 -458444 2042641 8553950
36964 8553950 12750763 12168223 10771591 10579953 8061566 1316848 -5583152 -8804465
36956 -8804465 -10118030 -12515469 -14780659 -14220852 -11623540 -10069695 -11119423 -14583419
36948 -14583419 -19450621 -22767840 -20498588 -12271896 -3092895 1917204 2308096 202463
36940 202463 -3374671 -7470211 -9516581 -8022803 -4940295 -2497472 170629 4227590
36932 4227590 7300597 6387588 3308204 3157144 7317531 11291537 10189827 4358200
36924 4358200 -974341 -661846 5325087 10956445 9355825 152621 -9626531 -13059015
36916 -13059015 -9838044 -4079786 1305426 5054883 5023921 -66907 -6826942 -9425762
36908 -9425762 -6520318 -2912258 -3406306 -7697941 -12456863 -15864121 -17992811 -18201891
36900 -18201891 -14821670 -7979668 -1250037 1127627 -1058237 -3402786 -2162702 996221
36892 996221 1534121 -1559157 -4923684 -6199130 -6294580 -5360217 -1128947 5896617 9718266
36883 9718266 5665139 -2660166 -7754043 -7684126 -6527987 -6667158 -5969759 -2946820 -87925
36874 -87925 -804009 -6214273 -15483165 -26064162 -33081833 -31971089 -23100836 -11643793
36866 -11643793 -2695162 1154742 -1428166 -9609674 -17943774 -19881936 -15544599 -11828099
36858 -11828099 -12950401 -15405241 -14907790 -13448897 -14894803 -17141688 -14365234 -5831430
36850 -5831430 2572312 5665786 3963892 1050312 -663568 -844080 -503968 -1084132 -2474140
36841 -2474140 -2124505 1613094 5719326 5374979 1032105 -1107027 2578106 7837220
36833 7837220 8716422 6185449 5811386 7766117 5106836 -5608724 -16854362 -18330856
36825 -18330856 -10531129 -4319189 -6562445 -11877610 -11432331 -5106619 75971 755048
36817 755048 250511 1067023 501749 -4040727 -9872105 -12502086 -11533479 -9830601 -8740958
36808 -8740958 -7602827 -7031039 -9021922 -13186048 -15665276 -13470720 -8635510 -6281855
36800 -6281855 -8434931 -11019091 -8272385 -20218 7145821 6994854 451576 -6465470
36792 -6465470 -9847638 -10051858 -7903224 -3376076 1269471 1881487 -1618125 -3771113
36784 -3771113 -1418148 706160 -3237623 -10547852 -12760916 -7111791 404329 3848311
36776 3848311 3899534 3898693 4013382 2443216 -509589 -2726575 -3126315 -2011287 231434
36767 231434 3145399 6142118 9540030 13864415 16852178 13649600 2501521 -11455206
36759 -11455206 -20773001 -22935435 -20672161 -16757561 -12115999 -8306664 -7463987 -8646549
36751 -8646549 -7667540 -2254261 5137449 11000643 14451742 15436678 12485570 5622031
36743 5622031 -624382 -1295375 2387434 4134334 460507 -5767990 -9853984 -9802126 -5719885
36734 -5719885 1117600 6625241 5446947 -2249644 -8445668 -6072274 1690797 5610541
36726 5610541 2840644 -363705 1064469 3880351 2661568 -1586993 -3656948 -2541681
36718 -2541681 -2592514 -6532378 -11481246 -13047267 -10621503 -7311739 -6462417 -9323594 -14619579
36709 -14619579 -19232023 -20427851 -18545607 -16678878 -16814393 -17326856 -15653802 -12535291
36701 -12535291 -11334467 -12811250 -12827632 -7033005 3231326 11779342 14097377 10898745
36693 10898745 5001863 -2358135 -10068701 -14468775 -12158540 -5487488 -1509641 -3676498
36685 -3676498 -6972548 -3659391 7328191 18824353 22682280 16828867 5668777 -4204824
36677 -4204824 -8112361 -5142086 1973422 8577005 10812518 7893821 2284808 -2591064
36669 -2591064 -5304558 -7043593 -9088439 -10376508 -8678414 -3941778 936285 3050061
36661 3050061 2269607 943357 1764007 5755107 10955820 13221295 10287630 5336134
36653 5336134 4239600 8426973 12831970 12244067 7354861 2739291 1182080 2371867
36645 2371867 5112365 7881183 8748317 7773479 8006688 10636304 10618354 1937351 -12704897
36636 -12704897 -22369942 -19736667 -8674892 1905813 8031276 11605128 14489239 15884177
36628 15884177 14920673 12591764 10579312 9724361 9708377 9307128 7506941 5306432 5504580
36619 5504580 9502058 15282744 19993993 23454460 27050480 29815626 28433599 22088264
36611 22088264 15220033 13377827 16698864 19297203 15963806 8510550 3972812 6463284
36603 6463284 12393255 14676750 10341010 2628675 -3130204 -3808833 50568 4280636
36595 4280636 3446478 -3365354 -9382689 -6921247 2234163 8231411 6595003 4294596
36587 4294596 8235973 13415728 9854281 -1707670 -9664343 -7297734 -773500 925883
36579 925883 -2718210 -6325603 -6972834 -5115196 -1007241 4578762 8365546 8123751 6660653
36570 6660653 7707542 9160451 5670546 -2106299 -6328387 -1938546 6276959 9344646
36562 9344646 4377781 -3198140 -6037702 -1458693 7085855 13126112 12376764 6363369
36554 6363369 750777 -509015 1233752 1811519 -1003751 -5946553 -10108621 -11262851
36546 -11262851 -9437134 -7280470 -7881526 -11185914 -13695196 -12858380 -10328615 -9082585
36538 -9082585 -8627668 -5765633 106962 5148722 5311624 567725 -5892500 -10955379
36530 -10955379 -12985695 -11575849 -7796858 -4115341 -2268365 -1054080 2376908 8517085
36522 8517085 13990572 15103077 12166275 8825328 7288129 6104506 3300137 -403594
36514 -403594 -3274750 -5722045 -8987856 -11643264 -10736589 -6348794 -1501864 2718743
36506 2718743 7732339 12277363 12139410 7975142 7700394 15696172 24252818 23013417
36498 23013417 14011076 8828831 11811214 15433783 13636414 10106382 9289061 8025275
36490 8025275 2747068 -1810870 802740 7660041 9964967 5257471 -1248139 -5767456
36482 -5767456 -8871919 -10061876 -7108832 -1645434 1435530 1663163 3789313 9033157
36474 9033157 11806368 8192311 2164738 -455298 245510 580785 -492942 -1883861
36466 -1883861 -4297946 -9071082 -14583321 -17721336 -18045286 -17494355 -16935740 -15726620 -13638480
36457 -13638480 -10511473 -4986143 3542214 12115428 15903335 12906142 5621087 -1489516
36449 -1489516 -5106194 -4770267 -2927523 -2315434 -2518142 -950510 1943107 1704430 -3628333
36440 -3628333 -9330575 -10044549 -7470834 -7347270 -10197082 -10298119 -4069526 5015393 10941317
36431 10941317 11221901 7712107 4414040 5070166 9967581 14535478 13831291 8551809
36423 8551809 3616152 1247824 -269679 -950868 2079772 8139822 10884989 6488432
36415 6488432 -234489 -2322195 -209945 8086 -4142456 -8915428 -10435495 -9229889
36407 -9229889 -8378200 -9809111 -12244256 -11180389 -2868037 9132460 14385402 7266374
36399 7266374 -4055516 -6476615 1247869 7934017 6864823 4594218 8682706 14467992
36391 14467992 11904586 1331764 -6506671 -5640605 -2155163 -4329679 -11719572 -17712848
36383 -17712848 -18937235 -17837954 -17621915 -18427094 -18615741 -17466062 -15647328 -13799031
36375 -13799031 -11314479 -6910825 -650918 5192279 8189608 8284159 7230928 6031364
36367 6031364 4297274 1632136 -1990001 -6468741 -10028932 -8608584 -644842 7653942
36359 7653942 6903099 -3563580 -13168758 -13039131 -7274652 -6210459 -11718197 -16075982
36351 -16075982 -14396727 -10545598 -8974662 -7664174 -3415621 920956 209355 -4488946
36343 -4488946 -6795492 -3876650 346924 1543482 551397 934135 3871237 7780104
36335 7780104 11257496 13806578 14172218 10522053 3313868 -3404836 -5170332 -1594586
36327 -1594586 3209325 4738620 1786507 -3848302 -9627809 -13343708 -13549221 -10763535
36319 -10763535 -7452710 -5167346 -2631413 1410788 4798379 4527874 1938655 1210077
36311 1210077 2342328 357127 -6624141 -13162261 -13777811 -10482627 -8376543 -6790264
36303 -6790264 -976952 8307344 13426463 9667514 1468999 -3576229 -3178604 -244940
36295 -244940 2215984 2512463 -1007004 -8213514 -14563248 -14210407 -7084409 -260696 -367482
36286 -367482 -6107834 -10491340 -9865248 -8019493 -10312181 -16079236 -19539210 -17264205
36278 -17264205 -11370645 -4866360 2308393 10115013 14351704 10025859 -1786822 -13963234
36270 -13963234 -20505669 -21078808 -18486399 -14878406 -11366395 -8571052 -6056653 -3149901
36262 -3149901 -1210494 -2694154 -6680884 -7983016 -3036192 5061651 9834010 8676497
36254 8676497 4619756 1772266 1534967 3164873 5568323 7589747 7980358 6188063
36246 6188063 2726735 -1665286 -6675549 -11698764 -14970332 -14650490 -11528530 -9756807
36238 -9756807 -12873106 -18569210 -19667195 -12257494 -1233215 4996743 4250878 1756734
36230 1756734 2221222 4928565 7261454 8355292 7143793 1301161 -8237828 -15262882
36222 -15262882 -15300036 -12205237 -12951842 -17599746 -19905569 -17205266 -13633371 -12556248
36214 -12556248 -11765760 -8981769 -7142185 -9960091 -15416198 -18274368 -17398321 -16142942
36206 -16142942 -15999727 -14052794 -7547425 2153182 11290807 16894153 17127984 11189735
36198 11189735 1275618 -6849129 -8113424 -3179284 2416353 4141763 1885299 -2341642
36190 -2341642 -7533200 -13169112 -17543538 -18782407 -16619635 -11487623 -3378508 5662070
36182 5662070 9453915 2815860 -10665604 -20852790 -23000434 -22487583 -24251820 -23310155
36174 -23310155 -12943040 1243498 5272353 -4352047 -15042026 -15276744 -9253019 -7945595
36166 -7945595 -11951318 -12387394 -6009834 445613 1819806 1644402 4224790 6563554
36158 6563554 3665051 -2313440 -4177890 576077 7043169 9662859 7821472 4308978
36150 4308978 1394699 -271113 -700457 8325 1404264 2036892 -316789 -6054197 -11143132
36141 -11143132 -10133978 -3797879 -607242 -6653593 -16305944 -18375785 -11092514 -4638053
36133 -4638053 -6922768 -12840207 -11964342 -2790650 6132124 7393220 1922686 -4580748
36125 -4580748 -7998440 -7951549 -6906028 -7889771 -10836407 -11383031 -6044484 1868102 5256983
36116 5256983 2521985 -433365 985790 3627069 2160969 -2337590 -3896790 -271229
36108 -271229 4404959 5726481 4118620 2804062 3495218 5747268 8728194 11638222
36100 11638222 13030776 11471301 7401325 3724321 3759682 8055132 13219981 14594090
36092 14594090 10561572 3840331 -1796417 -5302260 -8110813 -10850996 -11796552 -9036813
36084 -9036813 -3468316 1161358 1663251 -958280 -1888132 2357051 9174779 11766045
36076 11766045 6592056 -2169147 -6605670 -2680516 6857288 15800419 19317772 16698549
36068 16698549 11473863 8738062 10772293 15110534 17589610 16493530 12599321 6631363
36060 6631363 -866008 -7839909 -11835006 -13010051 -13523204 -13710085 -11799387 -8016797
36052 -8016797 -5391869 -4657659 -1905690 5312787 12124130 11155018 2637732 -4713293
36044 -4713293 -3968261 2313662 6443887 4952429 878074 -1866191 -3177356 -5102152
36036 -5102152 -7594681 -7921316 -4303756 1277146 5008958 5404546 4105993 2758058
36028 2758058 1348696 515712 2652108 7884082 10878767 5811935 -5707889 -15825690
36020 -15825690 -20208000 -22170603 -25258295 -26642044 -22076940 -13885534 -8469199 -7380690
36012 -7380690 -6367497 -3046771 -92787 189128 -661357 -1357670 -4067042 -10457333 -17684643
36003 -17684643 -21448248 -20888484 -17965123 -14260361 -11025782 -10198152 -12396656 -15449893
35995 -15449893 -17230124 -17967095 -17612008 -14095110 -7761953 -4297761 -7965575 -13863415
35987 -13863415 -12774837 -3029202 8304633 15810838 20541190 23020039 18623055 4477935
35979 4477935 -13518362 -25608862 -28148148 -25235121 -22172416 -20485294 -18432128 -14007044
35971 -14007044 -7758642 -3242940 -3021509 -3962623 299334 10944683 21485069 25732861
35963 25732861 24700309 22769573 20599185 15980821 9353753 3929298 1207385 -73192
35955 -73192 -1142964 -2198351 -3277515 -3558279 -1058602 4266562 8686544 9123034 8050358
35946 8050358 10473419 16920553 22850464 24298840 20802262 13642461 5186647 -198388
35938 -198388 1212303 7699497 12690656 11273855 4555467 -2363366 -4816727 -1422382
35930 -1422382 5081582 9704994 9544371 6016904 1931437 -1865058 -5324163 -7255056
35922 -7255056 -7241920 -7054728 -7122932 -4534347 1524499 5525749 2102511 -5688849 -10477556
35913 -10477556 -10770221 -10416464 -9850641 -5949906 -83059 2465329 2167853 5575414 13526863
35904 13526863 17586624 12198456 2856859 -2426929 -3029459 -2244776 -533277 1957064
35896 1957064 1787310 -2677965 -7244584 -8771909 -11374394 -19433323 -28753193 -31629630
35888 -31629630 -27296270 -20435322 -12530906 -2366260 7035135 9998832 6405658 1842168
35880 1842168 61421 1141566 5794879 14487569 22650142 23979963 19273598 15491547
35872 15491547 15209739 13613822 7405159 9729 -4593407 -7251105 -9742841 -10770489
35864 -10770489 -9412434 -8211806 -9066395 -9548250 -6989501 -3390947 -2672385 -5155833
35856 -5155833 -8018839 -9524755 -9777545 -8645711 -6096069 -4201016 -6110063 -12299468
35848 -12299468 -19088622 -21661002 -18591272 -13257775 -10304607 -10667006 -11297856 -10171088
35840 -10171088 -9264271 -10924096 -13670884 -14356291 -12552022 -9749135 -6315737 -3067546
35832 -3067546 -3670265 -10347531 -18455815 -21006662 -18180272 -16503155 -18639965 -20620871
35824 -20620871 -20019840 -19406039 -19105211 -14113104 -2939996 6873093 8261497 5033932
35816 5033932 6015686 11744660 14034096 8022230 -1405181 -5974181 -2548787 5549987
35808 5549987 12598314 14910435 13121148 10549040 8782999 6169564 1496437 -3305342
35800 -3305342 -6049618 -7297404 -7906215 -6218979 -1056390 4757374 7721260 8619102
35792 8619102 9857251 9435650 2861461 -9072547 -19647583 -24479307 -25885810 -27229785
35784 -27229785 -27143599 -22520977 -14458183 -7454800 -3523889 -267417 4577930 8873026
35776 8873026 8273807 2474018 -2834890 -2155314 2585829 4163188 39221 -3688450
35768 -3688450 -1152303 3982308 3205607 -4367579 -10424613 -9375585 -5872753 -6917507
35760 -6917507 -10944811 -10120978 -1677309 8501372 13936327 14504385 13545926 11928790
35752 11928790 8337657 3342465 -554669 -2315854 -2517914 -331237 5895703 14201637
35744 14201637 19056697 17933714 14415896 12024725 8543584 718869 -8361628 -12371595
35736 -12371595 -10900047 -9287384 -9393253 -7250762 -1513272 2535649 1023993 -2113842
35728 -2113842 -1639068 355363 -2128415 -9566449 -16409528 -18766512 -17794673 -15971589
35720 -15971589 -14276952 -13256609 -13457830 -14204486 -13991734 -11979437 -7807804 -1452016
35712 -1452016 4875643 6927767 3498821 -574788 132429 4749887 8254485 9015093
35704 9015093 9993384 13032469 16050582 16197304 12801678 7296951 2601196 1404861
35696 1404861 2296001 -409621 -9072091 -17084848 -16114452 -7738960 -1863664 -3781825
35688 -3781825 -9178841 -12661554 -14244248 -14788322 -11506969 -2673018 7307074 12196124
35680 12196124 11243076 8988546 9383728 12289312 14268946 11656629 4787784 -588508
35672 -588508 662599 5496330 5796259 -112215 -4996301 -4240366 -3285427 -8633754 -16938916
35663 -16938916 -19773067 -15767418 -10902011 -8706954 -7534059 -7188276 -10854343 -18513911
35655 -18513911 -24312603 -23517341 -18128456 -12826913 -8794377 -4945308 -2882336 -6303507
35647 -6303507 -15244308 -23900104 -25826334 -20297906 -12148963 -5823618 -1652667 1271386
35639 1271386 1314642 -3200448 -8818955 -8974268 -2570214 3446315 2685404 -2656841 -5551198
35630 -5551198 -3445975 -94457 495128 -1731863 -4260139 -4725590 -2540069 100789
35622 100789 -366070 -4553332 -8668062 -9514150 -8875449 -9986035 -11981491 -11985931 -10849534
35613 -10849534 -11633934 -13117631 -10449091 -3027061 3361742 3899675 78501 -3827972
35605 -3827972 -5604941 -4750374 -1431851 1802342 752627 -5406425 -12501502 -16467084
35597 -16467084 -16827883 -13661124 -5918185 3934110 8306778 2725828 -7248601 -12548933
35589 -12548933 -11838963 -10908142 -12904143 -15711109 -18303124 -22178251 -24859378 -19286013
35581 -19286013 -3934426 11793393 17651555 14672743 11772458 12597298 12233775 6879593
35573 6879593 -21246 -4329623 -8780261 -18523042 -30834223 -35181843 -25597602 -9425493
35565 -9425493 -261316 -3281877 -10895283 -13162790 -9009983 -4912449 -5205536 -7893814
35557 -7893814 -9684626 -10486445 -10609229 -7093861 2661807 14462758 19178470 12866273
35549 12866273 2056289 -3762032 -3180176 -3022776 -7818845 -13230186 -12344028 -5604294
35541 -5604294 49236 1612134 4217699 11956482 19011074 16336791 6019226 1273378
35533 1273378 9198165 20039444 19494849 7419164 -3379217 -5237566 -3733759 -6055577
35525 -6055577 -9573975 -7078885 2026762 11698510 17404994 19041966 17781872 15014046
35517 15014046 13120357 12840885 11068739 5479752 -365032 -1610230 -186767 -1967388
35509 -1967388 -6424867 -6498430 -56448 6025778 6491983 5593059 9407688 15732835 17807753
35500 17807753 14667994 11490122 11309897 12078247 11484793 9963823 8627239 7712408 7340190
35491 7340190 7365482 6824780 5333116 3635551 1048922 -4749606 -12384722 -14840832 -7919302
35482 -7919302 2096713 5582737 2887929 3266744 10325371 16174804 12569624 1416710
35474 1416710 -9384226 -15286182 -16185493 -12595316 -5629556 1720851 7316768 11985608
35466 11985608 15935754 15796875 9074247 -601895 -6805835 -7514377 -5233414 -1489804
35458 -1489804 4204367 10301518 12817519 10156914 5181823 1495432 251910 1202786
35450 1202786 3854227 6245213 5252020 158087 -5742858 -9073142 -10816704 -14788059
35442 -14788059 -21851407 -27438470 -25714146 -15748625 -2885703 6056175 8331976 5725231
35434 5725231 775113 -5206755 -10232850 -10812358 -5530096 2020966 6725723 7831416
35426 7831416 8502644 9628146 7711664 587436 -7800625 -11498316 -10115556 -8923592
35418 -8923592 -11265314 -14122048 -12898470 -8148968 -4519727 -3894381 -3220942 -165958
35410 -165958 2403248 405616 -4988899 -8551972 -8032402 -6109151 -4944988 -3142145
35402 -3142145 -117116 627895 -3573963 -9099220 -10180837 -7309195 -6615278 -10681280
35394 -10681280 -14685692 -13307690 -7609853 -2671366 -1315022 -2895792 -6078207 -9704618
35386 -9704618 -12044921 -12000104 -10739413 -10253790 -10874113 -11802189 -12795440 -12954019 -9139525
35377 -9139525 804326 13216654 20645100 19942519 15407664 12399240 10975879 8466758
35369 8466758 5546130 5535555 8544209 10625269 9538270 7665407 7397798 6799605 2997672
35360 2997672 -1927207 -2360549 3287632 9713297 10944453 7193083 3311117 1826332
35352 1826332 540235 -2679974 -5644279 -4469422 935868 6590331 9589394 11109621
35344 11109621 13330279 15479267 14956508 11267018 6493995 2128619 -2169591 -6171205
35336 -6171205 -7853411 -6163415 -3409412 -2813547 -4326057 -4950076 -3348247 -2147682
35328 -2147682 -4506692 -9473523 -12380677 -9961073 -3795552 2134201 6340957 10545703
35320 10545703 15539122 18653482 16963661 11456828 5729382 1345986 -2978080 -7975826
35312 -7975826 -12520946 -15855745 -17984775 -17337179 -11817999 -3659810 973175 157811
35304 157811 69203 6289760 14344352 14684002 5800340 -3772809 -6896947 -5303178 -3809402
35295 -3809402 -2681798 325453 3922594 4022712 -361703 -5329206 -6476823 -3415131
35287 -3415131 233275 660833 -2155261 -4527729 -3936680 -2888018 -5640210 -11606037
35279 -11606037 -15294991 -13399535 -8621683 -5199330 -3847100 -2969676 -1981925 -1199432
35271 -1199432 -772708 -1621327 -4945042 -9065249 -9847415 -6553304 -3901618 -5365128 -8061541
35262 -8061541 -8396836 -9356544 -16490093 -28331883 -36627479 -35958083 -28455972 -19199414
35254 -19199414 -11587140 -7198114 -5346070 -2256469 4708903 11492165 10903687 2646099
35246 2646099 -5433600 -7669290 -6758890 -7300301 -8875407 -9529825 -11112521 -15677672 -19824685
35237 -19824685 -18450511 -12619953 -8392208 -8167825 -7736041 -2434350 7037297 15418862
35229 15418862 17311167 11315579 2095805 -2653467 8116 4589920 4161600 -616172
35221 -616172 -3470668 -2106727 -379611 -918518 -1642008 -1346513 -2889744 -7392379 -10183761
35212 -10183761 -7102156 -1308592 1026972 -816795 -2996562 -4213056 -6009436 -6971525
35204 -6971525 -3210024 4343681 8963645 6607150 484633 -5154943 -10673483 -16922604
35196 -16922604 -20288929 -17125904 -10060694 -4400172 -390919 5112360 10731959 11247354
35188 11247354 6697973 3917590 6504945 9259988 6453314 637687 -1922361 -1159446
35180 -1159446 -2548819 -7832042 -12085701 -10679044 -4748884 1735945 7063469 11814513
35172 11814513 15689426 16610901 13213686 7582442 4639222 7372334 12482011 13136307
35164 13136307 7604643 2618979 5214858 13228040 17984000 15563772 10685983 8790357
35156 8790357 8980180 7183611 2803413 -1106696 -2600118 -2857226 -3894402 -6045131
35148 -6045131 -7566111 -6054755 -1055730 4272939 5508068 1909621 -2252147 -2326636
35140 -2326636 1933810 7160993 10556919 11846864 11922235 11130020 9112896 5958519 3394982
35131 3394982 3954909 7723615 10855321 9687376 5897581 4364527 5570549 4131152
35123 4131152 -3285192 -12390816 -16702657 -15436641 -12148653 -7940073 -878373 8638935
35115 8638935 16693014 20542213 20824411 18611224 14050983 8963361 6972396 8895721
35107 8895721 10709529 8355225 2720941 -1841307 -2032491 2812238 11035135 18151533
35099 18151533 18575139 11545774 4120687 4361100 11620997 17131751 14560097 6285349
35091 6285349 -1798689 -7467003 -11334552 -12456796 -9562536 -5525168 -5778407 -11383180
35083 -11383180 -17251120 -18636581 -16328298 -13645244 -11369871 -8634415 -6614669 -7355176
35075 -7355176 -9393888 -8361421 -2949741 2483620 2873818 -1657156 -6260780 -6504138
35067 -6504138 -1823606 4990155 10064486 10632556 6753425 1666058 -225084 3230474
35059 3230474 9812697 14170309 11884783 3197236 -7025175 -13222508 -13270894 -9322038
35051 -9322038 -5550085 -5115661 -7988637 -10908538 -10335869 -6075448 -1079942 2478096
35043 2478096 4949057 6348854 4767486 4175 -3763573 -2352631 3031132 8148259
35035 8148259 11573481 13855285 12695782 5268834 -4481107 -7622148 -1740550 5002926
35027 5002926 4578124 -1253150 -6080130 -8919010 -13390475 -19631986 -23244910 -21835181
35019 -21835181 -17669796 -13445427 -9297036 -4837074 -1300545 -566744 -3335740 -8194509
35011 -8194509 -11538653 -9699209 -2923882 3931108 6529042 5611762 4646021 4710326 4252933
35002 4252933 2447930 -130686 -3382868 -7691688 -12551111 -16889484 -19735517 -19411731
34994 -19411731 -14403716 -6840363 -2078549 -2141324 -2848235 -772224 919863 -1616476
34986 -1616476 -5082788 -3781151 546213 1324401 -1711216 -2215781 1782012 4955963
34978 4955963 4205277 2861342 2756317 322744 -5178191 -7236531 -1824884 4736782
34970 4736782 4621919 534067 1303742 8288795 13919786 13119823 9311453 8137231 10568774
34961 10568774 13910548 15721779 14869666 11332930 6693355 3294290 1652792 -483518
34953 -483518 -5578004 -12737585 -17024695 -13439986 -2828485 7152327 9257693 4321433
34945 4321433 -1142208 -4325025 -8622039 -16028311 -22333074 -22868808 -18990189 -15174862
34937 -15174862 -12635356 -9450478 -4853916 -71352 3522906 4674470 2564878 -1304281
34929 -1304281 -4032663 -5513118 -8043431 -10289943 -7125732 1293223 6436869 2725758
34921 2725758 -3638878 -4014075 -610911 -2063239 -9256280 -15217878 -17572015 -20974758
34913 -20974758 -26494159 -28204555 -22969089 -15515941 -10565872 -6940117 -2884486 -663392
34905 -663392 -1754042 -2938783 -1305325 1335763 2470567 2856393 3170698 1184076 -4198457
34896 -4198457 -10167649 -14353775 -17447526 -18562270 -13741794 -3623319 3084099 -33413
34888 -33413 -7679048 -10548920 -8710548 -9391624 -13637599 -14095751 -6871681 2102489 5273311
34879 5273311 2618178 -359141 -29681 2515870 3410576 -856329 -9780364 -17088766
34871 -17088766 -15394178 -4294506 8329912 14598775 14175350 12089791 11387807 10572731
34863 10572731 7248061 1432840 -5176353 -11196738 -15547001 -16573121 -13087315 -6547522
34855 -6547522 -631394 2369447 3560408 4705160 5118194 3606906 2158558 4060405
34847 4060405 8334193 9847891 6072551 359443 -2897929 -2955150 -841540 3395225
34839 3395225 8630436 10979371 7771265 1297835 -4249690 -7465391 -8642371 -6857154
34831 -6857154 -2125757 1524212 -451702 -7245807 -13674344 -16074392 -14290981 -9509321
34823 -9509321 -3850228 -742932 -1666369 -3349361 -1763176 2358639 5657240 7854083
34815 7854083 10527127 11910682 8887855 3595472 1761629 4015219 5038236 2457685
34807 2457685 195880 788411 536778 -4156468 -10526232 -13355595 -11429952 -6859598
34799 -6859598 -1713955 1213376 -2008214 -11598828 -20957815 -22566038 -16273645 -9118421
34791 -9118421 -7745289 -12642326 -18491610 -18847344 -11982347 -2943229 1904686 2111616
34783 2111616 1906609 2528211 1108722 -2224595 -2793880 378668 1322270 -3563126 -8945364
34774 -8945364 -8840143 -6089895 -6878826 -10138457 -10062120 -6209983 -3073925 -1252640 2706238
34765 2706238 7921515 8697760 3728305 -1264420 -2228087 -2131498 -5111848 -10384056 -14736879
34756 -14736879 -16945779 -17099518 -14967691 -11347614 -8261044 -6217130 -3917517 -1428366
34748 -1428366 -271380 294080 2771839 5742750 3433237 -5949628 -15180092 -15309433
34740 -15309433 -6163851 3742010 6842684 3480204 -525813 -1431597 -1854800 -7040972
34732 -7040972 -16906881 -24182572 -22792663 -15782343 -10789998 -9215597 -5616752 1989850
34724 1989850 7698370 6181203 463858 -2379761 150167 4896169 7826853 7033469
34716 7033469 3286048 76994 1021990 5250617 7559447 4732700 -703962 -4251536
34708 -4251536 -4002828 -299711 5517456 10344565 11037144 8797702 8128687 9819465 9476494
34699 9476494 4889924 -555336 -4481409 -9348912 -15671124 -17786973 -12087890 -3880320
34691 -3880320 288826 1713912 3679342 2314749 -6738427 -16295601 -13891731 354438
34683 354438 12872009 14815644 11034145 8597234 6670747 2813303 736036 4649640
34675 4649640 11029831 12590009 7653559 732146 -3854327 -4836084 -2481503 2013054
34667 2013054 6578532 9993646 12491270 13715253 12376998 9005054 6149547 4408633
34659 4408633 1288865 -4168610 -8569191 -8215228 -3819850 586102 1647532 -1279525
34651 -1279525 -5735114 -7176967 -3142882 3134993 6272745 5779905 5529534 6374664 4890373
34642 4890373 547732 -2032530 -389471 2172373 3254801 5378688 9393755 10492583
34634 10492583 6459438 3828991 8502541 14981730 13469913 4753086 -1035778 538575
34626 538575 3436752 2391752 500446 2329726 5903941 6057746 1944107 -2905399
34618 -2905399 -6011047 -8183668 -10969584 -13923345 -14830550 -12367383 -8153645 -4995351
34610 -4995351 -3019028 19706 3625931 3302552 -2864601 -9661917 -10766393 -6774616
34602 -6774616 -2922033 -1332021 -858092 -2575007 -8719593 -16374690 -18825789 -14520257
34594 -14520257 -9073350 -6742327 -5222044 -1106982 4428206 8363800 10310960 11302678
34586 11302678 11361411 10979325 11954782 13866993 12475317 5030295 -4484935 -8639628 -4664791
34577 -4664791 2750991 6616067 4482215 229714 -768559 1817813 3097928 374222
34569 374222 -2212847 -103883 3135684 -255839 -10167519 -17335798 -15947024 -11003203
34561 -11003203 -9586238 -10556122 -8099167 -1345454 5497819 10266358 14224242 17046734
34553 17046734 15711530 9356259 1742374 -2358880 -1433251 2294664 4992757 4021188
34545 4021188 272538 -2277224 -407903 5316147 11944218 17274233 20418329 20712074
34537 20712074 18077174 14031232 10786820 9193798 8039313 5242305 95604 -4904283
34529 -4904283 -5522050 -988047 3525112 2901886 -304217 1088474 7898579 12144036
34521 12144036 7749654 -1471538 -7899729 -9623779 -9730039 -10075204 -10835194 -13437991
34513 -13437991 -18581124 -22781516 -21485000 -14595566 -5361075 4168927 12309080 14750080
34505 14750080 8226272 -3472207 -12456269 -15735712 -16726179 -18254146 -19397620 -19708527
34497 -19708527 -21106217 -23801547 -24613039 -21227633 -14856876 -7512698 -76426 5896199
34489 5896199 8129559 6830265 4741387 2949112 48336 -3646346 -5261179 -4432043
34481 -4432043 -4951701 -8742980 -11923592 -10017052 -3969518 2377239 7999646 13798547
34473 13798547 17722762 15276025 5291955 -7503714 -16332778 -17638807 -13087638 -7718365
34465 -7718365 -5669264 -6689222 -7386480 -6299326 -6154721 -9983045 -16445073 -20522293
34457 -20522293 -18142411 -9515606 821671 6790891 5471853 -164867 -5039205 -8585976
34449 -8585976 -14230133 -21418537 -23383811 -16755829 -8948370 -9497079 -16117316 -17028911
34441 -17028911 -7900739 1267383 122679 -7380308 -8914336 -1241100 6010587 4470775
34433 4470775 -2193958 -5143746 -2737606 -363595 -536823 56588 3086614 4422917
34425 4422917 704737 -4292474 -4313540 766427 5472341 6602348 6124098 6585972 8040193
34416 8040193 10042597 12593937 13930537 11185980 4972182 -43047 -1075441 -663201
34408 -663201 -2123918 -4822500 -6687787 -8328086 -10967938 -12647285 -10826576 -7588715
34400 -7588715 -7767254 -11835968 -14647445 -12165803 -6210366 -1195942 1152171 2173174
34392 2173174 3491785 5861543 9431566 13046469 13793624 9334530 1267496 -5238879
34384 -5238879 -6512426 -4766193 -5934434 -12427812 -19367262 -19797962 -13130462 -6048528
34376 -6048528 -4478343 -7000120 -7767642 -4005871 1926668 7081817 11516341 16376913
34368 16376913 20315682 19892167 13753583 5069407 -1622646 -5792439 -11023035 -18528203
34360 -18528203 -23032323 -18608901 -7647053 553216 992599 -1728691 -1407328 1202950
34352 1202950 2020373 2115554 6309244 14061577 17785520 12094689 912407 -6774590
34344 -6774590 -5897548 1532059 10105718 15771071 17643997 16613904 12883652 5794137
34336 5794137 -3438704 -10544494 -11833261 -8153683 -3256883 665818 3438364 4506547
34328 4506547 3872645 4547049 9345074 14871091 13721989 4370100 -5840457 -10046168
34320 -10046168 -9708544 -9797501 -10652999 -9690848 -8018976 -9232646 -12776688 -14328116 -12997755
34311 -12997755 -12995588 -17078392 -22721329 -26137830 -26186218 -22935247 -16439511 -8918665 -4260033
34302 -4260033 -2856791 -594895 4221122 6928122 3444714 -2693061 -5848165 -8075724
34294 -8075724 -16150065 -29134347 -36485518 -31035555 -17955004 -7430007 -3334539 -3094224
34286 -3094224 -4190617 -5319734 -4073842 404670 3597484 160684 -7766613 -12173904
34278 -12173904 -9843316 -6235529 -7117353 -11338118 -14765701 -16892341 -19205015 -20037408
34270 -20037408 -16343398 -9842507 -6563492 -9172470 -13246098 -13179724 -9628814 -8462170
34262 -8462170 -12800873 -18640906 -19822469 -16134247 -14044381 -18794469 -27960309 -34534374
34254 -34534374 -34574779 -29376748 -21816706 -14384955 -10170786 -10974777 -13211455 -10064201
34246 -10064201 -129382 9553183 11737619 7085721 1157348 -3415247 -7736178 -12100992
34238 -12100992 -15366950 -17794609 -20166951 -20464509 -15491856 -6115253 2496062 6279105
34230 6279105 5245605 1304017 -3653440 -7331515 -7921090 -6119842 -3937235 -1585918
34222 -1585918 1765234 4657402 4370549 1384924 -1003699 -2104476 -4953785 -10949901
34214 -10949901 -17175282 -20453220 -20361741 -16827302 -9103786 394056 5521783 3367769
34206 3367769 -1292353 -2186701 390565 1458599 -1049358 -4804772 -7651824 -9361857
34198 -9361857 -9590871 -8064874 -6520300 -6900648 -7802555 -6121255 -2046821 1218275 2882549
34189 2882549 5807048 11342664 16511856 18008246 16117022 12871465 8938554 4581248
34181 4581248 1675590 2085147 4846290 7037312 7091230 5766465 4231195 2764044 1621662
34172 1621662 2015244 4999279 8886400 8639980 169413 -13424575 -22007761 -17944728
34164 -17944728 -4891249 6140007 9333175 8784366 10022747 11860399 9989816 4907032
34156 4907032 1466258 2227207 5652347 10021717 14736473 17853793 16711289 11847900
34148 11847900 6598406 1932165 -4401409 -12222347 -16621727 -13970258 -6920912 -473811
34140 -473811 4030568 7684338 9557495 7780312 3478680 -744446 -5419037 -12874990
34132 -12874990 -21408120 -25270314 -21548909 -13539999 -6274718 -2081012 -1665473 -5694571
34124 -5694571 -12727311 -18199667 -18328896 -13970067 -9020434 -6189771 -5459750 -5386089 -5000050
34115 -5000050 -5442334 -9397524 -16770285 -21761767 -18320066 -8864826 -2707149 -4144315
34107 -4144315 -7341039 -5907750 -1952242 -683357 -818791 2773641 9394916 12521215
34099 12521215 8975051 2145253 -4043321 -9068884 -13225018 -15749732 -16258447 -14534514
34091 -14534514 -9498926 -2436099 333982 -6053082 -16462365 -20447588 -15835831 -10397803
34083 -10397803 -8864460 -6785223 -810603 3305265 -714773 -9122330 -13157605 -10622740
34075 -10622740 -6069320 -2862308 -1640926 -4006746 -10691492 -17159945 -17362706 -11621638
34067 -11621638 -5731078 -3172443 -3412453 -6349366 -11769521 -14996486 -10763039 -2616483
34059 -2616483 -799926 -7871174 -13678509 -9357587 -127533 2348740 -3798235 -9481861
34051 -9481861 -8107886 -2947320 -322884 -1460130 -3491683 -4254935 -3107240 176863
34043 176863 4233388 5551612 2084130 -3231097 -5018901 -1491645 3843787 6360905
34035 6360905 4545451 289878 -3064378 -2760429 1404000 6599669 9946960 11989978
34027 11989978 15086759 18386471 17785093 12157062 6104576 4070625 4895031 5296436
34019 5296436 5483140 6903847 7025138 1894079 -7206651 -14995977 -19387536 -21996181
34011 -21996181 -22228059 -17657997 -10897098 -8719541 -12034341 -13716728 -9809179 -6100286
34003 -6100286 -8914845 -15548801 -19596439 -20416936 -20683595 -18999498 -12599782 -4695389
33995 -4695389 -1675703 -4464985 -9215444 -14816554 -22452559 -28949864 -28956813 -24443510 -23834890
33986 -23834890 -29207118 -31703911 -23779921 -10227134 -1945063 -2494190 -6030048 -6725909
33978 -6725909 -5253831 -5350486 -7311810 -7424960 -3825859 -726672 -3858388 -11699435 -15502451
33969 -15502451 -10517220 -2867069 -689318 -2304760 -73723 6162117 8121763 2500055
33961 2500055 -2834126 407268 10085152 17768853 19187613 16264129 12165618 8843722
33953 8843722 7704281 8984800 10931840 11440361 9690677 5540371 -695621 -7067643
33945 -7067643 -10974742 -12300554 -13297816 -14785773 -15249942 -14329850 -13919004 -14718022 -14909114
33936 -14909114 -13479646 -11704350 -10072996 -6898957 -1301676 5292504 11392348 16068989
33928 16068989 17293123 13980322 10094080 11433302 17022362 19209288 14233718 6954842
33920 6954842 2706615 789342 -537830 717155 5029034 7288875 4093739 330267
33912 330267 2153412 7459228 9844681 8452169 7040441 6330873 4519972 3091394
33904 3091394 4647329 6424391 3390434 -2998795 -6438271 -5726701 -5371212 -5764885 -1029789
33895 -1029789 10600808 21292468 22816441 16579765 10337121 8040449 6810987 2495129
33887 2495129 -4721911 -10285809 -10004263 -4714596 629498 2939395 3776309 4895898
33879 4895898 4818839 3189938 4500078 11879879 20006728 20747911 14280108 7995662 5751548
33870 5751548 5637442 7441947 13295064 19809323 18869057 9491148 830383 -424833
33862 -424833 2055614 3129615 4505592 7792217 7024873 -2864465 -15083140 -18019469
33854 -18019469 -10913851 -3878272 -3424261 -6259100 -7590948 -7506359 -7090187 -4970105 -955115
33845 -955115 1704381 861480 -1215114 -1643325 -861696 -157097 1792553 6546038 11709307
33836 11709307 12422070 6923456 -1261382 -6474615 -4963582 3415030 15352409 25618170
33828 25618170 30229078 29380133 26724983 24982360 22852377 17498530 9776293 4841468
33820 4841468 6139770 10247025 10219587 4125297 -2118929 -1457475 6448210 15411684 19441980
33811 19441980 17499545 12291201 6628082 1741850 -2202959 -5384867 -8011278 -9800516
33803 -9800516 -9675840 -6924141 -2992126 -744396 -723015 356786 4873604 8978916 5885421
33794 5885421 -4716438 -14573951 -16516822 -12580934 -9193229 -7671518 -4537258 610429
33786 610429 3384113 1058252 -4066010 -8658539 -11589825 -12098692 -8903707 -3229668
33778 -3229668 407950 -1198041 -6298925 -10441054 -10818534 -7984311 -5276271 -6676948
33770 -6676948 -12744154 -18497788 -18050451 -11479520 -4362315 -857940 -666121 -2186319
33762 -2186319 -4000024 -3210982 2137050 7901029 6841034 -1274285 -8257248 -8553749
33754 -8553749 -5503782 -3345802 -35463 6444388 10998487 8287052 2345894 1028193
33746 1028193 3444423 1647194 -5922283 -11375545 -9128379 -3041487 1070856 3662679
33738 3662679 7958495 12765359 13794920 10250606 5980386 4389435 5063806 5830942
33730 5830942 6052998 6396294 6031490 2283835 -5388425 -12485359 -13522470 -9000939 -5046354
33721 -5046354 -5318417 -6992773 -6432137 -4629625 -3854503 -2704364 1041323 5249969 5921420
33712 5921420 3354367 1448640 1969399 3628887 5811205 8900014 11509155 11576350 10095344
33703 10095344 10197200 12745050 15850671 17854412 17762038 14509004 9638198 8577512
33695 8577512 14231217 20926641 20405307 12775627 5520642 2523864 1008479 -750977
33687 -750977 -602262 1024172 -308394 -4807279 -5842448 168306 7324788 8577869
33679 8577869 5342022 3344510 2997543 -60285 -7090511 -14254359 -17529129 -15930868
33671 -15930868 -11081858 -6660122 -6719682 -11481513 -16007180 -15456471 -10255912 -4279556
33663 -4279556 -96728 2047213 3061077 4829919 8438852 10892662 7485124 -288177
33655 -288177 -4161344 -327952 3880865 271811 -7589004 -9390580 -3147118 2782957
33647 2782957 2178005 -2258697 -5528813 -6704245 -6478656 -4338533 -1127215 212791
33639 212791 -719750 -361832 2997499 5813755 4614521 1240252 -609452 -1255345 -3780222
33630 -3780222 -8667179 -13042735 -14217433 -11362499 -4888328 3062035 8346437 7913844
33622 7913844 3195824 -1509247 -3864398 -5159804 -7688161 -12129724 -17065303 -19563563
33614 -19563563 -17089675 -10733032 -5616425 -5622206 -8379991 -8460043 -5084654 -2654666 -3014891
33605 -3014891 -2211583 2082508 4430427 -1677157 -13239403 -20074700 -17772809 -12421382
33597 -12421382 -10870799 -12048789 -11421176 -9304643 -9568697 -12758472 -15848877 -17679741
33589 -17679741 -19696154 -21633627 -21237177 -18757528 -17330772 -17780982 -17031173 -13297020
33581 -13297020 -9394198 -8944234 -12071266 -16487115 -19980814 -20055371 -14147871 -2894980
33573 -2894980 8773692 16034293 18103859 16430710 11608331 4493770 -1871785 -4598859
33565 -4598859 -4301978 -3939123 -5229911 -7917234 -11288731 -14552019 -16680484 -17321623 -16920584
33556 -16920584 -15478046 -13263295 -13050698 -17859880 -24781386 -25485335 -16410300 -4669872
33548 -4669872 735379 456100 2049021 7885422 12258693 10302650 3767293 -3128573
33540 -3128573 -8441297 -11489747 -11651055 -10397215 -10914580 -13327435 -13233867 -7517165 507236
33531 507236 4244495 1057192 -5423486 -9646655 -9602001 -7930173 -7904272 -8997414 -8160816
33522 -8160816 -5585753 -5563306 -9158373 -10005779 -2556956 8019902 10928375 4320975
33514 4320975 -2250752 -1284025 3795399 6398674 7031262 10432354 16492205 19853814
33506 19853814 17129646 10215603 3096434 -1683583 -4131546 -6484318 -10674894 -14881894
33498 -14881894 -14825789 -9801643 -4172855 -977392 1758270 5300675 5871320 1447681
33490 1447681 -1433865 4585224 15129931 17857229 9363739 96459 -344086 4514897
33482 4514897 4960604 -1500497 -9507281 -14750091 -17134129 -16816049 -13195355 -8019982
33474 -8019982 -4670153 -3447200 -1309748 2833395 6113912 6304647 5182657 5290969
33466 5290969 5814568 4019823 -654046 -5802192 -8262406 -5969748 653557 7700839
33458 7700839 10218181 7658469 4868240 5308608 5940799 2569272 -2380978 -3312081 -1641277
$$ [...]
##END NTUPLES=NMR SPECTRUM
##END=
