##TITLE=31Pdec_DE-63_33
 D2O, 64 sc
 13.8.2024
##JCAMPDX= 6.0         $$ Bruker NMR JCAMP-DX V2.0
##DATA TYPE= NMR SPECTRUM
##DATA CLASS= NTUPLES
##ORIGIN= UXNMR, Bruker Analytische Messtechnik GmbH
##OWNER= root
$$ XWIN-NMR		Version 3.5
$$ Tue Aug 13 16:47:36 2024 Russian Standard Time (UT+4h)  she@DPX200
##.OBSERVE FREQUENCY= 81.013821
##.OBSERVE NUCLEUS= ^31P
##.ACQUISITION MODE= SIMULTANEOUS
##.ACQUISITION SCHEME= undefined
##.AVERAGES= 64
##.DIGITISER RES= 17
##SPECTROMETER/DATA SYSTEM= spect
##.PULSE SEQUENCE= zgpg30
##.SOLVENT NAME= D2O
##.SHIFT REFERENCE= (INTERNAL, D2O, 0, 198.062)
##AUDIT TRAIL= $$ (NUMBER, WHEN, WHO, WHERE, WHAT)
$$ ##TITLE= Audit trail, XWIN-NMR		Version 3.5
$$ ##JCAMPDX= 5.01
$$ ##ORIGIN= Bruker BioSpin GmbH
$$ ##OWNER= she
$$ F:/spectra/data/she/nmr/P31/2/pdata/1/auditp.txt
$$ ##AUDIT TRAIL=  $$ (NUMBER, WHEN, WHO, WHERE, WHAT)
(   1,<2024-08-13 16:45:42.68 +0400>,<she>,<DPX200>,
      <created by zg, POWCHK disabled, PULCHK disabled
       configuration hash MD5:
       00 E9 B6 7A A2 85 ED C7 34 08 36 98 17 FE 4E 26
       data hash MD5: 32K
       0F BB 2D 82 64 B2 1D 52 42 46 AC 62 3F 42 C0 18>)
(   2,<2024-08-13 16:45:45.78 +0400>,<she>,<DPX200>,
      <Start of raw data processing
       efp BC_mod = 2 LB = 1.5 FT_mod = 6 PKNL = 1 PHC0 = 2698.512 PHC1 = 84.08804 SI = 64K 
       data hash MD5: 64K
       00 2F 0B 6A 7E FB 57 B6 33 3B A9 7C CE 46 C0 0E>)
(   3,<2024-08-13 16:46:05.92 +0400>,<she>,<DPX200>,
      <pk PHC0 = -15.74364 PHC1 = -23.6 
       data hash MD5: 64K
       78 6E 96 32 32 EC FF F1 6C EF 5E 1A 00 CA 75 DB>)
(   4,<2024-08-13 16:46:09.45 +0400>,<she>,<DPX200>,
      <abs ABSG = 5 
       data hash MD5: 64K
       A7 24 62 C4 D0 F6 C6 EA 6F A3 7B AB A7 96 DE 58>)
$$ ##END=
$$ 
$$ hash MD5
$$ 2A 1D 58 1E 1C 73 AA 88 65 B3 B2 81 09 FE A2 08
##$RELAX= 
##$RELAX= 
##$RELAX= 
##$RELAX= 
##$RELAX= 
##$RELAX= 
##$RELAX= 
##$RELAX= 
$$ Bruker specific parameters
$$ --------------------------
##$DU= <F:/spectra>
##$EXPNO= 2
##$NAME= <P31>
##$PROCNO= 1
##$TYPE= <nmr>
##$USER= <she>
##$AMP= (0..31)
100 100 100 100 100 100 100 100 100 100 100 100 100 100 100 100 100 100 
100 100 100 100 100 100 100 100 100 100 100 100 100 100 
##$AQSEQ= 0
##$AQ_mod= 1
##$AUNM= <au_zg>
##$AUTOPOS= <>
##$BF1= 81.014009
##$BF2= 200.13
##$BF3= 200.13
##$BF4= 200.13
##$BF5= 200.13
##$BF6= 200.13
##$BF7= 200.13
##$BF8= 200.13
##$BYTORDA= 1
##$CFDGTYP= 0
##$CFRGTYP= 5
##$CHEMSTR= <none>
##$CNST= (0..31)
1 1 145 1 1 1 1 1 1 1 1 1 1 1 1 1 1 1 1 1 1 1 1 1 1 1 1 1 1 1 1 1 
##$CPDPRG= <waltz16>
##$CPDPRG1= <>
##$CPDPRG2= <waltz16>
##$CPDPRG3= <>
##$CPDPRG4= <mlev>
##$CPDPRG5= <mlev>
##$CPDPRG6= <mlev>
##$CPDPRG7= <mlev>
##$CPDPRG8= <mlev>
##$CPDPRGB= <>
##$CPDPRGT= <>
##$D= (0..31)
0 1 0 0 0 0 0 0 0 0.06 0 0.03 2e-05 3e-06 0 0 0.0002 0 0 0 0 0 0 0 0 0 
0 0 0 0 0 0 
##$DATE= 1723553142
##$DBL= (0..7)
120 120 120 11 120 120 24 19 
##$DBP= (0..7)
150 150 150 150 150 150 150 150 
##$DBP07= 0
##$DBPNAM0= <>
##$DBPNAM1= <>
##$DBPNAM2= <>
$$ [...]
##$SUBNAM3= <"">
##$SUBNAM4= <"">
##$SUBNAM5= <"">
##$SUBNAM6= <"">
##$SUBNAM7= <"">
##$SUBNAM8= <"">
##$SUBNAM9= <"">
##$SW= 400.765351723535
##$SWIBOX= (0..15)
0 1 3 0 0 0 0 0 0 0 0 0 0 0 0 0 
##$SW_h= 32467.5324675325
##$TD= 32768
##$TD0= 1
##$TE= 0
##$TE2= 300
##$TE3= 300
##$TEG= 300
##$TL= (0..7)
0 120 53 12 22 120 120 120 
##$TP= (0..7)
150 150 150 150 150 150 150 150 
##$TP07= 0
##$TPNAME0= <>
##$TPNAME1= <>
##$TPNAME2= <>
##$TPNAME3= <>
##$TPNAME4= <>
##$TPNAME5= <>
##$TPNAME6= <>
##$TPNAME7= <>
##$TPOAL= (0..7)
0.5 0.5 0.5 0.5 0.5 0.5 0.5 0.5 
##$TPOFFS= (0..7)
0 0 0 0 0 0 0 0 
##$TUNHIN= 0
##$TUNHOUT= 0
##$TUNXOUT= 0
##$USERA1= <user>
##$USERA2= <user>
##$USERA3= <user>
##$USERA4= <user>
##$USERA5= <user>
##$V9= 5
##$VALIST= <valist>
##$VCLIST= <CCCCCCCCCCCCCCC>
##$VD= 0
##$VDLIST= <DDDDDDDDDDDDDDD>
##$VPLIST= <PPPPPPPPPPPPPPP>
##$VTLIST= <TTTTTTTTTTTTTTT>
##$WBST= 1024
##$WBSW= 4
##$XGAIN= (0..3)
0 0 0 0 
##$XL= 0
##$YL= 0
##$YMAX_a= 42731
##$YMIN_a= -37045
##$ZGOPTNS= <>
##$ZL1= 120
##$ZL2= 120
##$ZL3= 120
##$ZL4= 120
##$ABSF1= 198.0616
##$ABSF2= -202.7028
##$ABSG= 5
##$ABSL= 3
##$ALPHA= 0
##$AQORDER= 0
##$ASSFAC= 0
##$ASSFACI= 0
##$ASSFACX= 0
##$ASSWID= 0
##$AUNMP= <proc_1d>
##$AZFE= 0.1
##$AZFW= 0.5
##$BCFW= 0
##$BC_mod= 2
##$BYTORDP= 0
##$COROFFS= 0
##$CY= -3
##$DATMOD= 1
##$DC= 0
##$DFILT= <>
##$DTYPP= 0
##$F1P= 0
##$F2P= 0
##$FCOR= 1
##$FTSIZE= 65536
##$FT_mod= 6
##$GAMMA= 0
##$GB= 0
##$INTBC= 1
##$INTSCL= 9.790993e-09
##$ISEN= 30
##$LB= 1.5
##$LEV0= 0
##$LPBIN= 0
##$MAXI= 10000
##$MC2= 0
##$MEAN= 0
##$ME_mod= 0
##$MI= 50
##$NCOEF= 0
##$NC_proc= -7
##$NLEV= 6
##$NOISF1= 182.463
##$NOISF2= 159.3651
##$NSP= 0
##$NTH_PI= 0
##$NZP= 0
##$OFFSET= 198.0616
##$PC= 4
##$PHC0= 2682.768
##$PHC1= 60.48804
##$PH_mod= 1
##$PKNL= yes
##$PPARMOD= 0
##$PSCAL= 0
##$PSIGN= 0
##$REVERSE= no
##$SF= 81.0140089999434
##$SI= 65536
##$SIGF1= 159.3651
##$SIGF2= -187.1042
##$SINO= 113.3802
##$SIOLD= 16384
##$SREGLST= <1H.CDCl3>
##$SSB= 0
##$STSI= 65536
##$STSR= 0
##$SW_p= 32467.5324675325
##$SYMM= 0
##$S_DEV= 0
##$TDeff= 32768
##$TDoff= 0
##$TI= <>
##$TILT= no
##$TM1= 0
##$TM2= 0
##$TOPLEV= 0
##$USERP1= <user>
##$USERP2= <user>
##$USERP3= <user>
##$USERP4= <user>
##$USERP5= <user>
##$WDW= 1
##$XDIM= 65536
##$YMAX_p= 606608692
##$YMIN_p= -23533058
$$ End of Bruker specific parameters
$$ ---------------------------------
##NTUPLES= NMR SPECTRUM
##VAR_NAME=  FREQUENCY,     SPECTRUM/REAL,   SPECTRUM/IMAG
##SYMBOL=    X,             R,               I
##VAR_TYPE=  INDEPENDENT,   DEPENDENT,       DEPENDENT
##VAR_FORM=  AFFN,          ASDF,            ASDF
##VAR_DIM=   65536,         65536,           65536
##UNITS=     HZ,            ARBITRARY UNITS, ARBITRARY UNITS
##FACTOR=    0.49542278885378, 1,            1
##FIRST=     16045.7642231865, 0,            0
##LAST=      -16421.768244346, 0,            0
##MIN=       -16421.768244346, -23533058,    0
##MAX=       16045.7642231865, 606608692,    0
$$ Real data points
##PAGE= N=1
##DATA TABLE= (X++(R..R)), XYDATA
$$ [...]
42582 -192915 -584823 -991750 -64253 2209595 3920792 3781691 2964432 3211967 4175008
42573 4175008 4145569 2828750 1706915 1681495 1901571 1385853 560394 377701 716380
42564 716380 601714 -347357 -1556656 -2471270 -3067639 -3252575 -2558147 -968554 479099
42555 479099 692748 4954 -73408 1273824 3154575 4120840 3790137 2843411 1806147
42546 1806147 502154 -1278218 -3049725 -3806562 -2899817 -807524 1003408 1319814 433364
42537 433364 -197917 307481 1347121 1937733 2029551 2062800 1796065 579177 -1365483
42528 -1365483 -2871184 -3125278 -2338996 -1130753 -23131 392405 -315374 -1687060 -2540049
42519 -2540049 -2186119 -947770 661383 2503214 4296736 5405868 5675991 5737278 5864351
42510 5864351 5278527 3400600 1153912 -33438 -146733 -360524 -1041047 -1249978 -519257
42501 -519257 92076 -540220 -1923954 -2674639 -2467301 -2272493 -2737768 -3248143 -2811636
42492 -2811636 -1205472 1003668 2942566 3623076 2407858 -10916 -1606947 -924049
42484 -924049 1117032 2119880 935277 -1288829 -2839465 -3290390 -3243139 -3075767 -2677916
42475 -2677916 -1998500 -1206138 -457727 160695 683119 1374651 2341623 2969168 2521979
42466 2521979 1533080 1564727 3023790 4310673 4017979 2866627 2222065 1742019 226730
42457 226730 -1876663 -2858520 -2481256 -2290306 -2935585 -3155249 -2075468 -720834 -265078
42448 -265078 -315461 -109202 -128482 -1151533 -2612887 -3326888 -3312490 -3596309 -4426915 -4803131
42438 -4803131 -3864146 -2054355 -757871 -975413 -2238648 -2937397 -2263366 -1593907 -2815991
42429 -2815991 -5278502 -6079630 -4038124 -1616842 -1571733 -3180408 -3601793 -1925185 199935
42420 199935 1372944 1668738 1110405 -886881 -3893608 -5956081 -5673100 -3816478 -2202071
42411 -2202071 -1726812 -2055527 -2510645 -2640968 -2317202 -1723035 -1134235 -691253 -557301
42402 -557301 -935937 -1486186 -1274192 -98780 700239 -134094 -1815523 -2561543 -2254331
42393 -2254331 -2301720 -2841074 -2192645 151113 1975439 1245896 -814176 -1294636 476741
42384 476741 2298520 2229370 874647 226512 1244510 3125779 4477601 4695662 4181478
42375 4181478 3463924 2527250 1311745 445417 619865 1284803 1005141 -539696 -1896741
42366 -1896741 -1755492 -625935 166966 376095 729817 1460871 2008374 2013472 1724781 1428998
42356 1428998 1143015 878014 766257 1033476 2094461 4192397 6477699 7085623 4977877
42347 4977877 1344091 -1617687 -2945007 -3133708 -2674696 -1625099 -434332 196466 487766
42338 487766 1367642 2684856 2818890 779845 -2186013 -3878602 -3443242 -1742317 -40692
42329 -40692 877847 695370 -411273 -1671772 -2212813 -1790039 -853477 -10599 409048
42320 409048 516609 814942 1683442 2691051 2849879 1894307 822937 653811 1101326
42311 1101326 1184474 765401 553948 715027 539425 -242750 -784641 -319835 679131 1231126
42301 1231126 1203261 1098457 787902 -509008 -2757544 -4478322 -4247890 -2491383 -1109318
42292 -1109318 -1285353 -2221278 -2359484 -1445485 -729764 -1135530 -1993903 -2087458 -1349307 -643529
42282 -643529 -157305 758831 1909226 1760657 -399254 -2761581 -2850025 -731290 1011261
42273 1011261 560587 -1164069 -2148545 -1736301 -872856 -825105 -2267588 -4845476 -7030143
42264 -7030143 -7166309 -5303737 -3259697 -2295858 -1720572 -601899 355038 68415 -732910
42255 -732910 -444355 723745 962404 -220098 -1257177 -1082550 -538730 -493996 -326187
42246 -326187 609780 1512092 1484959 1181534 1673664 2653294 3241135 3705863 4651788 5133844
42236 5133844 3625084 826830 -457209 1214360 4095917 5533747 4807692 3020780
42228 3020780 1350506 355250 164097 352340 111031 -703719 -1165017 -598168 245454
42219 245454 172382 -748425 -1428056 -1424502 -1293304 -1280507 -775212 535786 1804368 1891772
42209 1891772 624649 -1234151 -2773712 -3238159 -2105212 355244 2814512 3932210
42201 3932210 3684388 3065523 2562044 1747740 543852 -98460 568250 1830519 2325582
42192 2325582 1773423 1096052 1006025 1317959 1633847 1841667 1742604 968758 -382391 -1664665
42182 -1664665 -2575559 -3510728 -4632369 -5248166 -4719861 -3453078 -2253033 -1077931 712765
42173 712765 2977579 4506989 4369630 3056059 2017999 2262886 3437929 4122205 3125336
42164 3125336 756286 -1313426 -1715758 -728741 368153 965438 1510063 2308714 2744969
42155 2744969 2068744 494400 -970567 -1641890 -1740450 -1864800 -2183808 -2380544 -2345321
42146 -2345321 -2576183 -3537358 -4751815 -5087417 -4128792 -2766543 -2107696 -2280747 -2728244
42137 -2728244 -3111938 -3223366 -2464950 -450285 1931925 3045468 2347724 947666 102659
42128 102659 -28290 236418 1067756 2649693 4221708 4518153 3170307 1105044 -467917
42119 -467917 -1037913 -829768 -408959 -398117 -1121655 -2185998 -2634487 -1891847 -548313
42110 -548313 107137 -506443 -1533231 -1663092 -796069 -309812 -1419106 -3578833 -4986514
42101 -4986514 -4622843 -3304800 -2533351 -2713974 -2935813 -2330234 -1098153 5721 785827
42092 785827 1690952 2866230 3727848 3805699 3576031 3921825 4968669 5997825 6358648
42083 6358648 5831290 4237442 1639184 -903290 -1827965 -910280 255956 343728 35358
42074 35358 703331 2064511 2487721 1360138 -232383 -1266646 -1923427 -2591643 -2893208
42065 -2893208 -2414151 -1658501 -1538028 -2278675 -3285132 -3748935 -3105359 -1356049 697482
42056 697482 1949402 2061478 1673636 1306656 603723 -897021 -2750540 -4024887 -4479196
42047 -4479196 -4672449 -4966023 -5050226 -4636500 -4121246 -4150514 -4715262 -5141128 -5071165 -5018861
42037 -5018861 -5559676 -6310989 -6413335 -5944811 -5929870 -6637811 -6855796 -5576112 -3595801
42028 -3595801 -2477488 -2547325 -3015333 -3536040 -4306891 -4921479 -4627196 -3751638 -3421433
42019 -3421433 -3669554 -3305121 -2075082 -1447561 -2485744 -4218468 -5044893 -4736142 -4104689
42010 -4104689 -3540176 -2836672 -1871935 -681727 630216 1563736 1527279 911396 903436 1687107
42000 1687107 1967407 1051072 147090 500326 1400705 1424134 671555 183962 -163907 -1465688
41990 -1465688 -3764100 -5718428 -6168043 -4868086 -2079933 1187504 2891280 1561507
41982 1561507 -1686952 -4032743 -3897538 -1936213 617765 3079268 4792941 5084881
41974 5084881 4149747 2879782 1689783 602637 253783 1178588 2107501 928702 -2159584
41965 -2159584 -4347536 -3857341 -2087255 -1073760 -628886 417927 1581695 1333505 -365053
41956 -365053 -2005764 -2765588 -3189676 -3634307 -3452182 -2076202 69318 2082973 3327538
41947 3327538 3468170 2453221 808402 -444371 -492607 677168 2348169 3613669 4004339
41938 4004339 3773508 3479792 3289430 2981893 2603191 2510196 2539207 1797150 -166154 -2385211
41928 -2385211 -3261624 -2163648 88094 2050733 2626633 1555156 -518853 -2505987
41920 -2505987 -3665708 -3892676 -3290911 -2000389 -645333 -273387 -1232344 -2462709 -2522851
41911 -2522851 -1178556 481514 1360154 1315571 867704 384855 -254462 -1292939 -2505476
41902 -2505476 -3172412 -2849910 -2016072 -1598449 -1941132 -2591414 -2938880 -2623055 -1607694
41893 -1607694 -529237 -635817 -2382020 -4266830 -4279007 -2493542 -865373 -339571 110082
41884 110082 1055075 1201742 -366505 -2248385 -2723479 -2384872 -2841378 -3769424 -3478836
41875 -3478836 -1983763 -1236269 -2109701 -3088068 -2483197 -458350 1668212 2856429 2615462
41866 2615462 1044652 -838908 -1754415 -1534911 -1016126 -480373 578441 1911041 2181274
41857 2181274 831441 -964190 -1973486 -2375771 -2701558 -2516573 -1431365 -558579 -1479703
41848 -1479703 -4052798 -6442266 -7194597 -6314222 -4505186 -2480869 -1046664 -694352 -686213
41839 -686213 550826 3432221 6120129 6169595 3226814 -421839 -2130206 -1401461 92788
41830 92788 710156 507626 596622 1424171 2314597 2515958 1995063 1096526 51842 -882065
41820 -882065 -1321692 -1235475 -1212681 -1822745 -2847030 -3486172 -3283285 -2613838 -2251849 -2533237
41810 -2533237 -2950632 -2654643 -1438716 -1991 1010537 1877866 3160016 4486427 4893637
41801 4893637 4382368 4059439 4323695 4014072 2270796 419490 666003 3077166 5104306
41792 5104306 4455562 1581047 -1168644 -2188646 -1760295 -933446 -161424 662085 1319967
41783 1319967 1055408 -622933 -3209333 -5487291 -6425107 -5687963 -3584816 -927625 1195896
41774 1195896 2071781 1961372 1711526 1650108 1261905 152401 -1097737 -1447539 -569713
41765 -569713 852636 1938533 2434760 2704662 3082501 3383701 3137380 2280588 1378522
41756 1378522 963861 906941 797115 725780 1144437 2001551 2608463 2444928 1576458 230822
41746 230822 -1393202 -2746370 -3096086 -2454816 -1742420 -1604473 -1621751 -1151532 -396938
41737 -396938 -38531 -207870 -446459 -440384 -293560 -272854 -628132 -1336049 -1711215 -807317
41727 -807317 1285358 3085545 3345746 2594671 2316239 2971949 3668139 3504156 2369028
41718 2369028 585998 -1297808 -2399509 -2087831 -824668 258603 636758 588102 292107
41709 292107 -348318 -1014179 -1114803 -762021 -639224 -781136 -578880 -189064 -592704 -1711293
41699 -1711293 -1860282 -50198 2352668 3483599 3508369 3826315 4482217 4157361 2560049
41690 2560049 1049948 532820 226453 -837405 -2288051 -3220622 -3625095 -4071887 -4513611
41681 -4513611 -4295233 -3143247 -1501755 -35357 736888 551667 -333377 -1115054 -1114259
41672 -1114259 -376029 657616 1741303 2653702 2810213 1786414 148234 -968605 -1245194
41663 -1245194 -1540522 -2637993 -4144600 -4958258 -4469687 -3012584 -1427586 -463035 -342968
41654 -342968 -630563 -692611 -491516 -665810 -1614568 -2844216 -3593715 -3807811 -3943351 -3923313
41644 -3923313 -2948954 -637165 2046209 3413921 2599321 266523 -2194575 -3913531
41636 -3913531 -4799415 -4807415 -3572652 -1149226 1306726 2334037 1709708 631996 271143
41627 271143 737992 1590764 2492972 2916988 2113599 274796 -921472 -61984 1993725
41618 1993725 2981112 2019941 388444 -595625 -1234231 -2476362 -4292887 -5802091 -6431193
41609 -6431193 -6268318 -5646985 -4969291 -4693827 -5023322 -5705070 -6336582 -6654838 -6462152
41600 -6462152 -5648904 -4367421 -2785460 -770299 1515193 2854855 1957693 -529813
41592 -529813 -2191603 -1628889 50124 1282489 2296969 4016025 5790381 6049644 4823851
41583 4823851 3831512 3930325 3988619 2684233 249157 -1985936 -2822288 -1694386 1000731
41574 1000731 3647380 4470026 3427125 2289041 2354979 2897402 2446563 840511 -752130
41565 -752130 -1286978 -583866 934238 2465344 3060972 2390945 1245712 734813 988443
41556 988443 1089557 322372 -873381 -1316009 -287903 1749541 3613510 4521442 4622391
41547 4622391 4388665 3875415 2976028 2069983 1738184 1924934 2061748 2004923 2127929 2465957
41537 2465957 2612814 2619505 3106432 4215311 5347454 6232069 7183808 7829773 6837344
41528 6837344 3817698 414472 -1624795 -2502318 -3226686 -3434953 -2174167 -267494 264522
41519 264522 -748643 -1211116 35851 1484297 1430029 508744 311621 688771 217888
41510 217888 -1198697 -1976174 -1145274 402062 1300355 1242897 651353 -303922 -1667513
41501 -1667513 -3127437 -4064391 -4065259 -3184612 -1929121 -1099508 -1244864 -1982937 -2184406 -1191201
41491 -1191201 358632 1263934 1154980 791873 1061050 2058363 3183039 3765515 3464443
41482 3464443 2370208 1023724 215004 415685 1232084 1517475 260715 -2435708 -5222144
41473 -5222144 -6472696 -5543885 -3154615 -631106 1081549 1756690 1659716 1266552 982486
41464 982486 801575 334245 -575341 -1440030 -1692674 -1468159 -1328865 -1358615 -1206828 -1031446
41454 -1031446 -1537281 -2750773 -3587808 -3268200 -2522671 -2612417 -3585825 -4357974 -4257305
41445 -4257305 -3603403 -2835110 -1967157 -1058016 -456583 -319861 -433060 -666869 -1072941
41436 -1072941 -1422110 -1272277 -668183 -149618 113100 474410 848193 455612 -896983
41427 -896983 -2080262 -2034256 -1351584 -1461813 -2507294 -3154251 -2634328 -1885927 -2098630
41418 -2098630 -2920833 -3003701 -1982921 -919662 -630228 -512861 330712 1452028 1533792
41409 1533792 330569 -968639 -1526732 -1870334 -2510067 -2655946 -1406415 574161 1924904
41400 1924904 2645068 3750395 5093530 5294460 4110853 3110245 3245071 3331526 2014357
41391 2014357 -63022 -1340666 -1579508 -1643515 -1842958 -1960365 -2349998 -3433994 -4368183
41382 -4368183 -3794660 -2010264 -971873 -1826058 -3608850 -4782213 -5014757 -4959545 -5163669
41373 -5163669 -5770880 -6635540 -7189477 -6680885 -4979285 -2781417 -804428 715406 1505528
41364 1505528 953636 -1073303 -3496291 -4775078 -4394959 -3251550 -2539214 -2501109 -2374442
41355 -2374442 -1475136 -160725 456529 -291510 -1997488 -3766131 -4996978 -5406995 -4851787
41346 -4851787 -3659266 -2809915 -3207018 -4827845 -6815306 -8092395 -7758708 -5636857 -2921348
41337 -2921348 -1445193 -1510673 -1297338 522199 2511677 2402136 637900 -63210 1344663
41328 1344663 2880159 2687891 1551051 1166501 1534996 1517078 914507 511708 611851
41319 611851 759557 590018 43554 -887652 -1844979 -2009488 -1134571 -205751 -236772 -859967
41309 -859967 -993261 -488241 -141907 -345656 -685394 -740095 -408754 427205 1713159 2792737
41299 2792737 3029874 2811226 3055657 3717332 3729564 2638899 1356206 822746 694476
41290 694476 23611 -1210500 -2016961 -1796695 -1221508 -1429449 -2634955 -3941883 -4512299
41281 -4512299 -4424367 -4075996 -3278214 -1724404 -125460 192845 -950339 -2245421 -2735531
41272 -2735531 -2924410 -3307391 -2949586 -867666 1891174 3177971 2599833 1909561 2331989
41263 2331989 2958501 2419808 966777 -43089 -69 559822 1041044 1434701 1944240
41254 1944240 2559720 3093098 3365021 3382051 3455995 3921849 4532926 4471841 3384295 2150925
41244 2150925 2000497 2832419 3112985 1812735 -123583 -917035 -238979 545926 418472
41235 418472 -79388 -95921 153111 189017 569955 2029788 3771848 4117985 2771526
41226 2771526 994039 -439663 -1775944 -2575395 -1520235 1174433 3018149 2273424
41218 2273424 251840 -819884 -756573 -550763 5243 1588282 3153693 2904826 1102101
41209 1102101 -310506 -680493 -1058795 -1759645 -1876918 -1417920 -1480823 -1795086 -573535
41200 -573535 2220368 3798577 2135719 -1283368 -3738043 -4539340 -4495486 -3838970 -2607488
41191 -2607488 -1791564 -2083560 -2350035 -1183055 767356 1758523 1522436 1031215 361866
41182 361866 -1102165 -2622142 -2431184 -356301 1682437 2144508 1303143 -15185 -1422911
41173 -1422911 -2210971 -1305490 1039776 2733380 2062785 -363467 -2651115 -3837430 -4331681
41164 -4331681 -4808595 -5433612 -5778766 -5007326 -2636165 467697 2491989 2628557 2021400
41155 2021400 2177985 3050120 3437051 2754586 1464161 40821 -1455935 -2738351 -3152775
41146 -3152775 -2566029 -1806403 -1809150 -2655343 -3756054 -4663211 -5320361 -5736675 -5889909 -5950751
41136 -5950751 -6192575 -6566026 -6710681 -6526316 -6313335 -6088329 -5297949 -3780099 -2502222
41127 -2502222 -2389158 -2669294 -1645916 720909 2395282 2062880 993930 1013142 1794563
41118 1794563 1742062 740488 101018 39312 -736767 -2579289 -3886892 -3284699 -1315774
41109 -1315774 848467 2899250 4520747 4482654 2216295 -592678 -1673320 -990244 -378188
41100 -378188 -711562 -1117003 -986740 -1000244 -1625069 -2135370 -2009443 -2126278 -3466744 -5379857
41090 -5379857 -6260856 -5562987 -4188096 -3163241 -2841657 -3216559 -4025334 -4489003 -3905369
41081 -3905369 -2788022 -2581411 -3781297 -5038859 -4770829 -3162984 -1816010 -1647528 -1961361
41072 -1961361 -1685490 -842832 -411601 -1064047 -2444727 -3686197 -4415188 -5032221 -5860769
41063 -5860769 -6247925 -5119253 -2623351 -477274 12211 -327265 156902 1264958 1021280
41054 1021280 -1381035 -4227415 -5612251 -5769508 -5896792 -5763954 -4185448 -1428330 589067
41045 589067 663686 -502172 -1742001 -2724877 -3293143 -2755927 -815559 1509595 2812517
41036 2812517 2817944 2336609 2028978 1829216 1387174 545972 -524117 -1327259 -1370104 -808799
41026 -808799 -514208 -1085743 -1961986 -1921849 -469735 1494575 2377135 1264051 -1145854
41017 -1145854 -2923078 -2591355 -604919 1171498 1539523 1037635 785824 964233 975285
41008 975285 605580 312555 523507 1167515 1798547 1877574 1233029 583911 1134881 3085279
40998 3085279 4989562 5365042 4597177 4299842 4913330 5048004 3509714 1021589 -696015
40989 -696015 -990087 -756932 -1098925 -2050912 -2690919 -2257457 -1026331 -8110 232237
40980 232237 172058 505275 1096522 1324901 1202489 1321904 1697301 1587895 735590 -161290
40970 -161290 -721912 -1714525 -3758597 -5860538 -6304789 -4708179 -2226166 47314 1801176
40961 1801176 2716038 2273947 813011 -297992 -240490 264455 207070 -265795 -537755
40952 -537755 -943406 -2273031 -4159197 -5230643 -4927220 -4029140 -3225248 -2328911 -1258111
40943 -1258111 -556092 -280916 475159 2059591 3287239 3095950 2230802 1945520 1930497
40934 1930497 1301181 971975 2692755 5659385 6614150 4243110 1238084 504130 1241791
40925 1241791 822382 -912154 -1778696 -1029212 -333936 -786619 -1282141 -678556 293324
40916 293324 364310 -434485 -1392968 -2430918 -3550966 -3885607 -2707797 -953157 -392453
40907 -392453 -1321799 -2128796 -1270020 1136409 3802627 5587325 6066863 5417097 4167656
40898 4167656 2866571 1785665 1042947 908551 1622201 2845133 3641920 3237441 1719406
40889 1719406 -43105 -1087533 -1025966 -228545 595999 1032360 1099201 786973 -179275
40880 -179275 -1811814 -3368382 -3906209 -3339364 -2517198 -2166238 -2188058 -2220633 -2439069 -3247919
40870 -3247919 -4291851 -4425755 -3055529 -1189090 -578862 -1744215 -3331879 -3721701 -2850001
40861 -2850001 -1953457 -1811076 -1966381 -1679709 -866197 196352 1382245 2401573 2475972
40852 2475972 1028755 -1436620 -3615050 -4473600 -3840905 -2329565 -1070158 -1035082 -1985092
40843 -1985092 -2472461 -1606831 -375242 -217031 -678074 57933 2204447 3593252 2652982
40834 2652982 796113 571371 2317490 4075754 4381396 3703491 3159863 3118485 3365507
40825 3365507 3648291 3672311 3297677 2963546 3178083 3469825 2791359 1216819 139128
40816 139128 260090 534879 -23140 -576975 214174 1881363 2706388 2265818 1798516
40807 1798516 1979634 1963316 1148514 419273 708841 1442869 1500188 932785 580978 508255
40797 508255 16505 -1005653 -1845734 -2040644 -1742976 -1045732 65754 993496 815183
40788 815183 -343545 -1150814 -796853 -81922 -153606 -862555 -1166747 -660281 188976 1019978
40778 1019978 1842602 2378787 2107308 1244274 884093 1621417 2508363 2020518 -32401
40769 -32401 -2037400 -2165086 -262473 1939402 2514568 1260230 -113886 192942 2135893
40760 2135893 3914921 3950101 2407382 635533 -466585 -1043823 -1452509 -1521111 -952274
40751 -952274 -76349 295564 -210035 -1055500 -1336238 -640582 676720 1887155 2451614
40742 2451614 2376149 2190985 2467693 3158749 3475596 2626775 674245 -1475957 -2830037
40733 -2830037 -2840443 -1409097 1051684 3441645 4508339 4073087 3323307 3287924 3369877
40724 3369877 2266060 240227 -688539 690114 3058373 4337047 4373353 4508718 4859034
40715 4859034 3858826 1066044 -1222263 -530279 2497819 4858078 4862350 3536098 2380764
40706 2380764 1418753 111496 -1156946 -1653224 -1576793 -1644744 -1814379 -1443842 -496479
40697 -496479 393916 1011318 1802690 2914213 3754379 3741524 2901178 1575127 129019
40688 129019 -891282 -940107 -102696 932377 1744516 2502768 3189783 3162749 2036188
40679 2036188 608607 282715 1581181 3560920 4717793 4401755 3463223 3480218 5089462
40670 5089462 7146528 7937729 7145875 6023458 5619512 5643905 5339500 4612984 3785672
40661 3785672 3023283 2721139 3713314 6108786 8388933 8771332 7344635 5879590 5571660
40652 5571660 5985724 6365814 6877300 7927112 8996532 9041994 7960015 7047360 7762217
40643 7762217 10182159 12893606 14474471 14875780 15026916 15305232 15187297 14593422 14560647
40634 14560647 15795533 17344256 17824169 17482770 17701253 18642752 18918299 17893317 16891984
40625 16891984 17365765 18960744 20312306 20929298 21260202 21443739 21143425 20517756 20343836
40616 20343836 20866064 21125216 19926040 17404458 15299950 15329903 17242729 18972970 19139696
40607 19139696 18825883 19992880 22556025 24440791 24640292 24627732 26055542 28549937 30968383
40598 30968383 33594204 37402177 41783139 44773099 45551396 45338961 45688624 47052751
40590 47052751 49194510 51875778 54792311 57705606 60885021 64600626 68054475 69808360
40582 69808360 69573112 68634857 68150366 67962812 67530514 67000817 66673179 66275019 65589460
40573 65589460 65081898 65026894 64636802 63053600 60755255 58896890 57498138 55442733 52378063
40564 52378063 49576293 48500934 49221066 50668617 51937804 52879062 53791329 55075135
40556 55075135 57134504 60205408 64050199 67861199 70686348 72278431 73642686 76401453
40548 76401453 81210431 86894519 91499599 94145641 95496919 96485489 97096610 96605014
40540 96605014 94615041 91561646 88392884 86007125 84810399 84462575 84004578 82479748
40532 82479748 79667401 76296415 73485833 71811321 70789727 69317026 66681920 63076055
40524 63076055 59093496 55033027 50998836 47451033 45085143 44056475 43774707 43667006
40516 43667006 43743176 44163739 44724098 45229333 45980259 47215020 48304463 48371142 47746162
40507 47746162 47797817 48855630 49303362 47720599 45255636 44473017 45907342 47204259 46158852
40498 46158852 43294192 40479218 38088662 35062800 31357960 28624607 28032677 28649663
40490 28649663 28681595 27553685 26103346 25292928 25383783 25959242 26149610 25146035 23020164
40481 23020164 20734444 18905561 17065565 14813012 13128253 13417750 15378744 17003405
40473 17003405 16971031 15985221 15280859 14885005 14252140 13767929 14255941 15223609 15054070
40464 15054070 13365597 11951222 12417432 13704640 13332713 10945729 9091657 9866016
40456 9866016 12050024 12815481 11501370 10063862 9930292 10269687 10023948 9907703 10945838
40447 10945838 12209509 11922344 10367680 9699286 10681164 11502582 10547208 8696744 7736272
40438 7736272 7759757 7616731 7075875 6912570 7216820 7194135 6635502 6131025 5641187 4341952
40428 4341952 2423545 1618670 2941337 4963911 5576635 4741589 4093144 4167551 3659006
40419 3659006 1722881 -437886 -1150992 -491432 127638 42507 -120626 141439 391283
40410 391283 163407 -197803 -188678 -18969 -130719 -227172 384881 1516240 1947165 879558
40400 879558 -944444 -1964821 -1409498 124529 1535431 2338818 2879788 3575971 4122000
40391 4122000 3691039 2083350 384541 -36799 806352 1412817 586691 -1141346 -2277862
40382 -2277862 -2194157 -1666015 -1697351 -2286691 -2510364 -1637608 -16511 1233184 1460326
40373 1460326 1167787 1100623 951641 -168970 -1932459 -2637932 -1528872 -212734 -610285
40364 -610285 -2199580 -2756890 -1537995 -104632 178406 -167372 -233207 -490886 -1860009
40355 -1860009 -3815776 -4695353 -3695668 -1724678 -382757 -663589 -2387466 -4282319 -4812077
40346 -4812077 -3525830 -1527968 -267847 -136289 -597087 -1158700 -1525938 -1241700 -142306
40337 -142306 934154 800841 -587926 -1995142 -2352939 -1698633 -588888 600677 1418580
40328 1418580 1095579 -706501 -3054328 -4197120 -3082014 -355639 2243144 3575278
40320 3575278 4094562 4889012 5887534 5768663 3910391 1485026 -184994 -1510597 -3553171
40311 -3553171 -5525731 -5103903 -1562670 2824538 5209680 4968251 3448641 1974177
40303 1974177 1017953 612212 508401 196889 -508390 -1138286 -1305677 -1338685 -1603072 -1658683
40293 -1658683 -827561 659232 1757522 1764911 979353 390574 912029 2434527 3413897
40284 3413897 2196256 -737446 -2740432 -1988855 377751 2057683 2509391 2632036 2398316
40275 2398316 846988 -1707145 -3466760 -3541563 -2875136 -2356303 -1722310 -1021615 -1394675
40266 -1394675 -3205137 -4798303 -4517838 -2933503 -1718553 -1258146 -886466 -719794 -1440825
40257 -1440825 -2519884 -2411897 -756790 982572 1391014 488277 -989037 -2526580 -3631605
40248 -3631605 -3747569 -2988550 -2238525 -2056257 -2157811 -2335721 -3027195 -4373595 -5495372
40239 -5495372 -5519003 -4832649 -4524529 -4880701 -5188883 -4893147 -4290028 -4048948 -4438725 -5010068
40229 -5010068 -4848912 -3390738 -1213490 354395 695378 443519 169844 -688850 -2693019
40220 -2693019 -4795602 -5155705 -3451009 -1184132 377950 1321912 1899003 1643200 465715
40211 465715 -528480 -428580 24260 -505895 -1934884 -2919870 -2726616 -1845830 -915132 -120678
40201 -120678 312934 65250 -658532 -1248537 -1513707 -1618090 -1304740 -257721 717629
40192 717629 187700 -1786428 -3206602 -2483511 -238196 1863790 2986052 3010960 1713382
40183 1713382 -684057 -2866375 -3622337 -3261073 -2817369 -2435442 -1693714 -919705 -791242
40174 -791242 -1059493 -1101238 -1332734 -2435418 -3463061 -2644421 -144519 1949972 2710015
40165 2710015 3319654 4340941 4389388 2886761 1947676 3418292 5555473 5101153 1908837
40156 1908837 -881733 -1095203 247058 1177503 1283682 1263079 1490167 1941049 2605894
40147 2605894 3234515 3320457 2844278 2441601 2449173 2400645 1884257 1344897 1536480 2480128
40137 2480128 3315434 3060345 1497727 -447474 -1368760 -858707 -138939 -600617 -1923262
40128 -1923262 -2527330 -1880645 -1267134 -1852017 -2920011 -2760126 -767482 1992809 3987152
40119 3987152 4418776 3448054 1748508 -65101 -1710439 -2982623 -3458085 -2856781 -1623395
40110 -1623395 -618119 -156236 154270 579592 877388 897691 918896 1089267 1100402 751623
40100 751623 315734 -23442 -591545 -1621993 -2615614 -2792957 -2022518 -997913 -605514
40091 -605514 -1185704 -2163119 -2419950 -1434853 -28785 517412 23533 -559090 -591420 -315822
40081 -315822 84510 869212 1786400 1852644 775570 -335268 -441955 77273 353293
40072 353293 439049 818791 1213830 935254 -79633 -1495473 -3249693 -5050705 -5906688
40063 -5906688 -5309297 -4268787 -3929062 -3789600 -2746479 -1266885 -693793 -712708 395442
40054 395442 2821605 4637973 4702649 4184045 4274316 4196286 2785558 607410 -990218
40045 -990218 -1876725 -2708312 -3289346 -2851579 -1496101 -57494 1081018 1840008 1561673
40036 1561673 -311226 -2804283 -4013340 -3290790 -1750105 -489532 555150 1705808
40028 1705808 2581350 2623607 1876152 742115 -485971 -1451926 -1626972 -860095 281874
40019 281874 1068526 1240819 916346 275992 -379984 -683988 -703965 -1076196 -2193749 -3486204
40009 -3486204 -4011157 -3677258 -3300965 -3269891 -2718036 -649845 2284622 3983308 3327594
40000 3327594 1823011 1920215 3881671 5409334 4678629 2623422 1380642 1318994 848600
39991 848600 -1117026 -3702099 -5144344 -4445695 -1959119 742154 1595284 -193322 -2819084
39982 -2819084 -3410210 -1362672 903515 1095133 -212026 -910926 -344320 451643 811756
39973 811756 1115482 1480208 1279376 347370 -428918 -236994 641119 1281133 1025349 -212036
39963 -212036 -1883816 -2876575 -2316337 -544490 1246766 2356829 2839339 2565429 1234524
39954 1234524 -407647 -664082 1094975 3524871 5078603 5578552 5261749 3674052 929563
39945 929563 -1071390 -565364 1480919 2530922 1926550 1266237 1386667 1088758 -543885
39936 -543885 -2420343 -3045057 -2486115 -1724999 -1091250 -289369 838710 2328222 4084013
39927 4084013 5330781 5084104 3751566 3084646 3800331 4533308 4073774 3250275 3336310
39918 3336310 3916938 3873895 3314534 2818897 1885884 94580 -1208833 -740167 -88666
39909 -88666 -2012904 -6077299 -8705496 -7910377 -5386798 -3306406 -1658506 161566 1588813
39900 1588813 2235946 2979209 4084289 4017276 1812284 -964917 -2368018 -2686020 -3040634
39891 -3040634 -2891100 -1302555 364884 -307271 -3162300 -5363510 -4942853 -2583225 16243
39882 16243 1599631 1178296 -1530092 -5014330 -6961830 -6765415 -5667400 -4376617 -2396766
39873 -2396766 -87168 686647 -947101 -3203139 -3630654 -1763357 1029973 3270455
39865 3270455 4133165 3554682 2502546 2322991 3143344 3824070 3976848 4668475 6278585
39856 6278585 7182556 5954867 3628983 2108701 1355307 104253 -1301098 -1053958 1128576
39847 1128576 3243566 3712694 3115877 2553388 1892532 672668 -529399 -934101 -963476
39838 -963476 -1537631 -2429420 -2559049 -1765306 -1089274 -1128611 -1171918 -457966 507572 587156
39828 587156 -531445 -2246158 -4059282 -5755679 -6627886 -5682801 -3182033 -1053919 -809294
39819 -809294 -1595728 -1437591 -83493 781966 284260 -251527 531382 1741641 1466043
39810 1466043 -391122 -1918885 -1701654 -252848 1186723 2137367 2709990 2840027 2421482
39801 2421482 1804859 1531599 1638348 1600436 1023664 226256 -7267 644042 1463236 1465854
39791 1465854 862904 1104136 2893691 4756365 4604949 2514870 709752 569331 922016
39782 922016 48009 -1669888 -2316921 -1212572 180279 247691 -863047 -1752318 -1524152
39773 -1524152 -459600 728875 1681159 2333835 2498993 1918175 831560 195827 858541
39764 858541 2361419 2975345 1396185 -1690644 -4170106 -4652602 -3683643 -2742957 -2549422
39755 -2549422 -2714113 -2699704 -2515707 -2428352 -2454982 -2408961 -2238575 -2077716 -2011162 -1939419
39745 -1939419 -1666631 -1038876 -26104 1218913 2338867 2899632 2719032 2191599 2166110
39736 2166110 3184155 4722847 5497513 4819668 3462622 2806617 3257369 3965949 4035371
39727 4035371 3414905 2541725 1794455 1563830 2116379 2861652 2444669 373744 -1887864
39718 -1887864 -2338297 -702056 1534873 3045758 3580629 3181225 1899958 634876 877223
39709 877223 2806044 4638273 4826508 4096750 4190890 5197540 5515877 4349919 2871106
39700 2871106 2512519 3147949 3615370 3372119 2872468 2614892 2555234 2499908 2494397 2523917
39690 2523917 2177631 1072994 -426568 -1363317 -1225575 -462249 310183 1187802 2548872
39681 2548872 4073492 4935887 4890739 4407455 3704637 2517977 1049868 254580 694756
39672 694756 1808177 2773179 3413440 3766389 3562100 2863167 2544797 3269530 4435542
39663 4435542 4910412 4372692 3226475 1788436 477025 226885 1513851 3240999 3788394
39654 3788394 3108971 2681254 3351760 4308588 4401527 3536339 2435030 1712187 1468422
39645 1468422 1337626 881459 291331 403408 1501121 2643521 3007612 3272438 4470068
39636 4470068 5961260 6050990 4414913 2397466 1004798 204402 130974 1071603 2031673
39627 2031673 1382794 -466618 -1085103 453086 2103540 2065811 1425458 2038228 3631625
39618 3631625 4889043 5815730 6893855 7230528 5967336 4609924 5403039 7822687 9113719
39609 9113719 8148926 6388517 4961583 3237988 809868 -1332235 -2454804 -3102367
39601 -3102367 -3632125 -3406069 -2353116 -1737579 -2246548 -2647984 -1547012 606262 2389881
39592 2389881 3267574 3375256 2411669 233986 -1948931 -2449148 -1125637 552832 1470871
39583 1470871 1904045 2451388 2869907 2534697 1635559 1275851 2182404 3574450 3793070
39574 3793070 2240556 207209 -703995 -462673 -117061 82847 729632 1501643 1009444
39565 1009444 -986840 -2643133 -2345209 -884048 -178611 -712888 -1543222 -2160565 -2797458
39556 -2797458 -3162719 -2488687 -1074799 -402391 -1139677 -2089110 -1869384 -876064 -638761
39547 -638761 -1579466 -2374980 -1684128 242266 2147306 3462329 4579941 5448721 4952850
39538 4952850 2484530 -501810 -1707551 -733339 507423 354700 -715551 -1268951 -892053
39529 -892053 -137170 677612 1531730 2029500 1731183 1011937 747955 1204835 1874980 2272396
39519 2272396 2297044 2025046 1742157 1942705 2699183 3354661 3473724 3640752 4487633 5424034
39509 5424034 5433553 4752693 4401618 4184537 2765595 116761 -1623257 -622887 2301621
39500 2301621 4696391 5130422 4106105 2947482 2594299 3123628 3767938 3545084 2198481
39491 2198481 290676 -1595719 -3035558 -3136294 -1029675 2338908 4164185 2772967
39483 2772967 -127323 -1522944 -817847 41506 -190478 -557640 -1640 727280 244777
39474 244777 -1429900 -3051279 -3762117 -3629789 -2963727 -1951267 -854568 62722 795491
39465 795491 1424754 1849740 2019779 2153997 2328206 2185676 1609243 1330460 2036037 2962206
39455 2962206 2383277 -120592 -2688180 -3149273 -1520240 209710 583188 156289 332508
39446 332508 1458547 2644223 3123646 3081569 3026050 2931563 2449914 1667227 1035982 523044
39436 523044 -535201 -2331156 -3799232 -3603947 -1836773 -97345 262178 -547445 -1403556
39427 -1403556 -1675242 -1511689 -1142918 -599494 -148977 -462553 -2027519 -4471367 -6572501
39418 -6572501 -7065991 -5741655 -3862854 -3122327 -3882257 -4794873 -4517582 -3305708 -2247355
39409 -2247355 -1400564 192529 2667228 4722439 5276375 4729564 3948035 2919659 1380218
39400 1380218 110667 355827 2015655 3428732 3166058 1362726 -866385 -2651923
39392 -2651923 -3725189 -4096547 -3834128 -3032401 -1843381 -618301 106627 89336 -214973
39383 -214973 -106477 539982 1323658 2122707 3227049 4465053 4794347 3293549 391181
39374 391181 -2259349 -3135754 -2012091 19786 1508574 1766647 1259665 946699 1297260
39365 1297260 2023455 2580702 2617103 2026193 995993 90195 -113364 367566 990019
39356 990019 1510039 2349142 3845776 5458356 6154798 5525099 4157377 2896564 2073490
39347 2073490 1647538 1805406 2867520 4412528 5027477 3668246 1228992 -79330 712822
39338 712822 2110209 2046345 294737 -1839463 -3551546 -4954678 -5738611 -4982885 -2728332
39329 -2728332 -511206 325031 1880 -493330 -655189 -326978 729510 2318870 3589714
39320 3589714 4069657 4203122 4167816 3131809 754849 -1480543 -1884380 -947713 -579496
39311 -579496 -1277802 -1727425 -1218684 -715759 -1018750 -1371278 -726710 685093 1882751
39302 1882751 2421368 2475202 2367740 2610194 3610340 4670670 4096703 1204987 -2344120
39293 -2344120 -4102278 -3344854 -1334853 404494 1219483 1156781 695949 565860 1001001
39284 1001001 1212908 304674 -1369249 -2491905 -2425270 -1858643 -1747819 -2234241 -2731197
39275 -2731197 -2579627 -1589035 -403233 -221458 -1516529 -3083378 -3112001 -1304174 777799
39266 777799 1564141 910041 -432322 -1774637 -2483465 -1997142 -682515 -16310 -988147
39257 -988147 -2725202 -3615982 -3495969 -3619821 -4428719 -4528151 -2524228 854622 3334009
39248 3334009 3593322 2473603 1642997 1738747 2236123 2662640 3137385 3637963 3491695
39239 3491695 2135378 185 -1934048 -3232543 -4050020 -4298354 -3623268 -2314808 -1383432
39230 -1383432 -1319700 -1419348 -809650 361848 1211940 1136740 145384 -1284938 -2225657 -1790034
39220 -1790034 -275329 723528 115354 -1223877 -1625147 -821120 56061 354586 544081
39211 544081 950902 1066400 473984 -484555 -1374694 -2209733 -2949796 -3216662 -2956763 -2763581
39201 -2763581 -3093898 -3621802 -3648482 -2711150 -725374 1814166 3715338 4029517 3305184
39192 3305184 3009795 3509590 3706171 3001205 2314992 2474841 2889170 2838147 2952727 4145273
39182 4145273 5894447 6889849 6814411 6348755 5956622 5718824 5730468 5598115 4345236
39173 4345236 2045604 601874 1332734 2734363 2624881 1710785 2498466 4922051 5877095
39164 5877095 3655161 299896 -1455418 -1416814 -918971 -569634 -445104 -918601 -1771377
39155 -1771377 -1704728 -43413 2192773 3932779 5330806 6282772 5477333 2661959 214440
39146 214440 252677 1437943 1108292 -338080 14120 2961375 5884958 6459433 5205330
39137 5205330 3630340 2029781 263694 -991164 -1089599 -455326 223587 952024 1806386
39128 1806386 2258211 1922779 1243661 734203 222577 -524790 -1113144 -1083202 -549878 285619
39118 285619 1602103 3301400 4509256 4494154 3671633 2996486 2675887 2169814 1265686
39109 1265686 449444 149334 141056 -26384 -238158 194957 1577785 3094172 3540965
39100 3540965 2863203 2298943 2670648 3309048 3308536 3016458 3246004 3723714 3689468 3550645
39090 3550645 4267827 5208229 4452448 1652441 -1074592 -1829762 -1122251 -544937 -490493
39081 -490493 -213522 698360 1906741 2896474 3374297 3541822 4167247 5655920 7006213
39072 7006213 6750785 5004639 3265783 2129974 941562 -63811 437693 2065340
39064 2065340 2222192 -49052 -2001480 -1096216 1075215 1422511 239189 310530 2157215
39055 2157215 3539808 3428681 3195631 3557531 3376403 2216792 1344413 1207301 456388
39046 456388 -1325185 -2269522 -1086591 748028 1289508 843687 661603 485204 -608297
39037 -608297 -1997014 -2132154 -761238 1095118 2827327 4370204 5189348 4749179 3740377
39028 3740377 3402032 3786346 4005596 3985047 4521452 5608802 6196207 5935047 5848689 6692199
39018 6692199 7704214 7721057 6787803 5892463 5566076 5519191 5472281 5550783 5619869 4839028
39008 4839028 2598705 -128501 -1197966 339626 2800576 3703528 2788551 2072906 2896084
38999 2896084 4337995 5077981 5296828 5577064 5176619 3112330 348878 -894062 25059
38990 25059 1595339 2568212 3398062 4760558 6052941 6329556 5796664 5331156 5038788
38981 5038788 4278521 2942546 1906954 2107214 3572646 5374137 6281400 5658485 4061504
38972 4061504 2822286 2736042 3361777 3973544 4815975 6574304 8629160 9000710 6783757
38963 6783757 3820656 2733055 3623504 4215513 3431550 3042422 4689497 6838787 6652483
38954 6652483 4101213 1915659 1475960 1143048 -578477 -2450483 -2564651 -1332502 -573145
38945 -573145 -686405 -618469 26427 725247 1538754 3010946 4587406 4894934 3854513
38936 3854513 2939209 2957118 3105406 2793712 2908430 4290536 6041420 6445323 5019949
38927 5019949 2857221 1333540 1015404 1423722 1497754 708794 -161627 -19767 744062
38918 744062 562598 -873749 -1803768 -826772 1050570 1984051 1974895 2491410 3882283
38909 3882283 4759158 4086580 2617567 1788013 1985934 2402899 2183513 1370564 808568
38900 808568 1122520 1785636 1593785 286236 -926977 -1025555 -739721 -1500157 -3203561
38891 -3203561 -4232694 -3792984 -3077948 -3576179 -5007480 -5658144 -4434782 -1999020 89563
38882 89563 978126 1130179 1442018 2009891 2117558 1432798 629167 441554 621811 451315
38872 451315 -79192 -352372 -189579 -64423 -314328 -836610 -1481433 -1994238 -1680641 -81565
38862 -81565 1949186 2862582 2367319 1754623 1895980 2031996 1266318 249227 315767 1595656
38852 1595656 3088067 4229946 5271185 6211189 6414500 5451907 3580618 1276022 -1047975
38843 -1047975 -2767323 -3203402 -2313542 -780457 668147 1567486 1449686 86156 -1790985
38834 -1790985 -2788416 -2305887 -1122575 -190558 458496 1100144 1417859 1153956 1134060
38825 1134060 2427128 4520434 5500874 4402892 2409280 1174929 831113 506291 179771
38816 179771 784350 2473442 3903672 3745141 2233838 642425 -367160 -1203661 -2313995
38807 -2313995 -3369345 -3711943 -3221146 -2368633 -1492943 -342059 1473192 3684033 5331754
38798 5331754 5693831 5026408 4115389 3304504 2460560 1821605 2129534 3538095 4926415
38789 4926415 4850235 2927157 -46771 -2862905 -4258134 -3184118 135793 3557080
38781 3557080 4636477 3248238 1653681 1570477 2136442 1473688 -552928 -2181340 -2051368
38772 -2051368 -756053 -65669 -1132743 -3438489 -5175155 -4853466 -2844522 -1026465
38764 -1026465 -616435 -915392 -699021 -79876 25699 -265038 123256 1357234 2247025
38755 2247025 1979140 1149393 612334 344937 45684 -78678 156281 401615 558619
38746 558619 1304814 2912403 4187158 3713544 1839244 324492 96472 348918 -36914
38737 -36914 -1062078 -1858353 -1727322 -697374 487512 823757 -54741 -1376501 -2061111
38728 -2061111 -2005987 -2004345 -2410256 -2576140 -1807307 -280424 1281436 2421557 3194696
38719 3194696 3933207 4907489 5904271 6134426 4996595 2950755 1134129 76976 -656679
38710 -656679 -1549970 -2550475 -3509949 -4434745 -5049101 -4851315 -3897204 -2772830 -1527191
38701 -1527191 383462 2614098 3557987 2386596 472086 -441974 -685608 -1760527 -3484831
38692 -3484831 -3877935 -2098207 152459 856547 112581 -488333 -41845 994478 1731565
38683 1731565 1615799 587568 -804828 -1585706 -1196595 -129237 606914 539821 23639
38674 23639 -330464 -256464 -29330 -225217 -1056773 -1835280 -1481281 183745 2021493 2741067
38664 2741067 2152700 1056431 405880 935579 2920518 5531464 6945377 6179893 4688113
38655 4688113 4984806 7466157 9696937 9408486 7211884 5422713 4946121 4631783 3508804
38646 3508804 2222714 1752356 1773179 1195753 -202750 -1563105 -2126550 -1849046 -949472
38637 -949472 315668 1306656 1237395 145139 -950894 -1265176 -1145010 -1364942 -2023996
38628 -2023996 -2640899 -2872262 -2515805 -1230457 918688 2840001 3233724 2114569 803077
38619 803077 297191 349009 313071 162233 287005 834493 1600661 2132098 1709272 -144048
38609 -144048 -2702962 -4176056 -3455251 -1445239 -76790 -177720 -848162 -837965 11444
38600 11444 827863 862153 319684 -659 173020 114358 -936533 -2568158 -3561221 -3418019
38590 -3418019 -2772784 -2135813 -1177808 211151 1085328 648243 -259389 -2448 1668407
38581 1668407 3298519 3668886 3146684 2814794 2986848 3069820 2535105 1606225 1016697
38572 1016697 1175465 1586888 1338928 350746 -255341 510827 2121642 3125684 2963617
38563 2963617 2479669 2621254 3323717 3833751 3553159 2376475 693155 -760420 -1469478
38554 -1469478 -1677557 -1966398 -2318197 -2144197 -1291807 -399073 -82395 -332306 -839009
38545 -839009 -1270393 -1061158 276987 2197170 3139659 2102739 -200438 -2163862 -2848611
38536 -2848611 -2402652 -1517382 -965975 -1142962 -1486691 -853402 924342 2393702 2183739
38527 2183739 892330 308658 1032384 1962112 2136963 1940132 2123949 2596755 2754325
38518 2754325 2366026 1586897 606978 -203053 -297474 317744 822497 739709 971571 2780642
38508 2780642 5849623 8315959 8911117 8165117 7148849 6024196 4614913 3550919
38500 3550919 3575511 4052604 3549695 2030236 1116545 1678544 2466339 2080638 1220827
38491 1220827 1624978 3404558 4925665 5145248 4624413 4142787 3739101 3512348 4008044
38482 4008044 5074171 5454904 4457907 3182653 3081655 3919977 4214072 3279989 1763110
38473 1763110 333129 -1026466 -2271388 -2774415 -2013584 -309718 1486952 2814068
38465 2814068 3691045 4347639 4748935 4584157 3790171 2907810 2532807 2439675 1791057 355562
38455 355562 -1083130 -1785174 -1858907 -1624943 -905355 454403 1992634 3231547 4257671
38446 4257671 4996789 4651597 2851642 715591 -412692 -740830 -1191420 -1311621 169933
38437 169933 2727408 3952327 2696486 626907 -257174 -208259 -669551 -1801560 -2477076
38428 -2477076 -2078863 -1036511 780 440441 -345785 -2162823 -3283375 -1909576 1493000
38419 1493000 4380225 4953585 3938696 3184985 3312832 3422907 2709458 1602712 1194880
38410 1194880 1900890 2944882 3155112 2091626 264373 -1551050 -2785444 -2901451 -1444310
38401 -1444310 1253627 3844562 5091917 5139325 5163019 5812016 6499578 6335034 5328625
38392 5328625 4418281 4459782 5343388 6099364 5909999 5037831 4578893 5169558 6148720 6255738
38382 6255738 5040216 3307807 2184967 1942636 1799992 865632 -698630 -1562404 -541981
38373 -541981 1974249 4257232 4961520 4257413 3212438 2630182 2783607 3706706 5175058
38364 5175058 6666552 7787242 8546211 8952795 8720398 7701823 6188629 4427347 2400734
38355 2400734 542432 -97732 755917 1692909 1214078 -142753 -487067 822687 2603759
38346 2603759 3898204 5094742 6513068 7247155 6389246 4558947 3246989 3093092 3523695
38337 3523695 3691673 3173322 2124655 1292155 1499619 2669202 3783071 4202504 4382110
38328 4382110 4731798 4571174 3165454 1228967 262353 669790 1634789 2668900 4012456
38319 4012456 5407521 5819435 4907096 3674349 2955635 2200372 684783 -822927 -837562
38310 -837562 654361 1977497 1925957 1182866 1167250 2210569 3499722 4347442 4737626
38301 4737626 4715542 4013224 2615748 1261959 891804 1621751 2549643 2655735 1811798
38292 1811798 900433 972954 2192651 3525935 3615602 2122035 103372 -1055687 -872493
38283 -872493 296629 2149233 4568029 6890385 7882940 6924064 4775112 2781557 1705413
38274 1705413 1671909 2583089 3766961 3686993 1215886 -2626602 -5189743 -4892687 -2729923
38265 -2729923 -714078 371342 992529 1389605 1248388 741187 821576 2086137 3947463
38256 3947463 5325215 5783001 5676959 5479174 5260837 4712632 3568852 2187320 1605338
38247 1605338 2476592 3855522 3801054 1713287 -562798 -760045 1114440 3088308 3994888
38238 3994888 4649594 5967112 7198772 6975564 5307168 3448533 2199144 1465472 1356775
38229 1356775 2443534 4536271 6201763 6204094 4888486 3523954 2718112 2185741 1801733
38220 1801733 2014571 3069613 4478017 5587701 6243265 6515515 6166326 4965371 3416411
38211 3416411 2505152 2511567 2614937 2091716 1474036 1888947 3449317 5016748 5579933
38202 5579933 5173643 4325741 3385573 2693848 2573810 2636604 1937619 557669 174173
38193 174173 1988390 4786801 6425510 6768018 7513422 9255618 10621117 10758647 10800834
38184 10800834 11819144 12847539 12321545 10447031 8729675 7857075 7382592 6973561 6650291
38175 6650291 6132714 5174635 4293277 4072798 4101079 3776513 3737371 5013886 6985065
38166 6985065 7842184 7200362 6596554 7000240 7430266 6739243 5380679 4540161 4625316
38157 4625316 5397361 6511990 7159924 6373500 4676354 4236000 6100152 8295374 8181334
38148 8181334 5965504 4257535 4572539 5944289 6860931 6907665 6296465 5296326 4608668
38139 4608668 5048496 6266898 6799782 5919675 4503343 3547346 2845850 1903967 1241503
38130 1241503 1698539 2919063 3599009 3168288 2413985 2366061 3183568 4294096 5173964
38121 5173964 5736750 6150917 6495755 6664163 6595159 6436843 6271212 5837274 4927026 3969964
38111 3969964 3653142 3896278 3892253 3428361 3393993 4394686 5547090 5568528 4719143 4629257
38101 4629257 6140068 8194483 9148012 8499472 6980531 5534196 4712377 4685518 5231533
38092 5231533 5745222 5640189 4819668 3654753 2642330 2265434 3000387 5076321 8085739
38083 8085739 10942050 12376552 11723571 9536207 7435561 6914698 7987117 9263670
38075 9263670 9595665 9239015 8970520 8595153 7321459 5525448 4912812 6351527 8479329
38066 8479329 9373774 9000801 8924123 9886364 10918666 10999855 10442848 10103161 10119621 10195516
38056 10195516 10490043 11306663 12140971 11899459 10171952 7751316 5787042 4822644 4749499
38047 4749499 5323784 6475481 8171718 10053615 11310919 11206749 9896820 8478175
38039 8478175 7965407 8392035 9135531 9860236 10767795 12044855 13419133 14288994 14186377
38030 14186377 13239102 12216661 11834831 11967956 11954084 11658732 11488683 11186577 9715678
38021 9715678 7074620 5209313 5901057 8338712 10073192 10031817 9283207 9027331 9249713
38012 9249713 9465097 9500339 9280723 8896139 8988449 10003518 11122209 11248298 10964514
38003 10964514 11805022 13437954 13610012 11548345 9357104 8933103 9446001 9352409 9105521
37994 9105521 9978942 11634037 12918315 13973606 15434934 16449788 15765181 14190875
37986 14190875 13713112 14511546 15052461 14842938 14756228 14764552 13898509 12680437 12993123 14931553
37976 14931553 16334853 16340047 16818851 18913361 20602960 19693625 17315984 16212961 16876654
37967 16876654 17611867 17537158 17337311 17483173 17664308 17863350 18387974 18911899 18876683 18744717
37957 18744717 19522761 21077081 22171903 22226840 21899157 21827890 21862872 21775659 21910550 22842352
37947 22842352 24786940 27250707 28938437 28557609 26385597 24452676 24304855 25178248
37939 25178248 25410667 24987046 25269059 26617970 27950871 28698867 29615645 31210794 32656292
37930 32656292 32853196 31759390 30297074 29623549 30542585 32770764 34778602 35356654 35345510
37921 35345510 36656277 39513088 42065973 43103646 43691399 45354607 47876606 49915403
37913 49915403 50930793 51471824 52123155 53068068 54305719 55533114 56058592 55429868 54016971
37904 54016971 52656224 51917806 51834406 51983470 51790076 51195378 50932203 51534622 52342365
37895 52342365 52460279 52465464 53754845 56107244 57518031 56956047 55678992 55052900 54709414
37886 54709414 53970030 53503915 54039789 54706018 54371980 53657837 53815238 54407541 54066544
37877 54066544 53067355 53100617 54580506 56123955 56905477 57762004 59544513 61896263 64150135
37868 64150135 66133948 67695202 68703765 69848414 72016808 74461738 75170205 73818973
37860 73818973 72810457 74226081 77071378 78992218 79736798 81190265 84377805 88124803
37852 88124803 90898473 92705832 94669818 97516505 100986469 104326493 107009880 109165337
37844 109165337 111419892 114143488 116881647 118840139 119953844 121116056 123164211 125906339
37836 125906339 128480748 130614964 133122406 136904328 141764228 146752430 151655704 157433520
37828 157433520 164792857 172919465 180281990 186379744 192044241 198252067 205357586 213368835
37820 213368835 222225878 231785150 242153513 253945520 267457553 281653699 294896061
37813 294896061 306850732 318853970 332242562 347205400 363447636 380870224 399072676
37806 399072676 417191992 434966371 453165796 472237534 491265845 509061870 525561030
37799 525561030 541201063 555546538 567685277 577677875 586477754 594441171 600851420
37792 600851420 604949270 606608692 605988261 603426581 599868060 596472603 593269660 588754926
37784 588754926 581375385 571172569 559620431 548125371 537126579 526527071 516384679
37777 516384679 506771864 497205117 486874577 475757752 465060662 455981359 448235976
37770 448235976 440417620 431665660 422252360 412669377 403205155 394573442 387677196 382137771
37762 382137771 376288681 369636653 364258186 362327916 362893809 362673649 359885469 355866757
37754 355866757 352882515 351797083 352314401 354188577 357310811 361293144 365747738 370701936
37746 370701936 376293839 382273507 388108977 393524211 398916311 405261144 413189531 421805918
37738 421805918 429022346 433860049 437934641 443529821 450417903 455891900 458013014 457425402
37730 457425402 455575026 452618379 448041064 442218260 436060835 429591297 421988895 412948653
37722 412948653 403204652 393669296 384534396 375243190 365129400 354199519 343345466
37715 343345466 333493415 324582882 315910544 307408082 299697892 292700717 285242762 276590047
37707 276590047 267417229 258550921 249716968 240521678 231828448 224834318 219213010 213520865
37699 213520865 207320158 201574927 196725455 191571632 184729208 176561453 169037729 163833734
37691 163833734 160834577 158431498 155188990 151127066 147166391 143542120 139591259 135311433
37683 135311433 131983411 130329025 128943772 125907896 121509880 117905491 116124558 114847187
37675 114847187 112450344 109028082 105849632 103750337 102601052 101672438 100110182 97632284
37667 97632284 94967546 92978319 91371214 89230058 86828929 85542124 85517230 84892220
37659 84892220 82233803 78532632 75662485 73930841 72479349 71154475 70270207 69039883
37651 69039883 66169884 62153300 59311187 59015963 60110543 60626104 59945230 58597654
37643 58597654 56971369 55241372 53953773 53605523 53775767 53436882 52119235 50220907
37635 50220907 48208762 46093632 43840880 41833044 40575168 40079021 39808375 39264631
37627 39264631 38450769 37631351 36783441 35630178 34315930 33652732 34274164 35669942 36474100
37618 36474100 35730390 33589668 30868610 28401547 26856353 26580644 27235080 27886457 27853611
37609 27853611 27361022 27152769 27643503 28687001 29969036 31228383 32106925 32205661 31569499
37600 31569499 30938724 31110883 31883190 31951674 30346924 27928407 26809196 27971795 30048335
37591 30048335 31061366 30831800 30700269 31179531 31249433 30268658 29212704 29119251 29345389
37582 29345389 28661293 27526271 27812757 30213528 33177624 34843863 35094652 35121769 35641083
37573 35641083 36239527 36193578 35383650 34451407 34268359 35096534 36221809 36777800 36987766
37564 36987766 37975505 40043966 41851588 41968197 40717503 39571883 39021067 38184444 36687444
37555 36687444 35759444 36725620 39076011 40886244 40899282 39494949 37768092 36407172 35571065
37546 35571065 35204888 35150239 35282224 35690156 36370758 36701937 35817523 33780914 31792757
37537 31792757 30789830 30413494 29960167 29694588 30191977 30784290 30049101 27979557 26287791
37528 26287791 25980076 25883008 24516087 22375842 21076998 20930424 20857268 20381937 20132896
37519 20132896 20294893 20137887 19575059 19772268 21337607 22980726 23029219 21599264 20285311
37510 20285311 20193813 21184164 22596284 23741512 23976613 23313503 22845109 23625931 25176993
37501 25176993 26037673 25798556 25522335 25920939 26235878 25553420 24361405 23937150 24676858
37492 24676858 25872358 26887894 27701603 28227019 27856330 26108888 23430410 20964752
37484 20964752 19554241 19145761 19125659 18951909 18324924 17078106 15433561 14358321 14987784
37475 14987784 17250422 19501438 20097199 19096651 17882036 17389355 17408890 17423836 17257269
37466 17257269 16848223 16244105 15988731 16695921 17998636 18749117 18533039 18048804 17612969
37457 17612969 16449036 14237056 12254843 11781059 12169802 11893988 10935759 10538190 10787711
37448 10787711 10214674 8174841 6064328 5372655 5710842 5736412 5187230 4950708 5606609
37439 5606609 6872692 8270977 9514573 10265401 10155814 9193449 7873781 6900021 6827371
37430 6827371 7624962 8464805 8521799 8268702 9196549 11635498 13716415 13616873 12226025
37421 12226025 12036505 13492087 14197836 12384010 9599748 8709023 10189028 11908844
37413 11908844 12145858 11263909 10280551 9225368 7657189 5883446 4705377 4307241 4203345
37404 4203345 4210987 4783678 6183839 7807733 8748126 8919021 9223528 10368052 11703164
37395 11703164 11721096 9886549 7517947 6370918 6658855 7146786 7014278 6686763 6700445
37386 6700445 6832217 6916353 7527966 8931612 10115874 10015769 9168741 8891723 9205266
37377 9205266 9100802 8756213 9659175 12043584 13969223 13971501 13155790 13307828 14105924
37368 14105924 13874121 12346295 10862913 10110392 9443845 8536372 8014212 8023735 7655323
37359 7655323 6484347 5481517 5608727 6501540 7340962 8110837 9053444 9651409 9250337
37350 9250337 8214869 7403147 6822625 5919285 5060089 5481212 7415639 9276183 9400518
37341 9400518 8072412 7075460 7407290 8123690 7675780 5948027 4445015 4453040 5524409
37332 5524409 6150428 5622386 4660425 4286681 4745164 5720406 6983774 8354232 9388561
37323 9388561 9601086 8881193 7465769 5720187 4134409 3200826 3009498 3236363 3727345
37314 3727345 4678303 5972658 6897312 7024916 6908449 7260645 7808836 7701262 6818812
37305 6818812 5874947 5248113 4497079 3211318 1744671 862366 1030192 2145008 3606136
37296 3606136 4616058 4770876 4375733 3919039 3453357 2932472 2822747 3583695 4643833
37287 4643833 4809868 3855603 2839269 2548903 2517052 2092403 1648640 1882803 2422831
37278 2422831 2107832 588445 -1126976 -1887711 -1646282 -1259792 -1364065 -1725319 -1659443
37269 -1659443 -922130 -49337 222646 -258556 -982231 -1308803 -849049 491329 2439520
37260 2439520 4406608 6011150 7446037 8853938 9538589 8608498 6503654 5008384
37252 5008384 5309412 6668060 7466416 7044459 6078167 5637852 6296070 7695535 8598548
37243 8598548 7825917 5486309 2800133 602984 -1078017 -1767795 -361063 2830334
37235 2830334 5259141 5002809 3503325 3570929 5266465 5965149 4406713 2292703 1307994
37226 1307994 885198 178245 277586 2543146 5859358 7539587 6638768 4842535 4143500
37217 4143500 4822513 5716170 5507763 3749708 1390096 194019 935088 2381517 2831841
37208 2831841 2309310 2218789 3051011 3686326 3178658 2118650 1752281 2522860 3901625
37199 3901625 5018322 5108143 3954491 2283458 1243790 1220360 1612377 1870077 2034756
37190 2034756 2038582 1359561 -74368 -1381207 -1843558 -1972096 -2648141 -3585726 -3550266 -2071706
37180 -2071706 -207500 568510 -199006 -1730523 -2886812 -3094807 -2540425 -1621473 -475122
37171 -475122 719866 1329625 914150 272076 865157 2835298 4557543 4777444 4194095
37162 4194095 3982777 3731555 2289605 68453 -1220012 -1051406 -663200 -881761 -956402
37153 -956402 -146108 961152 1576323 1981060 2691477 3323797 3350252 3190922 3473340 3897410
37143 3897410 3956499 4125842 5048580 6086886 6166383 5719918 6107509 7138267 7059519 5516062
37133 5516062 4654244 6127625 8447751 8862469 6987669 4916414 4129214 4002547 3534339
37124 3534339 3017785 3305418 4387678 5475323 5933887 5530270 4235736 2443195 1079753
37115 1079753 844129 1396801 1758381 1401342 526077 -535705 -1536979 -1948819 -1170291
37106 -1170291 482113 1531558 707043 -1566122 -3447871 -3398895 -1355595 1590919 4181403
37097 4181403 5616942 5705703 4774472 3414029 2176192 1419483 1237277 1347528 1228044
37088 1228044 719934 483355 1465013 3720107 5960784 6486301 4626921 1387937 -1245539
37079 -1245539 -1874898 -877851 47852 -252692 -1233370 -1692457 -1541916 -1737427 -2604818
37070 -2604818 -3241361 -2825018 -1640328 -410115 581347 1205242 1148058 566590 429043
37061 429043 1389095 2759518 3321168 2730637 1488527 119033 -757736 -156454 2270093
37052 2270093 5204508 6730155 6279270 4603592 2276032 -380361 -2137522 -1462540
37044 -1462540 1302403 3908161 4962230 5286432 5772407 5466439 3164144 -191734 -2339621
37035 -2339621 -2464491 -1777575 -1610342 -2190212 -3213266 -4408447 -5306631 -5367750 -4659662
37026 -4659662 -3830596 -3265336 -2786413 -2216234 -1625666 -900905 353665 2188008 3911713
37017 3911713 4582272 3824132 2197534 856551 648797 1332049 1845468 1494402 553286
37008 553286 -431834 -1330591 -1987090 -1753932 -284169 1575574 2560490 2512700 2327629
36999 2327629 2471828 2438567 1815696 1107356 1139738 2084090 3259922 3622166 2552535
36990 2552535 647383 -424183 508106 2722338 4417129 4821093 4680174 4666701 4388047
36981 4388047 3391789 2197572 1583937 1432911 1033407 212493 -488803 -610936 -214936
36972 -214936 422619 1144265 1891257 2554638 2888639 2594255 1663468 643596 289562
36963 289562 865707 1984712 3104082 3885244 4117258 3715425 2876733 1918898 1003541
36954 1003541 376395 641650 2061286 3617586 3707623 2113401 506563 532501 2043980
36945 2043980 3704632 4653629 4911192 4695642 4163905 3604349 3242581 2971523 2668072
36936 2668072 2474549 2350365 1791008 600889 -444889 -447575 362794 982901 1063878 1156935
36926 1156935 1591708 2023070 2303378 2976614 4439574 6155546 7195528 7257538 6773767
36917 6773767 6250189 5857124 5527050 5130611 4570270 3892618 3316290 3066309 3219321
36908 3219321 3756129 4660347 5834169 6945536 7534709 7449876 7185572 7563698 8856691
36899 8856691 10336708 10982419 10583887 9796760 9129382 8410716 7461594 6724736 6739494
36890 6739494 7350577 8000824 8611542 9585428 10975225 12204032 12717505 12473318 11647660
36881 11647660 10282507 8491397 6709357 5374508 4453147 3590889 2768033 2525418 3333575
36872 3333575 4885141 6324624 7184550 7727957 8241829 8501905 8380167 8515624 9570988
36863 9570988 10942898 11086841 9316265 6584327 4306741 3142731 3099222 3838224 4382541
36854 4382541 3545988 1546523 400745 1615599 3986581 4842963 3224475 682322
36846 682322 -986401 -1598040 -1941224 -2347194 -2491687 -2045178 -1028454 210380 1155907
36837 1155907 1488128 1324386 900602 242485 -439199 -386400 894696 2573691 3132944
36828 3132944 2251238 1316631 1754220 3403595 4874843 5101789 4266463 3447039 3508637
36819 3508637 4236483 4694769 4537209 4416712 4677596 4442691 2980327 1310969 1031821
36810 1031821 1861755 1973460 741085 -620122 -1407532 -2418399 -3836971 -4201577 -2857433
36801 -2857433 -1624308 -2155554 -3096851 -2166247 -90781 185221 -2015067 -4087026 -4098626
36792 -4098626 -3310503 -3645349 -4675145 -4727805 -3598588 -2412281 -1622758 -845516 -229855
36783 -229855 -335763 -701565 -72125 1658400 3065685 3270543 3210919 4047807 5260170
36774 5260170 5418940 4325414 3225473 3041956 3450059 3789778 3872869 3526628 2263253
36765 2263253 91658 -1921810 -2652368 -2205082 -1607918 -1433530 -1303095 -637625 627190
36756 627190 2029150 2864108 2577612 1282972 -188318 -1066037 -1277581 -1029092 -213254
36747 -213254 1183910 2499662 3007799 2887202 2815272 2835138 2473733 1759544 1177657 830368
36737 830368 689522 1362889 3182587 4698725 3927279 1415958 96951 1303623 2923741
36728 2923741 2775342 1831696 2120084 3028741 2363949 331843 -407294 1130281 2661833
36719 2661833 2143022 811925 1219186 3467853 5099806 4375184 2323140 1278522 2141408
36710 2141408 3601284 3943618 3151558 2765602 3748416 5210584 5616935 4565305 2739639
36701 2739639 771730 -910925 -1622117 -1014507 7641 137134 -520592 -554981 678459
36692 678459 2132429 2470859 1433007 -506489 -2853156 -4963626 -6014839 -5724183 -4645351
36683 -4645351 -3424143 -2261477 -1281898 -725010 -454661 63624 945129 1611209 1569405
36674 1569405 848832 -478134 -2330474 -3837718 -3516078 -976883 2148409 3692464
36666 3692464 3013290 1192775 -275353 -560195 145095 790004 458179 -401077 -318395
36657 -318395 1188552 2680574 2502689 754660 -1176570 -2399743 -2920057 -2802848 -2094545
36648 -2094545 -1436052 -1685847 -2757524 -3597963 -3523941 -2985693 -2800067 -3118903 -3439141
36639 -3439141 -3358027 -3035674 -2876381 -2807293 -2104309 -274080 2022933 3515562 3810064
36630 3810064 3590123 3193591 2037462 35453 -1486258 -1355913 -287784 197179 61647
36621 61647 521731 1727819 2285345 1439526 327332 322549 1200435 1839901 1954710 2053754
36611 2053754 2068179 1127343 -1136989 -3738827 -5055890 -4140187 -1394727 1594454 2936030
36602 2936030 1842597 -435301 -1543378 -426390 1481472 2027423 979040 -10009
36594 -10009 42880 268757 -124340 -123119 1556319 4078773 5320710 4760170 3814248 3331146
36584 3331146 2653096 1587723 1301553 2200662 2653758 1308227 -623965 -1022911 181459
36575 181459 1410833 2041945 2757566 3693839 4099653 3824088 3483557 3043200 1832291
36566 1832291 232108 -229479 992127 2574362 3203803 3171171 3387964 3808579 3640480
36557 3640480 2470615 588379 -1233960 -1880988 -541775 2239611 4715702 5604396
36549 5604396 5203279 4658600 4701060 5225624 5406959 4149763 1350603 -1147716 -1051137
36540 -1051137 1498299 3755917 3761084 2609591 2341702 2833856 2386026 671497 -726228
36531 -726228 -698745 23739 283367 78177 120459 591952 997190 884103 246145 -588207
36521 -588207 -1150552 -1026128 -62567 1578640 3486956 4975211 5190528 3785158 1725356
36512 1725356 1024495 3002829 6602051 8906314 7897500 4573124 1783815 1095511
36504 1095511 1662904 2262002 3042440 4372192 5225765 4384320 2604180 1746185 1936819
36495 1936819 1539668 146248 -469064 873877 2897728 3886043 3956364 4028422 4004353
36486 4004353 3563094 3548483 4738291 6067878 5961067 4911073 4863742 6266955 7555620
36477 7555620 7606140 6992131 6531930 6141572 5611681 5228825 5048592 4539963 3438059
36468 3438059 2176849 1211652 671976 756353 1554300 2429835 2638670 2650032 3665314
36459 3665314 5615588 6936173 6725871 5790082 4946765 3700859 1599308 -254908 -335995
36450 -335995 1275673 3062579 3810628 3305224 1815180 -99532 -1518178 -1783261 -1152794
36441 -1152794 -339235 313986 759767 887670 870255 1315365 2291205 2738697 1835040 524481
36431 524481 504779 1805770 2597052 1621271 -257998 -1381305 -1296284 -831609 -760306 -1045963
36421 -1045963 -1158339 -645032 495814 1679359 2041649 1131116 -670232 -2422226 -3240726
36412 -3240726 -2759255 -1323397 192929 1072266 1419872 1917272 2777698 3259989 2546238
36403 2546238 924401 -340883 -396027 291200 639957 323845 34491 436212 1348737
36394 1348737 2172740 2657997 2791726 2284060 894363 -762981 -1503472 -939888 30197
36385 30197 469225 593913 1210306 2353274 3122812 2757864 1400111 -130793 -951965
36376 -951965 -661755 296328 905999 612515 -18730 -66531 509010 933444 795465 467628
36366 467628 296850 135886 -13021 389689 1566494 2664933 2607595 1530116 647739
36357 647739 648479 928688 717998 315372 549987 1307994 1417369 200260 -1480023 -2191623
36347 -2191623 -1621052 -761829 -561235 -958221 -1361279 -1547501 -1736094 -2046715 -2274487
36338 -2274487 -2193595 -1877749 -1633401 -1579100 -1299059 -176175 1642723 2875573 2310396
36329 2310396 394687 -1051617 -925837 18929 456566 149184 -306651 -713736 -1300135
36320 -1300135 -1869011 -1949620 -1724934 -1847652 -2253928 -2108864 -1197863 -490332 -859407 -1927890
36310 -1927890 -2665772 -2544449 -1631658 -173880 1262948 1744708 894131 -289790 -231446
36301 -231446 1542991 3904086 5223398 4699847 2843627 1042464 396908 566167 100609
36292 100609 -1554096 -2834929 -1744337 1416096 4043416 4169467 2500701 1185328
36284 1185328 1384160 2572405 3503411 3157709 1255600 -1396666 -3313319 -3699840 -3258010
36275 -3258010 -3197858 -3795325 -4471992 -4883657 -5116924 -5011300 -4176657 -2739463 -1326819
36266 -1326819 -211929 846205 1845377 2374685 2358485 2187435 1862941 833348 -899929
36257 -899929 -2281416 -2376912 -1451871 -356178 535182 1176320 1329777 999192 837847
36248 837847 1215417 1293303 35618 -2092661 -3453066 -3189028 -1930685 -628347 301369
36239 301369 649428 379283 206660 1150999 3038411 4384565 4314292 3708238 3752146 4161236
36229 4161236 3756458 2274181 672926 -98029 122382 918956 1554642 1183980 -446346
36220 -446346 -2508581 -3850852 -4180067 -4007273 -3620336 -2797136 -1498917 -146381 913330
36211 913330 1618359 1742325 869064 -865912 -2485311 -3007488 -2329203 -1082193 40292
36202 40292 572401 310152 -466384 -987302 -666921 251506 1090792 1703657 2502051 3387349
36192 3387349 3330459 1690436 -370584 -750813 1046387 3023754 2956564 1009714 -690132
36183 -690132 -759668 119833 541360 2533 -1109881 -2242191 -2799641 -2259242 -899304
36174 -899304 3205 -590742 -2274612 -3768175 -4404173 -4423799 -4059693 -3173093 -1923154
36165 -1923154 -1085046 -1253990 -1995136 -2170778 -1186405 236965 780189 157340 -272138
36156 -272138 992625 3640415 5819905 6402542 6064414 5779115 5256503 3682803 1243258
36147 1243258 -1122146 -3048586 -4841611 -6501613 -7586435 -7917298 -7613876 -6595063
36139 -6595063 -4874986 -3207079 -2565011 -3038239 -3992355 -5097283 -6258145 -6756257 -5709518
36130 -5709518 -3546159 -1886596 -1611410 -1960725 -1813834 -912993 470534 2055766 3292746
36121 3292746 3584740 3365446 4047052 6143377 8141283 8030600 5529116 2209736 -131629
36112 -131629 -699928 213506 1682542 2843770 3559753 4326407 5493281 6871696 7986039
36103 7986039 8193064 6840115 4238274 2275121 2713207 4708371 5474078 3843816 1615254
36094 1615254 668261 502327 -144442 -921508 -930752 -903759 -2124461 -3817741 -3848356 -1974757
36084 -1974757 -419119 -874719 -2571421 -3745217 -3650141 -2634269 -1400033 -696473 -819879
36075 -819879 -1075542 -561398 418072 720106 173803 -244742 -248812 -793587 -2230074 -3344756
36065 -3344756 -3211872 -2838965 -3718752 -5471468 -6232176 -5125805 -3253940 -2153659 -2077351
36056 -2077351 -2089759 -1480924 -718760 -821884 -1823208 -2410825 -1661083 -609638 -993568
36047 -993568 -2630761 -3526019 -2885151 -2392621 -3546963 -5153052 -4974896 -3022468 -1511252
36038 -1511252 -1834665 -3107539 -3792442 -3439902 -2484214 -1416365 -697971 -729986 -1329964
36029 -1329964 -1647852 -983778 519977 2045730 2633124 1722346 -152910 -1241006 -52846
36020 -52846 2681427 4337700 3231362 462929 -1689058 -2462864 -2637752 -2406878 -913726
36011 -913726 1648071 3006083 1251658 -2327419 -4363305 -3421464 -1563358 -1395123 -2764495
36002 -2764495 -3473094 -2541950 -1325565 -1346033 -2284735 -2725550 -2123786 -1247610 -903238
35993 -903238 -871783 -275834 1232975 2865935 3426356 2671012 1670146 1579566 2361425
35984 2361425 3124231 3369686 3197484 2506728 1026613 -633627 -950547 852183 3653819
35975 3653819 5495477 5402324 3802579 1734611 226405 -54576 650739 1152453 475350
35966 475350 -974600 -1900519 -1701650 -1084588 -1080755 -1863723 -2631292 -2423435 -1026207 788258
35956 788258 1932493 1957579 1271984 565683 369802 1025561 2383403 3396290 2789998
35947 2789998 549437 -1880929 -3243261 -3600664 -3444612 -2687772 -1390798 -567739 -1023618
35938 -1023618 -1933382 -1864013 -877028 -287856 -499401 -506148 280434 1036207 778017 -414560
35928 -414560 -1816006 -2791265 -2842176 -1911372 -989933 -1402495 -3023591 -4177927 -3809225
35919 -3809225 -2730871 -2132863 -1958503 -1622137 -1283803 -1226259 -728573 1074599 3524669
35910 3524669 4827958 4048953 1826598 -705266 -2749307 -3716730 -3350327 -2237600 -1464732
35901 -1464732 -1490792 -1819857 -1819013 -1362389 -687908 -132500 29233 -35535 353253 1520517
35891 1520517 2703056 2884954 2198336 1681949 1759272 1916428 1922789 2259807 2978269 3163278
35881 3163278 2191116 784739 130460 453938 1086403 1535111 1894727 2441229 3254978
35872 3254978 4066242 4277448 3486539 2117494 1017051 323329 -503378 -1333707 -1165401
35863 -1165401 90945 778093 -365688 -2024026 -1709474 972204 3824478 4726941 3533006
35854 3533006 1338266 -749969 -1823360 -1459272 -396605 189 -592267 -1209073 -1329308
35845 -1329308 -1669390 -2593864 -2934643 -1516371 893537 2307158 1789595 106764 -1473969
35836 -1473969 -2116131 -1541419 -237467 636291 413464 -178016 -43560 681078 1006934
35827 1006934 749013 609500 683278 207442 -907587 -1518573 -804804 564001 1481988
35818 1481988 1898141 2555459 3747726 4976597 5558269 5163522 4046077 2959104 2413102
35809 2413102 1862135 284292 -2148280 -3799137 -3551535 -2334611 -1863542 -2399154 -2721357
35800 -2721357 -2063759 -1055365 -615604 -711906 -595025 124255 971083 1119998 337244
35791 337244 -640098 -868565 -379954 -241915 -1221068 -2704710 -3254325 -2046309 400578
35782 400578 2688672 3656374 3390990 3157931 3840632 4546788 3627340 1150804 -837202
35773 -837202 -992694 -311027 -243115 -547205 -408205 -502217 -1960634 -3863938 -3942244 -1826734
35763 -1826734 391290 1234110 1579919 2587452 3610019 3401607 2232732 1512081 1908167
35754 1908167 2787366 3074680 2084674 88113 -1479153 -1152338 698455 2019090 1631693
35745 1631693 562226 75156 -305596 -1541187 -2957810 -3074172 -1944911 -1001535 -868154
35736 -868154 -944253 -972265 -1318034 -1636990 -1014319 195848 363108 -922793 -1897979 -1079311
35726 -1079311 697831 1802135 2137075 2561599 2929792 2367651 1075783 241318 166558
35717 166558 -105719 -1092673 -2043489 -2197653 -1805435 -1383818 -848018 31741 1036296
35708 1036296 1938599 2879825 3715557 3663567 2353265 658760 -357301 -837490 -1492327
35699 -1492327 -2002794 -1359339 221929 1079152 260246 -1162777 -1539781 -554707 933428
35690 933428 2177204 2941081 3291843 3766607 5122700 7053450 7750008 5793197 2063564
35681 2063564 -1305049 -3454959 -4999011 -6022974 -5635113 -3836814 -2218120 -1946434
35673 -1946434 -2247542 -1802939 -664933 259168 829957 1569849 2369284 2489568 1804581
35664 1804581 1126290 1210229 2054712 3155213 3886227 3702331 2551045 1114254 185577
35655 185577 -178780 -506235 -1002705 -1238063 -730820 468398 1764459 2457711 2412592
35646 2412592 2382164 3216165 4575292 5139874 4508711 3986705 4635588 5416749 4647761
35637 4647761 2825380 2307003 4042780 6223166 6781064 5877894 4955836 4387643 3369258
35628 3369258 1663170 132716 -570317 -892922 -1567094 -2490489 -2918363 -2543466 -1886211
35619 -1886211 -1502207 -1179287 -310790 1070555 2156742 2367914 1951074 1336647 546863
35610 546863 -266174 -401241 396533 1029409 280260 -1217885 -1447613 416808 2989106
35601 2989106 4499471 4611535 4051542 3477493 3279466 3566058 3691620 2645706 610610
35592 610610 -718879 -185064 1291720 2178778 2494370 3205953 4077516 3753536 1971418
35583 1971418 193669 -312732 216879 1116675 2428736 4103599 4995331 3889397 1324363
35574 1324363 -586593 -324115 1585855 3384773 3875736 3243456 2513027 2558318 3460485
35565 3460485 4434027 4338466 2629320 40183 -1925237 -2491309 -2404862 -2846983 -3794764
35556 -3794764 -4145422 -3412562 -2367337 -1668020 -842315 605608 1924188 2113999 1695317
35547 1695317 2072203 3207672 3449989 2108039 762367 1052443 2257024 2403192 1154287
35538 1154287 69027 66183 174855 -644464 -1687002 -1564055 -400258 233302 -525907
35529 -525907 -1817894 -2458649 -2429324 -2374614 -2294733 -1634920 -447964 432723 496583 87194
35519 87194 -407776 -1153960 -2186558 -2794728 -2337795 -1277452 -564773 -217241 548601
35510 548601 1752530 2277605 1470550 180560 -512797 -867012 -1787315 -3016961 -3231369
35501 -3231369 -1995991 -501981 79921 48130 314141 879020 1132562 1229257 2006759
35492 2006759 3499262 4595316 4546313 3943976 3642532 3460519 2750781 1734873 1268918
35483 1268918 1432918 1337476 490293 -495795 -897784 -858111 -872129 -892955 -619693 -347182
35473 -347182 -792690 -2053844 -3247692 -3334001 -2084210 -280853 814614 354712 -1309309
35464 -1309309 -2720305 -2570627 -989735 635329 1128674 560547 -116320 -33852 1042472
35455 1042472 2588798 3437555 2497885 -77914 -2667914 -3701734 -3348521 -3119629 -3816144
35446 -3816144 -4652779 -4707390 -4367614 -4529838 -4939581 -4487200 -3077441 -1999355 -2061049
35437 -2061049 -2427859 -2026408 -1225206 -1119089 -1720153 -2017671 -1586836 -958568 -384364
35428 -384364 576440 1954935 2976922 3300936 3675180 4633289 5357613 4769055 3185227
35419 3185227 1870453 1212095 356495 -1339855 -3378178 -4823530 -5264574 -4839938 -3864054
35410 -3864054 -2692299 -1531343 -166769 1694878 3559862 4091436 2446019 -455352
35402 -455352 -2443422 -2051154 139592 2075738 2053366 59069 -2431366 -3843211 -3812322
35393 -3812322 -3324465 -3625761 -4936089 -6244059 -6438791 -5527356 -4473258 -3906114 -3494255
35384 -3494255 -2768557 -1951648 -1448313 -1049531 -476209 -400606 -1861095 -4581114 -6861483
35375 -6861483 -7433739 -6564380 -5063629 -3253710 -1480822 -601746 -1020321 -1933472 -2433983
35366 -2433983 -2739303 -3389633 -3893938 -3415056 -2406267 -2192166 -2957028 -3434218 -2796640
35357 -2796640 -1712524 -1180584 -1338115 -1882182 -2759642 -3820227 -4452158 -4202164 -3366961
35348 -3366961 -2534675 -1897864 -1340772 -831990 -467239 -477372 -1275544 -2900466 -4275352
35339 -4275352 -3888120 -1730616 222720 280991 -769573 -721424 1057586 2772842 2544341
35330 2544341 692215 -833750 -718562 668605 2159187 2938713 2769713 1839993 871038
35321 871038 856343 1955747 2868766 2160312 249178 -882494 -311366 508860 -195746
35312 -195746 -2045271 -3252408 -3243394 -3032676 -3059091 -2263499 49380 2628490 3527721
35303 3527721 2336199 334271 -1212791 -2155397 -2977492 -3883659 -4602171 -4881974 -4956391
35294 -4956391 -5288259 -5729293 -5272495 -3160169 -128012 2061206 2408813 1510817 589064
35285 589064 315752 716021 1533843 2321613 2637801 2486888 2233469 1951479 1335063 407387
35275 407387 -264712 -378440 -436757 -1123134 -2463645 -3864149 -4695569 -4714553 -4230453 -3908110
35265 -3908110 -4050133 -4144399 -3578443 -2597581 -1868905 -1335755 -507438 201840 -291728 -1884669
35255 -1884669 -2951105 -2445677 -1182033 -277406 563980 2196333 4287248 5544748 5284208
35246 5284208 3967592 2541461 1782832 1792434 1703953 599767 -909414 -1059561 542299
35237 542299 2067911 2089606 1656856 2316670 3320541 2762275 736376 -791081 -1031701
35228 -1031701 -1217463 -2234178 -3339563 -3761544 -3932133 -4376448 -4639061 -4104516 -2980900
35219 -2980900 -1861365 -1050741 -711394 -893984 -1126391 -813614 -301411 -594534 -1710064
35210 -1710064 -2373862 -1863398 -1119793 -1298116 -2063338 -2193401 -1309373 -176889 387718
35201 387718 227221 -362866 -1038545 -1649337 -2273833 -2884585 -3062583 -2514750 -1818134 -1895930
35191 -1895930 -2571283 -2489784 -968112 806824 1144991 -1877 -986658 -413246 1432993
35182 1432993 3083133 3359057 2228894 490353 -1078091 -2136649 -2578775 -2398759 -1953675
35173 -1953675 -1887111 -2367857 -2755380 -2476662 -1844653 -1453264 -1227516 -863629 -806255 -1740365
35163 -1740365 -3235133 -3955694 -3335342 -2138975 -1257276 -810529 -557690 -303329 256631
35154 256631 1219208 1859258 1258082 -254455 -1246078 -1042382 -472778 -415589 -599609 -366879
35144 -366879 273360 985786 1789991 2754756 3507174 3586382 3000582 2177406 1619416 1564479
35134 1564479 1624414 1080877 85988 -99000 932417 1385453 -416974 -3013903 -3429098
35125 -3429098 -1662478 -783698 -1989774 -2592128 -440104 2395782 2653514 516647 -1373108
35116 -1373108 -2029578 -2483965 -2989125 -2685845 -1752569 -1366825 -1504479 -1020267 -90016
35107 -90016 -430232 -2579863 -4740802 -4966169 -3203019 -806556 732163 406489 -1535232
35098 -1535232 -3111348 -2235317 775190 3481081 4344392 4144263 4064928 3898565 2935515
35089 2935515 1439613 279710 -154324 66363 868795 1990835 2863132 3184488 3185583
35080 3185583 3024958 2453949 1364948 146856 -763469 -1224579 -1176496 -632656 17527
35071 17527 249781 -4078 -510616 -1273150 -2141572 -2140918 -364307 2359320 3896272 3314623
35061 3314623 1942205 1477426 2059671 2823002 3402980 4007280 4605340 4952443 5155010
35052 5155010 5514122 5894449 5709031 4518023 2458759 213431 -1366053 -1822776 -1385594
35043 -1385594 -602297 150413 581295 317010 -588608 -1227107 -651538 887456 2096459
35034 2096459 2003136 729872 -830003 -1532691 -549824 1776534 3861862 4409041 3729040
35025 3729040 2824586 1746446 -18936 -2022806 -3130174 -3123992 -2688551 -2022608 -974785
35016 -974785 -372638 -1413437 -3543625 -4664495 -3784959 -1875761 100578 2106499 3604878
35007 3604878 3399295 1782685 832116 1443661 1955332 953470 -490978 -947457 -1117328
34998 -1117328 -2207735 -3321288 -2746020 -896849 233236 -17649 -630015 -1055136 -1763563
34989 -1763563 -2732289 -3056716 -2165786 -241310 2327780 4747896 5597717 4270092 2278823
34980 2278823 1628660 2160582 2044802 672048 -632718 -794831 -228005 389663 1105528
34971 1105528 2008747 2742120 3154691 3544283 3965911 4063641 3680900 2928144 1800870
34962 1800870 536186 -27851 471168 883291 -74541 -1701292 -2131139 -1155596 -482150
34953 -482150 -965682 -1369788 -494620 1042101 1996906 2197199 2155192 2016432 1752401 1575093
34943 1575093 1416692 731911 -534312 -1479431 -1328318 -337761 851093 2021793 3015277
34934 3015277 3288586 2506079 1126322 -25134 -372457 306760 1659267 2494325 1682842
34925 1682842 -329486 -1781230 -1690377 -726784 321799 1688831 3521876 4851529 4771417
34916 4771417 3845287 3289061 3396802 3781037 4559459 6155989 8254278 9955184 10751118
34907 10751118 10538877 9093205 6571724 4252030 3535272 4113244 4181704 2742907 774545
34898 774545 -270994 -251568 31350 307413 961682 1818545 1804497 318828 -1638024
34889 -1638024 -2459615 -1917161 -1376355 -1877686 -2783455 -2796750 -1618126 134040 2070137
34880 2070137 4130976 5890472 6829340 7202731 7607766 7735143 6695110 4712572 3274687
34871 3274687 3186982 3593653 3472487 3061722 3087211 3447996 3480145 2891925 1760066 246096
34861 246096 -979342 -684245 1648846 4804240 6816792 6861270 5822811 5306811 6307827
34852 6307827 8320759 9490807 8290360 5373498 3050831 2627630 3204397 3530460 3792578
34843 3792578 4636571 5533936 5454165 4504238 3636700 3189247 2889768 2905280 3681796 4999862
34833 4999862 6270841 7448361 8520099 8538567 6687951 4255136 3897935 6459375 9759858
34824 9759858 11148648 10239280 8508773 7165983 6331397 5757800 5371152 5079743 4600280
34815 4600280 3659003 2288966 977319 483826 1273218 3037308 4910916 6173667 6662458
34806 6662458 6641842 6473895 6317382 5980485 5172064 3982075 2912626 2378978 2459553
34797 2459553 3106684 4112479 4869612 4882980 4653303 5179582 6301281 6594077 5481249
34788 5481249 4323797 4512082 5508139 5940389 5754960 5901242 6521731 6913578 6893075
34779 6893075 6833804 6710258 6446968 6755887 8045940 8887657 7458974 4487515 2776410
34770 2776410 3484324 4807317 4946958 4466886 4694723 5447961 5666121 5096766 4083747
34761 4083747 2674484 1208158 943373 2682789 5212810 6388999 5636407 4385023
34753 4385023 4114391 4867692 5805276 6500224 7273949 8413592 9377687 9163841 7624931
34744 7624931 5860624 4714560 3515414 1374021 -847314 -1506062 -933735 -1176512 -2589854
34735 -2589854 -2904965 -765077 1896501 2687520 2227888 2685280 4146131 4891815 4548504
34726 4548504 4340286 4316185 2936136 10263 -2205910 -1934074 -183279 1063642 1592673
34717 1592673 2493548 3918616 4830156 4588945 3478949 1737679 -751541 -3528180 -5235793
34708 -5235793 -4851788 -2895766 -955414 -120497 -212962 -514531 -817992 -1434580 -2335109
34699 -2335109 -2756929 -1878602 300414 2878107 4662337 4791787 3095924 202098 -2761427
34690 -2761427 -4791227 -5423713 -4675414 -2907215 -859899 505004 526513 -757403 -2669351
34681 -2669351 -4186427 -4367449 -2993112 -886748 758751 1427179 1376161 941350 393898
34672 393898 305980 1082310 2001234 1743803 206885 -1236394 -1736698 -2098049 -3171915
34663 -3171915 -4213877 -3920364 -2347026 -722202 74706 -95298 -1077316 -2165086 -2019758
34654 -2019758 -93452 2279560 3384179 3289922 3297257 3700732 3604502 2758620 2004609 1773337
34644 1773337 1530575 941578 358129 -55573 -524254 -855607 -615766 -187461 -346462
34635 -346462 -682023 62694 1791716 2807119 2310080 1583170 1920727 2895722 3653463
34626 3653463 4480936 5811173 6805162 6324878 4589714 2722697 1365787 778637 1419337
34617 1419337 3089940 4154954 3042710 241298 -2342623 -3659208 -4014360 -3691833
34609 -3691833 -2444061 -375112 1770946 3353585 4147629 4055761 3280586 2554761 2373874
34600 2373874 2261934 1645385 1056880 1375501 2185776 2215978 1378835 1026441 1906242 3047231
34590 3047231 3113164 1935242 339231 -690963 -380379 1362982 3389613 4048749 3003904
34581 3003904 1664782 1405389 2015215 2341163 1810871 810388 57467 62292 830609
34572 830609 1792946 2380602 2766807 3517338 4513036 5025981 4993812 5224665 5952768 6209456
34562 6209456 5259974 3742763 2592192 1657432 351476 -987589 -1479540 -1060111 -414248
34553 -414248 220559 1168821 2284366 2757061 2148276 958673 -12013 -383697 -176076
34544 -176076 493428 1517475 2753145 3857349 4241344 3632911 2733937 2558694 2809909
34535 2809909 1909442 -627013 -2887979 -2875781 -1375425 -997571 -2710253 -4881194 -5688522
34526 -5688522 -4936120 -3379779 -1850692 -1382310 -2604618 -4390362 -4538643 -2520104 -195315
34517 -195315 878309 1266126 1797895 1668984 102406 -1469296 -1040947 864182 1881857
34508 1881857 1301751 747261 1266850 1837767 1361308 341892 -345768 -922923 -1853558
34499 -1853558 -2611714 -2455132 -1711260 -1235870 -1089454 -726628 -177151 -115953 -840284 -1894238
34489 -1894238 -2736927 -3273793 -3682358 -4069980 -4369516 -4422112 -4183497 -3817149 -3354521 -2359424
34479 -2359424 -448244 1769658 2914874 2383938 1216287 986406 2112784 3581406
34471 3581406 4087604 3236267 1904476 1523961 2575096 3725732 3125688 781097 -1146964
34462 -1146964 -888692 817492 1796607 999396 -783848 -2295032 -2995710 -3039722 -2809529
34453 -2809529 -2576890 -2329844 -2042633 -2126920 -3012983 -4106317 -4083264 -2755803 -1653184
34444 -1653184 -1919858 -2626711 -2325777 -1407579 -1448539 -2805406 -4430620 -5693071 -6711780
34435 -6711780 -7070759 -6018183 -4128547 -3079650 -3393015 -3896007 -3758718 -3462746 -3307015
34426 -3307015 -2690561 -1609442 -1170506 -1678602 -1884884 -1314643 -1677386 -4361384 -7882131
34417 -7882131 -9653622 -9302700 -8345893 -7371250 -5657248 -3305456 -1698196 -1580104 -2223002
34408 -2223002 -2736201 -2914473 -2672302 -1945375 -1328591 -1563383 -2189875 -1915172 -528724
34399 -528724 769856 1200756 1302744 1652417 1956633 1940445 1962863 2127721 1842897 927067
34389 927067 198796 325296 997554 1802634 2826730 3685037 3185840 1086693 -803480
34380 -803480 -614760 1119526 2248763 1748284 380802 -1027170 -2563989 -4431757 -6260865
34371 -6260865 -7381528 -7092217 -4927768 -1571187 880837 826378 -792704 -1647183 -1139656
34362 -1139656 -817418 -1531024 -2063533 -1374650 -437209 -493684 -894153 -381874 446666 -62584
34352 -62584 -1798650 -2874006 -2543917 -2269928 -3316600 -4877397 -5443809 -4789769 -3662303
34343 -3662303 -2562607 -1852716 -2103070 -3096970 -3247882 -1443620 972679 1586544 147042
34334 147042 -1136952 -724181 405721 627479 -45920 -612212 -960242 -1770246 -3024933
34325 -3024933 -3864189 -3854990 -3465140 -3228006 -3168912 -3115072 -2948795 -2488279 -1667498 -918363
34315 -918363 -904769 -1757505 -2841488 -3227654 -2228634 104991 2556006 3359212 2116611
34306 2116611 712694 1216055 3080201 3817085 2573323 1393046 2175432 3909591 4313367
34297 4313367 3168475 2268796 2426448 2312657 607732 -2049755 -3900892 -3999277 -2751600
34288 -2751600 -1189689 -234978 -173379 -350285 248516 1719750 2913754 2746015 1448379
34279 1448379 127299 -495255 -413723 147296 855500 1141136 676739 -54459 -296997
34270 -296997 -89818 -147926 -731748 -1423989 -2050015 -2794277 -3135602 -1953345 453862
34261 453862 1654145 -123321 -3159357 -3996445 -1896813 325022 295114 -1053375 -1641584
34252 -1641584 -1474154 -1911631 -2875362 -2978163 -2097013 -1678023 -2239207 -2512505 -1720898
34243 -1720898 -937219 -1108856 -1257613 -176932 1118095 490928 -2036740 -3778624 -2484287
34234 -2484287 1167709 4514770 5467514 3823822 946130 -1230508 -1389929 257823
34226 257823 2245397 3246131 3182191 2997964 3584816 4911690 5943099 5472360 3348874
34217 3348874 764802 -1043182 -2124116 -3249543 -4329118 -4449841 -3596761 -3111575 -3808810
34208 -3808810 -4661519 -4313731 -3131122 -2527987 -2609254 -1772116 1179896 5437084 8923721
34199 8923721 9994448 8350062 5022226 1648240 -812082 -2711945 -4564225 -5577647
34191 -5577647 -4469179 -1749707 216282 -9254 -1361868 -2255325 -2841888 -4070144 -5561402
34182 -5561402 -6063838 -5472049 -4756402 -4135012 -2946006 -1300088 -175502 362453 1328690
34173 1328690 2691840 2831678 1113316 -535643 -58783 1764833 2384160 978606 -613867
34164 -613867 -401502 1524485 3422964 3759972 2441035 635605 -560183 -1302597 -2337194
34155 -2337194 -3133755 -1911961 1687702 5166899 5786444 3818804 1656163 336216
34147 336216 -1123287 -3112462 -4262419 -3451324 -1362906 651619 1951561 2209599 986917
34138 986917 -1352825 -3308728 -3781550 -3285119 -2951098 -3057241 -3192207 -3119208 -2744827
34129 -2744827 -1884477 -772171 -240989 -749493 -1719755 -2345496 -2511640 -2505129 -2484450 -2641975
34119 -2641975 -3141110 -3523601 -3084223 -2189439 -2039250 -2604160 -2288363 -576484 581749
34110 581749 -503128 -2551915 -3208924 -2553634 -2503876 -3337370 -3245436 -1395351 813359
34101 813359 2048636 2674730 3323178 3458286 2396922 687010 -441001 -329846 917592
34092 917592 2797519 4511335 5336535 5213357 4504474 3285864 1637817 386407 405604
34083 405604 1252715 1759783 1937726 2748682 3817377 3227448 373811 -2619174 -3452645
34074 -3452645 -2367176 -1158987 -600029 -157881 495158 1040296 1241763 1141172 758502
34065 758502 198700 -353959 -1143875 -2625580 -4289334 -4667804 -3207137 -1191802 -36484
34056 -36484 361267 720357 957214 827578 1004104 2171212 3753701 4762331 5184096
34047 5184096 5362331 4881384 3437360 1927996 1154255 376270 -1083007 -1831993 -298540
34038 -298540 2145229 2697195 1491785 1380208 2956709 3065654 -345079 -4718655 -6331417
34029 -6331417 -5148671 -3895324 -3760180 -3585937 -2664553 -1933596 -2266520 -3255753 -3958708
34020 -3958708 -3750137 -2425883 -427559 1140660 1602288 1589098 1958641 2243044 1343828
34011 1343828 -483517 -1720206 -1792335 -1877079 -2995330 -4326854 -4197720 -2212350 291860
34002 291860 1760333 1948707 1886595 2470859 3262046 2946829 1052499 -1236869 -2300411
33993 -2300411 -1751507 -501371 461098 834997 872404 1080927 1901710 3201891 4256843
33984 4256843 4581964 4408003 3957781 2917538 1337922 336653 764700 1635764 1243514
33975 1243514 -297571 -1052149 24562 1742368 2479890 2122512 1607582 1576901 2132652
33966 2132652 3010130 3322767 2020781 -650211 -2954207 -3676791 -3484041 -3416860 -3017170
33957 -3017170 -1316634 933273 1701642 432541 -1046409 -849033 736151 1950284
33949 1950284 1837539 1105445 909257 1314560 1195981 -358086 -2751748 -4359426 -4330666
33940 -4330666 -3430063 -2913322 -3218205 -4137350 -5465537 -6694053 -6768444 -5246942 -3275099
33931 -3275099 -2223691 -1626434 175132 3326738 5844722 6103301 4670367 3064074
33923 3064074 1835815 749127 -37942 -46178 651180 1433552 1836373 1799328 1506558 1304322
33913 1304322 1383500 1316923 486046 -784078 -1252827 -289463 1413755 3014210 4391227
33904 4391227 5300550 4900738 3133892 1480834 1088082 1123560 429467 -199648 691282
33895 691282 2329277 2405465 578840 -973851 -850530 -85778 138867 291878 907728
33886 907728 1175056 592581 389518 1541815 2663234 1817965 -440652 -1818777 -1537072
33877 -1537072 -887931 -782803 -695855 -202941 195045 216732 300125 503413 265907 -232153
33867 -232153 145080 1604346 2599866 1913819 566710 458918 1731687 2710370 2259633
33858 2259633 1111283 689119 1315068 1890283 1156231 -794494 -2335523 -1996563 -354513
33849 -354513 442671 -652658 -2205567 -2276326 -1046969 -380003 -1117065 -2092668 -1974642
33840 -1974642 -947442 -76674 134195 -112995 -626412 -1348235 -2035283 -2425022 -2590827
33831 -2590827 -2668944 -2403816 -1481960 -209543 707351 1047477 1155046 1099714 519522 -361468
33821 -361468 -357170 1246872 3333840 3981182 2727104 859404 -604703 -2059336 -3886556
33812 -3886556 -5001612 -4006214 -1332519 997439 1788145 1845021 2532941 4074265 5693064
33803 5693064 6695050 6825631 6077893 4761602 3475733 2533407 1659656 634553 -121579
33794 -121579 -88714 560240 1271773 1916609 2614423 3024747 2715716 2228219 2765374 4477369
33784 4477369 5958941 6059790 5445147 5524142 6383503 6875821 6579666 6459912 7243406
33775 7243406 8156890 8001305 6844850 5797967 5398895 5081167 4265805 3228416 2590214
33766 2590214 2439923 2325088 1895617 1348386 1382495 2713189 5267930 7791662 8768126
33757 8768126 8070467 7288586 7963622 9790358 11094087 10909795 10000623 9821808 11024772
33748 11024772 13093940 14941006 15595874 14721229 12862149 11095296 10202001 10202007 10702978
33739 10702978 11483531 12609108 14156426 15962963 17545970 18296139 18076688 17736483 18579913
33730 18579913 20889379 23195263 23574851 21780772 19671599 19302186 20869422 22846213
33722 22846213 23914421 24214132 24532123 24795588 24037395 21895508 19572003 18855950 20324547
33713 20324547 22821236 24662682 25096322 24585207 23979309 23630145 23276197 22633215 21891630
33704 21891630 21453909 21272917 20834166 19967128 19300007 19486736 20150231 20093094 18667374
33695 18667374 16636205 15532313 16272723 18381237 20379826 20911920 19639081 17182908
33687 17182908 14391125 11912088 10316787 9946136 10320151 10311738 9475658 8741217 9145527
33678 9145527 10356265 11305939 11884376 12843965 14109321 14444130 13110761 10805032 8549567
33669 8549567 6674243 5379975 5221727 6190248 7123142 6952111 5995095 5232921 4878420
33660 4878420 4509180 4074190 3787693 3414752 2685007 2166076 2673248 3872225 4445934
33651 4445934 3716896 2264096 895570 -108059 -599887 -319847 614168 1624316 2370395
33642 2370395 3005310 3617828 4053493 4402952 4920952 5253362 4581440 2943631 1622104
33633 1622104 1611184 2310539 2376094 1367642 -85439 -1251764 -1642256 -797764 1242806
33624 1242806 3288515 3796816 2667563 1527633 1769580 2826921 2961212 1445796 -688872
33615 -688872 -2055067 -2413689 -2475403 -2605132 -2265042 -806748 1505144 3500292 4151574
33606 4151574 3580564 2945685 3185213 3893727 3781763 2409565 976682 873474 1875649
33597 1875649 2640647 2754200 3031881 3586540 3126878 1163431 -374939 632838 3290127
33588 3290127 4521571 3078068 923158 212804 626485 683414 286518 458892 1303536
33579 1303536 1793898 1465161 1029873 1137063 1515451 1643500 1469086 1094846 418816
33570 418816 -433136 -815492 -273211 705717 1165524 819027 260019 43155 4693 -316937
33560 -316937 -918452 -1294046 -1026347 -181090 789269 1332064 1132174 468213 139043 678216
33550 678216 1686603 2336227 2474867 2693290 3285241 3854830 4172595 4619128 5306596
33541 5306596 5551428 4949067 4286488 4444642 4907211 4433687 2876502 1183100 -186059
33532 -186059 -1543105 -2678790 -2698689 -1550625 -500960 -511368 -1107801 -1367284 -1073390
33523 -1073390 -399940 511017 1062154 414668 -1024500 -1457681 -46356 1666346 1897295
33514 1897295 1141306 979799 1235965 350615 -1670510 -2838977 -2139315 -1060031 -1333420
33505 -1333420 -2598246 -3375684 -3301865 -3189367 -3468429 -3660243 -3187659 -1975502 -432860
33496 -432860 661947 619099 -259677 -621208 435765 2108417 2845626 2275152 1326059
33487 1326059 587272 -351853 -1608428 -2079377 -646675 2158355 4529521 5320327 4945536
33478 4945536 4376617 3965509 3555383 3188252 3158669 3548284 4107708 4516536 4476407 3702835
33468 3702835 2227635 691822 -51398 234544 920103 1131687 514502 -497087 -960336
33459 -960336 -194918 1324493 2025569 796209 -1465182 -2490787 -1138232 1200593 2058901
33450 2058901 526423 -1859544 -2715194 -1125974 1568228 3250752 3226674 2597886 2345876
33441 2345876 1872444 273297 -1668747 -2251484 -1438770 -977911 -1613163 -1956754 -953665
33432 -953665 275716 431511 398226 1760517 3915731 4734379 3713041 2489565 2235418
33423 2235418 2405924 2385425 2654020 3678892 4968056 5851213 6127784 5526308 3737336
33414 3737336 1491762 301963 386129 90868 -1675690 -3608075 -3848371 -2763914 -2383079
33405 -2383079 -3468004 -4603057 -4236878 -2467041 -548258 499308 491398 -42401 -258722
33396 -258722 271773 1008335 978959 27305 -876215 -791599 83088 806470 970934 1112905
33386 1112905 1774206 2574607 2611484 1654266 471321 -167189 -417804 -1030311 -2384895
33377 -2384895 -4141705 -5567952 -5960528 -5158148 -4017169 -3881212 -4982046 -5829948 -4954528
33368 -4954528 -2842340 -1236048 -891886 -1180026 -1638893 -2445832 -3211179 -2871956 -1380451
33359 -1380451 -156026 -80286 -243764 408713 1343442 1516048 1225391 1494642 2213577
33350 2213577 2355584 1790166 1511290 2031508 2715286 2870965 2502111 1749542 525895
33341 525895 -886683 -1611429 -1100754 72258 743417 316804 -800245 -1776556 -2203214
33332 -2203214 -2330540 -2463229 -2319578 -1383154 138512 1297865 1559298 1376106 1309129
33323 1309129 1211735 723666 -86563 -1092261 -2396029 -3613265 -3718975 -2531181 -1513866
33314 -1513866 -1856983 -2431329 -1197475 1709580 3983814 4187954 3081887 1758032 364003
33305 364003 -671305 -79122 2253536 4199582 3935932 2553647 2352525 3238936 2963541
33296 2963541 956656 -290252 1352688 4460492 5773619 4280692 2029552 1123161
33288 1123161 1479521 1960578 2354974 3201478 4364004 4975838 4686009 4032073 3529461
33279 3529461 3193612 3037838 3187569 3317512 2902271 2344187 2782646 4153466 4538152
33270 4538152 2503987 -747344 -2825727 -3108064 -2797774 -2476447 -1396736 642805 2465112
33261 2465112 3192668 3345509 3503064 3203953 2211281 1669739 2560062 3759007 3259595
33252 3259595 1086960 -561027 -272705 867955 1072326 190103 -601817 -635534 -167615
33243 -167615 693184 2289121 4436669 6081143 6477387 6140088 5988263 5924516 5032890
33234 5032890 3095636 1121611 152346 165299 476724 677131 704468 408659 -352974
33225 -352974 -1272139 -1633642 -834880 1161184 3587483 5032410 4433008 2303159 495629
33216 495629 271933 1016649 1313994 784613 230530 417745 1458105 3040187 4477490
33207 4477490 4805837 3685660 2077837 1267079 1352155 1420732 995515 474337 302506
33198 302506 564327 1249233 2054893 2118936 933338 -614088 -1147220 -607208 -21538
33189 -21538 345583 1193048 2497023 3200688 2957745 2701637 2976003 3182510 3124806 3722912
33179 3722912 5217909 6116197 5173331 3262483 1972325 1400406 775452 350029 961038
33170 961038 2170109 2511768 1565189 444067 135406 438389 665706 482745 -81511
33161 -81511 -734022 -951883 -467927 343679 1010333 1589194 2223231 2514611 2080482 1369781
33151 1369781 1117168 1248668 1101401 460269 -424311 -1596689 -3288116 -5106446 -6058762
33142 -6058762 -5413153 -3171488 -20563 2757314 3900571 3354313 2317004 1535854 383537
33133 383537 -1590040 -3300418 -3635645 -3336925 -3704961 -4235766 -3561368 -2207788 -2031813
33124 -2031813 -2944465 -2749709 -812287 613997 -111520 -1374624 -792820 1372659 3155340
33115 3155340 3962973 4674361 5377948 5064095 3500644 1774953 768409 327351 148163
33106 148163 392610 1086408 1750253 2012803 2013627 1914214 1487880 482404 -922644 -2243184
33096 -2243184 -3108580 -3463695 -3472627 -3222017 -2453962 -742604 1887823 4632909 6394986
33087 6394986 6613544 5614851 4259638 3238315 2581030 1947856 1518868 2170899 4173350
33078 4173350 6023814 5636789 2953587 432563 339829 2211817 3709263 3510584 2505991
33069 2505991 2229640 2889579 3273999 2296936 275987 -1449735 -2025360 -1797692 -1374581
33060 -1374581 -599980 817736 2089123 1860429 -25276 -2315427 -4041760 -5324865
33052 -5324865 -6226469 -6139625 -5055880 -4240011 -4575010 -5125291 -4489003 -2873728 -1626118
33043 -1626118 -1258313 -1213117 -1180617 -1295562 -1227034 -434022 671198 1096876 865568 888207
33033 888207 1065437 52018 -2458509 -4640936 -4771865 -3486572 -2588728 -2399538 -1755875
33024 -1755875 -369979 290010 -1148282 -4144464 -6705771 -7153689 -5292898 -2435734
33016 -2435734 -467576 -298851 -1013284 -1110280 -686851 -1421211 -3875938 -5920174 -5051121
33007 -5051121 -1667817 1428004 2585135 2724355 2981020 2754345 1155951 -1000293 -2162253
$$ [...]
##END NTUPLES=NMR SPECTRUM
##END=
