##TITLE=31Pdec_DE-63_32
 D2O, 64 sc
 13.8.2024
##JCAMPDX= 6.0         $$ Bruker NMR JCAMP-DX V2.0
##DATA TYPE= NMR SPECTRUM
##DATA CLASS= NTUPLES
##ORIGIN= UXNMR, Bruker Analytische Messtechnik GmbH
##OWNER= root
$$ XWIN-NMR		Version 3.5
$$ Tue Aug 13 16:55:02 2024 Russian Standard Time (UT+4h)  she@DPX200
##.OBSERVE FREQUENCY= 81.013821
##.OBSERVE NUCLEUS= ^31P
##.ACQUISITION MODE= SIMULTANEOUS
##.ACQUISITION SCHEME= undefined
##.AVERAGES= 64
##.DIGITISER RES= 17
##SPECTROMETER/DATA SYSTEM= spect
##.PULSE SEQUENCE= zgpg30
##.SOLVENT NAME= D2O
##.SHIFT REFERENCE= (INTERNAL, D2O, 0, 198.062)
##AUDIT TRAIL= $$ (NUMBER, WHEN, WHO, WHERE, WHAT)
$$ ##TITLE= Audit trail, XWIN-NMR		Version 3.5
$$ ##JCAMPDX= 5.01
$$ ##ORIGIN= Bruker BioSpin GmbH
$$ ##OWNER= she
$$ F:/spectra/data/she/nmr/P31/2/pdata/1/auditp.txt
$$ ##AUDIT TRAIL=  $$ (NUMBER, WHEN, WHO, WHERE, WHAT)
(   1,<2024-08-13 16:54:15.85 +0400>,<she>,<DPX200>,
      <created by zg, POWCHK disabled, PULCHK disabled
       configuration hash MD5:
       00 E9 B6 7A A2 85 ED C7 34 08 36 98 17 FE 4E 26
       data hash MD5: 32K
       B5 89 A0 E7 A4 5A 98 CE FE 6A 6C ED C3 3C DD 7F>)
(   2,<2024-08-13 16:54:18.53 +0400>,<she>,<DPX200>,
      <Start of raw data processing
       efp BC_mod = 2 LB = 1.5 FT_mod = 6 PKNL = 1 PHC0 = 2682.768 PHC1 = 60.48804 SI = 64K 
       data hash MD5: 64K
       08 2E 24 40 65 A0 BE 36 18 56 8F BC 26 C4 6B 0A>)
(   3,<2024-08-13 16:54:39.21 +0400>,<she>,<DPX200>,
      <pk PHC0 = -20.25981 PHC1 = 47 
       data hash MD5: 64K
       D7 12 08 4D A7 6E 71 24 C9 15 4F 0F 45 5A 04 1A>)
$$ ##END=
$$ 
$$ hash MD5
$$ 9A 30 61 D0 33 64 A0 A8 2C B7 8B 1E D1 4B A9 9E
##$RELAX= 
##$RELAX= 
##$RELAX= 
##$RELAX= 
##$RELAX= 
##$RELAX= 
##$RELAX= 
##$RELAX= 
$$ Bruker specific parameters
$$ --------------------------
##$DU= <F:/spectra>
##$EXPNO= 2
##$NAME= <P31>
##$PROCNO= 1
##$TYPE= <nmr>
##$USER= <she>
##$AMP= (0..31)
100 100 100 100 100 100 100 100 100 100 100 100 100 100 100 100 100 100 
100 100 100 100 100 100 100 100 100 100 100 100 100 100 
##$AQSEQ= 0
##$AQ_mod= 1
##$AUNM= <au_zg>
##$AUTOPOS= <>
##$BF1= 81.014009
##$BF2= 200.13
##$BF3= 200.13
##$BF4= 200.13
##$BF5= 200.13
##$BF6= 200.13
##$BF7= 200.13
##$BF8= 200.13
##$BYTORDA= 1
##$CFDGTYP= 0
##$CFRGTYP= 5
##$CHEMSTR= <none>
##$CNST= (0..31)
1 1 145 1 1 1 1 1 1 1 1 1 1 1 1 1 1 1 1 1 1 1 1 1 1 1 1 1 1 1 1 1 
##$CPDPRG= <waltz16>
##$CPDPRG1= <>
##$CPDPRG2= <waltz16>
##$CPDPRG3= <>
##$CPDPRG4= <mlev>
##$CPDPRG5= <mlev>
##$CPDPRG6= <mlev>
##$CPDPRG7= <mlev>
##$CPDPRG8= <mlev>
##$CPDPRGB= <>
##$CPDPRGT= <>
##$D= (0..31)
0 1 0 0 0 0 0 0 0 0.06 0 0.03 2e-05 3e-06 0 0 0.0002 0 0 0 0 0 0 0 0 0 
0 0 0 0 0 0 
##$DATE= 1723553655
##$DBL= (0..7)
120 120 120 11 120 120 24 19 
##$DBP= (0..7)
150 150 150 150 150 150 150 150 
##$DBP07= 0
##$DBPNAM0= <>
##$DBPNAM1= <>
##$DBPNAM2= <>
##$DBPNAM3= <>
##$DBPNAM4= <>
##$DBPNAM5= <>
##$DBPNAM6= <>
##$DBPNAM7= <>
##$DBPOAL= (0..7)
0.5 0.5 0.5 0.5 0.5 0.5 0.5 0.5 
##$DBPOFFS= (0..7)
$$ [...]
##$SUBNAM2= <"">
##$SUBNAM3= <"">
##$SUBNAM4= <"">
##$SUBNAM5= <"">
##$SUBNAM6= <"">
##$SUBNAM7= <"">
##$SUBNAM8= <"">
##$SUBNAM9= <"">
##$SW= 400.765351723535
##$SWIBOX= (0..15)
0 1 3 0 0 0 0 0 0 0 0 0 0 0 0 0 
##$SW_h= 32467.5324675325
##$TD= 32768
##$TD0= 1
##$TE= 0
##$TE2= 300
##$TE3= 300
##$TEG= 300
##$TL= (0..7)
0 120 53 12 22 120 120 120 
##$TP= (0..7)
150 150 150 150 150 150 150 150 
##$TP07= 0
##$TPNAME0= <>
##$TPNAME1= <>
##$TPNAME2= <>
##$TPNAME3= <>
##$TPNAME4= <>
##$TPNAME5= <>
##$TPNAME6= <>
##$TPNAME7= <>
##$TPOAL= (0..7)
0.5 0.5 0.5 0.5 0.5 0.5 0.5 0.5 
##$TPOFFS= (0..7)
0 0 0 0 0 0 0 0 
##$TUNHIN= 0
##$TUNHOUT= 0
##$TUNXOUT= 0
##$USERA1= <user>
##$USERA2= <user>
##$USERA3= <user>
##$USERA4= <user>
##$USERA5= <user>
##$V9= 5
##$VALIST= <valist>
##$VCLIST= <CCCCCCCCCCCCCCC>
##$VD= 0
##$VDLIST= <DDDDDDDDDDDDDDD>
##$VPLIST= <PPPPPPPPPPPPPPP>
##$VTLIST= <TTTTTTTTTTTTTTT>
##$WBST= 1024
##$WBSW= 4
##$XGAIN= (0..3)
0 0 0 0 
##$XL= 0
##$YL= 0
##$YMAX_a= 21384
##$YMIN_a= -18209
##$ZGOPTNS= <>
##$ZL1= 120
##$ZL2= 120
##$ZL3= 120
##$ZL4= 120
##$ABSF1= 0
##$ABSF2= 0
##$ABSG= 0
##$ABSL= 0
##$ALPHA= 0
##$AQORDER= 0
##$ASSFAC= 0
##$ASSFACI= 0
##$ASSFACX= 0
##$ASSWID= 0
##$AUNMP= <proc_1d>
##$AZFE= 0.1
##$AZFW= 0.5
##$BCFW= 0
##$BC_mod= 2
##$BYTORDP= 0
##$COROFFS= 0
##$CY= -3
##$DATMOD= 1
##$DC= 0
##$DFILT= <>
##$DTYPP= 0
##$F1P= 0
##$F2P= 0
##$FCOR= 1
##$FTSIZE= 65536
##$FT_mod= 6
##$GAMMA= 0
##$GB= 0
##$INTBC= 1
##$INTSCL= 9.790993e-09
##$ISEN= 30
##$LB= 1.5
##$LEV0= 0
##$LPBIN= 0
##$MAXI= 10000
##$MC2= 0
##$MEAN= 0
##$ME_mod= 0
##$MI= 50
##$NCOEF= 0
##$NC_proc= -8
##$NLEV= 6
##$NOISF1= 182.463
##$NOISF2= 159.3651
##$NSP= 0
##$NTH_PI= 0
##$NZP= 0
##$OFFSET= 198.0616
##$PC= 4
##$PHC0= 2662.508
##$PHC1= 107.488
##$PH_mod= 1
##$PKNL= yes
##$PPARMOD= 0
##$PSCAL= 0
##$PSIGN= 0
##$REVERSE= no
##$SF= 81.0140089999434
##$SI= 65536
##$SIGF1= 159.3651
##$SIGF2= -187.1042
##$SINO= 113.3802
##$SIOLD= 16384
##$SREGLST= <1H.CDCl3>
##$SSB= 0
##$STSI= 65536
##$STSR= 0
##$SW_p= 32467.5324675325
##$SYMM= 0
##$S_DEV= 0
##$TDeff= 32768
##$TDoff= 0
##$TI= <>
##$TILT= no
##$TM1= 0
##$TM2= 0
##$TOPLEV= 0
##$USERP1= <user>
##$USERP2= <user>
##$USERP3= <user>
##$USERP4= <user>
##$USERP5= <user>
##$WDW= 1
##$XDIM= 65536
##$YMAX_p= 432379967
##$YMIN_p= -68338553
$$ End of Bruker specific parameters
$$ ---------------------------------
##NTUPLES= NMR SPECTRUM
##VAR_NAME=  FREQUENCY,     SPECTRUM/REAL,   SPECTRUM/IMAG
##SYMBOL=    X,             R,               I
##VAR_TYPE=  INDEPENDENT,   DEPENDENT,       DEPENDENT
##VAR_FORM=  AFFN,          ASDF,            ASDF
##VAR_DIM=   65536,         65536,           65536
##UNITS=     HZ,            ARBITRARY UNITS, ARBITRARY UNITS
##FACTOR=    0.49542278885378, 1,            1
##FIRST=     16045.7642231865, 0,            0
##LAST=      -16421.768244346, 0,            0
##MIN=       -16421.768244346, -68338553,    0
##MAX=       16045.7642231865, 432379967,    0
$$ Real data points
##PAGE= N=1
##DATA TABLE= (X++(R..R)), XYDATA
$$ [...]
40129h240587l725634M96K105827R26339K03298J935808K971431O15657k411452
$$ -8240587 -11966221 -11965725 -9859898 -8933559 -8730261 -6794453 -3823022 -3207365 -5618817
40120e618817j852852J625629L456735J734569p31770j148119l36462l66158j127421
$$ -5618817 -7471669 -5846040 -2389305 -654736 -1386506 -2534625 -2871087 -3237245 -4364666
40111d364666j186871l57179N98283J583735K513113K209095K35958j197588J00563
$$ -4364666 -5551537 -5908716 -5310433 -3726698 -1213585 995510 1231468 33880 134443
40102A34443K436997K223918l47953j306347P65721K248602P2176l660229n053727
$$ 134443 2571440 4795358 4447405 3141058 3906779 6155381 6227557 2567328 -2486399
40093b486399l564418j086708J484740L658644L554917L52986k917406k647314
$$ -2486399 -6050817 -7137525 -5652785 -1994141 1560776 1913762 -1003644 -3650958
40085c650958K19471J738491Q20543p7258L70700Q07214M40678J96370J08928
$$ -3650958 -3431487 -1692996 -872453 -949711 -579011 228203 668881 865251 974179
40076I74179r92819k459376j871443P98293K318597R29122j063809j130789j91521
$$ 974179 -18640 -2478016 -4349459 -3551166 -1232569 -303447 -1367256 -2498045 -2689566
40067b689566l65149j339912j298594P1575J477368J833080P93331j345583l239292
$$ -2689566 -3054715 -4394627 -5693221 -5621646 -4144278 -2311198 -1517867 -2863450 -6102742
40058f102742l391475k298545j993650k713925k273224J63506K279457K217298
$$ -6102742 -9494217 -11792762 -13786412 -16500337 -18773561 -18610055 -16330598 -14113300
40050a4113300J363263J404423J257927k54757j075313J119137M167568L632772
$$ -14113300 -12750037 -11345614 -10087687 -10342444 -11417757 -10298620 -6131052 -2498280
40042b498280p41473m479874m448625k164133m34830K75389R58851J905907K846194
$$ -2498280 -3239753 -7719627 -12168252 -14332385 -14767215 -14491826 -13532975 -11627068 -8780874
40033h780874L696272M073412L243505J332803m31133j200235j225492q23181
$$ -8780874 -5084602 -1011190 2232315 3565118 3133985 1933750 708258 -114923
40025a14923J29193J209052J212025l28752k211168k839216j931065n39625K11453
$$ -114923 14270 1223322 2435347 2106595 -104573 -2943789 -4874854 -5414479 -5203026
40016e203026J04066k58180m31881r20315k389617m048575m023561j993753m1787
$$ -5203026 -5098960 -5357140 -5789021 -6709336 -9098953 -13147528 -17171089 -19164842 -19206629
40007a9206629K95282L06825J652608L094572K287723m5027p95903Q06291K293586
$$ -19206629 -18911347 -18604522 -16951914 -13857342 -11569619 -11614646 -12410549 -11604258 -9310672
39998i310672K183320J864567K213959J607977p20077k161997k67458L177230
$$ -9310672 -7127352 -5262785 -3048826 -1440849 -2160926 -4322923 -4590381 -1413151
39990a413151M441573K850693O71554q79339k308842l049564j564220J185862
$$ -1413151 3028422 5879115 6550669 5671330 3362488 312924 -1251296 -65434
39982f5434J693032j183115l925289k991985L27790K096971J296150L90847R45544
$$ -65434 1627598 444483 -3480806 -6472791 -6145001 -4048030 -2751880 -2361033 -1415489
39973a415489J633759J062524L6344j39807K61158L35418J16261j74438j130455
$$ -1415489 218270 1280794 1317138 1177331 1438489 1773907 1890168 1715730 585275
39964E85275k827439l619698k167734J35693Q51172P6878J7412J147489J466616
$$ 585275 -2242164 -5861862 -8029596 -7893903 -7042731 -6965853 -6948441 -5800952 -4334336
39955d334336Q4156j126640o59953K05757j87253j030613o56961N05267Q00137
$$ -4334336 -4250180 -5376820 -6036773 -5831016 -6018269 -7048882 -7705843 -7200576 -6400439
39946f400439J50206j80306P8300K17412L87205J252447K056264J223158r64951
$$ -6400439 -6250233 -6430539 -6352239 -6134827 -5747622 -4495175 -2438911 -1215753 -2180704
39937b180704k314778j728642m53819J96502O56550J810475L229568L676039K561466
$$ -2180704 -4495482 -6224124 -6677943 -6481441 -5824891 -4014416 -784848 2891191 5452657
39928E452657K71663k255755l848901l752337k452662j344273j269619j754703
$$ 5452657 5724320 3468565 -380336 -4132673 -6585335 -7929608 -9199227 -10953930
39920a0953930j701749m65862J502858K685392J819011j21038l21208K146562
$$ -10953930 -12655679 -13121541 -11618683 -8933291 -7114280 -7235318 -7556526 -5409964
39912e409964M103364J970003k826188m895115j792309K756779L836891J389765
$$ -5409964 -1306600 663403 -2162785 -7057900 -8850209 -6093430 -2256539 -866774
39904h66774o36958J81676K290620K927685J475629n43120j781109k354415k769765
$$ -866774 -1503732 -1322056 968564 3896249 5371878 4828758 3047649 693234 -2076531
39895b076531k444151m39712K314671L116370Q50571k047345k567518r92861J89581
$$ -2076531 -4520682 -4960394 -2645723 470647 1321218 -726127 -3293645 -4286506 -4096925
39886d096925L12914Q28968J911088J781769Q87j379153j064826m58987r12675
$$ -4096925 -3784011 -2955043 -1043955 737814 738701 -640452 -1705278 -2164265 -3076940
39877c076940j266763O464J904970K172840M69852j454291k122923j565376o92695
$$ -3076940 -4343703 -4337239 -2432269 -259429 210423 -1243868 -3366791 -4932167 -5624862
39868e624862l62808o14018m48585Q48782K206963K005155P88891O75242J717165
$$ -5624862 -5987670 -6601688 -7050273 -6201491 -3994528 -1989373 -1200482 -525240 1191925
39859A191925J443090r93354k923535k077450J09643J156316J198744J556209
$$ 1191925 2635015 1641661 -1281874 -3359324 -3249681 -2093365 -894621 661588
39851F61588J653081K16888j845792k525222j672416n05774P34278K242115K920816
$$ 661588 2314669 2531557 685765 -1839457 -3511873 -4017647 -3283369 -1041254 1879562
39842A879562J720446l35789j792702k986942m049684k711262K168819O557429
$$ 1879562 3600008 3264219 1471517 -1515425 -5565109 -8276371 -6107552 449877
39834D49877N486185O66292j289880J415824L215331q2024n077034o127466k839501
$$ 449877 5936062 6602354 5312474 6728298 9943629 9861605 4784571 -1342895 -4182396
39825d182396J060415L111383K944050L97557l457751n283100l093089L71714
$$ -4182396 -3121981 -10598 2933452 3331009 -126742 -5409842 -8502931 -8131217
39817h131217J225620R4042M82997K465278K445037m80323k389940m86865K500052
$$ -8131217 -6905597 -6811555 -6328558 -3863280 -1418243 -1898566 -4288506 -4775371 -2275319
39808b275319K511488R7236j044867J14053J117123O70409N78945K024712K856423
$$ -2275319 236169 333405 -711462 -597409 519714 1190123 1769068 3793780 6650203
39799F650203P75390k571705l399640j126818P63927l15029k554162k558438q3004
$$ 6650203 7425593 4853888 1454248 327430 1091357 776328 -1777834 -4336272 -4419276
39790d419276J888978J235475q15657j527164J3173J919945J724158o17033k360666
$$ -4419276 -2530298 -1294823 -2110480 -3637644 -3624471 -1704526 19632 -597401 -2958067
39781b958067j209245J593398K738985J276134l74775k90284L54088j43373j024626
$$ -2958067 -4167312 -2573914 165071 1441205 1066430 776146 1130234 986861 -37765
39772c7765p33153J26368q4953j139962j613892j457685j368339n38963K034590
$$ -37765 -770918 -644550 -729503 -1869465 -3483357 -4941042 -6309381 -6848344 -4813754
39763d813754M589971M138886R51027j548281j562699o06711j21560L37496Q18289
$$ -4813754 -223783 3915103 4866130 3317849 1755150 1148439 1026879 1364375 2182664
39754B182664J55433j385355j686788l34135M02391m02153n29312J171664K030436
$$ 2182664 2338097 952742 -734046 -1068181 -665790 -1067943 -1597255 -425591 1604845
39745A604845j94334l052749k742108K17182K091593J515107O29450J154006K207454
$$ 1604845 1410511 -1642238 -4384346 -4167164 -2075571 -560464 68986 1222992 3430446
39736C430446K067215Q9536k890403m639883l030470Q72875K762303M17765k610096
$$ 3430446 5497661 5587197 2696794 -1943089 -4973559 -4100684 -1338381 -920616 -3530712
39727c530712j763521J564972K024812j209868k831958M56714M718504M560200
$$ -3530712 -5294233 -3729261 -1704449 -2914317 -5746275 -5289561 -571057 3989143
39719C989143Q35436j251748j574J005367r62950l628477l364397n76097J077438
$$ 3989143 4824579 3572831 3571257 4576624 3613674 -14803 -3379200 -3955297 -2877859
39710b877859j58059k294704k932988j962920j10453K727938N788403O193189
$$ -2877859 -3035918 -5330622 -8263610 -10226530 -10336983 -7609045 -1820642 4372547
39702D372547K381834k408915l560135j511710r19438l144378m122596j339542
$$ 4372547 6754381 4345466 785331 -726379 -1645817 -4790195 -8912791 -10252333
39694a0252333J654648Q57411j828004j974873L46074J545354Q17393O44389J657978
$$ -10252333 -8597685 -7740274 -9568278 -11543151 -11197077 -9651723 -8834330 -8189941 -6531963
39685f531963J670068J00795p93677P5279R93339P88237N49964Q78332M40271
$$ -6531963 -4861895 -4761100 -5554777 -5479498 -4486159 -3697922 -3147958 -2269626 -1829355
39676a829355j343047k803127k647486j774150j146058r3061J814573L222614
$$ -1829355 -3172402 -5975529 -8623015 -10397165 -11543223 -11636284 -9821711 -6599097
39668f599097K872616J387965j03562j490874k598299k322952l76003J488984
$$ -6599097 -3726481 -2338516 -2442078 -3932952 -6531251 -8854203 -9230206 -7741222
39660g741222J494809J10192q60582n55648M84309J256157J050270J55034K8718
$$ -7741222 -6246413 -6136221 -6996803 -7552451 -7068142 -5811985 -4761715 -4606681 -4577963
39651d577963J540149L101257K398143O582j174104m96422n71516k554403l669531
$$ -4577963 -3037814 63443 2461586 2468168 1294064 797642 226126 -2328277 -5997808
39642e997808j623562J395538K088164J145690J458610K703652J734752j805909
$$ -5997808 -7621370 -6225832 -4137668 -2991978 -1533368 1170284 2905036 1099127
39634A099127m061873k227286J523351K965945J023295j516074j675837N45144
$$ 1099127 -2962746 -5190032 -3666681 -700736 322559 -1193515 -2869352 -2324208
39626b324208K579445K209283j86746k336484k720295j834384q23607N257P32912
$$ -2324208 255237 2464520 2277774 -58710 -2779005 -4613389 -5436996 -5431739 -4698827
39617d698827J008752O70701L41746L45448k16279k050262l872634l453394m78649
$$ -4698827 -3690075 -3019374 -2677628 -2332180 -2548459 -4598721 -8471355 -11924749 -12403398
39608a2403398K701209L443045J407880j228995j836722K14186K891555L567483
$$ -12403398 -9702189 -6259144 -4851264 -6080259 -7916981 -7702795 -4811240 -1243757
39600a243757J828830k58124o57957O56624K268398K812946J704258n14549k210654
$$ -1243757 585073 326949 -331008 325616 2594014 5406960 7111218 6596669 4386015
39591D386015k115505r54871m73096r00566j071525j001003j908869l166223k162599
$$ 4386015 2270510 1315639 842543 -58023 -1129548 -2130551 -4039420 -7205643 -9368242
39582i368242J295825L329105J129592k531007k866718M39665L404293L416600
$$ -9368242 -8072417 -4743312 -3613720 -6144727 -9011445 -8571780 -5167487 -1750887
39574a750887J650415J71893m49931m17191L8966K18060m86256j348556j094460
$$ -1750887 -100472 71421 -378510 -795701 -756735 -538675 -1024931 -2373487 -3467947
39565c467947J12859Q67508N33471k61118q19242q00873P207J070666J059507
$$ -3467947 -3355088 -2487580 -1954109 -2215227 -3034469 -3835342 -3828135 -2757469 -1697962
39556a697962j79585p02725P61690K417592J962182K55946k43176M00571K19183
$$ -1697962 -1877547 -2580272 -1818582 599010 2561192 2817138 2573962 2974533 3193716
39547C193716o52662j77836J466949J654777k66816j792414j425634p08640q18415
$$ 3193716 2541054 2363218 3830167 5484944 5218128 3425714 2000080 1291440 473025
39538D73025l54572J657772L312033K516280Q6328j808603k530354k490023j415347
$$ 473025 118453 1776225 5088258 7604538 7690866 5882263 3351909 861886 -553461
39529e53461R49263L473872M541160L614542J172702j736266l396630k655445
$$ -553461 395802 3869674 8410834 12025376 13198078 11461812 8065182 5409737
39521E409737r42926j000802k715097k674961O99297M188417M077253J180565
$$ 5409737 4466811 3466009 750912 -1924049 -1224752 2963665 7040918 8221483
39513H221483j021723j429691j489839j544823l77101J729765K433892N83825
$$ 8221483 7199760 5770069 4280230 2735407 2358306 4088071 6521963 7105788
39505G105788j946490k540119q15483J277578J720207M94842m57286M03433K011809
$$ 7105788 5159298 2619179 1803696 3081274 4801481 5296323 4839037 5242470 7254279
39496G254279J848874o18750l191984m098871l943803l472645j651359K016419
$$ 7254279 9103153 8484403 5292419 1193548 -2750255 -6222900 -7874259 -5857840
39488e857840N071867M634719J374142j558406k853277l634820m049380k286094
$$ -5857840 -785973 3848746 5222888 3664482 811205 -2823615 -6872995 -9159089
39480i159089K124304O324550O950740L871658K2819j915501j873743j628232
$$ -9159089 -7034785 -710235 6240505 10112163 10134982 8219481 6345738 4717506
39472D717506k282102k994351k486919j212842p81655j295133j006611P67271
$$ 4717506 2435404 -558947 -3045866 -4258708 -5040363 -6335496 -7342107 -6574836
39464f574836K291179K145594J446293J611594J645753p877k131397j968340O57686
$$ -6574836 -4283657 -2138063 -691770 919824 2565577 2557700 426303 -1542037 -884351
39455h84351K944812K756827N05517k476386n111189n948050l800854J30044K685461
$$ -884351 2060461 4817288 5322805 2846419 -2264770 -8212820 -12013674 -11883630 -9198169
39446i198169K350800J016950J173197K609375L162297J995142P07958R86986
$$ -9198169 -6847369 -5830419 -4657222 -2047847 1114450 3109592 3817550 4804536
39438D804536K092351J651812j010226l554963l723060k650591k920012l876469
$$ 4804536 6896887 8548699 7538473 3983510 260450 -2390141 -5310153 -9186622
39430i186622k186422K255858M781508K522315r16777p22988J996210K598973
$$ -9186622 -11373044 -9117186 -4335678 -1813363 -2730140 -3453128 -1456918 1142055
39422A142055M77501o67763O11896J632518O29586p70283j105410j197682j531392
$$ 1142055 1619556 951793 1563689 3196207 3825793 3055510 1950100 752418 -778974
39413g78974j056493J40315K90732p28384q55743J90225M2845j724203k069990
$$ -778974 -1835467 -1695152 -1404420 -2132804 -2988547 -2798322 -2755477 -4479680 -6549670
39404f549670K82332J994416M33007j706473p24643K032940K550762N21207q70119
$$ -6549670 -6267338 -4272922 -3839915 -5546388 -6271031 -4238091 -1687329 -1166122 -2036241
39395b036241l28618M30059M62313Q26714J901888K458041J757964L82132j037057
$$ -2036241 -2364859 -1934800 -1472487 -645773 1256115 3714156 5472120 5854252 4817195
39386D817195k035291j764159k07992P79109j49155j287827k32558K115819K864359
$$ 4817195 2781904 1017745 809753 1588862 1439707 151880 -80678 2035141 4899500
39377D899500J768485J135513J322910K08347k231445k799823k50273J870144
$$ 4899500 6667985 7803498 9126408 9334755 7103310 4303487 4053214 5923358
39369E923358R7242l708835m848160k017443J640774K988790J994341M74385l56187
$$ 5923358 6020600 2311765 -2536395 -4553838 -2913064 75726 2070067 2544452 2188265
39360B188265o17307r96918j573691j289585Q34653L725197M684170K670959j4030
$$ 2188265 1570958 574040 -999651 -2289236 -1454583 2270614 6954784 9625743 9611713
39351I611713p06086p8030r37956l670759n156315k995914R53925K714119R39534
$$ 9611713 8905627 8827597 7889641 4218882 -937433 -3933347 -2979422 -265303 674231
39342F74231j944712l004592j692686O86689K924382M398050M546211L146224
$$ 674231 -1270481 -4275073 -5967759 -5281070 -2356688 2041362 6587573 9733797
39334I733797R86138o98451j526024j985755k188141j524278J46565J809409K366407
$$ 9733797 10719935 10021484 8495460 6509705 4321564 2797286 2943851 4753260 7119667
39325G119667J901519J319214J002869L90641j026645k585462k770106j037852
$$ 7119667 9021186 10340400 11343269 11733910 10707265 8121803 5351697 4313845
39317D313845R70869J016045q21494k163113j862068j659997k841356l302080
$$ 4313845 5284714 6300759 5479265 3316152 1454084 -205913 -3047269 -6349349
39309f349349p35538K762480L053737L85186q80902N78072R69234j714398l544954
$$ -6349349 -7084887 -4322407 -1268670 -883484 -1764386 -1186314 -217080 -1931478 -5476432
39300e476432q68009L268108L429653p8146k287173j269001J37331k01511j129541
$$ -5476432 -6344441 -3076333 353320 275174 -2011999 -3281000 -3143669 -3345180 -4474721
39291d474721j371822j209638l77678J977219M415501L870015L82675k095549
$$ -4474721 -5846543 -7056181 -7433859 -5456640 -1041139 2828876 3211551 1116002
39283A116002j078294J226780J626612J50491j238023j740072j581094p03638
$$ 1116002 37708 1264488 2891100 3041591 1803568 63496 -1517598 -2221236
39275b221236N09765P01571p08793k531070l620927m057342l563690r55117L257253
$$ -2221236 -1711471 -1009900 -1718693 -4249763 -7870690 -11928032 -15491722 -16446839 -13189586
39266a3189586N787730M239098M61866j704665r66418Q59238J749309J231678
$$ -13189586 -7401856 -3162758 -2700892 -4405557 -5371975 -4512737 -2763428 -1531750
39258a531750M1455n35570K86539J373241M49166k624014m816879l589244j47856
$$ -1531750 -1490295 -2025865 -1739326 -366085 83081 -2540933 -7357812 -10947056 -11094912
39249a1094912K487781L179405K669769J456459o4635m68645J247929L635620
$$ -11094912 -8607131 -5427726 -2757957 -1301498 -1366133 -1834778 -586849 3048771
39241C048771M212417K381541o65223l818674n836273m729813k86864L734668
$$ 3048771 7261188 9642729 8977506 5158832 -677441 -5407254 -5694118 -1959450
39233a959450L334584n387q26576K634436N838885M310750o03457m355744m960512
$$ -1959450 1375134 1369747 543171 3177607 9016492 13327242 12723785 8368041 3407529
39224C407529l619234j525238R38648K599687J964754m24141k152240j989937
$$ 3407529 -211705 -1736943 -798295 1801392 3766146 3342005 1189765 -800172
39216h00172j202319j130932r50560Q33587L445471M140373J783508j257987j897795
$$ -800172 -2002491 -3133423 -4083983 -3250396 195075 4335448 6118956 4860969 2963174
39207B963174k29894Q64906j49697j547609j247747O2811K37560r79644j819098
$$ 2963174 2733280 3598186 3448489 1900880 653133 715944 953504 -26140 -1845238
39198a845238j345204n97671o62305j138952j031738l3907J477782K709443K481779
$$ -1845238 -3190442 -3788113 -4450418 -5589370 -6621108 -6655015 -5177233 -2467790 13989
39189A3989L23586j962479j382130K414967N641337M472413P340k919674j942184
$$ 13989 337575 -1624904 -3007034 -592067 5049270 9521683 9529023 6609349 4667165
39180D667165J07169k62995k107631j935095M31516J233063j399022m185210l284318
$$ 4667165 4774334 4511339 2403708 468613 900129 2133192 734170 -3451040 -6735358
39171f735358K47425K388800J940572J009932N06777r55979l252350l608304p56122
$$ -6735358 -6487933 -4099133 -2158561 -1148629 -641852 -1597831 -4850181 -8458485 -9214607
39162i214607K794762M315956M010550K976972R86987j509563k135507k43978
$$ -9214607 -6419845 -2103889 1906661 4883633 5870620 4361057 2225550 1981572
39154A981572Q28113j420453l947054k319769K251457M600587L180180J044102
$$ 1981572 2809685 1389232 -2557822 -4877591 -2626134 1974453 5154633 6198735
39146F198735k66437k436070n321093n618020k563659j94737j135434k220654
$$ 6198735 5932298 3496228 -1824865 -7442885 -10006544 -10201281 -11336715 -13557369
39138a3557369K72235M396433N569725L545327K108975K916755L627355K152085
$$ -13557369 -13285134 -8888701 -3318976 226351 2335326 5252081 8879436 11031521
39130A1031521n00190k218692k263076j074395O01358J686984J104216j149606
$$ 11031521 10531331 8312639 6049563 4975168 5576526 7263510 8367726 7218120
39122G218120l723021m882127l641432m97743K518944L275590J680162k55466
$$ 7218120 3495099 -1387028 -5028460 -5526203 -3007259 268331 1948493 1693027
39114A693027r46447q33298r28094j168374j202788j372796j539920l16626K718711
$$ 1693027 746580 -86718 -1014812 -2183186 -3385974 -4758770 -6298690 -6615316 -3896605
39105c896605N110002L977476p8307l499773l989707k363420l27363J509181K914333
$$ -3896605 1213397 5190873 5112566 1612793 -2376914 -4740334 -5067697 -3558516 -644183
39096f44183L136989J826871m7566j067775q02291n1108p211j228800k980499
$$ -644183 2492806 4319677 4272111 3204336 2402045 2350937 2343726 1114926 -1865573
39087a865573l595483k019318R01182L025822K920739J194755o323J046181L679818
$$ -1865573 -5461056 -7480374 -6579192 -3553370 -632631 562124 555801 1601982 5281800
39078E281800M898686K401813k344376n274223m374112j736665k50186O429N62724
$$ 5281800 10180486 12582299 10237923 4963700 589588 -1147077 -1397263 -1390834 -828110
39069h28110J311144P70593j026516k191854j625092k14354Q11676J140782P19431
$$ -828110 483034 1253627 227111 -1964743 -3589835 -3804189 -2992513 -1851731 -1132300
39060a132300n36784j733243j112382J723925M484522M257906Q69621k647900
$$ -1132300 -1669084 -3402327 -4514709 -2790784 1693738 5951644 6821265 4173365
39052D173365l354733j745976r38843k355196l507639j406452K806319M928663
$$ 4173365 818632 -927344 -1866187 -4221383 -7729022 -9135474 -6329155 -1400492
39044a400492L309766P23905o5401K38644P665j11455R36715J747324M93298j684012
$$ -1400492 1909274 2633179 2567778 2806422 2814087 2702632 3639347 5386671 5879969 4195957
39034D195957k440447k190676k958221m109184k945234N40304L107860K961155
$$ 4195957 1755510 -435166 -3393387 -7502571 -10447805 -9907501 -6799641 -3838486
39026c838486J756046J230297Q90124L8009o06770l71715N13299K032586L936774
$$ -3838486 -2082440 -852143 37981 75990 -530780 -902495 -389196 1643390 5580164
39017E580164M131035P50456l832866m925523k253512m50356j410419j228306
$$ 5580164 9711199 10461655 6628789 1703266 -550246 -1000602 -2411021 -3639327
39009c639327K477704N428377L355068n95985q38210J526554J105489k203360
$$ -3639327 -1161623 4266754 7621822 7025837 6187627 7714181 8819670 6616310
39001F616310l210616p28804M08516j943149l316241m32490K903014J953040j397105
$$ 6616310 3405694 2676890 3085406 1142257 -2173984 -2606474 296540 2249580 852475
38992H52475k200813m74621l10403k522553l431816r78462K361709L611815K756819
$$ 852475 -1348338 -1822959 -2133362 -4655915 -8087731 -9066193 -6704484 -3092669 -335850
38983c35850J079838r38629k559841k128439N93799L090239K915709P49822r20485
$$ -335850 743988 -194641 -2754482 -4882921 -4289122 -1198883 1716826 2466648 1546163
38974A546163j126115p68089n23233l56606p42530k303007m001838l600433o49581
$$ 1546163 420048 -348041 -871274 -1227880 -1970410 -4273417 -8275255 -11875688 -12525269
38965a2525269K479704L441497K480837J175483K7197j152353j562597j92431
$$ -12525269 -10045565 -6604068 -4123231 -2947748 -2920551 -4072904 -5635501 -5827932
38957e827932K082354L170305K579655J704162J153401l8182j863778k307803
$$ -5827932 -3745578 -575273 2004382 3708544 4861945 4823763 2959985 652182
38949F52182l69404J719137J294066r64124k183429j394543k14375J48715J95122
$$ 652182 282778 2001915 3295981 2331857 148428 -1246115 -1460490 -1311775 -1116653
38940a116653K89355k36635j466446k204084j682313m54433J020425K912620M272702
$$ -1116653 -827298 -1063933 -2530379 -4734463 -6416776 -6871209 -5850784 -2938164 1334538
38931A334538K805618j835660o028040n701867j278295K901276L755193K124434
$$ 1334538 4140156 2304496 -3723544 -9425411 -10703706 -7802430 -4047237 -1922803
38923a922803L60976n40836p12956j52148J009421J927830J844888R94911J15146
$$ -1922803 -1561827 -2102663 -2815619 -2967767 -1958346 -30516 1814372 2809283 2924429
38914B924429l61592k28312M65703P49196p13921l371640m298298j644703K199370
$$ 2924429 2562837 2334525 2800228 3549424 2835503 -536137 -4834435 -6479138 -4279768
38905d279768L028583L28596j929074p05894K044255K312622m68884k983944k544901
$$ -4279768 -1251185 -922589 -2851663 -3557557 -1513302 799320 330436 -2653508 -5198409
38896e198409N334K136526K672994K203157J584538J085920N71998k54831j623664
$$ -5198409 -5193075 -3056549 -383555 1819602 3404140 4490060 5062058 4807227 3183563
38887C183563l163779l818684k913236j216061j89255j4593P33434K767143M302092
$$ 3183563 19784 -3798900 -6712136 -7928197 -8117452 -8132045 -7398611 -4631468 -329376
38878c29376L065838j20060j724863k51585J353057k03715l591202m630942k334607
$$ -329376 2736462 2616402 891539 639954 1993011 1789296 -1801906 -6432848 -8767455
38869h767455K513P2579l46307J051316L333613M300122L967250L557319K749771
$$ -8767455 -8764942 -8692363 -9038670 -7987354 -4653741 -353619 3613631 7170950 9920721
38860I920721P50312j107921p99042R50075J401607k98910k487508l928311m775954
$$ 9920721 10671033 9563112 8764070 9714145 11115752 10816842 8329334 4401023 -374931
38851c74931m755093l118098n95008J124045J925827K746133K743932K90814l006919
$$ -374931 -5130024 -8248122 -8843130 -7719085 -5793258 -3047125 -303193 -12379 -3019298
38842c019298l096989N64755L507504K465121k47905p92194P81326J779683J065804
$$ -3019298 -6116287 -5551532 -2044028 421093 173188 -619006 162320 1942003 3007807
38833C007807o20601k477552l383243j892235J185834K443318N70235j101149
$$ 3007807 2387206 -90346 -3473589 -5365824 -4179990 -1736672 -1166437 -2267586
38825b267586L61842K571445J638428j408203k411663p09924O78953N41857L85696
$$ -2267586 -1905744 665701 2304129 895926 -1515737 -2225661 -1546708 -1004851 -619155
38816f19155K92420j228406l027887j931114J508429K759442M75858q63819J870919
$$ -619155 -326735 -1555141 -4583028 -6514142 -5005713 -2246271 -1770413 -2634232 -763313
38807g63313M903772K922123k896559o337141m243940M37196L303420L209574
$$ -763313 4140459 7062582 4166023 -2171118 -6415058 -5977862 -2674442 535132
38799E35132J948693J298652J375380J256908N51266j04836l11641q09645k094357
$$ 535132 2483825 3782477 5157857 6414765 6966031 6861195 6549554 5739909 3645552
38790C645552l044628k607946j968035k681936l343868j214331K866187M706917
$$ 3645552 600924 -2007022 -3975057 -6656993 -10000861 -11215192 -8349005 -3642088
38782c642088K668404j26628p70991l39504q31230j602212j301938o34439n45079
$$ -3642088 -973684 -1100312 -1871303 -2210807 -3042037 -4644249 -5946187 -6580626 -7125705
38773g125705k0297J602298K347485N79503j639131j293025R90578K223878J714606
$$ -7125705 -7146002 -5543704 -3196219 -2616716 -4255847 -5548872 -4558294 -2334416 -619810
38764f19810J275801J655122J836612J376330O69224n66285k432367l198663j361852
$$ -619810 655991 2311113 4147725 5524055 6193279 5626994 3194627 -4036 -1365888
38755a365888J272219J620577n2347q68335m28771j319892l938943m775173j659913
$$ -1365888 -93669 1526908 1474561 606226 177455 -1142437 -5081380 -9856553 -11516466
38746a1516466K420413L204615P84142j100622j80144K177785L458986K797801
$$ -11516466 -9096053 -5891438 -5107296 -6207918 -6388062 -4210277 -751291 2046510
38738B046510J063890o46184j903511k556677k122447l12376J871393K670240
$$ 2046510 3110400 2464216 560705 -1995972 -4118419 -4430795 -2559402 110838
38730A10838J707470M68053k7231n70040j724471k210466j097729M8913m73043
$$ 110838 1818308 2286361 2259130 1689090 -35381 -2245847 -3343576 -3294663 -3767706
38721c767706j448964p73117P31953P52072j66706N53127K608642K781062L55808
$$ -3767706 -5216670 -5989787 -5257834 -4505762 -4672468 -4119341 -1510699 1270363 1626171
38712A626171j422012o03331M67146o47607k466896k221403j59989J171613M52575
$$ 1626171 204159 -399172 67974 -579633 -3046529 -5267932 -5427921 -4256308 -3803733
38703c803733j334963k069068J11430M647967P272615L814269l586361p545735
$$ -3803733 -5138696 -7207764 -7096334 -2448367 4824248 8638517 5052156 -2493579
38695b493579m661402L4279O99202j097436j90146L159786L883241P54941j478532
$$ -2493579 -7154981 -7120702 -6421500 -7518936 -7709082 -4549296 -666055 88886 -1389646
38686a389646M12078L418600L196433J32632k061142j559247K67437J529633J653945
$$ -1389646 -977568 2441032 5637465 5770097 3708955 2149708 2417145 3946778 5600723
38677E600723Q67790o01086k396259l618222l138192r19113J123117Q53018j027769
$$ 5600723 6468513 5867427 3471168 -147054 -3285246 -4204359 -3081242 -2228224 -3255993
38668c255993j335792J070156L105296J818543r74561j406090M75238J212739
$$ -3255993 -4591785 -3521629 -416333 1402210 427649 -978441 -503203 709536
38660G09536q9414n65087R67483J585815p76491l463610k933188P407J706798
$$ 709536 620122 55035 1022518 2608333 1831842 -1631768 -4564956 -4557549 -2850751
38651b850751Q31239o90231r28331J65619J547582J942565N85097j437535j658309
$$ -2850751 -2019512 -2709743 -3638074 -3472455 -1924873 17692 602789 -834746 -2493055
38642b493055L79227J703483O9356k050292p45374L043008M366587J541835j439341
$$ -2493055 -2113828 -410345 -340989 -2391281 -3136655 -93647 4272940 5814775 4375434
38633D375434j113486N61915K8487k094469k478541o82498L94119p18438k143607
$$ 4375434 3261948 3823863 3852350 1757881 -720660 -1403158 -1009039 -1727477 -3871084
38624c871084j987884q14061J62590J009671J894243J893777O05897n26677k51607
$$ -3871084 -5858968 -6673029 -6510439 -5500768 -3606525 -1712748 -1106851 -1633528 -1885135
38615a885135K86248o79195k372009k350722l66851R90302R5355j301595p00790
$$ -1885135 -1598887 -2278082 -4650091 -7000813 -7367664 -6377362 -6282007 -7583602 -8284392
38606h284392J542779K858745K066726P23500O98337J626639J609545K5041j422057
$$ -8284392 -6741613 -3882868 -1816142 -1092642 -394305 1232334 2841879 2866920 1444863
38597A444863r96204M75672O40030q28572j568456k97096Q01417n23156k458066
$$ 1444863 448659 924331 1564361 735789 -832667 -1129763 -328346 -851502 -3309568
38588c309568j450117K106378M089808K744710P52412J85779n43573k493486k883978
$$ -3309568 -4759685 -2653307 1436501 4181211 4933623 5119402 4575829 2082343 -801635
38579h01635M37162M237214L966002O03950j203512n97857r71485l223411l960737
$$ -801635 -364473 3872741 7838743 8442693 7239181 6641324 5669839 2446428 -1514309
38570a514309j573726Q55194P80598l9235L81225M71718j198772j996776O75894
$$ -1514309 -3088035 -2232841 -1452243 -1491478 -1110253 -638535 -1837307 -3834083 -3158189
38561c158189L882573K659893k208080m889642k904787j4770L43460M580J985518
$$ -3158189 724384 3384277 1176197 -3713445 -6618232 -6633002 -6289542 -6284962 -4299444
38552d299444M885840M924118J931271k56158O32001K199436R88131k546702m419551
$$ -4299444 586396 5510514 7441785 7185627 7817628 10017064 11005195 8458493 4038942
38543D038942k214752J647303K623618m50543l793498l137652J112512M336741
$$ 4038942 1824190 3471493 6095111 5644568 1851070 -1286582 -174070 4162671
38535D162671L160352p70427l049977j753207O20555M70669k523868n112284m356027
$$ 4162671 7323023 6552596 3502619 1749412 2369967 2840636 316768 -4795516 -9151543
38526i151543q25528K550288L901357L552563K355289O93464n75012n3618K169942
$$ -9151543 -9977071 -7426783 -3525426 27137 2382426 3075890 2500878 2447260 4617202
38517D617202L741250K688373k851j860811k249860k581432l573703m111381l125931
$$ 4617202 8358452 11046825 11043974 9183163 6933303 4351871 778168 -3333213 -6459144
38508f459144j184976L45461P46089R9509j138898k174799k081496n86922J459092
$$ -6459144 -7644120 -7298659 -6552570 -6453061 -7591959 -9766758 -11848254 -12435176 -10976084
38499a0976084K651182K164007N78161l85593M88268K283458K708273R20897j292377
$$ -10976084 -8324902 -6160895 -5582734 -5968327 -5480059 -3196601 -488328 432569 -859808
38490h59808j827445p45029M38899P93707J16902j679679l683918l736618j173896
$$ -859808 -2687253 -3432282 -2993383 -2199676 -2082774 -3762453 -7446371 -11182989 -12356885
38481a2356885J297978R93353n13912K61081K780718K923915k64237k575032r56633
$$ -12356885 -11058907 -10065554 -10579466 -10318385 -7537667 -4613752 -4877989 -7453021 -8409654
38472h409654K136247L058366K074793J220876L09431j300891j654284Q35028
$$ -8409654 -6273407 -3215041 -1140248 80628 390059 -910832 -2565116 -1730088
38464a730088L296229J906535j643614k055663J435623L754358J629605k013760
$$ -1730088 1566141 3472676 1829062 -226601 1209022 4963380 6592985 4579225
38456D579225k996356j374261J40975J82882r78109k612970l165326j162222J873213
$$ 4579225 1582869 208608 349583 532465 -445644 -3058614 -6223940 -7386162 -5512949
38447e512949K199961o28626k225038K00618L288637K858808N28341L63819J514740
$$ -5512949 -3312988 -3941614 -6166652 -5966034 -2677397 181411 709752 1073571 2588311
38438B588311O5910k953594k104869L098967N882162J998513l682886m434126
$$ 2588311 2654221 -299373 -2404242 694725 6576887 8575400 4892514 458388
38430D58388j190162K37429j400955j910285O79303L064798K185829n26499k081877
$$ 458388 -731774 -494345 -1895300 -3805585 -3126282 -61484 2124345 1597846 -484031
38421d84031j919318j162993l90417K1902o64460j962141j736447P78946L066547
$$ -484031 -2403349 -3566342 -3956759 -3934857 -4599317 -6561458 -8297905 -7518959 -4452412
38412d452412K409697l80134k382998k546892j909911q64261R37127K376129J749525
$$ -4452412 -2042715 -2422849 -4805847 -7352739 -9262650 -10126911 -9189784 -6813655 -5064130
38403e064130J50854P18102L479590M236377N84963l849387m100526o69229J801676
$$ -5064130 -4913276 -4195174 -715584 3520793 4105756 256369 -3844157 -4513386 -2711710
38394b711710J402014O63960J558083K601307J971785L67143q16502j658332k303815
$$ -2711710 -1309696 -645736 912347 3513654 5485439 5852582 5036080 3377748 1073933
38385A073933j566399Q95945K647397J172135k347782m202656k751064M9733J521050
$$ 1073933 -492466 403479 3050876 4223011 1875229 -2327427 -5078491 -5028758 -3507708
38376c507708R44456o19873j628990r91033J019182K595213K181085M24700o43937
$$ -3507708 -2563252 -3183125 -4812115 -5803148 -4783966 -2188753 -7668 417032 -226905
38367b26905k09624P31070J203646J273022J109418M45132n98239j231354r91055
$$ -226905 -436529 294541 1498187 2771209 3880627 4325759 3727520 2496166 1505111
38358A505111k36076M80315P47323J97283q51582r71886O52399K285196J342833
$$ 1505111 1269035 1749350 2496673 2693956 1842374 870488 1522887 3808083 5150916
38349E150916j762720l577582k014870J242264L531504M148992L338412Q72260
$$ 5150916 3388196 -189386 -2204256 -961992 2569512 6718504 10056916 10929176
38341A0929176k362388l604424j690481M16184m76147k724839k169880J222035
$$ 10929176 8566788 4962364 3271883 3688067 3211920 487081 -1682799 -460764
38333d60764L005036R08226k019380k246318l82796R56008J072761O52917l29507
$$ -460764 2544272 3452498 1433118 -813200 -1195996 -239988 832773 1485690 1156183
38324A156183j543461j081856J745079L899853K214506j401726j977237J385269
$$ 1156183 -387278 -1469134 275945 4175798 6390304 4988578 3011341 4396610
38316D396610M090916K587602j161054l363918l478210l178454k647234r70304
$$ 4396610 8487526 11075128 9914074 6550156 3071946 -106508 -2753742 -3724046
38308c724046J032186J429803L18271k30868N77292J274595O89472m75788j145996
$$ -3724046 -2691860 -1262057 -943786 -1174654 -597362 677233 1366705 890917 -255079
38299b55079j320403j442627j592297j667142j309972J85343K498388L356154
$$ -255079 -1575482 -3018109 -4610406 -6277548 -7587520 -7402177 -4903789 -1547635
38291a547635J209226j503739q21427K653613L769267L08207l383967k825888
$$ -1547635 -338409 -1842148 -2663575 -9962 3759305 4067512 683545 -2142343
38283b142343J59956J158691K85017P89872K517433K252736k8632q33130N00141
$$ -2142343 -1982387 -823696 -538679 251193 2768626 5021362 4992730 4159600 4659741
38274D659741N87561j569916k375617j56848J297180q91315l376474j960596J495960
$$ 4659741 5247302 3677386 1301769 1144921 2442101 1550786 -1825688 -3786284 -2290324
38265b290324K509100J396814J698611L048962J709238k175951l787955j109226
$$ -2290324 218776 1615590 3314201 6363163 8072401 5896450 2108495 999269
38257I99269J955884J756220j57170n85942M13439R00004N95097L05045k38127
$$ 999269 2955153 4711373 4554203 3968261 4381700 5281704 5876801 6181846 5943719
38248E943719j440678k235566j646728p42940r87376j709130j211299M42413J655943
$$ 5943719 4503041 2267475 620747 -122193 -1109569 -2818699 -4029998 -3587585 -1931642
38239a931642J723025J282702P71943M0046o42762n20349O36609K197994L165808
$$ -1931642 -208617 1074085 1846028 1886074 1243312 722963 1359572 3557566 6723374
38230F723374K643966N81272j510856j777547o79881q91987l320978m991595k961666
$$ 6723374 9367340 9948612 8437756 6660209 5980328 5088341 1767363 -3224232 -6185898
38221f185898J088468K935154J711238N22148J076271J222585p32890k410101
$$ -6185898 -5097430 -2162276 -451038 71110 1147381 2369966 1637076 -773025
38213g73025q39998K327966K545861j032192l962837k548998J177911K531951
$$ -773025 -1613023 714943 3260804 2228612 -1734225 -4283223 -3105312 -573361
38205e73361N16555j600964j493462n62700p63486j321918n19606J124290J924630
$$ -573361 -56806 -1657770 -3151232 -3713932 -4477418 -5799336 -6318942 -5194652 -3270022
38196c270022K142796L187431M158059K455115j532182l585160j302571J971859
$$ -3270022 -1127226 2060205 6218264 8673379 7141197 3556037 2253466 4225325
38188D225325J420867k666724n416479l795347J74528K708645K427257N67622
$$ 4225325 5646192 2979468 -2437011 -6232358 -6057830 -3349185 -921928 -354306
38180c54306j156080j806148j299580k18396O61173R40580N96422k67543j172884
$$ -354306 -1510386 -3316534 -4616114 -4834510 -4173337 -3232757 -2636335 -2903878 -4076762
38171d076762j243197k66229N99515K01201q01096p09894O84831J671571R94460
$$ -4076762 -5319959 -5586188 -4986673 -4785472 -5586568 -6296462 -5611631 -3940060 -2945600
38162b945600n21575j250052p16910L54443J225394J661378J657605J238672M88803
$$ -2945600 -3467175 -4717227 -5434137 -5079694 -3854300 -2192922 -535317 703355 1192158
38153A192158l62940p90494j26497J659018L484247M032767K989362Q71757j920660
$$ 1192158 829218 38724 -87773 1571245 5055492 9088259 12077621 12949378 11028718
38144A1028718m847535o367264m985775j558092J009825J194704O29773J357579
$$ 11028718 6181183 -186081 -5171856 -6729948 -5720123 -4525419 -3895646 -2538067
38136b538067K690694K532910Q80149k17404J725L1299r69177j426265J68849
$$ -2538067 152627 2685537 3565686 3348282 3350007 3381306 2412129 985864 1154713
38127A154713K696712L979313L683154K795962J228336j674048m636160n180615
$$ 1154713 3851425 7830738 11513892 14309854 15538190 13864142 9227982 4047367
38119D047367l266946j652380j749696j743913l13362N22096j148264l033198
$$ 4047367 780421 -871959 -2621655 -4365568 -4678930 -4156834 -5305098 -8338296
38111h338296j537135K304467L624309N99618k990192l051817p4097K640445L195218
$$ -8338296 -9875431 -7570964 -3946655 -3347037 -6337229 -9389046 -9463143 -6822698 -3627480
38102c627480J966065K33134m40047R19616K964595K683661p46598m187281m119455
$$ -3627480 -1661415 -1428281 -1868328 -948712 2015883 4699544 3952946 -234335 -4353790
38093d353790p69026K700569L832658K389355l47916k227154j449078J262489
$$ -4353790 -5122816 -2422247 1410411 3799766 3451850 1224696 -224382 1038107
38085A038107K814988J432460j112171k244946j863967j229347m89210N23615
$$ 1038107 3853095 5285555 4173384 1928438 64471 -1164876 -1654086 -1130471
38077a130471P60134l25781j060165o9182J109325P12139J94564J485969K535086
$$ -1130471 -370337 -696118 -1756283 -1825465 -716140 -4001 190563 1676532 4211618
38068D211618Q1375m043799m495956n75651K305573O89890k168193j955267M04187
$$ 4211618 4292993 249194 -4246762 -4822413 -2516840 -1826950 -3995143 -5950410 -5546223
38059e546223J266530N8018q74420l24271R08054K038189K685731K111126J56597
$$ -5546223 -4279693 -4221675 -5096095 -5420366 -4512312 -2474123 211608 2322734 2479331
38050B479331j708520j909821o71547P84809J917341K546199K127708Q37758K60471
$$ 2479331 770811 -1139010 -1810557 -1025748 891593 3437792 5565500 6403258 6663729
38041F663729J342341K493024J415193j599787l695788k753980K92975K536626
$$ 6663729 8006070 10499094 11914287 10314500 6618712 3864732 4157707 6694333
38033F694333K056936k03742j628541j121622k80954o14080j000994J43263J492324
$$ 6694333 8751269 8547527 6918986 5797364 5516410 4902330 3901336 4044599 5536923
38024E536923O15318j502032j468936P92654J472708q20880k395133l50836K672867
$$ 5536923 6152241 4650209 3181273 3973927 5446635 4625755 2230622 1879786 4552653
38015D552653K715338M00453q89499m72838l31406j082833j491648j249994j260099
$$ 4552653 7267991 7668444 6778945 6306107 5974701 4891868 3400220 2150226 890127
38006H90127j523307j127569l8190Q69250J066002M52196p87416j485142l37033
$$ 890127 -633180 -1760749 -1798939 -929689 136313 588509 -198907 -1684049 -2021082
37997b021082J658939J994807Q72017J290382L353064K853802j485268m139990
$$ -2021082 -362143 1632664 2504681 3795063 7148127 10001929 8516661 4376671
37989D376671r04425L361680J436786m812874p015786k900789J372461J646502
$$ 4376671 3472246 6833926 8270712 3457838 -3557948 -6458737 -5086276 -3439774
37981c439774R18492K244658L346869J557668j108239j454685M2444R72783O96811
$$ -3439774 -2521282 -276624 3070245 4627913 3519674 2064989 2107433 3080216 3777027
37972C777027o5945q02861o95962Q27932K001761L65145k667030k859740J5642
$$ 3777027 3711082 2908221 2212259 3040191 5041952 5407097 2740067 -119673 -104031
37963a04031J009958k272529n453764l914034O44580L698925M295484M081409
$$ -104031 905927 -1366602 -6820366 -10734400 -10089820 -6390895 -2095411 1985998
37955A985998L119781Q67449j006044p56641K19045l16003j719895k148505j896607
$$ 1985998 5105779 5973228 4967184 4210543 4429588 4113585 2393690 245185 -1651422
37946a651422j879339r82885J585366L409549K030193r06032k328452k488848
$$ -1651422 -3530761 -4513646 -2928280 481269 2511462 1605430 -723022 -3211870
37938c211870l002058k372720J581798O345137P045378L547160J55358j315206
$$ -3211870 -6213928 -8586648 -7004850 -659713 6385665 9932825 10088183 8772977
37930H772977k841268m528185l418016P54657L826094L205616J198725L54937
$$ 8772977 5931709 1403524 -2014492 -1259835 2566259 5771875 6970600 7325537
37922G325537k21099j560366j906121n9046J709419J177605j66180J6787Q98487
$$ 7325537 7104438 5544072 3637951 3578905 5288324 6465929 6299749 6316536 7215023
37913G215023M28474q70307j262252j183941k007766k811997j690992O63482J923150
$$ 7215023 7643497 6773190 5510938 4326997 2319231 -492766 -2183758 -1520276 402874
37904D02874K008770K720845L758899K626865q76183l289311k051301R85779K309638
$$ 402874 2411644 5132489 8891388 11518253 10642070 7352759 5301458 6287237 8596875
37895H596875J220851l19132j064985j581464k320587k548405j668417l60570
$$ 8596875 9817726 9498594 8433609 6852145 4531558 1983153 314736 -45834
37887d5834L28324L20102K32559K39099j8108n71890j004431j241306j685194
$$ -45834 282490 602592 835151 1074250 1056142 484252 -520179 -1761485 -3446679
37878c446679k290585k243458j020291Q28114K420378L494448M120049M088664
$$ -3446679 -5737264 -7980722 -9001013 -8172899 -5752521 -2258073 1861976 5950640
37870E950640L224699J835208L81752p44239r13099J87212J291587M20190k139068
$$ 5950640 9175339 11010547 11392299 10648060 9734961 9922173 11213760 11633950 9494882
37861I494882l558581k536222j433339k163935k349445Q80294N038684M956367
$$ 9494882 5936301 3400079 1966740 -197195 -2546640 -1666346 3372338 8328705
37853H328705Q14853j671117R9014K073205P44632j260095l40803J718155J277662
$$ 8328705 9143558 7472441 7571455 9644660 10389292 9129197 8788394 10506549 11784211
37844A1784211m94932N9507K079843J334403k206631l793288j621838L62902p06437
$$ 11784211 11289279 11348786 13428629 14763032 12556401 8763113 7141275 7504177 6797740
37835F797740j946950N9291L335821L682772J154585o82352m69338j31667q66934
$$ 6797740 4850790 4910081 8245902 11928674 13083259 12400907 11931569 11799902 10932968
37826A0932968j703415k155747l019659l879273k817411K02214K262387J466981
$$ 10932968 9229553 7073806 4054147 174874 -2642537 -2440323 -177936 1289045
37818A289045j21406M22936K435009K784903P22369j005507j88111J781964J863753
$$ 1289045 1167639 1590575 4025584 6810487 7532856 6527349 6339238 8121202 9984955
37809I984955q13860m087305n169007l282698j83502J640716J464794Q80709J456114
$$ 9984955 9171095 5083790 -85217 -3367915 -3551417 -1910701 -445907 434802 1890916
37800A890916K402728J743350m84048j900449j063028O31677J188664N63442k52242
$$ 1890916 4293644 6036994 5552946 3652497 2589469 3221146 4409810 4973252 4721010
37791D721010j151703k197436k238693m02243J763073J891679K11997r05728o45890
$$ 4721010 3569307 1371871 -866822 -1269065 494008 2385687 2597684 1691956 1046066
37782A046066m89708j061418j009047Q8052M32156q11109j480248L04305K784308
$$ 1046066 556358 -505060 -1514107 -1426055 -993899 -1805008 -3285256 -2980951 -196643
37773a96643K993577J139043j37703O6379L76421L82659J359551L317914M140220
$$ -196643 2796934 3935977 3798274 3864653 4241074 4623733 5983284 9301198 13441418
37764A3441418K751137R11525N10299R09386N10290n53894j058525r67727j210340
$$ 13441418 16192555 17104080 17614379 18523765 19034055 18480161 17421636 16453909 15243569
37755A5243569j688446j249322L96081K113326K845462K618020J942541J172402
$$ 15243569 13555123 12305801 12701882 14815208 17660670 20278690 22221231 23393633
37747B3393633O14384M69932M97467L70965L37489P63659J135691N12875r51148
$$ 23393633 24008017 24477949 24975416 25346381 25683870 26447529 27583220 28096095 27144947
37738B7144947k037977k249589k358142k713653k362016p81172P48702Q79573
$$ 27144947 25106970 22857381 20499239 17785586 15423570 14642398 15391100 16270673
37730A6270673L42483O47539J250192J47872k588014m079397k366410R26167L019430
$$ 16270673 16613156 17260695 18510887 18658759 16070745 11991348 9624938 10551105 13570535
37721A3570535L608239M141889M401738K366183k080644n537244m748036p88724
$$ 13570535 17178774 21320663 25722401 28088584 26007940 20470696 15722660 14933936
37713A4933936K146728J867801L58470L30683J253603M61977k395260m125990
$$ 14933936 17080664 18948465 19306935 19637618 20891221 21353198 18957938 14831948
37705A4831948j999754K471861N168593M095012J018638j352395k180032k090581
$$ 14831948 12832194 15304055 20472648 24567660 25586298 24233903 22053871 19963290
37697A9963290j455159k20494J180831J878845J633004J301836J929960L332076
$$ 19963290 18508131 18287637 19468468 21347313 22980317 24282153 26212113 29544189
37689B9544189L809698J865425j590027l620998k622349l82844M77131K25223
$$ 29544189 33353887 35219312 33629285 30008287 27385938 27003094 27480225 27705448
37681B7705448J148497L389997M292905K482660J14396k21382J211531K591332
$$ 27705448 28853945 32243942 36536847 39019507 39133903 38912521 40124052 42715384
37673D2715384L286480L529900K874182R59416j211112k477631k988903k941411
$$ 42715384 46001864 49531764 52405946 53365362 52154250 49676619 46687716 43746305
37665D3746305j298755K182330M987393M477800J717354J14924P45988J622167
$$ 43746305 42447550 44629880 49617273 54095073 55812427 55927351 56673339 58295506
37657E8295506J370899R03468J146461J627772J950054K554427L339187L397474
$$ 58295506 59666405 60569873 61716334 63344106 65294160 67848587 71187774 74585248
37649G4585248K839450L161315M940196O519836N942942L525985K004766M190249
$$ 74585248 77424698 80586013 85526209 92046045 97988987 101514972 103519738 107709987
37641A07709987R905452J4991599J4900442J0288697P026558Q907351J2836843
$$ 107709987 117615439 132607038 147507480 157796177 164822735 173730086 186566929
37634A86566929J4067181J3417140J4748073J7230962J6064664J0670628O054978
$$ 186566929 200634110 214051250 228799323 246030285 262094949 272765577 278820555
37627B78820555M808665L535193n52059m870806o469055p166523r941107j3779420
$$ 278820555 283629220 287164413 286612354 281741548 275272493 268105970 258164863 244385443
37619B44385443j5832793j5774558j4683614j2441314r474113q214571r531596
$$ 244385443 228552650 212778092 198094478 185653164 176179051 167964480 158432884
37612A58432884j0577341r445738q673091j0299403j1013750p130890j461209
$$ 158432884 147855543 138409805 129736714 119437311 108423561 101292671 99831462
37605I9831462L20596j944124l766204l561845l392473l269196j045320K115082
$$ 99831462 100152058 98207934 94441730 90879885 87487412 84218216 83172896 85287978
37597H5287978K293301n60184k267699j475007j262329k512079j806099J784966
$$ 85287978 87581279 87021095 84753396 83278389 82016060 79503981 77697882 79482848
37589G9482848L745356J391857r74151J582569P060753R762821Q212297N476179
$$ 79482848 83228204 84620061 83645910 85228479 92289232 102052053 110264350 115740529
37581A15740529L727867K848298L213112N731720R270009J1265999J1175590J0994721
$$ 115740529 119468396 122316694 125529806 131261526 140531535 151797534 162973124 173967845
37573A73967845J2237672J4329901J6148525J7498790J8645832J9467916J9617147
$$ 173967845 186205517 200535418 216683943 234182733 252828565 272296481 291913628
37566B91913628J9233520J9220872K0353084K1709778K0829973J6595728J1156264
$$ 291913628 311147148 330368020 350721104 372430882 393260855 409856583 421012847
37559D21012847P220209M146911q82513q159324j4753049j8728782k1157105k3314085
$$ 421012847 428233056 432379967 431497454 423338130 408585081 389856299 368699194 345385109
37551C45385109k4739425k4968733k4490770k3104549k0083283j6732093j5584861
$$ 345385109 320645684 295676951 271186181 248081632 227998349 211266256 195681395
37544A95681395j6070933j4634634j0664771q298807j0005809j2358370j1361422
$$ 195681395 179610462 164975828 154311057 146012250 136006441 123648071 112286649
37537A12286649q379817o931825o688646n102347k710978k135169l210827l613784
$$ 112286649 103906832 96975007 90286361 85184014 82473036 80337867 77127040 73513256
37529G3513256l420825m671759o821300o897251m374608k076718j722811j942487
$$ 73513256 70092431 65420672 58599372 51702121 47327513 45250795 43527984 41585497
37521D1585497j344689n39381l47569n52482j057246k073809k845117k319764
$$ 41585497 40240808 39701427 39353858 38801376 37744130 35670321 32825204 30505440
37513C0505440j151411q02266q12529N21176K848389L915435L162120K343344
$$ 30505440 29354029 28551763 27739234 28260410 31108799 35024234 38186354 40529698
37505D0529698K175548J205041j250106l601641m280970l371767j512952N40518
$$ 40529698 42705246 43910287 42660181 39058540 34777570 31405803 29892851 30433369
37497C0433369J088625j010819l668018l496598r98532k62979k381750l190811
$$ 30433369 31521994 30511175 26843157 23346559 22348027 22085048 19703298 16512487
37489A6512487J39392M029943L458971p30214l426697k540666p46568n76526j441701
$$ 16512487 16651879 20681822 24140793 23410579 19983882 17443216 16696648 16120122 14678421
37480A4678421j806373j366494m13984P07190R52668n78277k544374k078416J444222
$$ 14678421 12872048 11505554 11091570 11798760 12751428 12173151 9628777 7550361 8994583
37471H994583M974027N273295K575350m77114k463816m025365n385446m945757
$$ 8994583 13968610 19241905 21817255 21340141 18876325 14850960 9465514 4519757
37463D519757j363811L760271O520313M399437j051700n563133o143641l607190
$$ 4519757 3155946 6916217 13436530 17835967 16784267 11221134 5077493 1470303
37455A470303j145984o47691q84604L67375K961661M270580K668513k31480j879561
$$ 1470303 324319 -323372 -1207976 -840601 2121060 6391640 9060153 8828673 6949112
37446F949112k156633k680618l494489k839766l44042J986084K681979K514532
$$ 6949112 4792479 2111861 -1382628 -4222394 -4566436 -2580352 101627 2616159
37438B616159K324582J421136m84386j903966j797745j164952p19371P00343L217448
$$ 2616159 4940741 6361877 5877491 3973525 2175780 1010828 291457 991800 4209248
37429D209248L972592J225626j716362m95824L711474N630698L214526m49934
$$ 4209248 8181840 9407466 7691104 7195280 10906754 16537452 19751978 19302044
37421A9302044k297753k374303j613173l97950J52839r45605j962147m09821K120429
$$ 19302044 17004291 14629988 13016815 12618865 12771704 11826099 9863952 9454131 11574560
37412A1574560J395983k415288l993358r33914K297281J321884j651518k059792
$$ 11574560 12970543 10555255 6561897 5627983 7925264 9247148 7595630 5535838
37404E535838j61200M26781r67843j638512k19159J934252L558494M630697M939948
$$ 5535838 5374638 5801419 4833576 3195064 2975905 4910157 8468651 13099348 18039296
37395A8039296L866575J497477j402787l862657m396450j997428J484713K317137
$$ 18039296 21905871 23403348 22000561 18137904 13741454 11744026 13228739 15545876
37387A5545876k22687k555330k208148j312337k115523k541668o4155L020875
$$ 15545876 15323189 12767859 10559711 9247374 7131851 4590183 4526028 7546903
37379G546903K883413N16035k60469L80752j088792m644344n948213l084251P52364
$$ 7546903 10430316 10946351 10685882 11066634 9977842 5333498 -614715 -3698966 -2946602
37370b946602K330958J988719J115667j0170o07676P38616L125021L414930O52238
$$ -2946602 -615644 1373075 2488742 2478572 1870896 2609512 5734533 9149463 9801701
37361I801701k410339l197076j906670M44277L311100N071157L657849L3729k200750
$$ 9801701 7391362 4194286 2287616 2731893 6042993 11114150 14771999 14805728 12604978
37352A2604978j865111j513136k555252k921284j269426M02953N19449N06616
$$ 12604978 10739867 9226731 6671479 3750195 2480769 2883722 3403171 3909787
37344C909787J275835J095442k86192L10970L726432N075770R48618l781862k293853
$$ 3909787 5185622 6281064 5994872 6305842 10032274 15108044 16056662 12274800 9980947
37335I980947L634388N981030K144738k464182l507085k702843k353311j211094
$$ 9980947 13615335 19596365 21741103 19276921 15769836 13066993 10713682 9502588
37327I502588J303371K023974q79253l549104j514927L301873M987851J871318
$$ 9502588 10805959 12829933 11950680 8401576 6886649 10188522 15176373 17047691
37319A7047691j703047j848934O2311J85005k495018n233482n016825j792468
$$ 17047691 15344644 13495710 13558021 13743026 11248008 6014526 997701 -794767
37311g94767J666442K536519N12556k083169k518787j31752K937985L441171J71892
$$ -794767 871675 3408194 3920750 1837581 -681206 -812958 2125027 5566198 5738090
37302E738090m186275n245797j755789K581200L282800L12431k401920k095715
$$ 5738090 1551815 -3693982 -5449771 -2868571 414229 726660 -1675260 -3770975
37294c770975J84764K024858K514944J943507N31351j206620k063462j466709
$$ -3770975 -3586211 -1561353 953591 2897098 3428449 2221829 158367 -1308342
37286a308342m98991m49054q69436k53987J514015K572350J468442n10758m88566
$$ -1308342 -1807333 -2256387 -3125823 -3379810 -1865795 706555 2174997 1664239 1175673
37277A175673K108018L878501J336761l779484n604455j664795L311439L534558
$$ 1175673 3283691 7162192 8498953 4719469 -884986 -2549781 761658 4296216
37269D296216j40520k288378j223342m24764j617153j758254J095626L658820
$$ 4296216 4155696 1867318 643976 219212 -1397941 -3156195 -2060569 1598251
37261A598251K510097l03753p50532P53638P48577j183067k257596j535561o89697
$$ 1598251 4108348 3804595 3054063 3807701 4556278 3373211 1115615 -419946 -1109643
37252a109643j8945J827395L785767K634219j340470l213604k45980L737346L656836
$$ -1109643 -1128588 698807 4484574 7118793 5778323 2564719 2318739 6056085 9712921
37243I712921L7988k695280k695506j816009j334195l06782J557159K497769J379551
$$ 9712921 9750909 7055629 4360123 2544114 1209919 903137 2460296 4958065 6337616
37234F337616k48026k40786J028660J115675j038887l273491k697682L33290K188093
$$ 6337616 6089590 5848804 6877464 7993139 6954252 3680761 983079 1316369 3504462
37225C504462O81026j688165j192744J427624J746787j748554n204844m853485
$$ 3504462 4185488 2497323 1304579 2732203 4478990 2730436 -2474408 -7327893
37217g327893j808434O71651J903411K936449L299122K031885M92501N98001J205049
$$ -7327893 -9136327 -8464676 -6561265 -3624816 -325694 1706191 2198692 2796693 4001742
37208D001742k08141k838412l263150p94863J549686J791101J106044O06396k67758
$$ 4001742 3793601 955189 -2307961 -3102824 -1553138 237963 1344007 1950403 1682645
37199A682645j087127O806K402896K393353j220713m278915k924375P73773K193095
$$ 1682645 595518 602324 3005220 5398573 4177860 -101055 -3025430 -2251657 -58562
37190e8562P93310l62442r5873j17609j118026j532611n27369N86923M65105o90987
$$ -58562 734748 372306 276433 158824 -959202 -2491813 -3019182 -2432259 -1967154 -2658141
37180b658141j837257j851736K9666K942397M257408K537050k13211j232221q10649
$$ -2658141 -4495398 -6347134 -6317468 -3375071 882337 3419387 3206176 1973955 1163306
37171A163306r02257j116512N37837L369673M108978J684526j339015k693837
$$ 1163306 261049 -855463 -317626 3052047 7161025 8845551 7506536 4812699
37163D812699k716391k108957o49158Q72440O39760r79184j325705J05097N65420
$$ 4812699 2096308 -12649 -661807 210633 850393 -128791 -1454496 -1349399 -783979
37154g83979p96044n62843L177198O225086L663493k445265n385710k764333J271192
$$ -783979 -1580023 -2142866 1034332 7259418 10922911 8477646 3091936 327603 1598795
37145A598795K587791J623623O99303M75772N46764P92691N56232j446952m878445
$$ 1598795 4186586 5810209 6509512 6985284 7532048 8324739 8880971 7434019 2555574
37136B555574p040478n794839k078522J511978L479447L798399K778772R42192
$$ 2555574 -4484904 -10279743 -12358265 -10846287 -7366840 -3568441 -789669 152523
37128A52523o11082r48642k85391M28431O15709K65430n94721j965068l441046
$$ 152523 -458559 -1407201 -1692592 -1264161 -648452 -383022 -977743 -2942811 -6383857
37119f383857m085317k935854J00307L640373N486697M497362J683943j010499
$$ -6383857 -10469174 -13405028 -13304721 -9664348 -4177651 319711 2003654 993155
37111I93155k670609l471234l335075j881025K34516J357450R14249M57957J700957
$$ 993155 -1677454 -5148688 -8483763 -10364788 -10130272 -8772822 -7858573 -7400616 -5699659
37102e699659M017859M880972K813431p69622l053864k912558j912714j945053
$$ -5699659 -1681800 3199172 6012603 5242981 2189117 -723441 -2636155 -4581208
37094d581208k519400j547589J315069L743186L841056K540912J579032O47791
$$ -4581208 -7100608 -8648197 -7333128 -3589942 251114 2792026 4371058 5018849
37086E018849j299720l025337k169771O67679J968255K10419j853403j195913
$$ 5018849 3719129 693792 -1475979 -808300 1159955 1370374 -483029 -1678942
37078a678942J394221K960692K383846P54930r81853k623574l617010l309296
$$ -1678942 -284721 2675971 5059817 5814747 4832894 2209320 -1407690 -4716986
37070d716986k035289n50194J072622K522331K118631j174627m906289m882827
$$ -4716986 -6752275 -7302469 -6229847 -3707516 -1588885 -2763512 -7669801 -12552628
37062a2552628m29108M214211M867334K121121k45515j61719J156422J759006
$$ -12552628 -12981736 -8767525 -3900191 -1779070 -2024585 -2186304 -1029882 729124
37054G29124J190003N9614j117809k014526k232974j637723o48220J89605O91440
$$ 729124 1919127 1978741 860932 -1153594 -3386568 -5024291 -5672511 -5482906 -4791466
37045d791466P87412J07706j541194l216347l116585n68481K505970L061694K53583
$$ -4791466 -4004054 -3896348 -5437542 -8653889 -11770474 -12338955 -9832985 -6771291 -6517708
37036f517708l332295m284740j816446J801188L761431L124666J168207M6383
$$ -6517708 -9850003 -14134743 -15951189 -14150001 -10388570 -7263904 -6095697 -6049314
37028f049314Q07060K198035J965448p8021j301302J64528K190685J241552k233175
$$ -6049314 -5242254 -3044219 -1078771 -1156792 -2458094 -2293566 -102881 1138671 -1094504
37019a094504l852461j344550K352219L532232K605809K170772K335531J119292
$$ -1094504 -4946965 -6291515 -3939296 -407064 2198745 4369517 6705048 7824340
37011G824340j556831l473471l458239k401123j113314J26859J37950j876736
$$ 7824340 6267509 2794038 -664201 -3065324 -4178638 -4051779 -3913829 -5790565
37003e790565l495448j203459L804081N859074K579074j528115j838570j70013
$$ -5790565 -9286013 -10489472 -6685391 -826317 1752757 224642 -1613928 -1783941
36995a783941p71887k983521k844336j04735J730158J639882K032310L260806
$$ -1783941 -2555828 -5539349 -8383685 -8488420 -6758262 -5118380 -3086070 174736
36987A74736K519511o23796k639640j900871j367633k837794l196658m3377L118921
$$ 174736 2694247 2070451 -569189 -2470060 -3837693 -6675487 -9872145 -9915522 -6796601
36978f796601K058421r55668n53393K982389M172651J092448k001232j662989
$$ -6796601 -4738180 -5693848 -6247241 -3264852 907799 2000247 -985 -1663974
36970a663974J64625M19092m38908n29632o5274r2034j35755L84866L93545p55992
$$ -1663974 -1499349 -1080257 -1519165 -2048797 -2114071 -2206105 -2341860 -1956994 -1563449 -2319441
36960b319441j245494M80363K407857J373150j992644l805827k369324j37054
$$ -2319441 -3564935 -3084572 -676715 696435 -1296209 -5102036 -7471360 -7608414
36952g608414M30683K97312J563882L644116L943032J762668n18498o16982P31645
$$ -7608414 -7177731 -6880419 -5316537 -1672421 2270611 4033279 3514781 2897799 3629444
36943C629444J070683l00215j605071j450948q37221j228217j823300o93485J676899
$$ 3629444 4700127 4399912 2794841 1343893 506672 -721545 -2544845 -3238330 -1561431
36934a561431K281404k18994l165968l237165p28685J279355J155667J09526l33187
$$ -1561431 719973 500979 -2664989 -5902154 -6630839 -5351484 -4195817 -4086291 -4419478
36925d419478j60268J86329Q84484J860186K147875J171980k21476j023589j593446
$$ -4419478 -4579746 -4393417 -3508933 -1648747 499128 1671108 1449632 426043 -1167403
36916a167403k737157l790844l152719q24675J078561J084774M25582J112882
$$ -1167403 -3904560 -7695404 -10848123 -11672798 -10594237 -9509463 -9083881 -7970999
36908g970999K735250K926803J066570m01624O16438K621130K492746J2751j752243
$$ -7970999 -5235749 -2308946 -1242376 -1644000 -1027562 1593568 4086314 4099065 2346822
36899B346822q23144J017618J016278p23205j932229j760681j546022j989284
$$ 2346822 1523678 2541296 3557574 2834369 902140 -858541 -2404563 -4393847
36891d393847j612304R24097M206991N216936K817414r66110l222719k898936
$$ -4393847 -6006151 -5082054 -875063 4341873 7159287 6193177 2970458 71522
36883G1522j064235P29036J638950J469739L61240j135947k204213k462394k362333
$$ 71522 -992713 -263677 1375273 2845012 3206252 2070305 -133908 -2596302 -4958635
36874d958635k592996l297544m156229m852829m870801l196251O52867N038169
$$ -4958635 -7551631 -10849175 -15005404 -19858233 -24729034 -27925285 -27272418 -22234249
36866b2234249O799785M458598K99230j857330q72527P73732M09593j650374k998914
$$ -22234249 -15434464 -10975866 -10676636 -12533966 -13406493 -12632761 -12223168 -13873542 -16872456
36857a6872456k144149N10705L887224O741484P209435M037408r13335l391603
$$ -16872456 -19016605 -18505900 -14618676 -7877192 -667757 3369651 2456316 -935287
36849i35287j648443R20759K53704k403537k085023K449772O418330N533507J696491
$$ -935287 -2583730 -1662971 -1409267 -3812804 -5897827 -3448055 2970275 8503782 10200273
36840A0200273l23363L66698N91931j425524l785597m210691k858732j162168
$$ 10200273 9876910 10243608 10835539 9410015 5624418 1413727 -1445005 -2607173
36832b607173M7667N13509L18777L07975J293977K460229K126147M38912n46659
$$ -2607173 -2559506 -2045997 -1727220 -1419245 -125268 2334961 4461108 4900020 4353361
36823D353361l1257L42926n57417j340575o06501L61008m26492k173076k187442
$$ 4353361 4322104 4665030 4107613 2767038 2160537 2521545 2095053 -78023 -2265465
36814b265465R3751K155340J809579o6644q86454M61190K405807K394073l79342
$$ -2265465 -2171714 -16374 1793205 1726561 840107 1301297 3707104 6101177 5721835
36805E721835l858128m996723k929436J52724J507300O28485p74891q71209O84933
$$ 5721835 1863707 -3133016 -6062452 -5909728 -4402428 -3773943 -4548834 -5420043 -4735110
36796d735110K563209K749366M81865k386061k874729k30250L219976N023072
$$ -4735110 -2171901 577465 1059330 -1326731 -4201460 -4431710 -1211734 3811338
36788C811338N000636L948950J827160j079382k782718j774772K57458M01029
$$ 3811338 8811974 12760924 14588084 13508702 10725984 8951212 9208670 9609699
36780I609699j179583j574400Q3018J041484p20791l098492k853914m22001P12848
$$ 9609699 8430116 6855716 6938734 7980218 7259427 4160935 1307021 885020 1597868
36771A597868j047882l360546l214010n41480K314094L500288K783783N94352
$$ 1597868 549986 -2810560 -6024570 -6566050 -4251956 -751668 2032115 2626467
36763B626467k323347m267945l423176l31552J806998P25014j943473k884560
$$ 2626467 303120 -3964825 -7388001 -7719553 -5912555 -5187541 -7131014 -10015574
36755a0015574j470518K32321J364315L348259O413774P788783N106538j26188
$$ -10015574 -11486092 -11253771 -9889456 -6541197 -127423 7661360 12767898 12641710
36747A2641710m208071n202651l808713j510035N48101J670674J970176K094075
$$ 12641710 8433639 3230988 -577725 -2087760 -1539659 131015 2101191 4195266
36739D195266K006211J149907J64678M73713J457556O36572k006487k967332p09764
$$ 4195266 6201477 7351384 7516062 7989775 9447331 10083903 8077416 5110084 4400320
36730D400320J066485r63475l855971k668618J498628L088996P91428r85106L48678
$$ 4400320 5466805 4503330 647359 -2021259 -522631 2566365 3357793 2372687 2721365
36721B721365K024854J359190j46319l73950k33777j128263j899280q80542J268656
$$ 2721365 4746219 6105409 5959090 5585140 5351363 4223100 2323820 1443278 2711934
36712B711934K741195K622462N89535k967320n555576m350478n95445J057715
$$ 2711934 5453129 8075591 8665126 5697806 142230 -4208248 -4803693 -3745978
36704c745978r58152k929942j904159K13606J085806K068541M355595N147990
$$ -3745978 -4704130 -7634072 -9538231 -9324625 -8238819 -6170278 -1814683 3333307
36696C333307K241264j022384n94929J249123n01636m914329o318477l470013
$$ 3333307 5574571 4552187 3957258 5206381 4704745 -209584 -6528061 -9998074
36688i998074j133883j976115k886746j051650J559053K205901J641854J679638
$$ -9998074 -11131957 -13108072 -15994818 -17046468 -15487415 -13281514 -11639660 -9960022
36680i960022J892430J411791J247248K198363K681345J117965j255197k166417
$$ -9960022 -8067592 -6655801 -5408553 -3210190 -528845 589120 -666077 -2832494
36672b832494j429423l68459M59598J082515R11459l51023j486954j153231J50460
$$ -2832494 -4261917 -4630376 -4170778 -3088263 -2176804 -2527827 -4014781 -5168012 -5017552
36663e017552Q88147N98835n8542o82986j209541j060992M30991K710532L992408
$$ -5017552 -4129405 -3530570 -3589112 -4272098 -5481639 -6542631 -6111640 -3401108 591300
36654E91300K870852k44066l299734m343850l320760j796042o58585R01060L243887
$$ 591300 3462152 3218086 -81648 -4425498 -7746258 -9542300 -10200885 -9299825 -6055938
36645f055938M483692K809376k11166j133160O83954K366381J718764l49589k079045
$$ -6055938 -1572246 1237130 1025964 -107196 576758 2943139 4661903 4312314 2233269
36636B233269l005550l017415j731168M3608M63989n00645n70623J206226K600812
$$ 2233269 -772281 -3789696 -5520864 -5477256 -5013267 -5513912 -6084535 -4878309 -2277497
36627b277497J588874n56203j384715n89439O12343J583678J939411J017614l84912
$$ -2277497 -688623 -1244826 -2629541 -3218980 -2606637 -1022959 916452 1934066 1549154
36618A549154K28956L333981N449331L510936p33573l542313m421153n081556
$$ 1549154 1778110 5112091 10561422 14072358 13338785 9796472 5375319 293763
36610B93763m908627j875337K633969M453303K603336O45193J047688J812522
$$ 293763 -4614864 -6490201 -3856232 597071 3200407 3845600 4893288 6705810
36602F705810K76510k745934m509580l822728j382587J520919L311670K861575
$$ 6705810 6982320 4236386 -273194 -4095922 -5478509 -3957590 -645920 2215655
36594B215655J053924J5855R8959l41404j522662j333817Q17844K176713P97500
$$ 2215655 3269579 3285434 3384393 3042989 1520327 186510 1004354 3181067 3978567
36585C978567j129718r09450K4271j286016l574466k503437K407627O025068M176411
$$ 3978567 2848849 1939399 1963670 677654 -2896812 -5400249 -2992622 3032446 7208857
36576G208857r60883m023524l135827j257680j627033l741655m254462j168067
$$ 7208857 6247974 2224450 -911377 -2169057 -3796090 -7537745 -11792207 -12960274
36568a2960274L365997M900696J706595k771530l666356n13243K446901K035515
$$ -12960274 -9594277 -4693581 -2986986 -5758516 -9424872 -9938115 -7491214 -5455699
36560e455699R0365L38665L015383M786041L413971K68682k077518k862337k898302
$$ -5455699 -5365334 -5026669 -2011286 2774755 6188726 6457408 4379890 1517553 -1380749
36551a380749k694453j987365n23876J508871L393171L844558K018187p85814
$$ -1380749 -4075202 -6062567 -6586443 -5077572 -1684401 2160157 4178344 3392530
36543C392530j654683M39482K768528K186913n69796k139364j461786n91824n62391
$$ 3392530 1737847 2177329 4945857 7132770 6562974 4423610 2961824 2370000 1807609
36534A807609J18032J703420J530821j452571l580059j438825K219281J850784
$$ 1807609 1925641 3629061 5159882 3707311 127252 -1311573 907708 2758492
36526B758492k561404n176124k655183J480165K380522J46712j718351j505269
$$ 2758492 197088 -4979036 -7634219 -6154054 -3773532 -3626820 -5345171 -6850440
36518f850440l28486N05161Q04196Q05377P17853N88715R244j238461k084843
$$ -6850440 -7178926 -6673765 -5869569 -5064192 -4346339 -3757624 -3748380 -4986841 -7071684
36509g071684j188505P65494J706638J392497J569818K444069K009167k9484j059769
$$ -7071684 -8260189 -7494695 -5788057 -4395560 -2825742 -381673 1627494 1598010 538241
36500E38241o4574K86527j391509j901784J141485M024013J924572l188792n136582
$$ 538241 473667 760194 -631315 -2533099 -1391614 2632399 4556971 1368179 -3768403
36491c768403k693254m81461j014113j576087J17332K360164L126255K905540
$$ -3768403 -6461657 -6943118 -7957231 -9533318 -9415986 -7055822 -3929567 -1024027
36483a024027K252818N02808j514019j388719O56373J406363O5641k38527J745467
$$ -1024027 1228791 1731599 217580 -1171139 -514766 891597 957238 718711 2464178
36474B464178K717989N48490j945224k146119j988720l294455l312625K27237
$$ 2464178 5182167 5730657 3785433 1639314 -349406 -3643861 -6956486 -6729249
36466f729249L685353K812795R9738N34184K765472J619781k224289k844376P32962
$$ -6729249 -3043896 -231101 -131363 402821 3168293 4788074 2563785 -280591 452371
36457D52371K695284K53714j906663K34115L632833L616249Q61957r37940o95194
$$ 452371 3147655 3401369 1494706 1728821 5361654 8977903 9839860 8901920 8206726
36448H206726L52406J498302K015330N34513k235222l028112r34494M16135j354249
$$ 8206726 8559132 10057434 12072764 12607277 10372055 7343943 6409449 6825584 5471335
36439E471335k879495m07102L388430L018398j206596l595476j720554M86308
$$ 5471335 2591840 2184738 5573168 8591566 7384970 3789494 2068940 2555248
36431B555248p63721l709097m009553m24430M267546O444897M571816J10945l677877
$$ 2555248 1791527 -1917570 -5927123 -6351553 -2084007 4360890 8932706 9043651 5365774
36422E365774m550237l138561j581525r50442j008210j566360k386408k292177
$$ 5365774 815537 -2323024 -3904549 -4854991 -5863201 -7429561 -9815969 -12108146
36414a2108146l00711K403029L298893J558983j031930k334776j943633q44943
$$ -12108146 -12408857 -10005828 -6706935 -5147952 -6179882 -8514658 -10458291 -11303234
36406a1303234J06798R41057J907524K209214L33825l150789m280722j01467N802704
$$ -11303234 -11196436 -10255379 -8347855 -6138641 -5804816 -8955605 -13236327 -13337794 -7535090
36397g535090O271087M01148m073250j211439M675452N661401J747177n01422
$$ -7535090 -1264003 -862855 -4936105 -6147544 -1472092 4189309 5936486 5435064
36389E435064J018258J457188j985065n288135m227526n53521J545828J323163
$$ 5435064 6453322 7910510 5925445 637310 -3590216 -4143737 -2597909 -1274746
36381a274746O57448J73651q01433k150192l043086k807228o32377L618338P435497
$$ -1274746 -617298 -443647 -1245080 -3395272 -6438358 -9245586 -9877963 -6259625 1175872
36372A175872P164364K827601j238171k080371j591945k432691l618008k926350
$$ 1175872 8340236 11167837 9929666 7849295 6257350 3824659 206651 -2719699
36364b719699j142413o38773j353816j236100L15172K009029K836682K614084
$$ -2719699 -3862112 -4500885 -5854701 -7090801 -6775629 -4766600 -1929918 684166
36356F84166J323642k50297m52410Q51388J280125o51573k748719k150673L73216
$$ 684166 2007808 1757511 1305101 2156489 3436614 2785041 36322 -2114351 -1741135
36347a741135J861874J663486J491694J742361R23421j192678k560148j588084
$$ -1741135 120739 1784225 3275919 5018280 5941701 4749023 2188875 600791
36339F00791R05550K829208K750795Q92862q50130o05101Q69276O26405k204572
$$ 600791 1506341 4335549 7086344 7979206 7129076 6523975 7393251 8019656 5815084
36330E815084m504454l403981m30325J075237P38779L04816j84213j611892k471292
$$ 5815084 1310630 -2093351 -2523676 -1448439 -709660 -404844 -589057 -2200949 -4672241
36321d672241n48509K593091L079162P13135p52555J92624P46251q74755k287936
$$ -4672241 -5220750 -2627659 451503 1164638 412083 604707 1350958 476203 -1811733
36312a811733j230855N66919L84740j258243j910680q25762Q52601K027013K101826
$$ -1811733 -3042588 -2475669 -2090929 -3349172 -5259852 -6085614 -5233013 -3206000 -1104174
36303a104174R37102l89072l39027O35257L87281j290193j889922m13759N02793
$$ -1104174 -167072 -556144 -895171 -259914 127367 -1162826 -3052748 -3466507 -2963714
36294b963714j145337l006332j793259J589546L559750L164506K562004K861854
$$ -2963714 -4109051 -7115383 -8908642 -7319096 -3759346 -594840 1967164 4829018
36286D829018K784155J612899N47040K64436n58284k957180n360462n109060j924996
$$ 4829018 7613173 9226072 9773112 10037548 9479264 6522084 1161622 -3947438 -5872434
36277e872434J349047J933755M31407r0129J529436K626412M66337l496659n444217
$$ -5872434 -4523387 -2589632 -2158225 -2248354 -718918 1907494 2373831 -1122828 -6567045
36268f567045m434498k824033j711877L53922L372286M528096K739882J060331
$$ -6567045 -11001543 -13825576 -15537453 -15183531 -11811245 -7283149 -4543267 -3482936
36260c482936K023810L746735L552561K414825K274280J804117p98695l096626
$$ -3482936 -1459126 2287609 5840170 8254995 10529275 12333392 11534697 8438071
36252H438071j591714J722633J510954k447041m545152j965692J362381J356436
$$ 8438071 6846357 8568990 10079944 7632903 3087751 1122059 2484440 3840876
36244C840876m91922q37614M0130m5939r17361j107664j215535k632907m172383
$$ 3840876 3348954 2511340 2551470 2505531 1588170 480506 -735029 -3367936 -7540319
36235g540319l353151n36713J229617N30116p84326o51312N98629J398347J203434
$$ -7540319 -10893470 -11430183 -10200566 -9670450 -10454776 -11106088 -10507459 -9109112 -7905678
36226g905678P09029N64534N80245J56667o08358n13182J338848L698904L930626
$$ -7905678 -7196649 -6632115 -6051870 -5895203 -6503561 -7016743 -5677895 -1978991 1951635
36217A951635J210652k130341l264403j780859R04054L625843N494896N155282
$$ 1951635 3162287 1031946 -2232457 -4013316 -3109262 516581 6011477 11166759
36209A1166759K199093j210990k299236j226889p15693k004676l329023l065897
$$ 11166759 13365852 12154862 9855626 8628737 7913044 5908368 2579345 -486552
36201d86552k228931k388186k747070j336846J574459L378939K668279J144293
$$ -486552 -2715483 -5103669 -7850739 -9187585 -7613126 -4234187 -1565908 -421615
36193d21615J070222J991866J513843r11869k669674j324754J880479L460266
$$ -421615 648607 2640473 4154316 3242447 572773 -751981 1128498 4588764
36185D588764K206144L36311k13190m26544j707190k729387j367687J281082J958760
$$ 4588764 6794908 7131219 6918029 6491485 4784295 2054908 687221 1968303 3927063
36176C927063L24208l69039J324872K372696L00069k027757l22925M041863N224017
$$ 3927063 4251271 3882232 5207104 7579800 7879869 5852112 5529187 9571050 14795067
36167A4795067J251009l001404k676474O25569J795354o86259l582123l799816
$$ 14795067 16046076 13044672 10368198 10993767 12789121 12102862 8520739 4720923
36159D720923j666949O28694J683827J495002Q15583L51149n9424j233093k932278
$$ 4720923 3053974 3682668 5366495 6861497 7677080 8028229 7968805 6735712 3803434
36150C803434l225979r77979J774171J976667q2606r01135J201908L458183K452307
$$ 3803434 577455 -400524 1373647 3350314 3267708 2366573 3568481 7026664 9478971
36141I478971j128934l427335k277438P00297K735030K951362K143238O83388
$$ 9478971 8350037 4922702 2645264 3345561 6080591 9031953 11175191 11858579
36133A1858579j853311m783268n470910k151915K553221L318192j254376n664658
$$ 11858579 10005268 5222000 -248910 -2400825 152396 3470588 2216212 -3448446
36125c448446l834958K715291O458267L694443r88261j620263J222444K367659
$$ -3448446 -7283404 -4568113 1890154 5584597 4596336 2976073 4198517 6566176
36117F566176k20189l283654l427714j334344m3726r05491k312748j838577Q60888
$$ 6566176 6345987 3062333 -365381 -1699725 -1743451 -2648942 -4961690 -6800267 -5939379
36108e939379L319705K888504J24620j603243m03118J742600J913149R763j999493
$$ -5939379 -2619674 268830 393450 -1209793 -1612911 129689 2042838 2052601 53108
36099E3108l115264l445492k450718K74428K870102K649781P7993j119625J249906
$$ 53108 -3062156 -6507648 -8958366 -8683938 -5813836 -3164055 -3086062 -4205687 -2955781
36090b955781M872228N945393L725427O32419j303882k430068l719110m358687
$$ -2955781 1916447 7861840 11587267 12219686 10915804 8485736 4766626 407939
36082D07939k502465J447392L956656K432413p89702j180847J422982K501878
$$ 407939 -2094526 -647134 3309522 5741935 4952233 3771386 5194368 7696246
36074G696246P3541j936800k66707J813734k00449l916459l249861J554767L773921
$$ 7696246 7769787 5832987 5566280 7380014 7179565 3263106 13245 1568012 5341933
36065E341933O30071k639613j341656J847545K109196j46071j384018r92453p77118
$$ 5341933 5972004 3332391 1990735 3838280 5947476 5801405 4417387 3424934 2647816
36056B647816p78662J19032R89687K39742r79387m77330P89464N6116k210252
$$ 2647816 1869154 1988186 2977873 3217615 2238228 1760898 2550362 2606478 396226
36047C96226k508270J70287K547837J734115j117174k967780k606436j180513
$$ 396226 -2112044 -1941757 606080 2340195 1223021 -1744759 -4351195 -5531708
36039e531708n63481j827241m078130m717229k296663J122559K332422J429787
$$ -5531708 -6095189 -7922430 -12000560 -16717789 -19014452 -17891893 -15559471 -14129684
36031a4129684J471065L492480M710857K851434j94649r44536R74784K648354
$$ -14129684 -12658619 -9166139 -4455282 -1603848 -1798497 -2743033 -1768249 880105
36023H80105J705530j178593l372653k955757m57996J665450J649333M82720M93940
$$ 880105 2585635 1407042 -1965611 -4921368 -5379364 -3713914 -2064581 -1581861 -1087921
36014a087921J933655K464492N90278j976959k536570q54485R58714J322299N90881
$$ -1087921 845734 3310226 3900504 1923545 -613025 -1467510 -508796 813503 1404384
36005A404384p7605o0183M78165P82607k4066j987732l894245m339938l078190
$$ 1404384 1326779 1266596 1744761 2527368 2503302 515570 -3378675 -7718613 -10796803
35996a0796803q63269J577407L645295M415113L308125J274027J28568L54972
$$ -10796803 -11660072 -10082665 -6437370 -2022257 1285868 2559895 2688463 3043435
35988C043435O36797J01372j86635R46785K460928K273536M19164q05800j56813
$$ 3043435 3680232 3781604 3594969 4541754 7002682 9276218 9695382 8889582 8732769
35979H732769Q56040L81582j232078k507332l073866l290697k776861j211354
$$ 8732769 9588809 9970391 8738313 6230981 3157115 -133582 -2910443 -4121797
35971d121797K05950J99994j84057J061112L361389L912431J804788p60613j879529
$$ -4121797 -3915847 -3715853 -3899910 -2838798 522591 4435022 6239810 5479197 3599668
35962C599668j893314j208907P61960L079234K849089m61971l112231k160240
$$ 3599668 1706354 497447 1259407 4338641 7187730 6725759 3613528 1453288
35954A453288J80260M28903n08918K85507J721959J87469l589690m536420q74758
$$ 1453288 1633548 2062451 1553533 1839040 3560999 3748468 158778 -4377642 -5252400
35945e252400L100887L513346J822575J021587Q46547k36473j412557j256268
$$ -5252400 -2151513 1361833 3184408 4205995 5052542 4816069 3403512 2147244
35937B147244p71748j337821j481895P53042L586541L472618P00397q45969K81233
$$ 2147244 1375496 37675 -1444220 -691178 2895363 6367981 7068378 6222409 6503642
35928F503642J118703n44211k573712k249245q46148j370928l222933k655839
$$ 6503642 7622345 7078134 4504422 2255177 1409029 38101 -3184832 -5840671
35920e840671J346135M845315M037323L09401j965762j387902n86317j524868
$$ -5840671 -4494536 350779 4388102 4697503 2731741 1343839 757522 -767346
35912g67346k661501j936788k00258M27953P2560N09596J841763K358708J601942
$$ -767346 -3428847 -5365635 -5565893 -5137940 -5065380 -4555784 -2714021 -355313 1246629
35903A246629J068992J493554J767390J246227Q34941P74851l21713k675379l731223
$$ 1246629 2315621 3809175 5576565 6822792 7657733 8432584 8110871 5435492 1704269
35894A704269j568586J609283J975814o80459k804406k113350l58414l17138j900737
$$ 1704269 135683 1744966 3720780 3040321 235915 -1877435 -2235849 -2552987 -4453724
35885d453724k614491j057239J359116K317761J511143R31084K026284L311045
$$ -4453724 -7068215 -8125454 -6766338 -4448577 -2937434 -2006350 19934 3330979
35877C330979K022940j841386m706012l512001N27768L458793L048114M41176
$$ 3330979 5353919 3512533 -1193479 -4705480 -4177712 -718919 2329195 2770371
35869B770371j988260k909592k294879q12397O54292J571323J977538J867642
$$ 2770371 782111 -2127481 -4422360 -5234757 -4580465 -3009142 -1031604 836038
35861H36038Q84593p65724j862348j673008j220658j707048k252290r68444J834884
$$ 836038 1720631 954907 -907441 -2580449 -3801107 -5508155 -7760445 -8728889 -6894005
35852f894005L452346K301807J7669p73300N29675K555442L834578L577592J602480
$$ -6894005 -3441659 -1139852 -1122183 -1895483 -1365808 1189634 5024212 8601804 10204284
35843A0204284j230412l127883l125963k326324k244765k408719j086482J709774
$$ 10204284 8973872 5845989 2720026 393702 -1851063 -4259782 -5346264 -3636490
35835c636490L656665L058022Q71445j012658k113363k746881k369788m68779
$$ -3636490 20175 3078197 3949642 2936984 823621 -1923260 -4293048 -4761827
35827d761827J535371J515070j40227p18616Q04052K137522J214095p37932j433536
$$ -4761827 -3226456 -1711386 -1851613 -2570229 -1766177 371345 1585440 847508 -586028
35818e86028j051737j164022j446475l17303J641520J834884m76447k968638l462358
$$ -586028 -1637765 -2801787 -4248262 -4565565 -2924045 -1089161 -1565608 -4534246 -7996604
35809g996604k100865J87534K963648N112123M833959K216242j90932p46413o70175
$$ -7996604 -10097469 -9909935 -6946287 -1834164 2999795 5216037 5025105 4278692 3608517
35800C608517j161804r00556J289612L237580J891483j979546m493057l814598
$$ 3608517 2446713 1546157 2835769 6073349 7964832 5985286 1492229 -2322369
35792b322369j991090j463385k121069k460792j784579l75677J186291K094701
$$ -2322369 -4313459 -5776844 -7897913 -10358705 -12143284 -12518961 -11332670 -9237969
35784i237969J679218L88816l09609L68483J416564J234501k21879j068052L30135
$$ -9237969 -7558751 -7169935 -7479544 -7111061 -5694497 -4459996 -4681875 -5749927 -5419792
35775e419792L029084M251918K842575P71229P3268k59714k081261l977672k848432
$$ -5419792 -2390708 1861210 4703785 5475014 5548282 5288568 3207307 -770365 -3618797
35766c618797N62290J858970k59408j766322J11361K426041J794698L4173K43188
$$ -3618797 -3056507 -1197537 -1456945 -3223267 -3111906 -685865 1108833 1143006 1386194
35757A386194Q61906j053993l426374k161331J190273J455706j131770j026855
$$ 1386194 2248100 1194107 -2232267 -4393598 -3203325 -1747619 -2879389 -3906244
35749c906244K824580M486609O05273m131998m583605k459496j710831j469737
$$ -3906244 -1081664 3404945 4010218 -121780 -4705385 -7164881 -8875712 -10345449
35741a0345449J192436M862617N565682L048074M88594r26564k810112n408687
$$ -10345449 -9153013 -4290396 1275286 4323360 4811954 3885390 1075278 -4333409
35733d333409o374893m016214N79224M573021N129478J406467l513173m502831
$$ -4333409 -10708302 -14724516 -14145292 -9572271 -4442793 -3036326 -6549499 -11052330
35725a1052330m08956L739909L057306q04843k693670j291696M78728Q91144R23900
$$ -11052330 -11461286 -7721377 -4664071 -5468914 -8162584 -9454280 -8975552 -8084408 -7160508
35716g160508R86779L72894q7052J222916L115582K617051J732j033241R63673
$$ -7160508 -6173729 -5800835 -5887887 -4664971 -1549389 1067662 1069394 36153 999826
35707I99826L080378K767250J156121J59293m51821j247989j371428n84891n35881
$$ 999826 4080204 6847454 8003575 8162868 7711047 6463058 5091630 4506739 3970858
35698C970858j940903k821102j590990K62581O91505K01888K19526L42438k24181
$$ 3970858 2029955 -791147 -2382137 -2119556 -1428051 -1226163 -1006637 -664199 -888380
35689h88380k58134J519555L328829K326192q33052k439039p54677K084784L521325
$$ -888380 -1146514 373041 3701870 6028062 5195010 2755971 2001294 4086078 7607403
35680G607403L393762K554889R64216j468163l663943m456054m022208l095811
$$ 7607403 11001165 13556054 14520270 13052107 9388164 4932110 909902 -2185909
35672b185909j505705J177115L885616M450214K264803m23939q84726P46717J595960
$$ -2185909 -3691614 -2514499 1371117 5821331 8086134 7662195 6777469 7524186 9120146
35663I120146j61009k715947k857990j82905K355802K183749j3587j795916k183812
$$ 9120146 8959137 6243190 3385200 3202295 5558097 7741846 7728259 5932343 3748531
35654C748531k172639k545365k527704j022849J529176L242049K803516R90684
$$ 3748531 1575892 -969473 -3497177 -4520026 -2990850 251199 3054715 4045399
35646D045399k46010o2603N63241N06306k2573k53971k46266m93640p69980n17591
$$ 4045399 3799389 3736786 4300027 4806333 4783760 4529789 4283523 3789883 3019903 2502312
35636B502312L6977L09846M70380Q96782J076442N64905M29529J712205K827240
$$ 2502312 2539289 2849135 3319515 4216297 5292739 5857644 6287173 7999378 10826618
35627A0826618J046328l135951n763419m454114j313500L11955k74388j757116
$$ 10826618 11872946 8736995 2973576 -1480538 -2794038 -2482083 -2756471 -4513587
35619d513587k950766k615285M65976M954255O624852L310696j480760k827042
$$ -4513587 -7464353 -10079638 -9613662 -4659407 1965445 5276141 3795381 968339
35611I68339q52949L95869n03135r18977O57218J983717Q86797j420568k556287
$$ 968339 115390 511259 8124 -910853 -253635 1730082 2616879 1196311 -1359976
35602a359976k179658j286039j81723J086816J686947J008024k70765j316402
$$ -1359976 -3539634 -4825673 -5007396 -3920580 -2233633 -1225609 -1496374 -2812776
35594b812776k266497l150000l008214j478168n8557j86874j007934p63112M08102
$$ -2812776 -5079273 -8229273 -11237487 -12715655 -12774212 -12961086 -13969020 -14732132 -14324030
35585a4324030R87254Q46233J250186K063993J333792j451108l629129k395076
$$ -14324030 -13336776 -12490543 -11240357 -9176364 -7842572 -9293680 -12922809 -15317885
35577a5317885J620257N268441O520778N626238L346463J56313k670578l360754
$$ -15317885 -13697628 -8429187 -1908409 3717829 7064292 7220605 4550027 1189273
35569A189273k077408j397407k891259m514409l267181L96439L026893K797557
$$ 1189273 -888135 -2285542 -5176801 -9691210 -12958391 -12561952 -9535059 -6737502
35561f737502J366432Q35921J158832J421525J587548J656610Q58612q14307j760732
$$ -6737502 -5371070 -4535149 -3376317 -1954792 -367244 1289366 2147978 1333671 -427061
35552d27061r76516K75744N31947L80962R19974J501111J076861K96559n6473
$$ -427061 -1403577 -1127833 -595886 -214924 705050 2206161 3283022 3579581 3523108
35543C523108j118448l585459m865770k239447K156389L656147J950058J055775
$$ 3523108 2404660 -1180799 -6046569 -8286016 -6129627 -2473480 -523422 532353
35535E32353K206988J983885r86333k777671o09173K002691N47608l460404n178718
$$ 532353 2739341 4723226 3736893 959222 350049 2352740 2900348 -560056 -5738774
35526e738774l643040j701099m74234J331058L291777L060079O20173j040243
$$ -5738774 -9381814 -11082913 -11557147 -10226089 -6934312 -3874233 -3254060 -4294303
35518d294303k27996J501255K248707J910459R18564n68438j663447j299597k51215
$$ -4294303 -4522299 -3021044 -772337 1138122 2056686 1488248 -175199 -1474796 -1726011
35509a726011l43497j289348p05885K185940N177652N998367M516288J620226
$$ -1726011 -2069508 -3358856 -4064741 -1878801 3298851 9297218 13813506 15433732
35501A5433732j751534l897882l128824k29723J851823J531565q5357j695327
$$ 15433732 13682198 9784316 6655492 6425769 8277592 9809157 9723800 8028473
35493H028473l156534l840360k430809N44052K528172K424207J804341J663253
$$ 8028473 4871939 1031579 -1399230 -855178 1672994 4097201 5901542 7564795
35485G564795Q39174j004697j906011r17115Q5846p6900L20838K172457K871098
$$ 7564795 8403969 7399272 5493261 4576146 4661992 4585092 4905930 7078387 9949485
35476I949485N85019j795339q57615J620269J428158j463799l563561l779981
$$ 9949485 10534504 8739165 7881550 9501819 10929977 9466178 5902617 2122636
35468B122636l887605l778061j337244K582639L850960R71273k611558l493834
$$ 2122636 -1764969 -5543030 -6880274 -4297635 -446675 524598 -2086960 -5580794
35460e580794k186640o84167N29754J407011J176054O5523j34587J229908K477329
$$ -5580794 -7767434 -8451601 -7921847 -6514836 -5338782 -5273259 -5407846 -4177938 -1700609
35451a700609K259215J291691M22485o74270j785682j592584m0316J103277J176114
$$ -1700609 558606 1850297 2272782 1598512 -187170 -1779754 -1820070 -716793 459321
35442D59321J496495K175917J176643j744460l438832k131774o78518j997823
$$ 459321 1955816 4131733 5308376 3563916 125084 -2006690 -2685208 -4683031
35434d683031m007397k874117O48564K252775N22581j524306j208420Q19295K645727
$$ -4683031 -8690428 -11564545 -10915981 -8663206 -8140625 -9664931 -10873351 -10054056 -7408329
35425g408329L409504L053004J882412P89482L74917q1272j378116k677851k684338
$$ -7408329 -3998825 -945821 936591 1726073 2100990 2019718 641602 -2036249 -4720587
35416d720587j836961j423013j176214J21271K133312L205038K777234J647083
$$ -4720587 -6557548 -7980561 -9156775 -9035504 -6902192 -3697154 -919920 727163
35408G27163L55780p11088m19071J556416L021529J786326p15748j249814K75295
$$ 727163 1082943 371855 -47216 1509200 4530729 6317055 5601307 4351493 4626788
35399D626788R67166j74186j228393j473044k516652m263351l773549j33936L038967
$$ 4626788 5593954 5419768 4191375 2718331 201679 -4061672 -7835221 -7969157 -4930190
35390d930190K507372Q114p69509N31581J571763J464089J281875J409641J048059
$$ -4930190 -2422818 -2414704 -3184213 -2652632 -1080869 383220 1665095 3074736 4122795
35381D122795j2175j006861j232916l35278J484402K607972J042736k317282l558790
$$ 4122795 4110620 3103759 1870843 1535565 3019967 5627939 6670675 4353393 794603
35372G94603r02955K106709J254699k365768m318496l339704j957948j255877
$$ 794603 -108352 1998357 3253056 887288 -3431208 -6770912 -8728860 -9984737
35364i984737N48142L619051M805226K344150q95241j242179R21244K462146J978016
$$ -9984737 -9436595 -5817544 -1012318 1331832 436591 -805588 115656 2577802 4555818
35355D555818N99190n75459j488037k025795j899510j506590j401735j119153
$$ 4555818 5155008 4579549 3091512 1065717 -833793 -2340383 -3742118 -4861271
35347d861271K9625J277008J218032K61695L67864J950314L020149K327715J373169
$$ -4861271 -4831646 -3554638 -2336606 -2074911 -1707047 243267 3263416 5591131 6964300
35338F964300J684992J910300J27355k107119j359714J974770L162324k41305
$$ 6964300 8649292 10559592 10686947 8579828 7220114 9194884 12357208 12115903
35330A2115903m460200m730746j935184o10840j953152k842252j463162K34347
$$ 12115903 7655703 2924957 989773 378933 -1574219 -4416471 -5879633 -5645286
35322e645286M85515L90412J018474J014403o50084j995613o93068K225825L739543
$$ -5645286 -5159771 -4769359 -3750885 -2736482 -3386566 -5382179 -6075247 -3849422 -109879
35313a09879K809153Q89335n68034j175087r80035n13884p15065j419156j051511
$$ -109879 2699274 3588609 3020575 1845488 865453 351569 -363496 -1782652 -2834163
35304b834163P73567J973964J194654M00579J644510K975334J058168l095306
$$ -2834163 -2060596 -86632 1108022 1508601 3153111 6128445 7186613 4091307
35296D091307m878722k525258Q40164K010843J115309n07000k385704l596589
$$ 4091307 -787415 -3312673 -2472509 -461666 653643 146643 -2239061 -5835650
35288e835650k567419P3880J236296k19398j425835P2022K380625K326120M04155
$$ -5835650 -8403069 -8329189 -7092893 -7312291 -8738126 -8666104 -6285479 -3959359 -3555204
35279c555204l03869J091682K450324J965359J8642j974506k711074j478947Q64885
$$ -3555204 -3859073 -2767391 -317067 1648292 1666934 -307572 -3018646 -4497593 -3632708
35270c632708K084739J291467M28965J249605K212206R07894j673953k535254
$$ -3632708 -1547969 -256502 172463 1422068 3634274 4542168 2868215 332961
35262C32961j621020j635464k846589k203129J170192L597523K272234l26584
$$ 332961 -1288059 -2923523 -5770112 -7973241 -6803049 -3205526 -933292 -1259876
35254a259876m70457J086572J082511m69588p07278O75788Q34476j062068k182817
$$ -1259876 -1730333 -643761 438750 -30838 -738116 -62328 772148 -289920 -2472737
35245b472737q47765O43529k2086j486329j499793p74184j101458j721680r12117
$$ -2472737 -3320502 -2676973 -2699059 -4185388 -5685181 -6459365 -7560823 -9282503 -10194620
35236a0194620M03737L74595L76677L011491O222238M531732k435984p510536
$$ -10194620 -9790883 -9416288 -9039611 -6028120 194118 4725850 2289866 -5220670
35228e220670m991551J648947M770265K519815l77610j04744K331079M194241
$$ -5220670 -10212221 -8563274 -3793009 -1273194 -1650804 -1755548 575531 4769772
35220D769772M130937J905860j727771m363148l834636j218218M17444K64453
$$ 4769772 8900709 10806569 9078798 4715650 881014 -337204 80240 344693
35212C44693J08397N36146J55024j010845j017970J10733j47449j844096j200507
$$ 344693 453090 989236 1144260 133415 -884555 -773822 -921271 -2765367 -3965874
35203c965874L030206N796575K445973l755842n729931k527695J30288j121307
$$ -3965874 -935668 4860907 7306880 3551038 -2178893 -4706588 -4576300 -5697607
35195e697607l141465k319302J25583J413915J961597L412753M418291K351856
$$ -5697607 -8839072 -11158374 -11032791 -9618876 -7657279 -4244526 173765 2525621
35187B525621j669905l288304r26446J797017J181177j283958j092864K822814
$$ 2525621 855716 -2432588 -3359034 -1562017 -380840 -1664798 -2757662 65152
35179F5152O442137N852481J921451j540804k716461k877856l309567l522742
$$ 65152 6507289 12359770 14281221 12740417 10023956 7146100 3836533 313791
35171C13791k863227j861666j085372k03401P84438P66142p72886k300382j824247
$$ 313791 -2549436 -4411102 -5496474 -5699875 -4915437 -4149295 -4922181 -7222563 -9046810
35162i046810P04681L543912M972327M132214J154945k343332l829560k296565
$$ -9046810 -8342129 -4798217 174110 4306324 5461269 3117937 -711623 -3008188
35154c008188M47340J911942J456909j86894k358714l844726k493515K053153
$$ -3008188 -2560848 -648906 808003 621109 -1737605 -5582331 -8075846 -6022693
35146f022693O272705O179167K437368n52137m47259Q97881J102621Q1060j373585
$$ -6022693 250012 6429179 8866547 8314410 7867151 8765032 9867653 9948713 8575128
35137H575128k898751l416210j444466J970430L166868O04252k455137k186497
$$ 8575128 5676377 2260167 815701 2786131 5952999 6557251 4102114 1915617
35129A915617O06319K008329N51194j359982j222236O86444K499476L103728K615640
$$ 1915617 2521936 4530265 5081459 3721477 2499241 3185685 5685161 8788889 11404529
35120A1404529J458149l27220k807629n175010n499146k568960J935803M556392
$$ 11404529 12862678 12535458 9727829 4552819 -946327 -3515287 -1579484 2976908
35112B976908L902031J940041P60229r4371j714821l098965k528534n82053N10595
$$ 2976908 6878939 8818980 9579209 9484838 7770017 4671052 2142518 1560465 2071060
35103B071060Q685q47173j056362o13685N61303K336608L204403J661678j086610
$$ 2071060 2079745 1232572 176210 -437475 123828 2460436 5664839 7326517 6239907
35094F239907k013382l03379J569710J367269l96123k204042l568320m033103
$$ 6239907 4226525 3923146 5492856 6860125 6464002 4259960 691640 -3341463
35086c341463k261746J895800N731352O120853L124947k89182j622737p74803
$$ -3341463 -5603209 -3707409 2023943 8144796 11269743 10980561 9357824 8583021
35078H583021P52737J337265L88335r99989j113217l509L60978p30512j182298
$$ 8583021 9335758 10673023 11061358 10061369 8948152 8944643 9305621 8575109 7392811
35069G392811M61103J860096J08428l079448l169319K95559K642964J010616j550098
$$ 7392811 7853914 9714010 9822438 6742990 3573671 3869230 6512194 7522810 5972712
35060E972712j130304J194588J743329J12755r59217m05395N7592o67412j643348
$$ 5972712 4842408 6036996 7780325 7893080 6933863 6528468 6586060 5918648 4275300
35051D275300k079307k328014k357387j436767L03203J811032K551654K227135
$$ 4275300 2195993 -132021 -2489408 -3926175 -3622972 -1811940 739714 2966849
35043B966849j44441m178667n979276j972674M900330P223291K699370k588686
$$ 2966849 2822408 -1356259 -7335535 -9308209 -4407879 2815412 5514782 2926096
35035B926096k706850O07710K192451J280791N85705M16586j098711l316219l583138
$$ 2926096 219246 826956 3019407 4300198 4885903 5302489 4203778 887559 -2695579
35026b695579k012411j329128k027214j769113L02594K547913M133082N328023
$$ -2695579 -4707990 -6037118 -8064332 -9833445 -9530851 -6982938 -2849856 2478167
35018B478167M602820J79184m999251n109208J49636M118074K493635r34103j047140
$$ 2478167 7080987 7260171 2260920 -2848288 -2698652 1419422 3913057 2978954 1931814
35009A931814R76075J189119k2510K98097J531632O70672j762070k252813k90708
$$ 1931814 2907889 4097008 4074498 4372595 5904227 6574899 4812829 2560016 2269308
$$ [...]
##END NTUPLES=NMR SPECTRUM
##END=
