##TITLE=31Pdec_DE_63_2_oil
 D2O, 64 sc
 6.8.2024
##JCAMPDX= 6.0         $$ Bruker NMR JCAMP-DX V2.0
##DATA TYPE= NMR SPECTRUM
##DATA CLASS= NTUPLES
##ORIGIN= UXNMR, Bruker Analytische Messtechnik GmbH
##OWNER= root
$$ XWIN-NMR		Version 3.5
$$ Tue Aug  6 14:12:06 2024 Russian Standard Time (UT+4h)  she@DPX200
##.OBSERVE FREQUENCY= 81.013821
##.OBSERVE NUCLEUS= ^31P
##.ACQUISITION MODE= SIMULTANEOUS
##.ACQUISITION SCHEME= undefined
##.AVERAGES= 64
##.DIGITISER RES= 17
##SPECTROMETER/DATA SYSTEM= spect
##.PULSE SEQUENCE= zgpg30
##.SOLVENT NAME= D2O
##.SHIFT REFERENCE= (INTERNAL, D2O, 0, 198.062)
##AUDIT TRAIL= $$ (NUMBER, WHEN, WHO, WHERE, WHAT)
$$ ##TITLE= Audit trail, XWIN-NMR		Version 3.5
$$ ##JCAMPDX= 5.01
$$ ##ORIGIN= Bruker BioSpin GmbH
$$ ##OWNER= she
$$ F:/spectra/data/she/nmr/P31/2/pdata/1/auditp.txt
$$ ##AUDIT TRAIL=  $$ (NUMBER, WHEN, WHO, WHERE, WHAT)
(   1,<2024-08-06 14:11:01.32 +0400>,<she>,<DPX200>,
      <created by zg, POWCHK disabled, PULCHK disabled
       configuration hash MD5:
       00 E9 B6 7A A2 85 ED C7 34 08 36 98 17 FE 4E 26
       data hash MD5: 32K
       80 7D F5 A3 B5 E0 75 8C 1A 5A E9 F9 AF CA DB 8B>)
(   2,<2024-08-06 14:11:03.50 +0400>,<she>,<DPX200>,
      <Start of raw data processing
       efp BC_mod = 2 LB = 1.5 FT_mod = 6 PKNL = 1 PHC0 = 2655.058 PHC1 = 108.4869 SI = 64K 
       data hash MD5: 64K
       C6 B8 2A 5F 7A E6 74 3D BB D4 6B 55 2C 9C D8 0E>)
(   3,<2024-08-06 14:11:29.32 +0400>,<she>,<DPX200>,
      <pk PHC0 = -26.6887 PHC1 = 76.79998 
       data hash MD5: 64K
       F3 FF 43 49 CC 15 88 73 75 5A 75 43 DA A0 9D 33>)
(   4,<2024-08-06 14:11:34.87 +0400>,<she>,<DPX200>,
      <abs ABSG = 5 
       data hash MD5: 64K
       C6 AB 29 EB 00 06 98 8D 9E FB F5 BE F5 95 5A 4C>)
$$ ##END=
$$ 
$$ hash MD5
$$ 17 A1 78 0D 1B 09 8D F3 D3 82 36 F1 20 6C 51 42
##$RELAX= 
##$RELAX= 
##$RELAX= 
##$RELAX= 
##$RELAX= 
##$RELAX= 
##$RELAX= 
##$RELAX= 
$$ Bruker specific parameters
$$ --------------------------
##$DU= <F:/spectra>
##$EXPNO= 2
##$NAME= <P31>
##$PROCNO= 1
##$TYPE= <nmr>
##$USER= <she>
##$AMP= (0..31)
100 100 100 100 100 100 100 100 100 100 100 100 100 100 100 100 100 100 
100 100 100 100 100 100 100 100 100 100 100 100 100 100 
##$AQSEQ= 0
##$AQ_mod= 1
##$AUNM= <au_zg>
##$AUTOPOS= <>
##$BF1= 81.014009
##$BF2= 200.13
##$BF3= 200.13
##$BF4= 200.13
##$BF5= 200.13
##$BF6= 200.13
##$BF7= 200.13
##$BF8= 200.13
##$BYTORDA= 1
##$CFDGTYP= 0
##$CFRGTYP= 5
##$CHEMSTR= <none>
##$CNST= (0..31)
1 1 145 1 1 1 1 1 1 1 1 1 1 1 1 1 1 1 1 1 1 1 1 1 1 1 1 1 1 1 1 1 
##$CPDPRG= <waltz16>
##$CPDPRG1= <>
##$CPDPRG2= <waltz16>
##$CPDPRG3= <>
##$CPDPRG4= <mlev>
##$CPDPRG5= <mlev>
##$CPDPRG6= <mlev>
##$CPDPRG7= <mlev>
##$CPDPRG8= <mlev>
##$CPDPRGB= <>
##$CPDPRGT= <>
##$D= (0..31)
0 1 0 0 0 0 0 0 0 0.06 0 0.03 2e-05 3e-06 0 0 0.0002 0 0 0 0 0 0 0 0 0 
0 0 0 0 0 0 
##$DATE= 1722939060
##$DBL= (0..7)
120 120 120 11 120 120 24 19 
##$DBP= (0..7)
150 150 150 150 150 150 150 150 
##$DBP07= 0
##$DBPNAM0= <>
##$DBPNAM1= <>
$$ [...]
##$SUBNAM3= <"">
##$SUBNAM4= <"">
##$SUBNAM5= <"">
##$SUBNAM6= <"">
##$SUBNAM7= <"">
##$SUBNAM8= <"">
##$SUBNAM9= <"">
##$SW= 400.765351723535
##$SWIBOX= (0..15)
0 1 3 0 0 0 0 0 0 0 0 0 0 0 0 0 
##$SW_h= 32467.5324675325
##$TD= 32768
##$TD0= 1
##$TE= 0
##$TE2= 300
##$TE3= 300
##$TEG= 300
##$TL= (0..7)
0 120 53 12 22 120 120 120 
##$TP= (0..7)
150 150 150 150 150 150 150 150 
##$TP07= 0
##$TPNAME0= <>
##$TPNAME1= <>
##$TPNAME2= <>
##$TPNAME3= <>
##$TPNAME4= <>
##$TPNAME5= <>
##$TPNAME6= <>
##$TPNAME7= <>
##$TPOAL= (0..7)
0.5 0.5 0.5 0.5 0.5 0.5 0.5 0.5 
##$TPOFFS= (0..7)
0 0 0 0 0 0 0 0 
##$TUNHIN= 0
##$TUNHOUT= 0
##$TUNXOUT= 0
##$USERA1= <user>
##$USERA2= <user>
##$USERA3= <user>
##$USERA4= <user>
##$USERA5= <user>
##$V9= 5
##$VALIST= <valist>
##$VCLIST= <CCCCCCCCCCCCCCC>
##$VD= 0
##$VDLIST= <DDDDDDDDDDDDDDD>
##$VPLIST= <PPPPPPPPPPPPPPP>
##$VTLIST= <TTTTTTTTTTTTTTT>
##$WBST= 1024
##$WBSW= 4
##$XGAIN= (0..3)
0 0 0 0 
##$XL= 0
##$YL= 0
##$YMAX_a= 7833
##$YMIN_a= -7044
##$ZGOPTNS= <>
##$ZL1= 120
##$ZL2= 120
##$ZL3= 120
##$ZL4= 120
##$ABSF1= 198.0616
##$ABSF2= -202.7028
##$ABSG= 5
##$ABSL= 3
##$ALPHA= 0
##$AQORDER= 0
##$ASSFAC= 0
##$ASSFACI= 0
##$ASSFACX= 0
##$ASSWID= 0
##$AUNMP= <proc_1d>
##$AZFE= 0.1
##$AZFW= 0.5
##$BCFW= 0
##$BC_mod= 2
##$BYTORDP= 0
##$COROFFS= 0
##$CY= -3
##$DATMOD= 1
##$DC= 0
##$DFILT= <>
##$DTYPP= 0
##$F1P= 0
##$F2P= 0
##$FCOR= 1
##$FTSIZE= 65536
##$FT_mod= 6
##$GAMMA= 0
##$GB= 0
##$INTBC= 1
##$INTSCL= 9.790993e-09
##$ISEN= 30
##$LB= 1.5
##$LEV0= 0
##$LPBIN= 0
##$MAXI= 10000
##$MC2= 0
##$MEAN= 0
##$ME_mod= 0
##$MI= 50
##$NCOEF= 0
##$NC_proc= -9
##$NLEV= 6
##$NOISF1= 182.463
##$NOISF2= 159.3651
##$NSP= 0
##$NTH_PI= 0
##$NZP= 0
##$OFFSET= 198.0616
##$PC= 4
##$PHC0= 2628.369
##$PHC1= 185.2869
##$PH_mod= 1
##$PKNL= yes
##$PPARMOD= 0
##$PSCAL= 0
##$PSIGN= 0
##$REVERSE= no
##$SF= 81.0140089999434
##$SI= 65536
##$SIGF1= 159.3651
##$SIGF2= -187.1042
##$SINO= 113.3802
##$SIOLD= 16384
##$SREGLST= <1H.CDCl3>
##$SSB= 0
##$STSI= 65536
##$STSR= 0
##$SW_p= 32467.5324675325
##$SYMM= 0
##$S_DEV= 0
##$TDeff= 32768
##$TDoff= 0
##$TI= <>
##$TILT= no
##$TM1= 0
##$TM2= 0
##$TOPLEV= 0
##$USERP1= <user>
##$USERP2= <user>
##$USERP3= <user>
##$USERP4= <user>
##$USERP5= <user>
##$WDW= 1
##$XDIM= 65536
##$YMAX_p= 310358456
##$YMIN_p= -62087668
$$ End of Bruker specific parameters
$$ ---------------------------------
##NTUPLES= NMR SPECTRUM
##VAR_NAME=  FREQUENCY,     SPECTRUM/REAL,   SPECTRUM/IMAG
##SYMBOL=    X,             R,               I
##VAR_TYPE=  INDEPENDENT,   DEPENDENT,       DEPENDENT
##VAR_FORM=  AFFN,          ASDF,            ASDF
##VAR_DIM=   65536,         65536,           65536
##UNITS=     HZ,            ARBITRARY UNITS, ARBITRARY UNITS
##FACTOR=    0.49542278885378, 1,            1
##FIRST=     16045.7642231865, 0,            0
##LAST=      -16421.768244346, 0,            0
##MIN=       -16421.768244346, -62087668,    0
##MAX=       16045.7642231865, 310358456,    0
$$ Real data points
##PAGE= N=1
##DATA TABLE= (X++(R..R)), XYDATA
$$ [...]
39936e747564k861448K641210J08831j932811L639088J0479059R080839J260312
39928A6667516l844455l387898k136931k733167k686769q10765K11089j155540
39920A23080k942324l689726m429017n254910m002353l01137K490733J821946
39912a6183708j17646M86414L685904N925976M865123K083759Q58034K222819
39904C826675L727851K302450j805760n088174n325608m295406m302826m004384
39896a4965182p11317M370617O926119N284803J760579j608333m431010m814066
39888h187790j91553O669807P781273r2515r580212j1409567o034193j549598
39880b2594348j967543l185779m97751M890617Q184363O650896J867802j662092
$$ plain form
39936 -5747564 -8609012 -5967802 -5858971 -7791782 -4152694 6326365 15407204 16667516
39928 16667516 12823061 9435163 7298232 4565065 1878296 1067531 1278620 123080
39920 123080 -2819244 -6508970 -10937987 -16192897 -20195250 -20496387 -18005654 -16183708
39912 -16183708 -16301354 -15814940 -12129036 -6203060 -1337937 745822 1603856 3826675
39904 3826675 7554526 9856976 8051216 2963042 -2362566 -6657972 -10960798 -14965182
39896 -14965182 -15676499 -11305882 -4379763 905040 2665619 1057286 -3373724 -8187790
39888 -8187790 -8379343 -1709536 6071737 5979222 -3600990 -15010557 -21044750 -22594348
39880 -22594348 -24561891 -27747670 -28245421 -23354804 -15170441 -8519545 -6651743 -8313835
39872h313835j78610M968389P486699L493912k523710l106705J683522M508389
39864H018051J986115n52031J634807M440133J267680n992918q829356m145549
39856b173068J453477P45933n119294r127083p122190j290542L744654N581623
39848a3306490M648257K268110l30304j583348o0403L364733M806506J136556
39840I43617n090635o871639q14182P583208R464679L142067l852594m258229
39832B46292N9380J356352l251250q049726o800228j283432J515662o34672k441470
39823a9283092P47771O200375Q377978P201337O885751P699389M788107l197188
39815A9420428r622825p983175j149382K377344o111k427747M5707M377077M614902
$$ plain form
39872 -8313835 -8492445 -3524056 3962643 7456555 4932845 1826140 3509662 8018051
39864 8018051 10004166 9452135 11086942 15527075 16794755 10801837 1972481 -2173068
39856 -2173068 -719591 26342 -5092952 -14220035 -21342225 -22632767 -18888113 -13306490
39848 -13306490 -8658233 -6390123 -6720427 -8303775 -8364178 -4999445 -192939 943617
39840 943617 -4147018 -11018657 -11832839 -4249631 5215048 8357115 4504521 246292
39832 246292 305672 1662024 -1589226 -9638952 -16439180 -17722612 -16206950 -16841622 -19283092
39823 -19283092 -18535321 -12334946 -3956968 3244369 10130120 17829509 22617616 19420428
39815 19420428 9797603 1814428 665046 3042390 3036279 608532 654239 5031316 9646218
39806I646218O34742k117048n34047K325171K072636j266918m172614m440319
39798B147821k805375q00552M18753m54979l504076n326854j841521M987419P177275
39789b089Q74425p045203p613527k412785o78339m549257n742185N76285P123453
39780a9469222N702766M32593J190570P449178Q544934K21445q365924p530766
39772a1824426J68263N090737L671945N22713k92971j57080j719735m179843m648574
39763a3368971k187054J214979L102834L056766K658177L175885L663010K028703
39755C344329j885073n202644m749076n87661L770158M728983J973553j582127
39747a89558l128388k795905k545261k804803k126942o17741j015200m181005
$$ plain form
39806 9646218 10280960 8163912 7629865 9955036 12027672 10760754 6588140 2147821
39798 2147821 -657554 -1458106 -1039353 -1494332 -4998408 -10325262 -12166783 -7179364 -2089
39789 -2089 872336 -6172867 -13786394 -16199179 -16877518 -21426775 -27168960 -26592675 -19469222
39780 -19469222 -13766456 -13333863 -12143293 -4694115 3850819 4072264 -4293660 -11824426
39772 -11824426 -11656163 -6565426 -2893481 -2370768 -2663739 -2820819 -4540554 -8720397 -13368971
39763 -13368971 -15556025 -14341046 -11238212 -8181446 -5523269 -2347384 1315626 3344329
39755 3344329 1459256 -3743388 -8492464 -9080125 -5309967 -580984 1392569 -189558
39747 -189558 -3317946 -6113851 -8659112 -11463915 -13590857 -14208598 -15223798 -19404803
39739a9404803n855253j694051N437235P824871L322350j213887O04702N750255
39731e228581O469337J554090k312982n01381L269978K889983j383930l856930
39723H99584j716755J592879J963073J30641o70822k75872j446721m787213p150006
39714a1461212n762633j282976M008349Q296377R563014O254562O65257j691348
39706H589390R89903L630456J566628k295243k524202m04885j526564n665093
39698B360390o742664l218863n36159j130945m0989N506330R599298O617475N05788
39689A2919661k026954k569975o819726j2592419j1656719l116540M229042M679604
39681a6954026K664883L698676N481811L168070j657379l394461j210184K97257
$$ plain form
39739 -19404803 -25260056 -26954107 -21516872 -13692001 -10369651 -11583538 -10978836 -5228581
39731 -5228581 1240756 2794846 481864 -19517 3250461 6140444 4756514 899584
39723 899584 -817171 775708 2738781 2869422 2198600 1922728 476007 -4311206 -11461212
39714 -11461212 -17223845 -18506821 -14498472 -6202095 3360919 9615481 10280738 8589390
39706 8589390 9579293 13209749 14776377 12481134 9956932 9552047 8025483 2360390
39698 2360390 -4382274 -7601137 -8137296 -9268241 -9309230 -3802900 5796398 12413873 12919661
39689 12919661 10892707 8322732 1503006 -11089413 -22746132 -25862672 -21633630 -16954026
39681 -16954026 -14289143 -10590467 -5108656 -1940586 -3597965 -6992426 -8202610 -7905353
39673g905353j501981l903741l398411n7574L693532O170625O808865N064783
39665D970745R56712l352456m188228o6522N453267O516778J845461k610938l17510
39656I207309O952860R900697K653186r374596j4964381r635536l13020L042508
39648b530973j356831n995001l685288L902009Q882139O955023J644453j544120
39640F271411j850366j912601k321948j319298Q76543J452498m09989j581239
39632g94989N30162L797759M065799R08028j761496r28157J730233K474181O81964
39623A0703484p67976m70593j142969n013141q576624o168709J291838N967929
39615d176761L403186j426785j766777J353480K247045K97680J95783L322388
$$ plain form
39673 -7905353 -9407334 -13311075 -16709486 -16767060 -13073528 -6902903 -94038 4970745
39665 4970745 5927457 2575001 -1613227 -1679749 3773518 10290296 12135757 9524819 9207309
39656 9207309 16160169 26060866 28714052 19339456 4375075 -5260461 -5573481 -2530973
39648 -2530973 -3887804 -9882805 -13568093 -9666084 -783945 6171078 7815531 6271411
39640 6271411 4421045 2508444 186496 -1132802 -256259 1196239 786250 -794989
39632 -794989 -264827 3532932 7598731 8506759 6745263 5817106 7547339 10021520 10703484
39623 10703484 9935508 9464915 8321946 3308805 -5267819 -11436528 -10144690 -4176761
39615 -4176761 -773575 -2200360 -3967137 -2613657 -366612 -68932 126851 3449239
39607C449239N276604L035920o83787k032201q56946Q32907J731100J033235j404803
39598A0381268l482329k683990m29913q81241m331474o030266l295641N42940
39590a0210646J610284P11976L52578M74147K40021M39492J047374Q7767j928472
39581g175479o57116N031300Q950232N555525j719711n663874n424408n042925
39573f146456m718143j190214M286889O173475L393746Q65360J059785O51378
39565D375820k425214m809761l595516j224664j220318l110126m505065m526405
39557b1041249k634899J992262P143647P769879K956741j126104P11709N078324
39549H50310N156125P14927k476352j755030l33435r07814j913840j729904k094563
$$ plain form
39607 3449239 8725843 11761763 11077976 9045775 8188829 9021736 10752836 11786071 10381268
39598 10381268 6898939 4214949 3785036 2903795 -1427679 -7457945 -10753586 -10210646
39590 -10210646 -8600362 -7888386 -7535808 -7061661 -6821640 -6382148 -5334774 -5247007 -7175479
39581 -7175479 -7832595 -2801295 6148937 11704462 9984751 4320877 -1103531 -6146456
39573 -6146456 -10864599 -12054813 -7767924 -1594449 1799297 2664657 3724442 4375820
39565 4375820 1950606 -2859155 -6454671 -7679335 -8899653 -12009779 -16514844 -21041249
39557 -21041249 -23676148 -21683886 -14540239 -6770360 -3813619 -4939723 -4228014 850310
39549 850310 6006435 6721362 4245010 2489980 2156545 1248731 -665109 -2395013 -4489576
39540d489576m418233n655389j629529O190331J0508967O147223l319887q746539
39532e412632n281790K571680O628334M129425p93556l547437l640596k448813
39524g795385o245L717347O615581O349031L582697J087565R3924n03773j552748
39515A1587994k223879j683306q97286j865511n144759q405227p933057k321591
39507a8886622N335432R799573Q461582L196146k139632m778508l982734j005350
39499d000113J337788Q96794j108326j072517K487435O770722P796375M439204
39491A7547362j088605n324698n767971k757266L63718O19012j003278j445811
39483A142463o49409j220836k813720j565255K944703N011588P41174n245257
$$ plain form
39540 -4489576 -8907809 -14563198 -16192727 -10002396 506571 6653794 3333907 -5412632
39532 -5412632 -10694422 -8122742 -1494408 2635017 1841461 -1705976 -5346572 -7795385
39524 -7795385 -7801630 -4084283 2531298 8880329 12463026 13550591 13644515 13140742 11587994
39515 11587994 9364115 7680809 6783523 4918012 -226747 -8631974 -16565031 -18886622
39507 -18886622 -13551190 -3751617 4709965 7906111 5766479 987971 -2994763 -4000113
39499 -4000113 -2662325 -1765531 -2873857 -3946374 -1458939 5311783 13108158 17547362
39491 17547362 16458757 11134059 5366088 2608822 2972540 3591552 2588274 1142463
39483 1142463 493054 -727782 -3541502 -5106757 -2162054 2849534 3590708 -1654549
39475a654549n748574r66249K604917J774771r1001O26689K927431L765812K169479
39466E408726o44498l234492m857734n294052m177306q06408M079887O814696
39458b711181M378078k517N00537O074548Q366902K811948l307364j714575L389844
39449A7786220J801575o251902j0804998q176836n011841n076098l470156K164799
39441a7039237N373213J966393j583300J752588Q247986J0123294P629250O032733
39433B2502920N273311J664680l151152m044836j820098k359372o596877r026877
39425B441699o721619k811798N7977L144721O687493P444793L785203j009076
39417A3019393k739709m95831M009878P843153P271052J055767n945919o977821
$$ plain form
39475 -1654549 -7403123 -8369372 -5764455 -3989684 -4080685 -3453996 -526565 3239247 5408726
39466 5408726 4764228 1529736 -3327998 -8622050 -12799356 -13605764 -9525877 -2711181
39458 -2711181 1666897 1664380 2164917 8239465 16606367 19418315 16110951 14396376 17786220
39449 17786220 19587795 13335893 2530895 -5645941 -10657782 -15733880 -19204036 -17039237
39441 -17039237 -11666024 -9699631 -11282931 -9530343 -1282357 8840937 16470187 22502920
39433 22502920 27776231 29440911 26289759 22244923 20424825 18065453 11468576 2441699
39425 2441699 -4279920 -7091718 -7033741 -3889020 2798473 10243266 14028469 13019393
39417 13019393 10279684 9783853 13793731 21636884 28907936 29963703 24017784 17039963
39409A7039963k306310O98292k000837n517497l675725K108879N480816L897364
39401A5724945P31393k24156Q58008J096226j043298l498246k866405O71095K476595
39392A3926157l63070m086123l333734M92390J338427j613938k711140M26952
39384D075921K896832J189471p91784R27079K759106n69997o536698p972481l569517
39375g592068J090281K068973R18555J39658p8253J8164P28891J259867L47371
39366a098561j149827j190038L0206N58295K37410N78862J457094J379200P80650
39357A583291J368882K364752J519903j6708J361417M940760N063548l13906n302962
39348A2568977m073282P90534K665418P21031m49777J84273j790757p484881j0203872
$$ plain form
39409 17039963 14733653 15431945 13431108 7913611 4237886 6346765 11827581 15724945
39401 15724945 16456338 16232182 17090190 18186416 17143118 13644872 10778467 11449562 13926157
39392 13926157 13563087 9476964 6143230 6635620 7974047 6360109 3648969 4075921
39384 4075921 6972753 8162224 7370440 8297519 11056625 10486628 3949930 -4022551 -7592068
39375 -7592068 -6501787 -4432814 -3514259 -3374601 -3452854 -3434690 -2705799 -1445932 -1098561
39366 -1098561 -2248388 -3438426 -3408220 -2849925 -2612515 -2033653 -576559 802641 1583291
39357 1583291 2952173 5316925 6836828 6820120 8181537 13122297 18185845 17871939 12568977
39348 12568977 8495695 9286229 11951647 12672678 12222901 12407174 10616417 3131536 -7072336
39339g072336m330440N000506P385724J663241j723246M524550J3199083J1756690
39331C0403772k19387j0159288r303584k819170P1645o24855J474046O904125
39323A5727304Q639994K443271p097523j2228305r679250j847209N721655P061457
39315H741394J26477r627594j3264685q119321q90703R80203j736478k476140
39307b6266847J806960P193034Q329461M671490L71399o96364J297545L301313
39299G991L493339K939974K819386J955134q14949l092084r72282M963499Q558911
39290A9858919M576286n045338j2629258j2014127m136754M152439O999415N293232
39282G054814M276072N558428M869318n22700o284394o923064l793653j899789
$$ plain form
39339 -7072336 -11402776 -6402270 983454 2646695 923449 5447999 18647082 30403772
39331 30403772 30184385 20025097 10721513 7902343 7973988 7349133 8823179 15727304
39323 15727304 24367298 26810569 19713046 7484741 -2194509 -4041718 1679937 8741394
39315 8741394 8867871 -759723 -14024408 -22143729 -23034432 -22054229 -23790707 -26266847
39307 -26266847 -24459887 -17266853 -8937392 -4265902 -3894503 -4590867 -3293322 7991
39299 7991 3501330 6441304 9260690 11215824 10400875 7308791 6336509 11300008 19858919
39290 19858919 24435205 19389867 6760609 -5253518 -9390272 -5237833 1761582 7054814
39282 7054814 11330886 16889314 21758632 21235932 14951538 8028474 4234821 2335032
39274B335032j540128K38815J925978o02677n023681m294300J422924L934108
39266a603929P52699l46905M621470P360408O51017q389478q402956q98278L672087
39257b583865K776102L152038P070369Q731530N159102P70812q05529j138354
39249B3132205j506083r10053j223798o169011j2868127j2726818m104388L787244
39241a2588829L762664q7578r26417L46117n15102k234074p86538K964912N007215
39232e057630M505768K786028o19514n166144o168639j066481M290911K846806
39224c648895k596945l354771J654180M967755L059391Q83881K141980L332790
39216F439366R89861k263113l222957l610630n145891m367776J846010R458850
$$ plain form
39274 2335032 794904 1033719 2959697 2357020 -2666661 -6960961 -5538037 -1603929
39266 -1603929 -851230 -1198135 3423335 10783743 11434760 3045282 -5357674 -6255952 -2583865
39257 -2583865 192237 3344275 10414644 19146174 24305276 25076088 24270559 23132205
39249 23132205 21626122 20716069 19492271 13323260 455133 -12271685 -16376073 -12588829
39241 -12588829 -8826165 -8913743 -9840160 -9494043 -10009145 -12243219 -13029757 -10064845 -5057630
39232 -5057630 -551862 2234166 1614652 -3551492 -9720131 -10786612 -6495701 -3648895
39224 -3648895 -6245840 -9600611 -7946431 -2978676 80715 964596 3106576 6439366
39216 6439366 7429227 5166114 1943157 -1667473 -6813364 -11181140 -9335130 123720
39208A23720J1966737R194506N567172J930326m124423j0583704j0986378l785597
39200f97641M219693O676135N148381M288220L642680n63188p279137r840171
39192E594972m527989L676873O271525Q14195o589164q289433l294517K405802
39184c937736L389393J039663P29005L874165O036742L854770M02885O06095L612846
39175A9607828M035316K01934l424918l158095j257134j697630l842594l688635
39167F776072Q6572M457639O007341M204966Q90645j662365k208788j452948j407365
39158A5691769k891274m251458l593050j431087K03588O08058J022572K807019
39150H166137N761705P560106M790871l343123j1717940j2787590n386959L046981
$$ plain form
39208 123720 12090457 21284963 26852135 28782461 24658038 14074334 3087956 -697641
39200 -697641 3522052 10198187 15346568 19634788 23277468 22714280 15435143 5594972
39192 5594972 1066983 4743856 11015381 11829576 5240412 -3049021 -6343538 -3937736
39184 -3937736 -548343 491320 1220325 5094490 11131232 14986002 15388887 15994982 19607828
39175 19607828 23643144 23845078 20420160 17262065 16004931 14307301 10464707 6776072
39167 6776072 6862644 11320283 17327624 21532590 22423235 20760870 18552082 17099134 15691769
39158 15691769 12800495 8549037 4955987 3524900 3728488 4336546 5359118 8166137
39150 8166137 13927842 21487948 26278819 22935696 11217756 -1569834 -6956793 -3909812
39142c909812N826118N150432O663028R126935O044525l270732j0999648j0661622
39134C969224m438837J213082K886848J167004j802312l332035j685748J634033
39126c88741L432079L225562L113523L363654K374329J072891J946478L085360
39118B1225135k29132o271925o784780L47681O173544L810433j175236r09140
39110A6186580J436395j636606p184291n802340J815800M889742n182l659221
39102F040877l6636L722625m66689q132121r165356k630378L647960N125548M344275
39093B450105L891023K645752j37910k410163k757945k651559l485779l887997
39085f344473j798367K217698N361950N743740L900479J259642j622364m305834
$$ plain form
39142 -3909812 1916306 7066738 13729766 22856701 28901226 25630494 14630846 3969224
39134 3969224 -469613 743469 3630317 4797321 2995009 -337026 -2022774 -388741
39126 -388741 3043338 6268900 9382423 12746077 15120406 16193297 18139775 21225135
39118 21225135 20996003 14724078 7939298 8286979 14460523 18270956 17095720 16186580
39110 16186580 17622975 15986369 8802078 2999738 4815538 9705280 9700098 6040877
39102 6040877 6004241 9726866 9260177 1128056 -8037300 -10667678 -7019718 -1894170 2450105
39093 2450105 6341128 8986880 8848970 6438807 3680862 1029303 -2456476 -6344473
39085 -6344473 -8142840 -5925142 -563192 5180548 9081027 10340669 8718305 4412471
39077D412471m900600j669570L180562M141294q07755o262847n652869L2397L901000
39068c625917K848809P06583J099282K249424J124172j419927k657584k152424
39060a827582j003495O51106K693378L691389L015470K409474L262918M339790
39052A7232448M268793L853005L574556J617057k574618n507705m221085j400214
39044A6842237j650476m403543n233615l172588j722616k802547m568193n566730
39036a2278071o155016n002029N16275Q465062J1983606P989116K040083O33463
39028H192489K256051R86274l482738n303867j651510L055722L699379J107421
39020H859221l75495O63320J539290k25096l611012n211659k812275K047022N095093
$$ plain form
39077 4412471 -488129 -2157699 1022863 5164157 4356402 -1906445 -7559314 -7526917 -3625917
39068 -3625917 -777108 -70525 1028757 3278181 4402353 2982426 324842 -1827582
39060 -1827582 -2831077 -2179971 513407 4204796 7220266 9629740 12892658 17232448
39052 17232448 21501241 25354246 28928802 30545859 27971241 22463536 18242451 16842237
39044 16842237 15191761 10788218 5554603 2382015 659399 -2143148 -6711341 -12278071
39036 -12278071 -18433087 -23435116 -22918841 -14453779 -2470173 5518943 7559026 8192489
39028 8192489 10448540 11434814 7952076 2648209 996699 4052421 7751800 8859221
39020 8859221 8483726 9147046 10686336 10461240 6850228 1638569 -1173706 873316 5968409
39011E968409L632884m46649l174996l457634l165662k558730N59720N659184
39003C016526P640694L708442j191937p21739L061243K147474n483915j2455979
38995b79191j1868687n075460K504844P891822R738445O412105l93351m323479
38987D607048k001601J248884j037081o111485o005988j92936L481526J058830
38979d952803j769633J072577O774692P673499J414529o309394p978034j826948
38971e901515N837122O410099j089531p711499n604473J222651L001228r43251
38963d779169j887631L276027O425812J484649n466070n762940j143395M40710
38955g412007k557111m649004k724098J020758M194977O127109N603173K191354
$$ plain form
39011 5968409 9601293 9154644 5979648 2522014 -643648 -3202378 -2642658 3016526
39003 3016526 10657220 14365662 13173725 12451986 15513229 17660703 12176788 -279191
38995 -279191 -12147878 -17223338 -14718494 -6826672 2911773 9323878 8930527 4607048
38987 4607048 2605447 3854331 2817250 -3294235 -9300223 -9493159 -6011633 -4952803
38979 -4952803 -6722436 -5649859 1124833 8798332 10212861 3903467 -4074567 -5901515
38971 -5901515 -64393 6345706 5256175 -2455324 -8059797 -6837146 -3835918 -4779169
38963 -4779169 -6666800 -3390773 3035039 4519688 -946382 -6709322 -7852717 -7412007
38955 -7412007 -9969118 -14618122 -17342220 -16321462 -12126485 -5999376 -396203 1795151
38947A795151q44772P9783L161567L404398j11817l468617l800962j922382K15206
38938a492445Q92147j512788o159927q416861m812805J860843O043533O188595
38930g409708M267275J241140k077167k571779P54568K639010j168809n095761
38922i421231p70650Q748658J1787579N370772q97250n39274J007641k025550
38914A3260695n401224l153698J641402K326724p71332k862329l209850l650242
38906a819854k454110K521566P228630N768750r2837l006042q80265J347694P18996
38897I332528l4503R37315Q00779k454069n682933n136582j976315M1040J58001
38888d014739O02822J912461J426694k625480p403236p982038l679370N25492
$$ plain form
38947 1795151 950379 1030162 4191729 7596127 7484310 4015693 214731 -1707651 -1492445
38938 -1492445 -600298 -2113086 -8273013 -16689874 -21502679 -19641836 -13598303 -7409708
38930 -7409708 -3142433 -1901293 -3978460 -6550239 -5795671 -3156661 -4325470 -9421231
38922 -9421231 -10191881 -1443223 10344356 15715128 14817878 14278604 15286245 13260695
38914 13260695 7859471 4705773 6347175 8673899 7902567 5040238 1830388 -1819854
38906 -1819854 -4273964 -1752398 5476232 11244982 11152145 8146103 7265838 8613532 9332528
38897 9332528 9298025 10235340 11036119 8582050 2899117 -2237465 -4213780 -4172740 -4014739
38888 -4014739 -3411917 -1499456 -72762 -2698242 -10101478 -18083516 -21762886 -21237394
38880b1237394P08032j07594L365631R188942R117040N56788q120996q126201
38872a4655752j652498K380666Q26772j476664n53551J944928L398961M220255
38864e566883N181895M736874J708797j719035k337857j79499J658410J162577
38856D645279m85195j574556k910249n865303p940906m222495M744045J0665206
38848b944174P535336O21702q95642K247400J484371m399985o806976k484511
38840e642479M1099n049501j0278329p066548L17152K973214K065554L925266
38832a8714572O588094M062625k34094J901468P776104O987921m74409m059220
38824C833917j278757q52260m472711k176428P882708J1546559N59423j2070003
$$ plain form
38880 -21237394 -20529362 -20636956 -17271325 -8082383 1034657 1591445 -6529551 -14655752
38872 -14655752 -16308250 -13927584 -13100812 -14577476 -15131027 -13186099 -9787138 -5566883
38864 -5566883 -384988 4351886 6060683 4341648 2003791 1824292 3482702 4645279
38856 4645279 4160084 2585528 -324721 -6190024 -14130930 -18353425 -13609380 -2944174
38848 -2944174 4591162 5212864 4317222 6564622 8048993 3649008 -3157968 -5642479
38840 -5642479 -5601380 -10650881 -20929210 -27995758 -27678606 -24705392 -22639838 -18714572
38832 -18714572 -12126478 -8063853 -8297947 -6396479 1379625 8367546 7893137 3833917
38824 3833917 2555160 1702900 -2769811 -4946239 2936469 14483028 15042451 2972448
38816B972448j1255511k419325l87619n175278n165327J565146N981396N495693
38808h388377O245509P993708K769641q409985j2373758l430778O342327M553327
38800d698386l687654m996905K210355P455722M791530l15749r94042J961486
38792A726357L579032K272615N14926K05979L91393n56648k364444l389925l014633
38783f35348k248430j903541j481503k83113J768238M773721Q297898R559926
38775A7847848N270064k856553p701444n001093Q21200K947890J627376K229799
38767A5185087N568166O378402J834426m054608o272037m679103k207608p59105
38759A0993620q01708k105955l133656k064935L29829J102442p96222l299695
$$ plain form
38816 2972448 -8283063 -10702388 -11090007 -16265285 -21430612 -19865466 -13884070 -8388377
38808 -8388377 -2142868 5850840 8620481 210496 -12163262 -15594040 -9251713 -4698386
38800 -4698386 -8386040 -13382945 -11172590 -3716868 1074662 758913 -235129 1726357
38792 1726357 5305389 7578004 8092930 8298909 8690302 8133654 5769210 2379285 -635348
38783 -635348 -2883778 -4787319 -6268822 -6551935 -4783697 -9976 8287922 17847848
38775 17847848 23117912 20261359 12559915 7558822 8380022 11327912 12955288 15185087
38767 15185087 20753253 27131655 28966081 24911473 18639436 13960333 11752725 10993620
38759 10993620 10191912 8085957 4952301 2887366 3217195 4319637 3523415 223720
38751B23720m649033n176087m888692k410309K158385N833795N905341K986224
38743a6656L9184m29941J660022L304678P65991n212518q378672m622256J479692
38734a1410476K786707L73072J271332O017065O945730R13113m804915l671922
38726a580294M75908Q14101j585835j320209J255362J136450k290520m282878
38718g377915k265616J183531K841101K200271N92034O2929K137518N095497M536823
38709I006173m67363m683021l785718p43664m51097j486390N57597M113327L395555
38700E455399j688402m696846k391165J235429K086021J171072N75015n62175
38692A184348l120775m837268k983951J883662O495413P698577M585292k63942
$$ plain form
38751 223720 -4425313 -9601400 -14490092 -16900401 -14742016 -8908221 -3002880 -16656
38743 -16656 22528 -407413 1252609 4557287 5323278 110760 -8267912 -12890168 -11410476
38734 -11410476 -8623769 -8250697 -6979365 -962300 5983430 6896543 2091628 -1580294
38726 -1580294 -1104386 -290285 -1876120 -3196329 -1940967 -804517 -3095037 -7377915
38718 -7377915 -9643531 -8460000 -5618899 -3418628 -2826594 -2763665 -626147 4469350 9006173
38709 9006173 8538810 3855789 70071 -673593 -1124690 -2611080 -2053483 2059844 5455399
38700 5455399 3766997 -929849 -3321014 -2085585 436 1171508 1746523 1184348
38692 1184348 -1936427 -6773695 -9757646 -7873984 -1378571 6320006 10905298 10641356
38684A0641356k296735j92022J639190j261900o901059r701963p799453k946350
38676a8818936M209637J2418342J5471314P673302o280038j4684863j2939685
38669a2950927o879412j672497L501453P875791O419578o86924m976117j937517
38661a1306572J675274q20624n083800l723905J531483M183470L927795M244704
38653e372175L568373j422617o702611m980492K324762O232327L109614j657427
38645d900246l071500k078467j049704l73542l71995j110235m31519K552815L512583
38636g321810j066561n700055j892213Q440162J4350976J0998185M403119J65550
38628B2377353k875189n530846m913260k059960l303611r044457j0405219l143121
$$ plain form
38684 10641356 8344621 8152599 9791789 8529889 1628830 -8073133 -15872586 -18818936
38676 -18818936 -14609299 -2190957 13280357 20953659 14673621 -11242 -12950927
38669 -12950927 -19830339 -21502836 -18001383 -10125592 -3706014 -4392938 -9369055 -11306572
38661 -11306572 -9631298 -10451922 -15535722 -19259627 -17728144 -13544674 -9616879 -5372175
38653 -5372175 -1803802 -3226419 -9929030 -14909522 -12584760 -6352433 -3242819 -4900246
38645 -4900246 -7971746 -10050213 -11099917 -11473459 -11845454 -12955689 -13387208 -10834393 -7321810
38636 -7321810 -8388371 -14088426 -15980639 -7540477 6810499 17808684 22211803 22377353
38628 22377353 19502164 13971318 9058058 6998098 3694487 -5349970 -15755189 -18898310
38620a8898310M177882L476967N4069K754650Q475142P764675J066268k672757
38612F198586j266784j191713m419715n020794r82178J303087j572139l393346
38604a0344996J320225P735077Q048640K989409q91980j642538k531102m311622
38596C71113l918419q37726J358703J137586J571768M593884O846765M397356
38588A5521030j216360n071899n336857m279203l694008k840961j072511O86675
38580g304094J869629K926626L218335J200432k093912l114955j317534r87847
38572e603320m453748p112597l842759K527433N021253L058486K423026M943711
38564c038515N656369K076993r14369O55214K650528p87508p638296j0343904
$$ plain form
38620 -18898310 -14720428 -11243461 -11189392 -8434742 40400 7805075 8871343 6198586
38612 6198586 4931802 3740089 -679626 -5700420 -6682598 -5379511 -6951650 -10344996
38604 -10344996 -9024771 -1289694 6758946 9748355 8856375 7213837 4682735 371113
38596 371113 -3547306 -4385032 -3026329 -1888743 -316975 4276909 11123674 15521030
38588 15521030 14304670 9232771 3895914 -383289 -4077297 -6918258 -7990769 -7304094
38580 -7304094 -5434465 -2507839 710496 1910928 -182984 -3297939 -4615473 -5603320
38572 -5603320 -10057068 -17169665 -21012424 -18484991 -13463738 -10405252 -7982226 -3038515
38564 -3038515 2617854 4694847 3780478 4435692 7086220 6298712 -1339584 -11683488
38556a1683488n632466K616584Q770245R665956M935303k592105p326807n585724
38548f832502j89327K215918j246621o498563o950626j30940R638734J4717055
38540D723128J1426286L975657o45202j083585j548261l755947m431234k353042
38532F307800j801786n378771q765727p325465l315203j345041r14829P00889
38524b1838133K026216M69338j302537Q34136M598639M449110P64182j477425
38516a1476474j586826k699852l475591O47305P283833P488275r90499q860722
38508a3670551p398786J030598Q071106R270190N494904l22441m405611m290746
38500f221337k153562j933354k326962J500291Q255012J0216229N139599K41654
$$ plain form
38556 -11683488 -17315954 -14699370 -5929125 3736831 8672134 6080029 -1246778 -6832502
38548 -6832502 -7021829 -4805911 -6052532 -12551095 -19501721 -19632661 -9993927 4723128
38540 4723128 16149414 20125071 19479869 18396284 16848023 13092076 8660842 6307800
38532 6307800 4506014 -872757 -9638484 -16963949 -20279152 -21624193 -22539022 -21838133
38524 -21838133 -19811917 -19342579 -20645116 -19810980 -15212341 -10763231 -9999049 -11476474
38516 -11476474 -13063300 -15763152 -19238743 -18591438 -11307605 -3819330 -4809829 -13670551
38508 -13670551 -21069337 -20038739 -11967633 -2697443 2797461 2475020 -1930591 -6221337
38500 -6221337 -8374899 -10308253 -12635215 -11134924 -2879912 7336317 12475916 12717570
38492A2717570K37843m1239n083121r016946m920494K589387L797291j176419
38484h96128l797653j236596Q36935o29354j407990J713416N457145N681458K957268
38475H678501j44172l023688n816021p389583o700232m060064j06606M403194
38467a4158671P415374O645658K533105j638192k920883q74544K769565N144056
38459D915468L969332o4278l611967m509824l508078j300702K786526P155693
38451E832170P239075K041730k681531k371184p19627l003634o382772m617763
38443d663536K24623J40789n032398n920276J908647J0314168R714879J347810
38435H034706o262404q114287n455546j595985N72553n21977l225821l678267
$$ plain form
38492 12717570 12955413 12914174 7831053 -1185893 -6106387 -3517000 280291 -896128
38484 -896128 -4693781 -5930377 -5093442 -5722796 -7130786 -5417370 39775 5721233 8678501
38475 8678501 8534329 5510641 -305380 -7694963 -14395195 -18455259 -18561865 -14158671
38467 -14158671 -6743297 -97639 2435466 797274 -2123609 -2998153 -228588 4915468
38459 4915468 8884800 8820522 5208555 698731 -2809347 -4110049 -1323523 5832170
38451 5832170 13071245 15112975 12431444 10060260 9340633 6336999 -45773 -4663536
38443 -4663536 -4438913 -4298124 -9330522 -15250798 -13342151 -3027983 6686896 8034706
38435 8034706 1772302 -6341985 -11797531 -13393516 -12820963 -13342940 -16568761 -20247028
38427b0247028r14553J685284J761290J267766K268845L340111K949434K579762
38419e309089L160893K088431k217755n926819m348491J409291O312265P693826
38411B862552N813195Q79871n528232q346098m331489J474314R46224n195892
38403a1425555p330412q30657O465375N016551l102690p603976m075760J967635
38395b0919489M830949N536843O431078N005926j227279p153241m699982M924063
38387g271132J0697886O057194k377010m611291n74486K487876J967011J341083
38379G717131J300535j792255p317011q401752k022510N366952O683790L521317
38371E056197J821086K525255J982782j091193m289176n693461n302548l540843
$$ plain form
38427 -20247028 -21161581 -19476297 -17715007 -16447241 -14178396 -10838285 -7888851 -5309089
38419 -5309089 -2148196 -59765 -2277520 -8204339 -12552830 -11143539 -4831274 2862552
38411 2862552 8675747 9555618 4027386 -4318712 -8650201 -7175887 -6229663 -11425555
38403 -11425555 -18755967 -19586624 -13121249 -8104698 -11207388 -18811364 -22887124 -20919489
38395 -20919489 -16088540 -10551697 -4120619 885307 -341972 -7495213 -12195195 -7271132
38387 -7271132 3426754 9483948 7106938 2495647 1921161 4409037 6376048 7717131
38379 7717131 9017666 7225411 -91600 -8493352 -10515862 -5148910 1534880 5056197
38371 5056197 6877283 9402538 11385320 10294127 6004951 311490 -4991058 -8531901
38363h531901j503450r36412j285268M88263M141795M096558k324796q561872
38355a4417083o916942O6384L585953J850019J011874L449827M322573J457386
38347e590009l07351J697562K523987j486865n231564k671690L219414N334730
38339b511786L243708J713201J257204j726599o291702o481582p37411N073030
38331f461937O268663N175674N428524N631140K826911j322693k470598n4640
38323A5021044K018273O03750l521462p335875q278805n773351j972485n24568
38315i763479k757236n401169l839007K454456R108563J1376335Q261052K403618
38307A1843133k715180n179186n142329l525923p34680K522611L827767R94350
$$ plain form
38363 -8531901 -10035351 -10971763 -12257031 -11768768 -7626973 -3530415 -5855211 -14417083
38355 -14417083 -21334025 -21267641 -17681688 -15831669 -14819795 -11369968 -7047395 -5590009
38347 -5590009 -5897360 -4199798 -1675811 -3162676 -8394240 -11065930 -7846516 -2511786
38339 -2511786 731922 2445123 3702327 1975728 -4315974 -10797556 -11534967 -6461937
38331 -6461937 -193274 4982400 10410924 16042064 18868975 17546282 15075684 15021044
38323 15021044 17039317 17643067 14121605 6785730 -1493075 -7266426 -9238911 -9763479
38315 -9763479 -12520715 -17921884 -21760891 -19306435 -10197872 1178463 9439515 11843133
38307 11843133 9127953 3948767 -1193562 -4719485 -5454165 -2931554 896213 1890563
38299A890563l922987n522285j841710K588819L114424J265256P51159K57441
38291a419320l657607q073957n808507K927718Q575760N263039q41356j011452
38283d045682L803737O330446M325091J566684l849j899343l680675k771127j28174
38274C497108j03116l550228o289308n579770l152799o32674K752416O056423
38266g001948N635286J190655k032046o54018J451353p07746n343944o915015
38258a4377423m476694j953197j514971j691420j677470k694635m237181l089267
38250c5712258J951170P044645P243776K298557k998902l726277P97532O986513
38242a6115244J0333040Q826058L990685o37174k212585p92813O27737q92136
$$ plain form
38299 1890563 -2032424 -7554709 -9396419 -6807600 -3693176 -2427920 -1676761 -1419320
38291 -1419320 -5076927 -13150884 -18959391 -16031673 -7455913 -2192874 -3034230 -4045682
38283 -4045682 -241945 6088501 10413592 11980276 11976427 10077084 6396409 3625282 3497108
38274 3497108 3393992 -156236 -6445544 -12025314 -15178113 -15810787 -13058371 -7001948
38266 -7001948 -1366662 -176007 -2208053 -2862071 -1410718 -2118464 -7462408 -14377423
38258 -14377423 -18854117 -20807314 -22322285 -24013705 -25691175 -28385810 -32622991 -35712258
38250 -35712258 -33761088 -26716443 -19472667 -17174110 -20173012 -23899289 -23101757 -16115244
38242 -16115244 -5782204 3043854 7034539 6397365 4184780 3391967 4019704 3127568
38234C127568m655851o822731n190985j794503N79443K164743M045597M657144
38226c889575K401631j0013J153806L874748K746200j653030k338954L200314
38218E485127Q247258O443695K27450m737055p918126j0827626j0446269l521119
38210a7046665N003786O052204q75101o112393k760422M473179O331128R71954
38202c962330m779567m584934J39411K792150J19950l739873k942957K037131
38194a4921019N396974M477112K520691J995527P69796k189013k972373P41559
38186d180746M259144K797857l27800Q01013M389398L796872j372786n166236
38178D996716n445076o007484q210132q387904n071173j554519O33175L997348
$$ plain form
38234 3127568 -1528283 -8351014 -13541999 -15336502 -14757059 -12592316 -8546719 -3889575
38226 -3889575 -1487944 -1497957 -344151 3530597 6276797 4623767 2284813 5485127
38218 5485127 13732385 20176080 20403530 15666475 7748349 -3079277 -13525546 -17046665
38210 -17046665 -12042879 -5990675 -6865776 -12978169 -15738591 -11265412 -4934284 -3962330
38202 -3962330 -8741897 -13326831 -13187420 -10395270 -10275320 -14015193 -16958150 -14921019
38194 -14921019 -9524045 -5046933 -2526242 -530715 239081 -1949932 -4922305 -4180746
38186 -4180746 78398 2876255 2548455 3349468 7738866 11535738 10162952 4996716
38178 4996716 -448360 -6455844 -14665976 -23053880 -28125053 -29679572 -29046397 -25049049
38170b5049049Q515378R397718M484428j741299m497542l984865j882613J898356
38162a2859488O013008O641257L123009n1169N2410R04554K04934O4908J885790
38153E979213K453406n27475l912176m566696m420990n288007l814319K387430
38145a1709614P994673O285096o98642m864770k901045J605341M991827O523883
38137G226749N958623L634065J884366J675145j53804n301826q654571n164124
38129A104623M45145q96768q293475j0856032l282158O798044R934899O209551
38121A163829J664301o42199j360615q85201O82009J983611K063279J622735P54225
38112G045974j747069m933545n030798q88292L042329K353044j246982k879765
$$ plain form
38170 -25049049 -16533671 -7135953 -2651525 -4392824 -8890366 -12875231 -14757844 -12859488
38162 -12859488 -6846480 -205223 2917786 2866617 2919027 3823581 4028515 4093423 5979213
38153 5979213 8432619 7905144 3992968 -573728 -4994718 -10282725 -14097044 -11709614
38145 -11709614 -3714941 2570155 1871513 -2993257 -5894302 -4288961 702866 7226749
38137 7226749 13185372 16819437 18703803 20378948 20225144 14923318 6268747 1104623
38129 1104623 1549768 653000 -7640475 -18496507 -21778665 -14980621 -5045722 1163829
38121 1163829 2828130 2185931 825316 -59885 622124 2605735 4669014 6291749 7045974
38112 7045974 5298905 365360 -4665438 -5553730 -2511401 -158357 -1405339 -4285104
38104d285104j542315n36625j757150k969980j257210K806512N230864K647338
38096a663670l484754p233049m311825K455300O127765M104762N10624m73134
38088c967981J38622n56867k423525l691233m410005m926496l157156K403184
38080b0591457Q160066Q472465L500423k9095K715415Q497611J0278934N662623
38072B6666985j115386m700377m022443k028416j558401k593153l283991k592101
38064D772717j229743m39543o01456r01897Q6568K909359N602609M743041j73185
38055A4768470m532188l579754Q76498K372049j092757m106688k053506J975874
38047D627998K185571j304918l657766l136002k414312k816831k664099j739452
$$ plain form
38104 -4285104 -5827419 -6364044 -8121194 -11091174 -12348384 -9541872 -4311008 -1663670
38096 -1663670 -5148424 -12381473 -16693298 -14237998 -8110233 -4005471 -3494847 -3967981
38088 -3967981 -3829359 -4386226 -6809751 -10500984 -14910989 -19837485 -22994641 -20591457
38080 -20591457 -12431391 -3958926 -458503 -487598 2227817 10725428 21004362 26666985
38072 26666985 25551599 20851222 16828779 14800363 13241962 10648809 7364818 4772717
38064 4772717 3542974 3103431 2501975 1600078 1686646 4596005 10198614 14941655 14768470
38055 14768470 10236282 6656528 7533026 9905075 8812318 4705630 2652124 4627998
38047 4627998 6813569 5508651 1850885 -1285117 -3699429 -6516260 -9180359 -10919811
38039a0919811k108090l202452j256800M144405P821536O306237K846646J461016
38031E092687O41626j987837l094449J212238O315695L643775n788263j0863313
38023d827841n578751K979005N745232L767819L504290N559176N325005J851031
38015A8324966j021269j296004o40822j88876Q8744j519705o294781j0208754
38007b756501p338430J035881O722914N554649K144802J481223J860841k5815
37999H679564k346794j623753P30591Q00730j132536j391683P66025K242069J242002
37990G966215n04814q69967K96359K173348M049155N144474M918676L473040Q29176
37981B7475662l121253p013241q155052n799578k474778n15147N22291J214451
$$ plain form
38039 -10919811 -13027901 -16230353 -17487153 -13342748 -5521212 785025 3631671 5092687
38031 5092687 5734313 3746476 652027 1864265 8179960 11823735 6035472 -4827841
38023 -4827841 -10406592 -7427587 -1682355 2085464 5589754 11148930 16473935 18324966
38015 18324966 17303697 16007693 15366871 15177995 15266739 13747034 7452253 -2756501
38007 -2756501 -10094931 -9059050 -2336136 3218513 5363315 6844538 8705379 8679564
37999 8679564 6332770 4709017 5439608 6240338 5107802 3716119 4482144 6724213 7966215
37990 7966215 7461401 6591434 6887793 9061141 13110296 18254770 23173446 26646486 27475662
37981 27475662 24354409 17341168 9186116 3386538 911760 396613 918904 2133355
37973B133355l790l498958n457231k198432M048419P522039O134033K749720J23590
37964A1552745j674953k964331l041539j532374J161197M583956P391150O818423
37956B2294274J755338m310631o243394k984111J696830L459367O42749n193701
37948A1116721r708655q499342j935486M467901O689855O417289N999673L431766
37940A7979722k878033q292254p408784k690475o39391j382545J44399L846179
37932a321182M073049k9764k651760j628240j983397n987508p804332k732593
37924b0065727M883335Q100642O405224L494422Q33903j693064k738025j792308
37916b571598j320962k726292l412222j231376J690276K771635K751205K489932
$$ plain form
37973 2133355 2129565 -1369393 -6826624 -9025056 -4976637 2545402 8679435 11429155 11552745
37964 11552745 9877792 6913461 3871922 2339548 3500745 8084701 15475851 22294274
37956 22294274 24049612 19738981 13495587 10511476 12208306 15667673 16310422 11116721
37948 11116721 1408066 -7091276 -9026762 -4558861 2130994 8548283 14547956 17979722
37940 17979722 15101689 6809435 -599349 -3289824 -3929215 -5311760 -5167361 -1321182
37932 -1321182 2751867 2722103 70343 -1557897 -3541294 -9528802 -17333134 -20065727
37924 -20065727 -15182392 -7081750 -676526 2817896 3651799 1958735 -779290 -2571598
37916 -2571598 -3892560 -6618852 -10031074 -11262450 -9572174 -6800539 -4049334 -1559402
37908a559402L80988l454623m961811k224612P95839R18115J187881M442177O435895
37899A960447K156370m718092o062945r75825L619611K992409p10368l175305
37891d913698k343794J182035M198415K993191j049591j086481N441058J0864595
37883A5285730P473265l32270k347056J728772K627070l073098q042292o501708
37875F818413k109220l3069Q77230L318087N217208L352737j027342m529007o088624
37866E796413n723667k482772K762153N754927L766236n95825l744401o399006
37858h65942j0621614j3927739j1189521k126474P036826J0361396Q188551N173956
37850g970561L967420K738006r60500n666688p327069m754926j090156J076555
$$ plain form
37908 -1559402 -1178414 -4633037 -9594848 -11819460 -11023621 -10105506 -8917625 -4475448 1960447
37899 1960447 4116817 -601275 -6664220 -7640045 -4020434 -1028025 -1738393 -4913698
37891 -4913698 -7257492 -6075457 -1877042 1116149 66558 -1019923 4421135 15285730
37883 15285730 22758995 22426725 20079669 21808441 24435511 21362413 13320121 6818413
37875 6818413 4709193 4676124 5553354 8871441 14088649 17441386 16414044 11885037 5796413
37866 5796413 72746 -2410026 352127 6107054 9873290 9277465 5533064 -865942
37858 -865942 -11487556 -25415295 -36604816 -38731290 -31694464 -21333068 -13144517 -7970561
37850 -7970561 -4003141 -1265135 -2225635 -7892323 -15219392 -19974318 -21064474 -19987919
37842a9987919L060845O468219R099337P769511L207086j306470m373687n935706
37834a998784m426565P95528N648132N350946J760947J273015N252087Q008573
37826B1663879N202151q59406n648585p456853o567160l836592j679444k410977
37818a592987m337995l558473m68999L58429k078324l115611j68784K942941K403422
37809i616381M4242r64453j385072k708113k680634J211235O457133Q101159M997277
37800C456393K50344k930094l205947r18014J584855J322157j524640l253424
37792e218370j732196P63550J518567J209757J775915L331676N048951O200286
37784A2898136M988826n863n913821p611286n272237m492975o679793n874748
$$ plain form
37842 -19987919 -16927074 -10458855 -1359518 6409993 9617079 8310609 3936922 -1998784
37834 -1998784 -6425349 -5629821 18311 5369257 7130204 8403219 13655306 21663879
37826 21663879 26866030 26006624 20358039 12901186 6334026 2497434 817990 -1592987
37818 -1592987 -5930982 -9489455 -9958454 -9600025 -11678349 -14793960 -14962744 -12019803 -9616381
37809 -9616381 -9572139 -10536592 -11921664 -14629777 -17310411 -16099176 -9642043 -1540884 3456393
37800 3456393 3706737 776643 -2429304 -3347318 -1762463 -440306 -1964946 -5218370
37792 -5218370 -6950566 -6187016 -4668449 -3458692 -1682777 1648899 6697850 12898136
37784 12898136 17886962 17881099 11967278 4355992 -916245 -5409220 -12089013 -17963761
37776a7963761R60748P347172O802852K921119K708387M743589K416150m000501
37768E935755p149802l555914K548332O079589N607968J613883l775428n962095
37760A342288k651829J326610r9247m648749m714051O81297M483605K683170p87484
37751b384390j811381j436546r17217J697267O292515P796981L030625l669661
37743H598193n788890k677910R53852J113446k297546n972305n322614R49626
37735a0444148P338148O542257n95369m988712j516735M069439M419514J467866
37727F292260J875656N277819M941523n67495m334589k047975P04050k844208
37719I297041q871695p090651L730953J1733230P262715l220330n398478L042819
$$ plain form
37776 -17963761 -17003013 -9655841 -2852989 68130 2776517 7520106 9936256 5935755
37768 5935755 -1214047 -4769961 -2221629 3857960 9465928 11079811 7304383 1342288
37760 1342288 -1309541 17069 -82178 -4730927 -9444978 -8763681 -4280076 -1596906 -2384390
37751 -2384390 -4195771 -5632317 -6549534 -4852267 1440248 9237229 12267854 8598193
37743 8598193 2809303 131393 1085245 2198691 -98855 -6071160 -11393774 -10444148
37735 -10444148 -3106000 3436257 2840888 -2147824 -3664559 404880 4824394 6292260
37727 6292260 8167916 13445735 18387258 17819763 13485174 11437199 12141249 9297041
37719 9297041 425346 -6665305 -2934352 8798878 16061593 12841263 7442785 10485604
37711A0485604R337231L858225p053976j1342521p250393j770516J800286N563477
37703C627417Q609237O601292L11780l833756l404097k745981m236330m217092
37695G12470n02820L187369M031743M787189P328689P616437K316394m645275
37687B4832196p597423p014406o663910o686230m827882j368636K042848N252505
37679b030938O934182L367306m768408r080970l848759M384750N592837J100536
37671A650536R9809L595838L171209l544620p775309l817495J891413J968243
37663b760376k16679K159133O820820O329424R90633j500445J505105M016459
37655A7344074J531508k473023l128421j635039k023491m133438m417688k114691
$$ plain form
37711 10485604 19822835 23681060 16627084 5284563 -1965830 -3736346 -1936060 3627417
37703 3627417 12236654 18837946 19149726 15315970 11911873 9165892 4929562 712470
37695 712470 209650 3397019 7428762 12215951 19544640 27161077 29477471 24832196
37687 24832196 17234773 10220367 3556457 -3129773 -7957655 -9326291 -7283443 -2030938
37679 -2030938 4903244 8270550 3502142 -5578828 -9427587 -5042837 550000 1650536
37671 1650536 1750345 5346183 8517392 4972772 -2802537 -6620032 -4728619 -2760376
37663 -2760376 -2977055 -817922 6002898 12332322 13322955 11822510 13327615 17344074
37655 17344074 18875582 16402559 13274138 11639099 9615608 5482170 1064482 -1050209
37647a050209l82140j222781k496150j058636K957048O117477N171969J81979
37639H218557n107440o102224j745093L864569N598024L103373O25191P82039
37631I236996J392476N9297j201226P81793M542686N631758L142127J94510j839535
37622B1940882m595988p305853n559185J678559Q227884P782103J944069k471953
37614B1640518j849007J939013N328654N445913P78355o402473r861020n871713
37606A1148240J297336M479744K770286P96458K17875j710707m836259m303667
37598I859306J403828O548767O136471L154928L216491N533477M669567m96516
37590D0026319m980262m869065j810501P66380K471768M972688P945525Q101686
$$ plain form
37647 -1050209 -1432349 -2655130 -5151280 -6209916 -3252868 2864609 8036578 8218557
37639 8218557 3111117 -2991107 -4736200 -871631 4726393 7829766 8454957 9236996
37631 9236996 10629472 10688769 9487543 10269336 14812022 20443780 23585907 23780417 21940882
37622 21940882 17344894 10039041 4479856 6158415 14386299 22168402 24112471 21640518
37614 21640518 19791511 21730524 27059178 32505091 33283446 26880973 17019953 11148240
37606 11148240 12445576 16925320 19695606 20492064 20709939 18999232 14162973 9859306
37598 9859306 11263134 17811901 23948372 27103300 30319791 35853268 40522835 40026319
37590 40026319 35046057 30176992 28366491 29132871 31604639 36577327 44522852 52624538
37582E2624538K585256o869375j3672823j1849826k856431M536385L266982l817380
37574B3947326p197459k118077N814576P576748J256750o272772p382929j491166
37566A4132997N357704P304742M084875N2450r79745R20634L226301M244784M035796
37557D2380538K953979J087174n93459k74299K237660M163568K605667j558237
37549E3002591m431778l969553k189315j667516j788062l60155K349066L761485
37541D4706763K907609J693299J748570K235300J798348P81334J06981m86360
37533E5491844j425146j723376l25220J730593K523385K379456L702445P250839
37525F9604820J0418818J0320716P381921M445681K924624J617439l62969j474804
$$ plain form
37582 52624538 55209794 48340419 34667596 22817770 19961339 24497724 27764706 23947326
37574 23947326 16749867 14631790 20446366 28023114 29279864 23007092 15624163 14132997
37566 14132997 19490701 26795443 30880318 30932768 29953023 30873657 34099958 38344742 42380538
37557 42380538 45334517 46421691 45828232 45553933 47791593 51955161 54560828 53002591
37549 53002591 48570813 44601260 42411945 40744429 38956367 38596212 40945278 44706763
37541 44706763 47614372 49307671 51056241 53291541 55089889 55871223 55978204 55491844
37533 55491844 54066698 52343322 52018102 53748695 56272080 58651536 62353981 69604820
37525 69604820 80023638 90344354 97726275 102171956 105096580 106714019 106351050 104876246
37517A04876246l17939R53559j144646n438124n792403J025832J0049364J4038056
37509A18249945J2588016J1037406J1676052J1518349R000171O960461P041630
37502A88072030O684491M823111N352964J0442091J4764833J2073369M626192
37495B46839081J40098J172338L632592M943220P076741J0578598J1624986P739205
37487B93746859K330605N31505K824126N122119L969577K45855j948521j40299
37479C06681826K672516J004114n177425q964368o013665j521000k360855n901174
37471B80419969m520767O10242R3570q146718j3859079r263176l21672K792501
37463B47804870m36823l626784m696173o239822p997261o991817l908318k394032
$$ plain form
37517 104876246 104558307 105511866 104367220 98929096 93136693 94162525 104211889 118249945
37509 118249945 130837961 141875367 153551419 165069768 174069939 181030400 188072030
37502 188072030 194756521 199579632 204932596 215374687 230139520 242212889 246839081
37495 246839081 246979179 248151517 251784109 256727329 263804070 274382668 286007654 293746859
37487 293746859 296077464 296608969 299433095 304555214 308524791 308770646 306822125 306681826
37479 306681826 309354342 310358456 305181031 296216663 290202998 288681998 286321143 280419969
37471 280419969 275899202 276509444 276603014 268456296 254597217 245334041 245012369 247804870
37463 247804870 247368047 243741263 239045090 232805268 224808007 217816190 213907872 211513840
37455B11513840k518105j156476J256071N19336l901516o694556l772041K516980
37447A97763533O952259P077961L906033l00032l503878m856468m938516m177356
37439A97923536j903143J468534L081733J193023j619501k207202k076771m478221
37431A91381988p637665o504275j275045J778191m46495l312995j859835J908046
37423A74031915K838901M02271j365451O7654K942465L650603Q0900o256241j0220954
37414A66172063p246830P85144O121938L729030k666401n420830k082133K855960
37406A62247941L892485l23848o737583j0413088q127465j612793L405526L092692
37398A45423867o12854l596236n119507o966331q660927p591155l875553j261830
$$ plain form
37455 211513840 208995735 207839259 209095330 209614666 205713150 199018594 195246553 197763533
37447 197763533 204715792 211793753 215699786 215399754 211895876 207039408 202100892 197923536
37439 197923536 196020393 197488927 200570660 201763683 200144182 197936980 195860209 191381988
37431 191381988 183744323 177240048 175965003 177743194 177296699 173983704 172123869 174031915
37423 174031915 176870816 177273087 175907636 175975290 178917755 182568358 182649258 176393017 166172063
37414 166172063 158925233 159710377 165832315 169561345 166894944 161474114 159391981 162247941
37406 162247941 166140426 165816578 159078995 148665907 140538442 138925649 142331175 145423867
37398 145423867 144811013 141214777 136095270 129128939 120468012 112876857 109001304 107739474
37390A07739474k032148m025608m249698k953479k183386k158922j361227O23479
37382H9398485K289563K103282Q5899k267837k996931j296011J068080R55892
37374H9340422k217712m682658k403319L362762O892992M823695j59252l563430
37366I1393500m640094n446978o208333n066480k234854r45217l084584o455153
37358E7311807p902621p087502n460141l450066r00216J107985J299784L34752
37350C5253782j78708p0249l0848L91581J773733K514240L80464l798773o713210
37341B9522012o868522n561130l576021k68700L385974M466870K554369J321007
37333B4975859L312370N804938M793204J142125o58444Q99956K272644j04245
$$ plain form
37390 107739474 105707326 101681718 97432020 94478541 92295155 90136233 88775006 89398485
37382 89398485 91688048 93791330 93877229 91609392 88612461 87316450 88384530 89340422
37374 89340422 87122710 82440052 80036733 83399495 90292487 95116182 94956930 91393500
37366 91393500 86753406 81306428 75098095 70031615 67796761 66851544 63766960 57311807
37358 57311807 49409186 42321684 36861543 33411477 32511261 33619246 34919030 35253782
37350 35253782 35075074 35004825 34973977 35365558 37139291 39653531 40033995 36235222 29522012
37341 29522012 22653490 17092360 13516339 13247639 16633613 21100483 23654852 24975859
37333 24975859 28288229 34093167 38886371 40028496 39370052 40270008 42542652 42438407
37325D2438407m986350p672755n350943l33045K207313j53890m269555n180404
37317A6698778k118338J117329J553933J35652j153154k172925l025594k423560
37309H612121q448K056946K385612K962878N328015O318063J835919o066132j0322596
37300A3102378p481376j364091K892239M882455P034458R407040R421962O124248
37292D4019313K199448O99949O77283k142009r224656j5167040j2792555k691557
37284E578176N867071N547606p88302n391469n868519n401861m994467j726348
37276g178113M942634J0650248J1715245R280325O245580L559561J201650l24394
37268D0092736j213275k502113l924268m351546m786100p099564r092476n763469
$$ plain form
37325 42438407 37452057 29779302 24428359 24095314 26302627 26148737 21879182 16698778
37317 16698778 14580440 15697769 17251702 17387354 16234200 14061275 11035681 8612121
37309 8612121 8603673 10660619 13046231 16009109 21337124 27655187 29491106 23424974 13102378
37300 13102378 5621002 4256911 7149150 12031605 19066063 28473103 37895065 44019313
37292 44019313 46218761 46918710 47595993 45453984 36229328 21062288 8269733 5578176
37284 5578176 11445247 16992853 16204551 10813082 4944563 -457298 -5451765 -7178113
37276 -7178113 -2235479 8414769 20130014 29410339 35655919 39215480 40417130 40092736
37268 40092736 38879461 36377348 32453080 28101534 23315434 16215870 7123394 1359925
37260A359925K471192Q009413N944809J045121M42177L452127M201591J460065
37252B8386420m14477Q17594K422457J558553j724018o326237j0439881j0130489
37244D149922k690329P530075J1422420N434082l907345p799131m487503J111576
37236A0763767M060901L025065n42713l827946m135660j281635J694498J721125
37228A1477402n42771j321264J752742O491308Q109620M417675j527136m830493
37220B4027083m328776k894010k305944j069257J238674J319359k505321n269367
37212H212441r18060Q157916J2499518P030532l342595j0517533j1512823q717016
37204H92380n545069l675858k153772J633932P833182J1516813P948525P2431
$$ plain form
37260 1359925 3831117 11840530 17785339 18830460 19272637 22724764 26926355 28386420
37252 28386420 27971943 28789537 31211994 32770547 31046529 24720292 14280411 4149922
37244 4149922 1459593 8989668 20412088 25846170 21938825 14139694 9652191 10763767
37236 10763767 14824668 17849733 17307020 13479074 9343414 8061779 9756277 11477402
37228 11477402 10934631 9613367 11366109 17857417 25967037 30384712 28857576 24027083
37220 24027083 19698307 16804297 14498353 13429096 14667770 15987129 13481808 8212441
37212 8212441 7294381 15452297 27951815 34982347 31639752 21122219 9609396 892380
37204 892380 -4652689 -8328547 -10482319 -8848387 -1015205 10501608 18450133 18522564
37196A8522564m157265k349765r7149j620357m023518l368331p14665J226672
37188C418186K232523J904614j747544p139594q094108k587626L086018L954040
37180d973491L851049O812951P847624J485276n960095l904054N797764J1322706
37172B2279730Q693070N003044L642074o95336r157416j3282814q089803l19884
37164H072665K741991L367665N330071M831007j682959q161581p445052l521316
37156C532491m835111r476437q289923q13772L390038J32437l101073O44633P586078
37147a1230639R556507M895156j120935l109452J3637M771220N776533J289520
37139A0841547l576810k607421K820014N409355K387857j452299k312213k549539
$$ plain form
37196 18522564 14365299 12015534 11918385 10298028 6274510 2906179 2191514 3418186
37188 3418186 5650709 7555323 5807779 -1331815 -9425923 -12013549 -8927531 -4973491
37180 -4973491 -1122442 5690509 13538133 15023409 9063314 5159260 10957024 22279730
37172 22279730 30972800 35975844 39617918 38922582 29765166 16482352 8392549 8072665
37164 8072665 10814656 14182321 19512392 24343399 22660440 14498859 7053807 3532491
37156 3532491 -1302620 -10779057 -19068980 -19882752 -16492714 -16360277 -19461350 -18816717 -11230639
37147 -11230639 -1674132 3221024 2100089 -1009363 -995726 3775494 9552027 10841547
37139 10841547 7264737 4657316 7477330 12886685 15274542 13822243 11510030 8960491
37131H960491m315020m170133J008504P209725Q038297L603877o97270k500492
37123A7137979m139574o632227p338398m582893m90378K336032L915252N103543
37115E309336N264697L659911J430220K14260k10329j143944k482592k873683
37107I167876k228608k104769k884836k408601Q84607M594966M572052M33958
37099A0026645l618866m254971k816492k220837k483124j719770K23904J993451
37091d870060L214727L737308J767594l330689p210531m474285K954843O585323
37083a625770K588597k660768j861341K722864L390034j008233l803790j393827
37075c652234R68861k637913r081625r460344j085116Q174796R000642J501044
$$ plain form
37131 8960491 4645471 475338 1483842 8693567 16731864 20335741 19638471 17137979
37123 17137979 12998405 6366178 -972220 -5555113 -6045491 -3709459 205793 5309336
37115 5309336 10574033 14233944 15664164 15878424 15668095 14524151 12041559 9167876
37107 9167876 6939268 4834499 1949663 -458938 425669 5020635 9592687 10026645
37099 10026645 6407779 2152808 -663684 -2884521 -5367645 -7087415 -6863511 -4870060
37091 -4870060 -1655333 2081975 3849569 518880 -6691651 -11165936 -8211093 -1625770
37083 -1625770 962827 -1697941 -3559282 -836418 2553616 1545383 -2258407 -3652234
37075 -3652234 -2683373 -5321286 -14402911 -23863255 -24948371 -16773575 -7772933 -6271889
37067f271889n516092n247675k257L184408J453523j783343k345391K35054L862287
37058a2431375O633868P396789N861402L541690K635119K565039j20784o219918
37050I861830j0392032o735647K816249R398327P298896N5425n012140n440516
37042A850392l993467k466070M43850M571785N919582J966454l084306k550656
37034B657564L646969Q240510N873281p15952n654767p297257p311514n526504
37026f087670m92405N965363R341552P748294L227195j810349n764317o194118
37018E933545j946407K652181J103659n999865j0066951n573409K513729N833376
37010e550142L110743p09478k549929l299154l430683j542872K451478N987732
$$ plain form
37067 -6271889 -11787981 -17035656 -17037913 -13853505 -12399982 -14183325 -16528716 -16293662 -12431375
37058 -12431375 -5797507 1599282 7460684 11002374 13637493 16202532 16081748 9861830
37050 9861830 -530202 -7265849 -4449600 4948727 12247623 12303048 7290908 1850392
37042 1850392 -2143075 -4609145 -4165295 406490 6326072 8292526 5208220 2657564
37034 2657564 6304533 14545043 20418324 19702372 14047605 6750348 -561166 -6087670
37026 -6087670 -6580075 -614712 8726840 16475134 19702329 17891980 12127663 5933545
37018 5933545 3987138 6639319 7742978 1743113 -8323838 -13897247 -11383518 -5550142
37010 -5550142 -2439399 -3148877 -5698806 -8997960 -12428643 -13971515 -11520037 -5532305
37002e532305O341450L000891j858071m293117j866903K554899K877843k169937
36994i45250o066100k796395M660725Q298590N474937P29679j569306j598628
36986F188252j228658j096605j261084j772912k118673k083592k534029l416853
36978i324154k689117K37527K427375K194250K900089P067408R634749L932343
36970A6380470o923159j2101688o932184K233114P852376Q657808N695915j148854
36962A3713798q907622j0675913m148481L847416N929588K964978J03972j287182
36954A540554k505346k291906J112879M811902L772010k142997p663418q094478
36946a1460800l265312K995360N310223J234061m666251m741967J432435N581393
$$ plain form
37002 -5532305 809145 3810036 1951965 -2341152 -4208055 -1653156 1224687 -945250
36994 -945250 -7011350 -9807745 -5147020 3151570 8626507 9356186 7786880 6188252
36986 6188252 4959594 3862989 2601905 828993 -1289680 -3373272 -5907301 -9324154
36978 -9324154 -12013271 -11775744 -9348369 -7154119 -4254030 2813378 12448127 16380470
36970 16380470 9457311 -2644377 -9576561 -7343447 508929 9166737 14862652 13713798
36962 13713798 4806176 -5869737 -10018218 -6170802 -241214 2723764 2827736 1540554
36954 1540554 -964792 -3256698 -2143819 2668083 6440093 4297096 -3366322 -11460800
36946 -11460800 -14726112 -11730752 -6420529 -5186468 -9852719 -14594686 -13162251 -7580858
36938g580858K985887K372L360821Q091687N119317l194473n916291p02151L151960
36929E318271K91420k963712o39170K754781P18712l718214k849704L374551P257309
36920I544244L899954l935710j0511186j1949235p338638M70567N500793M056348
36912a0262863m43376j378402K464113N755160M453006J034786K71179K562846
36904D456449L916289J392753l424708o284263m553922L02434M032773L569373
36896C407178O3239k249778m55104M057436P212325O287311J795597l891831q262975
36887G963398r040323n119713J281050N087427L458093m56975j545611K82902
36879A910248Q41263q43296q88947J961499K762718j821953o773669n264197J222257
$$ plain form
36938 -7580858 -4594971 -4592599 -1231778 6859909 11979226 8784753 2868462 2166311 5318271
36929 5318271 5609691 2645979 2006809 4761590 5480302 1762088 -1087616 2286935 9544244
36920 9544244 13444198 9508488 -1002698 -12951933 -20290571 -19820004 -14319211 -10262863
36912 -10262863 -10706239 -12084641 -9620528 -3865368 587638 1622424 1893603 4456449
36904 4456449 8372738 9765491 6340783 56520 -4497402 -4194968 -162195 3407178
36896 3407178 3470417 1220639 765535 4822971 12035296 18322607 20118204 16226373 7963398
36887 7963398 -1076925 -6196638 -4915588 171839 3629932 3172957 1627346 1910248
36879 1910248 2751511 1908215 1019268 2980767 5743485 3921532 -2852137 -8116334 -6894077
36870f894077N341613M303322J455943r15930l066297k640612L566654J1330848
36862A2481464J1093333J879429m857123o30692P793851Q424177Q52536n205929
36854C1831046m833363k565659k987581m788864n339032m725240l485544j478279
36846A627484n45042l427832q217685q525071j696198O876091J0141180O933974
36838C166901R61277m364072p278986o840676m160212k581359l612593m285106
36830b8994826j412788L223082N331850M507911M254982N925150O723096M651011
36822D209468J758916N99474M01582p68172k321275k563225k148544k664495k653060
36813f149331Q25711O240259P577655K343356m220371o051902m112625l043212
$$ plain form
36870 -6894077 -1552464 2750858 4206801 3290871 224574 -2416038 1150616 12481464
36862 12481464 23574797 25454226 20597103 19966411 27760262 36184439 37036975 31831046
36854 31831046 26997683 24432024 21444443 16655579 11316547 6591307 3105763 1627484
36846 1627484 1082442 -2345390 -10563075 -19088146 -20784344 -13908253 -3767073 3166901
36838 3166901 4128178 -235894 -7514880 -14355556 -18515768 -21097127 -24709720 -28994826
36830 -28994826 -30407614 -27184532 -21852682 -17344771 -13089789 -7164639 -441543 4209468
36822 4209468 5968384 6567858 6969440 6201268 3879993 1316768 -831776 -3496271 -6149331
36813 -6149331 -5323620 916639 8494294 10837650 6617279 565377 -3547248 -6590460
36805f590460k791349K69562M773937M219288k664491q076767n711410K98562
36797a6273128K371158R70299K058232N517609M412752l381209j0212546q614486
36789b3151319j080914M142786L682321J235763Q82767K255654K626385J200993
36781h205564L0687J078608L184396L130066L37477j326364J257859M916928L572752
36772G976845k984088p871280n772535R58845O434244P697255M876849j234809
36764A0081326q272226j1740848r178705l367582J379983M198829O260026P048912
36756c590285N759285M110552L573521J845444l128171p485597n632397Q34088
36748c713560M790001M132673L544747M583762K218946m945009q888592l390374
$$ plain form
36805 -6590460 -9381809 -9112247 -4338310 -119022 -2783513 -10860280 -16571690 -16273128
36797 -16273128 -13901970 -12931671 -10873439 -5355830 -943078 -4324287 -14536833 -23151319
36789 -23151319 -24232233 -20089447 -16407126 -15171363 -14288596 -12032942 -9406557 -8205564
36781 -8205564 -8174877 -7096269 -3911873 -781807 -444330 -1770694 -512835 4404093 7976845
36772 7976845 4992757 -2878523 -8651058 -7692213 -1257969 6439286 11316135 10081326
36764 10081326 1809100 -9931748 -19110453 -22478035 -21098052 -16899223 -10639197 -3590285
36756 -3590285 2169000 6279552 9853073 11698517 8570346 1084749 -4547648 -3713560
36748 -3713560 1076441 5209114 8753861 13337623 15556569 10611560 1722968 -1667406
36740a667406M720417L994582m966448j0181503n117432L797499Q158660P991927
36732F730296P125272M871243j207306p867707q580282k953668J893613O40640
36724F52101l767758n084366k171635N59955m4682j622050L25599O234453J1185844
36715F267461J0107384L471084l214885n542089m455564l614866m055378l661594
36707d698447j532249n8985j347288l585688l275327l70376J195168j362436n753179
36698b0788807p014345l044041L420204Q089114R197001P869952N449960J961327
36690E140365k397165n616845n352656j862886K000918L965005M061286K974089
36682B912111P81864j629775k270070j127682j232684l753521m414758O36321
$$ plain form
36740 -1667406 3053011 7047593 2081145 -8100358 -13217790 -9420291 -1261631 6730296
36732 6730296 13855568 18726811 17519505 9651798 1071516 -1882152 11461 652101
36724 652101 -3115657 -8200023 -10371658 -9811703 -9856385 -11478435 -11152836 -4918383 6267461
36715 6267461 16374845 19845929 16631044 11088955 6633391 3018525 -1036853 -4698447
36707 -4698447 -6230696 -6289681 -7636969 -11222657 -14497984 -14868360 -13673192 -15035628 -20788807
36698 -20788807 -27803152 -30847193 -27426989 -19337875 -10140874 -2270922 3179038 5140365
36690 5140365 2743200 -2873645 -8226301 -10089187 -8088269 -4123264 -61978 2912111
36682 2912111 3693975 2064200 -205870 -1333552 -2566236 -6319757 -10734515 -10098194
36674a0098194O867895N539906l408853r421177n424768K430389M448416J467817
36666g598569J617896O027605O950627O84711o066984n958464p52446K895725
36658b199899K745762J471824R72942P34230L81877L78779Q52822J672095K521479
36649I531911K006486q64524l515739k030487J933693J711146l740585n902219
36641h70318Q89287Q801873O772769k399802n690298M45287N408882J810366l660807
36632A1507239k513226J642609M0520o318520q292134k855750K955856K707384
36624a126022j640351m257241k911102K59529K568619L584807N080516Q199214
36616I757969J0221399O391258k984860j0073437p995667J23913N101061L478571
$$ plain form
36674 -10098194 -3230299 2309607 -1099246 -10520423 -15945191 -13514802 -9066386 -7598569
36666 -7598569 -5980673 46932 6997559 7682270 1615286 -4343178 -5095624 -2199899
36658 -2199899 545863 2017687 2990629 3724859 4106736 4485515 5338337 7010432 9531911
36649 9531911 11538397 10673873 7158134 5127647 7061340 8772486 5031901 -870318
36641 -870318 18969 8820842 15593611 13193809 7503511 7948798 13357680 15168046 11507239
36632 11507239 8994013 10636622 10677142 4358622 -3933512 -6789262 -3833406 -1126022
36624 -1126022 -2766373 -7023614 -9934716 -9675187 -7106568 -3521761 1558755 9757969
36616 9757969 19979368 26370626 23385766 13312329 5316662 5440575 10541636 14020207
36608A4020207K32934j8410J286035J291946Q19127J702083K750761J948257L84067
36599B4417007N09692J678603P40849k882448n422555l374519J380352L029088
36591B0076069r58582n716974m502341K162981O546108M092314n88263j340172
36583A9771140K57353j172085m633452m030071J018475L542190Q6216l985336
36575A0854430l179900L77703J851780R58707q4951j094414j693090Q90629O461116
36566A5342010Q530310K639922n446980o893281k505809l96421k334683j540689
36558G394379M598298Q458035L238974o200180r269612l128381M833737O640490
36550A6565740J847574l920439n756244l725052j127752K79371J717739L621264
$$ plain form
36608 14020207 14253141 14234731 15520766 16812712 17631839 19333922 22084683 24032940 24417007
36599 24417007 24926699 26605302 27346151 24463703 19041148 15666629 17046981 20076069
36591 20076069 19117487 13400513 8898172 11061153 17607261 21699575 21111312 19771140
36583 19771140 20028493 18856408 14222956 10192885 11211360 14753550 14839766 10854430
36575 10854430 7674530 8052233 9904013 10862720 10777769 9683355 7990265 8880894 15342010
36566 15342010 23872320 26512242 21065262 14171981 11666172 11269751 8935068 7394379
36558 7394379 11992677 20450712 23689686 17489506 8219894 5091513 9925250 16565740
36550 16565740 18413314 14492875 8736631 5011579 3883827 4163198 5880937 9502201
36542I502201L265163r24655m720864k169539N991967J2167989J0625521K858578
36534C6596361n800490j0886404r965132l907300J891466K135076j305458j726060
36526G032059J969443L390323l63034l006095O92630N415895L163721l921476
36518A4373466o793446l165582L97245m74366k765608l046375k511415k634760
36510f620841j659585J394788L694134K842551Q79910J060712L119682M233980
36502H945331K761857p49216m284662m806075n05482N805280Q179031M403333
36494A9749397q90918k051459P42957K661692N71415l951627o804721n029253
36486D997483M69043M933395M311550M91633p90069J694245K353035k609202q366294
$$ plain form
36542 9502201 12767364 11842709 7121845 4952306 10944273 23112262 33737783 36596361
36534 36596361 30795871 19909467 9944335 6037035 7928501 10063577 8758119 7032059
36526 7032059 9001502 12391825 12028791 9022696 9715326 15131221 18294942 14373466
36518 14373466 7580020 4414438 4811683 4337317 1571709 -1474666 -3986081 -6620841
36510 -6620841 -8280426 -6885638 -3191504 -348953 530957 1591669 4711351 8945331
36502 8945331 11707188 10957972 6673310 1867235 1361753 7167033 15346064 19749397
36494 19749397 18858479 16807020 17549977 20211669 20783084 16831457 10026736 4997483
36486 4997483 5466526 10399921 14711471 15203104 14413035 16107280 18460315 15851113 7484819
36477G484819p675697j046421M458871M957425K950024J483972N72069j41587
36469A3043475j95311q55602m203874q326553q057169k420692L210543M795988
36461c009195M765962O147764O287057J531129n159703p297093m151390j355310
36453b240779k538495n420497o566652n365686k459653J478123M258220L479796
36445a5375623O17889o2319K069209L005259J226608P32493L742482N406548R09286
36436B271832n825021o716335r89413M098299L522545k29957k501309j715854
36428h085213J617666N921447P065215J180415q512462j2636599o872822K074199
36420a8248154N696442M608552M857761O810438N146172p67798m207371j159533
$$ plain form
36477 7484819 -190878 -1237299 3221572 8178997 11129021 12612993 13185062 13043475
36469 13043475 12848164 11992562 7788688 -537865 -8595034 -11015726 -7805183 -3009195
36461 -3009195 1756767 7904531 14191588 15722717 10563014 3265921 -885469 -2240779
36453 -2240779 -4779274 -10199771 -16766423 -22132109 -24591762 -23113639 -18855419 -15375623
36445 -15375623 -14757734 -14820053 -12750844 -9745585 -8518977 -7786484 -4044002 1362546 2271832
36436 2271832 -3553189 -10269524 -11258937 -7160638 -3638093 -3868050 -6369359 -8085213
36428 -8085213 -6467547 -546100 6519115 7699530 -812932 -13449531 -20322353 -18248154
36420 -18248154 -12551712 -7943160 -3085399 3725039 8871211 8103413 3896042 2736509
36412B736509L034987J301409m878914p799026m330568O24186J661372n51278
36404h201323k111727k003279k086842k490592r19500K892344N482798M388717
36396e049404J983128J818302L116525K531940J90769n24701Q04372O18339k094373
36387C394897l333777q20838J667087O48609q34056J295527M081386J814556l642566
36378D270825m522784Q79027N607045N057234L106681L871220M275263K40473
36370B2784984m968294n220520j343889J50166l049525o494913o295734l585824
36362h023549p89786J735444L527228K553515j339383m180222k037745L743276
36354d811222P782793O709705K288247j429012k713846l236029m872592o437097
$$ plain form
36412 2736509 5771496 7072905 2193991 -5605035 -9935603 -9311417 -7650045 -8201323
36404 -8201323 -10313050 -12316329 -14403171 -16893763 -17813263 -14920919 -9438121 -5049404
36396 -5049404 -3066276 -1247974 1868551 4400491 4591260 4066559 4870931 5489270 3394897
36387 3394897 61120 -759718 907369 1555978 721922 2017449 6098835 7913391 4270825
36378 4270825 -251959 627068 6234113 11291347 14398028 18269248 22544511 22784984
36370 22784984 17816690 12596170 11252281 11402447 8352922 1858009 -4437725 -8023549
36362 -8023549 -8813335 -7077891 -3550663 -997148 -2336531 -6516753 -8554498 -4811222
36354 -4811222 2971571 9681276 11969523 10540511 7826665 4590636 -281956 -6719053
36346f719053m853798J97678M534852L999110k57195l130110j865125J350093
36338f743548L317083L662145L377949J901690j679058n441490n666488j790494
36330i062211J941006J426811k039445l638605j597412Q54307Q19271J39727K148916
36321i007635O124026Q396478P994328P137863O018684J743385n672940j0595342
36313A2138847q517723k528800Q10628j89987k251331l437676m457824m396954
36305a2830820q88002M375856N646890J256464k586331K25118O987728R755586
36297A1942489O001418J103657n6698K50759l179667r838466j2645877o558362
36289a2980747M352269J0905383R204279L949495P79242q06995l973596p374021
$$ plain form
36346 -6719053 -11572851 -11375173 -6840321 -2841211 -3098406 -6228516 -8093641 -6743548
36338 -6743548 -3426465 235680 3613629 5515319 3836261 -1605229 -7271717 -9062211
36330 -9062211 -7121205 -5694394 -7733839 -11372444 -12969856 -12115549 -11296278 -11156551 -9007635
36321 -9007635 -2883609 5512869 13507197 20645060 26663744 28407129 22734189 12138847
36313 12138847 3621124 1092324 1902952 1712965 -538366 -3976042 -8433866 -12830820
36305 -12830820 -13718822 -9342966 -3696076 -2439612 -5025943 -4800825 2186903 11942489
36297 11942489 17943907 19047564 18990866 19241625 16061958 6223492 -6422385 -12980747
36289 -12980747 -8628478 2276905 11481184 15430679 16209921 15402926 11429330 4055309
36281D055309o606045j694551K257608K200606m9059k671138n826651p275320
36273a5609241k576472O729487J1340796O022012j933334k674279K056524K842832
36265F198325k108377n083848k083309J653194J569117N14829J544637J647545
36257C852113j825535m678663k317655J896469J668297j958480k445420J705782
36249d103092N059409L667115m89351l782068m508985j871225L531241P532912
36241E035956N691592k78862m076291l600595k805424l490841j692302M420781
36233g95986R048746O415950k63916l208587p84526J794488Q69983j937802l783396
36224G354954l632509j379869K023012L759329K176578O7674R77489L056883J469767
$$ plain form
36281 4055309 -2550736 -4245287 -1987679 212927 163868 -2507270 -8333921 -15609241
36273 -15609241 -18185713 -11456226 -115430 5906582 3973248 1298969 3355493 6198325
36265 6198325 4089948 -993900 -3077209 -1424015 145102 659931 2204568 3852113
36257 3852113 2026578 -2652085 -4969740 -3073271 -1404974 -3363454 -5808874 -4103092
36249 -4103092 956317 4623432 4134081 352013 -4156972 -6028197 -2496956 5035956
36241 5035956 10727548 10448686 6372395 2771800 -33624 -3524465 -5216767 -795986
36233 -795986 8252760 14668710 14404794 11196207 10411681 12206169 13076152 11138350 7354954
36224 7354954 3722445 2342576 4365588 8124917 10301495 10369169 11346658 14403541 15873308
36215A5873308l309050n244246j849519K025612J741631q54812j774651j124401
36207E483872j264567k197051k711351l372978m457815l357929J625032O675880
36199c576907O344565J374722j808495K11227L544435K588261k974820q392501
36191b689513r362828n862791j131260K053271L530902M168277L489570R66160
36183d838212j069767O41208M783759N971166K573055l43756J069496L185638
36175A1972587J202030k486753k518758j47488j056473m953116n505142j192690
36167d685803J827586j10188k642606j593341o1408k360521o039867n537894m31823
36158b1635865N002315P927088Q132869N456097O91593k570130j569926J058249
$$ plain form
36215 15873308 12564258 7320012 5470493 7496105 9237736 8382924 6608273 5483872
36207 5483872 4219305 2022254 -689097 -4062075 -8519890 -11877819 -10252787 -3576907
36199 -3576907 2767658 4142380 2333885 2545112 6089547 8677808 5702988 -2689513
36191 -2689513 -12052341 -17915132 -19046392 -16993121 -13462219 -9293942 -5804372 -4838212
36183 -4838212 -5907979 -5266771 -483012 5488154 8061209 7717453 8786949 11972587
36175 11972587 13174617 10687864 8169106 8021618 6965145 2012029 -3493113 -4685803
36167 -4685803 -2858217 -2968405 -5611011 -7204352 -7265760 -9626281 -15666148 -21204042 -21635865
36158 -21635865 -16633550 -8706462 -573593 4882504 5574097 3003967 1434041 2492290
36150B492290L86801l701211o207307l733221J586905N068680M188522L86304
36142D67763k327078j250045J456060Q42067l846732p025207m134756J684838
36134a4133090L951542J629497p99211o73122J45125l18133j332079j664465j221365
36125a4415301J26317K532413M578801M291804K147380P82657J445395K701291
36117D190757K718064J152853r75255j996643j072614J7627j427118m267713l771918
36108e431960R52568L887608M79344n110412o566536n100102n397118n480603
36100b7767211Q1908Q487946J0542379M753463n75360j119907j861112n307011
36092a2764905n370616J131762O856533N408580J781126K724325M556967P14624
$$ plain form
36150 2492290 2879091 -822120 -7029427 -10762648 -9175743 -4107063 81459 467763
36142 467763 -1859315 -3109360 -1653300 -811233 -4657965 -11683172 -15817928 -14133090
36134 -14133090 -10181548 -8552051 -9351262 -10024384 -9879259 -10197392 -11529471 -13193936 -14415301
36125 -14415301 -14288984 -11756571 -7177770 -2885966 -738586 44071 1489466 4190757
36117 4190757 6908821 8061674 7086419 5089776 4017162 4034789 2607671 -1660042 -5431960
36108 -5431960 -4479392 -591784 -112440 -5222852 -11789388 -16889490 -22286608 -27767211
36100 -27767211 -27685303 -19197357 -8654978 -3901515 -4476875 -5596782 -7457894 -12764905
36092 -12764905 -18135521 -17003759 -10147226 -4738646 -2957520 -233195 4323772 5038396
36084E038396n035478m440640O07104J306024k761909l780574k28666J144654
36076h151089j219770p01647L987456M355252l333357r781670o436352J178213
36068b0102964K733794q95620p75959M844927Q448630N443640j79230l205195
36060c687977l216366j618486J525831N160699N966102K241994l339360o649812
36052c617375n909695j791555L734864P487823O670105K352690o31593N07385
36044H802649K376186k07270o386049r068312l620486N560273R266107L506454
36036A0229552o460189j1976202r337618k159865L024833K754537p70321k305471
36028a7000744P28828N169657N857039K208265j161459q41115J288599K032525
$$ plain form
36084 5038396 2918 -4437722 -3830618 -2524594 -5286503 -9067077 -9295743 -8151089
36076 -8151089 -9370859 -10072506 -6085050 -1729798 -5063155 -14844825 -21281177 -20102964
36068 -20102964 -17369170 -18264790 -19040749 -14195822 -5747192 -303552 -482782 -3687977
36060 -3687977 -6904343 -8522829 -6996998 -1836299 4129803 6371797 3032437 -3617375
36052 -3617375 -9527070 -11318625 -7583761 -95938 6574167 8926857 8295264 8802649
36044 8802649 11178835 10971565 4585516 -4482796 -8103282 -2543009 6723098 10229552
36036 10229552 3769363 -8206839 -17544457 -19704322 -16679489 -13924952 -14695273 -17000744
36028 -17000744 -16271916 -11102259 -5245220 -3036955 -4198414 -5039529 -3750930 -1718405
36020a718405J864533K789047L573286J427942k379618l029605J087795N636688
36012I251663N534837M36703n662505q129935m927723J281006M310765O85661
36004B780472n439266p005752l324293N6527Q84363L172308Q199666R447677K191014
35995A0962716o809969o756435K030507P981484L850371m326496o561773k146714
35987a776309R09951k477418p964293p878747j166010N417373N959830K405824
35979f569799O93446K035631K381273K08684o54490K035857M590584L793261K773321
35970A1287768M933974O014584k49769j0312102j3120978n400138K972441K049546
35962a824674n761356j0605520p978296j700348L055687M619213L594186J052798
$$ plain form
36020 -1718405 146128 2935175 6508461 7936403 5556785 2527180 3614975 9251663
36012 9251663 14786500 15223203 9560698 1430763 -3496960 -2215954 2094811 2780472
36004 2780472 -2658794 -9664546 -12988839 -12932312 -12047949 -8875641 -675975 8771702 10962716
35995 10962716 4152747 -2603688 -573181 7408303 11258674 6932178 370405 -1776309
35987 -1776309 -866358 -3343776 -11308069 -19186816 -20352826 -14935453 -8975623 -6569799
35979 -6569799 -5876353 -3840722 -1459449 -1250765 -1905255 130602 4721186 8514447 11287768
35970 11287768 16221742 22236326 21986557 11674455 -1446523 -6846661 -3874220 -1824674
35962 -1824674 -7586030 -18191550 -26169846 -27870194 -24814507 -20195294 -16601108 -15548310
35954a5548310j320745j644605O86263M478690P424134P223263L367152j667872
35946B997970m443932m277902l318900k766988j583735L36782R40773k67446m23405
35937a2806783K080961L900256J197659m053204o224999l719914n62415j46105
35929b0334544j016857j2153L204584O350952P455099O127956L166743K30169
35921E171949q76505J71448J568283J293429k72067m82835K160056N236479M556849
35912A8527086l49562m783808m849459l095567m581426q138521o898573Q56583
35904a3313247O961304L788400m656443p797723k443725M432828O096374K992681
35896c939551j238479m445088m665202J7640O859657Q464942J800036o250919
$$ plain form
35954 -15548310 -16869055 -18513660 -17827397 -13348707 -5924573 1298690 4665842 2997970
35946 2997970 -1445962 -5723864 -9042764 -11809752 -13393487 -13056705 -12115932 -12383378 -12806783
35937 -12806783 -10725822 -6825566 -5627907 -9681111 -15906110 -19626024 -20188439 -20334544
35929 -20334544 -21351401 -21363554 -18158970 -11808018 -4352919 1775037 4941780 5171949
35921 5171949 4295444 4466892 6035175 7328604 7056537 6573702 8733758 13970237 18527086
35912 18527086 18177524 13393716 8544257 5448690 867264 -7271257 -14169830 -13313247
35904 -13313247 -6351943 -2563543 -7219986 -15017709 -17461434 -13028606 -6932232 -3939551
35896 -3939551 -5178030 -9623118 -14288320 -14270680 -7411023 1053919 2853955 -3396964
35888c396964o937322o32787N024623N915056M803282M712898M884871M350028
35880A8723685M178256L939285N79398n909225r624422o016215O03736K089547
35872H564045k075762m191687r2481M454701K485952l753139o505843l962590
35864e076804j607119k423173k465805J514544N837718N549179K157225N20920
35856D006685P56699q44687m048629m135115K47338M421807M671694K864441J682432
35847I622665J6923l431006o012149m847117j694512K30580J691948M773308O865495
35838G216135L346714m034690p544618l735350J883732L103051J588833L194832
35830E018639Q215067R953560L279116q404014j6195744j4761042p216133q25981
$$ plain form
35888 -3396964 -10334286 -10967073 -5942450 -27394 4775888 9488786 14373657 18723685
35880 18723685 22901941 26841226 27420624 21511399 11886977 5870762 6474498 8564045
35872 8564045 6488283 2296596 2204115 6658816 9144768 5391629 -1114214 -5076804
35864 -5076804 -6683923 -9107096 -11572901 -10058357 -4220639 1328540 3485765 4006685
35856 4006685 4763384 3918697 -129932 -4265047 -4017709 404098 5075792 7940233 9622665
35847 9622665 9639588 6208582 196433 -4650684 -6345196 -6114616 -4422668 350640 7216135
35838 7216135 10562849 6528159 -1016459 -4751809 -2868077 234974 1823807 5018639
35830 5018639 13233706 23187266 26466382 18062368 1866624 -12894418 -20110551 -20936532
35822b0936532J138575J530073L283707M394103J693768k569952k561496K736842
35814a1290912P501826O921941L075841N85157r7499j603177m151014n024742
35806d082579k830312P73985L430846L945546K183900p75151k656819k031231
35798b041815p0204J246274J843275K514987K198643q12615n056267o382046l205978
35789i765746J098581K364225L91678j785089j895746j51104J978048L012751
35781d752402J987049o39150k515604j332072K096833L761955P36966m826008
35773e482433p430084m336458J380547M646690L877259J361949l90204n74002
35765f946736O07851J969148J357949j428609k489336J514745O844677O002833
$$ plain form
35822 -20936532 -19797957 -18267884 -14984177 -10590074 -8896306 -11466258 -14027754 -11290912
35814 -11290912 -3789086 3132855 6208696 6793853 6696354 5093177 942163 -4082579
35806 -4082579 -6912891 -6138906 -2708060 1237486 3421386 2646235 -10584 -2041815
35798 -2041815 -2112019 -865745 977530 3492517 5691160 4878545 -177722 -6559768 -9765746
35789 -9765746 -8667165 -6302940 -5911262 -7696351 -9592097 -9743201 -7765153 -4752402
35781 -4752402 -2765353 -3404503 -5920107 -7252179 -5155346 -1393391 -656425 -5482433
35773 -5482433 -12912517 -17248975 -15868428 -11221738 -7344479 -5982530 -6372734 -6946736
35765 -6946736 -6338885 -4369737 -3011788 -4440397 -6929733 -5414988 1429689 7432522
35757G432522j398682o935818n164148j008252r37066k690085m49436M317328
35749f833637N334816K174744o9938l23648j744338k731131K268654J1052016
35741I127538J2807497L341760p575641r730643n677142l876523n530012o211329
35733a3324495n316025n165584m178218N20444N968799O996015N141606N708599
35725c648859P493586M739818j042356j546298M075410N734417k172320j0837124
35717B796274r317574o2474N601918L218831j421413k484977k98334K412043M299391
35708D743685M342820J536415k919753o013819o267423m508779j574474K003054
35700h658274M273691L177836J43771o95414K049647M976542M493649J037281
$$ plain form
35757 7432522 6033840 -901978 -6066126 -7074378 -8011444 -10701529 -11150965 -6833637
35749 -6833637 -1498821 675923 605985 282337 -1462001 -4193132 -1924478 9127538
35741 9127538 21935035 25276795 17701154 7970511 2293369 -1583154 -7113166 -13324495
35733 -13324495 -18640520 -23806104 -27984322 -27463878 -21495079 -14499064 -9357458 -3648859
35725 -3648859 3844727 8584545 7542189 5995891 10071301 15805718 13633398 2796274
35717 2796274 -6521300 -6583774 -981856 2236975 815562 -1669415 -1967749 444294 4743685
35708 4743685 9086505 10622920 7703167 1689348 -4578075 -9086854 -10661328 -8658274
35700 -8658274 -4384583 -1206747 -1062976 -1758390 291257 5267799 9761448 10798729
35692A0798729k700419n281269o264748m712328q26326K307094J884286k46510
35684e041491J11790K657999K235055k893895o702286l346633L618054N680003
35676c681404J880958J18596M609359Q974173O000139j352404m899427l451681
35668H198309k674856m321019l651458J309266N265123L547070j072479l300240
35660C299716k764250k438757k885098k270240o0816K760737N353408O185854
35652G180554L170104k249360m344722p39004K327292j883543r498688j0261942
35644a6299309k410119M607943M050676O45647J306386M118042L128006q25346
35636a678074k041138k14071l73899k916956k280677K455354L984825j680310
$$ plain form
35692 10798729 8098310 2817041 -3447707 -8160035 -8986361 -6679267 -4794981 -5041491
35684 -5041491 -4929701 -2271702 -36647 -2930542 -9632828 -12979461 -9361407 -3681404
35676 -3681404 -1800446 -1681850 2927509 11901682 17901821 16549417 11649990 8198309
35668 8198309 5523453 1202434 -2449024 -1139758 4125365 7672435 6599956 3299716
35660 3299716 535466 -1903291 -4788389 -7058629 -7119445 -4358708 994700 7180554
35652 7180554 10350658 8101298 3756576 3017572 5344864 3461321 -6037367 -16299309
35644 -16299309 -18709428 -14101485 -10050809 -9405162 -8098776 -3980734 -852728 -1678074
35636 -1678074 -3719212 -3933283 -4307182 -7224138 -9504815 -7049461 -3064636 -4744946
35628d744946p296672m845560J506247J609588m488959o620364q90435M271788
35620b1499313J920481k745064j716199L090622M552956K900090M245484Q670461
35612e80482R152044K999443l762281n515854l785877k231356r95301N52516O54168
35603c512980j188709j429466K461077P060350P069187K342972k457784l797338
35595F547309k316776j232800l316940p883897j0041624n617362K532976O955503
35587a4373611N420257L442408M956095O309592L498216k92816j54838K036365
35579A0841668J371821j058814l35047K874028K772574j767844n065249l479067
35571F154070j33348J183791J411818K775677M176460L205050K22783k196441
$$ plain form
35628 -4744946 -12041618 -16887178 -15380931 -13771343 -18260302 -24880666 -25771101 -21499313
35620 -21499313 -19578832 -22323896 -24040095 -20949473 -16396517 -13496427 -9250943 -580482
35612 -580482 8571562 11571005 7808724 2292870 -1493007 -3724363 -4719664 -4167148 -3512980
35603 -3512980 -4701689 -6131155 -3670078 3390272 10459459 12802431 10344647 6547309
35595 6547309 4230533 2997733 -319207 -8203104 -18244728 -23862090 -21329114 -14373611
35587 -14373611 -8953354 -5510946 -554851 5754741 9252957 8960141 8805303 10841668
35579 10841668 12213489 11154675 10819628 13693656 16466230 14698386 9633137 6154070
35571 6154070 6020722 7204513 8616331 11392008 15568468 18773518 18996301 16799860
35563A6799860k583647j748767j400437k258868l181274k515654m87043J246418
35555C870588K561471M523149N551448K475747k818707l660733R17285K641230
35547A6061478l298027r051393o106773K8645j411757p700357o611515K477353
35539a5612346O828650J630774k242554K902501Q998051O593505j05947k342621
35531F650013j268599k672018m788928k359333K482250L662133J502824L23522
35523C531864m66853l676421o194440l061053K785370M016602M25481j634248
35515d273698L48178L467869O307932Q806808P236905j171963r895610r479408
35507A347013j847975K038324j000450l033781j6982J787633j637364m313978
$$ plain form
35563 16799860 14216213 12467446 11067009 8808141 5626867 3111213 2624170 3870588
35555 3870588 6432059 10955208 16506656 18982403 16163696 12502963 13420248 16061478
35547 16061478 12763451 3712058 -2394715 -2366070 -3777827 -11478184 -18089699 -15612346
35539 -15612346 -8783696 -7152922 -9395476 -6492975 2505076 9098581 8992634 6650013
35531 6650013 5381414 2709396 -2079532 -4438865 -1956615 1705518 3208342 3531864
35523 3531864 3065011 -611410 -6805850 -9866903 -7081533 -3064931 -2639450 -4273698
35515 -4273698 -3925520 -457651 5850281 14657089 21893994 20722031 10826421 1347013
35507 1347013 -500962 1537362 536912 -2496869 -2513851 -726218 -2363582 -6677560
35499f677560j178844K851637K004026k22855J759816M712053J807783n279969
35491b23913q297231m511448O87033K624126K297401K210925K607579K997308
35483C91780L670303M341163L492765O5077m960673q596633p557025j534546M964438
35474e723351O414043K696795p22724J06825L172203M226631J949558k032152
35466A0087828n404220o131197m022484k191249l542216n333349k004513N428585
35458a3112815Q704005L712190l411229n481202l670687k590559j599176K115258
35450a5334215N997371N448680K235764J929698M289528L750913p99976m094914
35442C422849l060544n57251P84802K024367L221503J493660l232949n876502
$$ plain form
35499 -6677560 -7856404 -5004767 -3000741 -3223596 -1463780 3248273 5056056 -223913
35491 -223913 -8521144 -13032592 -12345559 -9721433 -7424032 -5213107 -2605528 391780
35483 391780 4062083 8403246 11896011 11961088 7000415 -1596218 -9153243 -10687789 -5723351
35474 -5723351 690692 3387487 2664763 2771588 5943791 10170422 12119980 10087828
35466 10087828 4683608 -1447589 -5470073 -7661322 -11203538 -16536887 -18541400 -13112815
35458 -13112815 -4408810 -696620 -4107849 -9589051 -13259738 -15850297 -17449473 -15334215
35450 -15334215 -9336844 -3888164 -1652400 277298 4566826 8317739 7517763 3422849
35442 3422849 362305 -194946 589856 2614223 5835726 7329386 4096437 -1780065
35434a780065l219574J062424K016142J16700j556908l087582n694236o717795
35426a8860894k596482M008707O006216J728061k300487p17211L285765L826875
35418e619450J860681K946346O832732O240256j946996j0298633j0073028k704101
35410a2762193L325706M209458L037489J852306r47417m372958l391390L186803
35402e862196R225655R393745N878108L209493J280812j854048m625518m794526
35394A1851525m133823m727657l826105J429988O828743N741688k81433k805566
35386A0077360J362708O030322M966170m15803m878771o182549n465095m033450
35378A460892k248824j63444J699328J573475k247275p725768r212664m326154
$$ plain form
35434 -1780065 -4999639 -3937215 -1921073 -1804373 -3361281 -6448863 -12143099 -18860894
35426 -18860894 -21457376 -17448669 -11442453 -9714392 -12014879 -12732090 -9446325 -5619450
35418 -5619450 -3758769 -812423 6020309 12260565 10313569 14936 -10058092 -12762193
35410 -12762193 -9436487 -5227029 -2189540 -337234 -1284651 -5657609 -9048999 -5862196
35402 -5862196 3363459 12757204 18635312 21844805 23125617 21271569 16646051 11851525
35394 11851525 7717702 2990045 -836060 593928 7422671 13164359 12882926 10077360
35386 10077360 11440068 17470390 22436560 22020757 17141986 10959437 5494342 1460892
35378 1460892 -787932 -951376 747952 2321427 74152 -7651616 -16864280 -21190434
35370b1190434J947417L893112K754799K873687L661473K197766Q49675L778974
35362G66469P488148M482807l688499p255254l490318m80587k570738l163762
35354g911734K370074O991068L147744m678002p422028m875428k573823o91057
35346a5643186M123099R368302Q956610L347559r66653j275711p82401j920412
35338E207207m145440p077344r439200o838873K195215R943491P607422j295480
35330c843002m518643J830234Q909107R040956M604968K76078m382077r747199
35322B170422j1381448o601591j62486K514502L133916N672964P858949M397711
35314G602939l303632p298939l238672M441479Q399224O225878J376347j704227
$$ plain form
35370 -21190434 -19243017 -15349905 -12595106 -9721419 -6059946 -3862180 -3012505 766469
35362 766469 8254617 12737424 9048925 1793671 -1696647 -2177234 -4747972 -7911734
35354 -7911734 -5541660 1449408 4597152 -80850 -7502878 -12378306 -14952129 -15643186
35346 -15643186 -11520087 -2151785 6804825 10152384 9185731 7910020 7127619 5207207
35338 5207207 1061767 -6015577 -15454777 -22293650 -20098435 -10154944 -2547522 -3843002
35330 -3843002 -8361645 -6531411 2377696 11418652 16023620 16299698 11917621 2170422
35322 2170422 -9211026 -15812617 -15975103 -13460601 -10326685 -4653721 3205228 7602939
35314 7602939 4299307 -2999632 -6238304 -1796825 6602399 12828277 14204624 12500397
35306A2500397k173653k726003n105000o791411m187490J414932M382664K055082
35298f30482j894529k985473j448666Q5849J204229K682459L093986K99749m369308
35289c962186o589357l982253J240315M676707L789081n7811k929732k299613
35281a0114849J55078R24522l99253q95797O79250J826234P94751J08423K752638
35272d169003O659009O298722k13222p812307r314348l264942L738576L847877
35264d229638k625094p109685l931553J842483J990676k512646l536620J158202
35256a8953875N282694N333021N504158Q020299P464982L91492p116505q401990
35248b475724o092656n345895l613104L425451J0756505R823019K674107p60549
$$ plain form
35306 12500397 10326744 7600741 2495741 -4295670 -8483160 -7068228 -2685564 -630482
35298 -630482 -2525011 -5510484 -6959150 -6873301 -5669072 -2986613 107373 407122 -3962186
35289 -3962186 -10551543 -14533796 -13293481 -8616774 -4827693 -4885504 -7815236 -10114849
35281 -10114849 -9959771 -9035249 -9434502 -10330299 -9651049 -7824815 -7030064 -6921641 -4169003
35272 -4169003 2490006 8788728 8575506 763199 -8551149 -11816091 -8077515 -4229638
35264 -4229638 -6854732 -13964417 -17895970 -16053487 -14062811 -16575457 -20112077 -18953875
35256 -18953875 -13671181 -8338160 -2834002 5186297 12651279 13042771 5926266 -2475724
35248 -2475724 -8568380 -13914275 -17527379 -14101928 -3345423 6477596 9151703 8391154
35240H391154J573727J997675k559172n581505k856416Q08286N48501j608565
35232G13685k736602l828258m493232q99242O195046R174788M862535N09024K108901
35223A1606645M150011r40174r303717j0968247m712906J586586L190755K504371
35215b886676K058943J419535R34623J912353L082511K286582O54744j15997k229611
35206G117007p042557q809597j819521Q097491R381939J949155k503270P63928
35198G134575K434282m246114j1162784q082838J039702M774318J589032j95612
35190f715439K997430N833692M336645J293772k85035j811945m444785n287675
35182d083340j770770L410787M836502O69564n083098o387158j566646L941531
$$ plain form
35240 8391154 9964881 11962556 9403384 3821879 965463 1773749 2322250 713685
35232 713685 -2022917 -5851175 -10344407 -11243649 -5048603 4126185 8988720 9497744 11606645
35223 11606645 15756656 14816482 5512765 -5455482 -10168388 -8581802 -5391047 -2886676
35215 -2886676 -827733 591802 1526425 3438778 6521289 8807871 9462615 9346618 7117007
35206 7117007 74450 -8735147 -10554668 -2457177 6924762 8873917 6370647 7134575
35198 7134575 9568857 5322743 -5840041 -13922879 -12883177 -8108859 -6519827 -6715439
35190 -6715439 -3718009 2115683 6452328 7746100 7461065 5649120 1204335 -4083340
35182 -4083340 -5854110 -2443323 2393179 3062743 -2020355 -8407513 -9974159 -6032628
35174f032628L328638k163342l450391L782842J1285909Q825623j012177o562288
35166H002186m076774j629889m768558p862104m373136K087741L676510Q4413
35158h859611k685513k161412j177262j356232j103035J56647J040083J818238
35150a4328097M383836P929001Q662251M984616j10100k778868k060900N88096
35142G269835L090894L699679K320085R58430Q22696k98848m803773j0045972
35134C013026j0366592m966441J84779j02072m013935n971269l430210J543815
35126b4108899N356390N634621K610352o24678o51670K407234N068783N092521
35118G84654L752490K878925K278725J143364o03809l290834o795216q085325
$$ plain form
35174 -6032628 -2703990 -4867332 -8317723 -4534881 6751028 15576651 14564474 8002186
35166 8002186 3925412 2295523 -2473035 -10335139 -14708275 -12620534 -8944024 -8859611
35158 -8859611 -11545124 -13706536 -14883798 -16240030 -17343065 -17186418 -16146335 -14328097
35150 -14328097 -9944261 -2015260 6646991 11631607 11521507 8742639 6681739 7269835
35142 7269835 10360729 14060408 16380493 17338923 18161619 17862771 13058998 3013026
35134 3013026 -7353566 -12320007 -12135228 -12237300 -16251235 -22222504 -25652714 -24108899
35126 -24108899 -18752509 -13117888 -10507536 -11132214 -11783884 -9376650 -4307867 784654
35118 784654 4537144 7416069 9694794 10838158 10234349 6943515 148299 -7937026
35110g937026l656023L876955O524103J425883m240197l299897J119903J425746
35102d760553j998524j953876L352253P265349M874776n13448l312227k862774
35094I0976k262533l706076o651600p749670k738434P522877J3846411P897958
35086F249909n037171j0088184j934327P983848P630844m6093m332499k906196
35078b479869j777316k914090j845482K766675N783948L587095r53028l515278
35070a347345l315513j299291K027431M838464L978982q02988n306781n476676
35062f703717j536469L406056O484254O033743K210559k121700l492251j895016
35054B385459n63867j008263j082079P99861K520716J549557p94508j023083J496985
$$ plain form
35110 -7937026 -11593049 -7716094 -1191991 233892 -4006305 -7306202 -6186299 -4760553
35102 -4760553 -6759077 -8712953 -5360700 1904649 6779425 6265977 2953750 90976
35094 90976 -2171557 -5877633 -12529233 -20278903 -23017337 -15494460 -1648049 6249909
35086 6249909 1212738 -8875446 -10809773 -2825925 4804919 4758826 426327 -2479869
35078 -2479869 -4257185 -7171275 -9016757 -6250082 -466134 3120961 2167933 -1347345
35070 -1347345 -4662858 -5962149 -3934718 903746 4882728 4079740 -1227041 -6703717
35062 -6703717 -8240186 -4834130 1650124 7683867 9894426 7772726 4280475 2385459
35054 2385459 1821592 813329 -268750 531111 3051827 4601384 3806876 2783793 4280778
35045D280778L495123J899312k401535n632163n670272m360499m043694k905910
35037a5338860K575114R805533R892617n84054j1827445j1348770j85586Q592486
35029h418965P091975O18419k590468j612790M20361K631794M588818L769149
35021F498293q319k124038l8003J769224r81248m564386l010060J825954L014070
$$ plain form
35045 4280778 7775901 9675213 7273678 1641515 -4028757 -8389256 -12432950 -15338860
35037 -15338860 -12763746 -2958213 6934404 6350350 -5477095 -16825865 -17011451 -8418965
35029 -8418965 -1326990 -708571 -3299039 -4911829 -4491468 -1859674 2729144 6498293
35021 6498293 6489974 4365936 4327933 6097157 5115909 551523 -2458537 -632583 2381487
$$ [...]
##END NTUPLES=NMR SPECTRUM
##END=
