##TITLE=31Pdec_DE-63_24_oil
 D2O, 64 sc
 8.8.2024
##JCAMPDX= 6.0         $$ Bruker NMR JCAMP-DX V2.0
##DATA TYPE= NMR SPECTRUM
##DATA CLASS= NTUPLES
##ORIGIN= UXNMR, Bruker Analytische Messtechnik GmbH
##OWNER= root
$$ XWIN-NMR		Version 3.5
$$ Thu Aug  8 15:35:14 2024 Russian Standard Time (UT+4h)  she@DPX200
##.OBSERVE FREQUENCY= 81.013821
##.OBSERVE NUCLEUS= ^31P
##.ACQUISITION MODE= SIMULTANEOUS
##.ACQUISITION SCHEME= undefined
##.AVERAGES= 64
##.DIGITISER RES= 17
##SPECTROMETER/DATA SYSTEM= spect
##.PULSE SEQUENCE= zgpg30
##.SOLVENT NAME= D2O
##.SHIFT REFERENCE= (INTERNAL, D2O, 0, 198.062)
##AUDIT TRAIL= $$ (NUMBER, WHEN, WHO, WHERE, WHAT)
$$ ##TITLE= Audit trail, XWIN-NMR		Version 3.5
$$ ##JCAMPDX= 5.01
$$ ##ORIGIN= Bruker BioSpin GmbH
$$ ##OWNER= she
$$ F:/spectra/data/she/nmr/P31/2/pdata/1/auditp.txt
$$ ##AUDIT TRAIL=  $$ (NUMBER, WHEN, WHO, WHERE, WHAT)
(   1,<2024-08-08 15:33:16.60 +0400>,<she>,<DPX200>,
      <created by zg, POWCHK disabled, PULCHK disabled
       configuration hash MD5:
       00 E9 B6 7A A2 85 ED C7 34 08 36 98 17 FE 4E 26
       data hash MD5: 32K
       7B CD 98 62 10 F6 CF E0 36 52 F7 5A 4A 31 3F ED>)
(   2,<2024-08-08 15:33:27.26 +0400>,<she>,<DPX200>,
      <Start of raw data processing
       efp BC_mod = 2 LB = 1.5 FT_mod = 6 PKNL = 1 PHC0 = 2668.954 PHC1 = 84.08804 SI = 64K 
       data hash MD5: 64K
       CE 75 CB 1F 6E 37 2A 89 FF 29 32 35 83 15 30 BD>)
(   3,<2024-08-08 15:33:48.95 +0400>,<she>,<DPX200>,
      <pk PHC0 = 1.940899 PHC1 = 0 
       data hash MD5: 64K
       3D 76 66 D2 A2 83 E6 0B 7D 32 9F 52 89 2C DD 36>)
(   4,<2024-08-08 15:33:52.89 +0400>,<she>,<DPX200>,
      <abs ABSG = 5 
       data hash MD5: 64K
       3E D2 C9 4F E8 E9 FF C8 3B F6 1F 64 A4 14 2B FF>)
$$ ##END=
$$ 
$$ hash MD5
$$ 60 6A 6B 43 56 7B 6E 80 54 A2 36 B1 16 68 FE 17
##$RELAX= 
##$RELAX= 
##$RELAX= 
##$RELAX= 
##$RELAX= 
##$RELAX= 
##$RELAX= 
##$RELAX= 
$$ Bruker specific parameters
$$ --------------------------
##$DU= <F:/spectra>
##$EXPNO= 2
##$NAME= <P31>
##$PROCNO= 1
##$TYPE= <nmr>
##$USER= <she>
##$AMP= (0..31)
100 100 100 100 100 100 100 100 100 100 100 100 100 100 100 100 100 100 
100 100 100 100 100 100 100 100 100 100 100 100 100 100 
##$AQSEQ= 0
##$AQ_mod= 1
##$AUNM= <au_zg>
##$AUTOPOS= <>
##$BF1= 81.014009
##$BF2= 200.13
##$BF3= 200.13
##$BF4= 200.13
##$BF5= 200.13
##$BF6= 200.13
##$BF7= 200.13
##$BF8= 200.13
##$BYTORDA= 1
##$CFDGTYP= 0
##$CFRGTYP= 5
##$CHEMSTR= <none>
##$CNST= (0..31)
1 1 145 1 1 1 1 1 1 1 1 1 1 1 1 1 1 1 1 1 1 1 1 1 1 1 1 1 1 1 1 1 
##$CPDPRG= <waltz16>
##$CPDPRG1= <>
##$CPDPRG2= <waltz16>
##$CPDPRG3= <>
##$CPDPRG4= <mlev>
##$CPDPRG5= <mlev>
##$CPDPRG6= <mlev>
##$CPDPRG7= <mlev>
##$CPDPRG8= <mlev>
##$CPDPRGB= <>
##$CPDPRGT= <>
##$D= (0..31)
0 1 0 0 0 0 0 0 0 0.06 0 0.03 2e-05 3e-06 0 0 0.0002 0 0 0 0 0 0 0 0 0 
0 0 0 0 0 0 
##$DATE= 1723116796
##$DBL= (0..7)
120 120 120 11 120 120 24 19 
##$DBP= (0..7)
150 150 150 150 150 150 150 150 
##$DBP07= 0
##$DBPNAM0= <>
##$DBPNAM1= <>
##$DBPNAM2= <>
$$ [...]
##$SUBNAM3= <"">
##$SUBNAM4= <"">
##$SUBNAM5= <"">
##$SUBNAM6= <"">
##$SUBNAM7= <"">
##$SUBNAM8= <"">
##$SUBNAM9= <"">
##$SW= 400.765351723535
##$SWIBOX= (0..15)
0 1 3 0 0 0 0 0 0 0 0 0 0 0 0 0 
##$SW_h= 32467.5324675325
##$TD= 32768
##$TD0= 1
##$TE= 0
##$TE2= 300
##$TE3= 300
##$TEG= 300
##$TL= (0..7)
0 120 53 12 22 120 120 120 
##$TP= (0..7)
150 150 150 150 150 150 150 150 
##$TP07= 0
##$TPNAME0= <>
##$TPNAME1= <>
##$TPNAME2= <>
##$TPNAME3= <>
##$TPNAME4= <>
##$TPNAME5= <>
##$TPNAME6= <>
##$TPNAME7= <>
##$TPOAL= (0..7)
0.5 0.5 0.5 0.5 0.5 0.5 0.5 0.5 
##$TPOFFS= (0..7)
0 0 0 0 0 0 0 0 
##$TUNHIN= 0
##$TUNHOUT= 0
##$TUNXOUT= 0
##$USERA1= <user>
##$USERA2= <user>
##$USERA3= <user>
##$USERA4= <user>
##$USERA5= <user>
##$V9= 5
##$VALIST= <valist>
##$VCLIST= <CCCCCCCCCCCCCCC>
##$VD= 0
##$VDLIST= <DDDDDDDDDDDDDDD>
##$VPLIST= <PPPPPPPPPPPPPPP>
##$VTLIST= <TTTTTTTTTTTTTTT>
##$WBST= 1024
##$WBSW= 4
##$XGAIN= (0..3)
0 0 0 0 
##$XL= 0
##$YL= 0
##$YMAX_a= 12113
##$YMIN_a= -7319
##$ZGOPTNS= <>
##$ZL1= 120
##$ZL2= 120
##$ZL3= 120
##$ZL4= 120
##$ABSF1= 198.0616
##$ABSF2= -202.7028
##$ABSG= 5
##$ABSL= 3
##$ALPHA= 0
##$AQORDER= 0
##$ASSFAC= 0
##$ASSFACI= 0
##$ASSFACX= 0
##$ASSWID= 0
##$AUNMP= <proc_1d>
##$AZFE= 0.1
##$AZFW= 0.5
##$BCFW= 0
##$BC_mod= 2
##$BYTORDP= 0
##$COROFFS= 0
##$CY= -3
##$DATMOD= 1
##$DC= 0
##$DFILT= <>
##$DTYPP= 0
##$F1P= 0
##$F2P= 0
##$FCOR= 1
##$FTSIZE= 65536
##$FT_mod= 6
##$GAMMA= 0
##$GB= 0
##$INTBC= 1
##$INTSCL= 9.790993e-09
##$ISEN= 30
##$LB= 1.5
##$LEV0= 0
##$LPBIN= 0
##$MAXI= 10000
##$MC2= 0
##$MEAN= 0
##$ME_mod= 0
##$MI= 50
##$NCOEF= 0
##$NC_proc= -9
##$NLEV= 6
##$NOISF1= 182.463
##$NOISF2= 159.3651
##$NSP= 0
##$NTH_PI= 0
##$NZP= 0
##$OFFSET= 198.0616
##$PC= 4
##$PHC0= 2670.895
##$PHC1= 84.08804
##$PH_mod= 1
##$PKNL= yes
##$PPARMOD= 0
##$PSCAL= 0
##$PSIGN= 0
##$REVERSE= no
##$SF= 81.0140089999434
##$SI= 65536
##$SIGF1= 159.3651
##$SIGF2= -187.1042
##$SINO= 113.3802
##$SIOLD= 16384
##$SREGLST= <1H.CDCl3>
##$SSB= 0
##$STSI= 65536
##$STSR= 0
##$SW_p= 32467.5324675325
##$SYMM= 0
##$S_DEV= 0
##$TDeff= 32768
##$TDoff= 0
##$TI= <>
##$TILT= no
##$TM1= 0
##$TM2= 0
##$TOPLEV= 0
##$USERP1= <user>
##$USERP2= <user>
##$USERP3= <user>
##$USERP4= <user>
##$USERP5= <user>
##$WDW= 1
##$XDIM= 65536
##$YMAX_p= 311881783
##$YMIN_p= -83675936
$$ End of Bruker specific parameters
$$ ---------------------------------
##NTUPLES= NMR SPECTRUM
##VAR_NAME=  FREQUENCY,     SPECTRUM/REAL,   SPECTRUM/IMAG
##SYMBOL=    X,             R,               I
##VAR_TYPE=  INDEPENDENT,   DEPENDENT,       DEPENDENT
##VAR_FORM=  AFFN,          ASDF,            ASDF
##VAR_DIM=   65536,         65536,           65536
##UNITS=     HZ,            ARBITRARY UNITS, ARBITRARY UNITS
##FACTOR=    0.49542278885378, 1,            1
##FIRST=     16045.7642231865, 0,            0
##LAST=      -16421.768244346, 0,            0
##MIN=       -16421.768244346, -83675936,    0
##MAX=       16045.7642231865, 311881783,    0
$$ Real data points
##PAGE= N=1
##DATA TABLE= (X++(R..R)), XYDATA
$$ [...]
$$ plain form
40161 -9078311 -4318138 -1490040 -1557586 -4360350 -8046522 -9537410 -7085008 -2046344
40153 -2046344 2362726 3657715 1745850 -890156 -1039217 1654102 3243581 -425941
40145 -425941 -8223855 -14593846 -16162826 -14799655 -13139459 -10164922 -3894934 3412357
40137 3412357 6324260 2867318 -2402558 -3391854 562367 4295148 3279467 -1334326
40129 -1334326 -5504571 -8596676 -13546068 -20269060 -23002873 -17313981 -6921413 654880
40121 654880 3391282 4720234 5333289 1563995 -6724824 -12971489 -12075114 -6929948 -2971604
40112 -2971604 -537628 2666600 5301967 4537806 2174242 2376514 4306194 3346806 -244672
40103 -244672 -586756 4029646 6760152 1518421 -7598643 -10765323 -3990715 7804353
$$ packed form
40161i078311M760173K828098o7546k802764l686172j490888K452402N038664
40153b046344M409070J294989j911865k636006j49061K693319J589479l669522
40145d25941p797914o369991j568980J363171J660196K974537O269988P307291
40137C412357K911903l456942n269876r89296L954221L732781j015681m613793
40129a334326m170245l092105m949392o722992k733813N688892J0392568P576293
40121F54880K736402J328952O13055l769294q288819o246665Q96375N145166L958344
40112b971604K433976L204228K635367p64161k363564K02272J929680r59388l591478
40103b44672l42084M616402K730506n241731r117064l166680O774608J1795068
$$ plain form
40095 7804353 17746659 22960156 23874646 21382917 16075259 8649837 351278 -6234060
40087 -6234060 -7523219 -2173416 5941869 10350488 8694623 5104624 4554213 6662205
40079 6662205 7508390 6460580 7457966 12428023 16786825 14526046 6164012 -1740715
40071 -1740715 -4461309 -2914172 661968 6513506 14397028 20131313 19199905 12823604
40063 12823604 7043029 5882100 8232815 11458933 14776156 17784486 18307359 14108705
40055 14108705 5986544 -2466372 -7960559 -9432180 -7341102 -2479535 3878541 9353425
40047 9353425 11352265 9476732 6601341 6338881 9173137 12060011 12056995 9095791 4793420
40038 4793420 241727 -3919609 -6802716 -8237892 -9328893 -10600523 -10897862 -9836204
$$ packed form
40095G804353R942306N213497R14490k491729n307658p425422q298559o585338
40087f234060j289159N349803Q115285M408619j655865l589999n50411K107992
40079F662205Q46185j047810R97386M970057M358802k260779q362034p904727
40071a740715k720594J547137L576140N851538P883522N734285r31408o376301
40063A2823604n780575j160929K350715L226118L317223L008330N22873m198654
40055A4108705q122161q452916n494187j471621K091078M861567O358076N474884
40047I353425J998840j875533k875391k62460K834256K886874l016k961204m302371
40038D793420m551693m161336k883107j435176j091001j271630k97339J061658
$$ plain form
40030 -9836204 -9756642 -12611134 -15912027 -14946601 -8982016 -2339733 1098920 1617057 1110782
40021 1110782 -194188 -2557559 -4350591 -3376631 62525 3284966 4373456 3907676
40013 3907676 3332094 2672463 922368 -1283216 -641079 5662202 15906807 24614902
40005 24614902 27668089 24893874 17541071 6590901 -4695415 -10414043 -8309353 -4229073
39997 -4229073 -5746011 -12534875 -17768097 -18234597 -17494726 -18596290 -19710869 -19145170 -19071857
39988 -19071857 -20574606 -19481815 -11983658 -1644504 4249585 4286799 4360406 9260013
39980 9260013 16387150 19113805 14408555 5766413 -943602 -3816831 -6418449 -12321694
39972 -12321694 -19238313 -21065817 -15813464 -8304056 -3605603 -859821 3672483 9574279
$$ packed form
40030i836204P9562k854492l300893R65426N964585O642283L438653N18137n06275
40021A110782j304970k363371j793032R73960L439156L222441J088490m65780
40013C907676n75582o59631j750095k205584O42137O303281J0244605Q708095
40005B4614902L053187k774215p352803j0950170j1286316n718628K104690M080280
39997d229073j516938o788864n233222m66500P39871j101564j114579N65699P3313
39988a9071857j502749J092791P498157J0339154N894089L7214P3607M899607
39980I260013P127137K726655m705250q642142o710015k873229k601618n903245
39972a2321694o916619j827504N252353P509408M698453K745782M532304N901796
$$ plain form
39964 9574279 11845476 7358322 -819459 -6397425 -6225584 -3148962 -2459462 -5677742
39956 -5677742 -9056020 -9055402 -7099633 -6138194 -4551563 1709750 11394559 17885979 17838080
39947 17838080 14427460 10464430 4606619 -2356990 -4067234 2818624 11372724 12281617
39939 12281617 5998679 831567 1195413 3983067 5016502 2817875 -3235684 -12306024
39931 -12306024 -19447656 -19021158 -11528566 -3005198 2081331 3141634 -54347 -7428832
39923 -7428832 -15169644 -18021850 -15874824 -13178539 -11546551 -8559741 -4682195 -5111988
39915 -5111988 -12356827 -21949860 -27982489 -28813636 -25763411 -20892404 -17936359 -20416070
39907 -20416070 -26206620 -28442205 -24334506 -18682946 -16235401 -15585177 -13867619 -12376870
$$ packed form
39964I574279K271197m487154q177781n577966J71841L076622O89500l218280
39956e677742l378278O18J955769R61439J586631O261313R684809O491420m7899
39947A7838080l410620l963030n857811o963609j710244O885858Q554100R08893
39939A2281617o282938n167112L63846K787654J033435k198627o053559r070340
39931a2306024p141632M26498P492592Q523368N086529J060303l195981p374485
39923g428832p740812k852206K147026K696285J631988K986810L877546m29793
39915e111988p244839r593033o032629q31147L050225M871007K956045k479711
39907b0416070n790550k235585M107699N651560K447545O50224J717558J490749
$$ plain form
39899 -12376870 -12967132 -12945415 -8666176 -1632787 3474417 4954072 4591355 3965459 3573800
39890 3573800 3625947 2688175 -2064246 -10045327 -15434098 -14124293 -10278897 -11458791 -18355001
39881 -18355001 -23623186 -20843870 -11398335 -2155810 1550747 423323 -434904 1993477
39873 1993477 4449906 2126485 -3277518 -5102052 -1989512 -352043 -3786079 -6555054
39865 -6555054 -2684001 4079827 6005364 2894991 552056 541535 -847896 -4656489
39857 -4656489 -7551925 -8053803 -8175911 -8523193 -7306558 -4610951 -2625576 -1496842 278983
39848 278983 1679808 533681 -1313487 125677 3871057 4609439 1049241 -2089837
39840 -2089837 -1321229 2036125 6479496 12427635 18025677 18959612 15120833 12100143
$$ packed form
39899a2376870n90262K1717M279239P033389N107204J479655l62717o25896l91659
39890C573800N2147r37772m752421p981081n388771J309805L845396j179894o896210
39881a8355001n268185K779316R445535R242525L706557j127424q58227K428381
39873A993477K456429k323421n404003j824534L112540J637469l434036k768975
39865f555054L871053O763828J925537l110373k342935j0521j389431l808593
39857d656489k895436n01878j22108l47282J216635K695607J985375J128734J775825
39848B78983J400825j146127j847168J439164L745380P38382l560198l139078
39840b089837P68608L357354M443371N948139N598042R33935l838779l020690
$$ plain form
39832 12100143 13135587 14441914 11594441 6017204 1825772 251434 563995 2978212
39824 2978212 7256016 11274933 13788514 15854624 17239705 14711175 6779285 -2557620
39816 -2557620 -7497500 -5884634 395606 7498742 10673735 6829852 -1851106 -9825115
39808 -9825115 -14872633 -19049522 -22150115 -19987419 -11956842 -4640545 -3642756 -6510350
39800 -6510350 -8319269 -9867398 -14778115 -21683191 -25060932 -22179172 -14698682 -5200403
39792 -5200403 3668491 8461927 7612078 3607694 -581857 -5081403 -10075061 -12453041
39784 -12453041 -9839261 -5322895 -3559535 -4269198 -3889688 -1350361 2216094 6915047
39776 6915047 12347957 14989965 12712988 9704779 11222294 15460318 16594262 14030015
$$ packed form
39832A2100143J035444J306327k847473n577237m191432j574338L12561K414217
39824B978212M277804M018917K513581K066110J385081k528530p931890r336905
39816b557620m939880J612866O280240P103136L174993l843883q680958p974009
39808i825115n047518m176889l100593K162696Q030577P316297R97789k867594
39800f510350j808919j548129m910717o905076l377741K881760P480490R498279
39792e200403Q868894M793436q49849m004384m189551m499546m993658k377980
39784a2453041K613780M516366J763360p09663L79510K539327L566455M698953
39776F915047N432910K642008k276977l008209J517515M238024J133944k564247
$$ plain form
39768 14030015 12115853 12075798 11209061 9401053 9276232 9895137 7409552 2451450 -246721
39759 -246721 -373985 -2636649 -7246924 -7784084 -1839947 3455582 1240313 -5430148 -8853770
39750 -8853770 -7405186 -5861119 -7538130 -10397426 -9882138 -3320191 7208152 15562255
39742 15562255 17374127 15354658 15472592 18037061 17319780 10469360 1227130 -6363888
39734 -6363888 -11751826 -13523788 -8379946 1802425 8463614 6883123 2626345 2289820
39726 2289820 3384867 -138900 -6993055 -10614425 -9078013 -5712459 -2061409 2336073
39718 2336073 4402161 -368606 -9438774 -13642949 -8320529 791737 5058494 2770742
39710 2770742 -699064 -193055 3790174 6328782 4182534 237807 91159 4086564
$$ packed form
39768A4030015j914162m0055q66737j808008j24821O18905k485585m958102k698171
39759b46721j27264k262664m610275n37160N944137N295529k215269o670461l423622
39750h853770J448584J544067j677011k859296N15288O561947J0528343Q354103
39742A5562255J811872k019469J17934K564469p17281o850420r242230p591018
39734f363888n387938j771962N143842J0182371O661189j580491m256778l36525
39726B289820J095047l523767o854155l621370J536412L365554L651050M397482
39718B336073K066088m770767r070168m204175N322420R112266M266757k287752
39710B770742l469806N06009L983229K538608k146248l944727j46648L995405
$$ plain form
39702 4086564 6450195 4151941 2082960 5526451 11570667 13384100 9937707 5382974
39694 5382974 1115977 -4602317 -10273953 -11775924 -9726261 -9446389 -12430714 -14246985
39686 -14246985 -12647607 -11578568 -14535220 -19362515 -22491031 -23338691 -21539837 -14972377
39678 -14972377 -4700592 2316504 396769 -7327301 -12614518 -11603180 -7161462 -3509093
39670 -3509093 -2186147 -2629822 -3631356 -4044887 -3632524 -2933856 -1701765 1152196 5375680
39661 5375680 9132204 11868366 15002500 18418722 19044684 15118003 9565902 6603976
39653 6603976 6667157 7039247 5932616 3596577 810236 -1197773 -229755 5145250 13492836
39644 13492836 21236137 24792735 21821380 12748256 2355513 -2739745 -409166 4996492
$$ packed form
39702D086564K363631k298254k068981L443491O044216J813433l446393m554733
39694E382974m266997n718294n671636j501971K049663K79872k984325j816271
39686a4246985J599378J069039k956652m827295l128516q47660J798854O567460
39678a4972377J0271785P017096j919735p724070n287217J011338M441718L652369
39670c509093J322946m43675j001534m13531M12363O98668J232091K853961M223484
39661E375680L756524K736162L134134L416222O25962l926681n552101k961926
39653F603976O3181L72090j106631k336039k786341k008009R68018N375005Q347586
39644A3492836P743301L556598k971355r073124j0392743n095258K330579N405658
$$ plain form
39636 4996492 8605154 10391560 12421939 13898575 12677001 9606746 7236158 5367145
39628 5367145 1911048 -2371003 -3818039 -777380 4305350 7685127 7003453 2246846
39620 2246846 -3178697 -3820514 1638726 6860912 5036411 -1299283 -3022206 3116392
39612 3116392 11053908 15677820 19539024 25740687 30546266 29115349 24434346 23487399
39604 23487399 26189755 24966641 15904466 4682700 -591692 1393443 5258118 5669864
39596 5669864 2051553 -1820157 -1591999 3161553 7773887 7369879 3065349 1056111
39588 1056111 4902326 11246475 14556392 13731543 11938272 11824616 13602890 16826906
39580 16826906 21091986 24756449 25249476 21588616 15680551 10951835 10281087 14340800
$$ packed form
39636D996492L608662J786406K030379J476636j221574l070255k370588j869013
39628E367145l456097m282051j447036L040659N082730L379777o81674m756607
39620B246846n425543o41817N459240N222186j824501o335694j722923O138598
39612C116392P937516M623912L861204O201663M805579j430917m681003r46947
39604B3487399K702356j223114r062175j1221766n274392J985135L864675M11746
39596E669864l618311l871710K28158M753552M612334m04008m304530k009238
39588A056111L846215O344149L309917q24849j793271j13656J778274L224016
39580A6826906M265080L664463M93027l660860n908065m728716o70748M059713
$$ plain form
39572 14340800 20179490 21957353 15638818 3703625 -6639427 -10712951 -10277072 -9794049
39564 -9794049 -11244221 -13974753 -16960874 -18359132 -14669115 -4309831 8102825 14967786
39556 14967786 14495346 12986943 16009518 20065687 16920985 5342891 -5776818 -7404082
39548 -7404082 -243427 7935234 12621713 16302797 22059767 27647709 28387595 23613070
39540 23613070 17282557 13231420 12617833 15389485 20787801 25715971 25823695 20176917
39532 20176917 13173269 10476949 14348407 23232189 33210162 38849357 36163431 27373922
39524 27373922 19983799 18231051 18121476 14137259 7665832 4159556 4850454 7434176
39516 7434176 12980964 24381848 37825311 44171752 41258432 37135209 37291254 36385002
$$ packed form
39572A4340800N838690J777863o318535j1935193j0343052m073524M35879M83023
39564i794049j450172k730532k986121j398258L690017J0359284J2412656O864961
39556A4967786m72440j508403L022575M056169l144702j1578094j1119709j627264
39548g404082P160655Q178661M686479L681084N756970N587942P39886m774525
39540B3613070o330513m051137o13587K771652N398316M928170J07724n646778
39532B0176917p003648k696320L871458Q883782R977973N639195k685926q789509
39524B7373922p390123j752748j09575l984217o471427l506276O90898K583722
39516G434176N546788J1400884J3443463O346441k913320m123223J56045r06252
$$ plain form
39508 36385002 28669939 19724444 18992100 24523468 24825434 15337942 4434794 1575587
39500 1575587 6766770 14435726 21541280 27719230 31560777 31466153 28811475 27165898
39492 27165898 28575704 31705806 33078808 30314548 25539510 24546630 29725512 34936793
39484 34936793 32067465 22846238 18419153 25032765 35792938 40562400 38938986 37687959
39476 37687959 39243345 40478008 41603794 47767605 59523324 68787183 69026310 64981191
39468 64981191 66743885 76600354 87635592 94984285 102362662 114979994 130546217 141912912
39460 141912912 147010760 151595070 161471864 175389956 187332036 193642049 195996662 198873751
39452 198873751 206024092 218173444 231890857 241328783 243255541 240071974 236052786 231624863
$$ packed form
39508C6385002p715063q945495p32344N531368L01966r487492j0903148k859207
39500A575587N191183P668956P105554O177950L841547r4624k654678j645577
39492B7165898J409806L130102J373002k764260m775038r92880N178882N211281
39484C4936793k869328r221227m427085O613612J0760173M769462j623414j251027
39476C7687959J555386J234663J125786O163811J1755719R263859K39127m045119
39468F4981191J762694R856469J1035238P348693P378377J2617332J5566223J1366695
39460A41912912N097848M584310R876794J3918092J1942080O310013K354613K877089
39452A98873751P150341J2149352J3717413R437926J926758l183567m019188m427923
$$ plain form
39444 231624863 224297341 214561033 206456898 201067176 193900050 181917912 169757101 164426819
39436 164426819 165566477 165959082 161481591 155360757 151176098 146849285 139356933 131698062
39428 131698062 129602321 132344497 132549442 126439358 119299416 117716132 120405569 121414841
39420 121414841 119827000 120070226 122744611 121875031 114099582 105102768 102221951 104454979
39412 104454979 105452314 103975660 104540325 107838049 107635645 99890778 89636386 84916894
39404 84916894 87207564 91430563 92888239 90570434 85580336 80186600 77627538 79579350
39396 79579350 84030439 87876911 90732979 93876015 96814070 98029680 98098204 98347481
39388 98347481 96746944 89283850 76412832 64577191 59520680 60515501 62683666 62744131
$$ packed form
39444B31624863p327522r736308q104135n389722p167126j1982138j2160811n330282
39436A64426819J139658L92605m477491o120834m184659m326813p492352p658871
39428A31698062k095741K742176K04945o110084p139942j583284K689437J009272
39420A21414841j587841K43226K674385q69580p775449q996814k880817K233028
39412A04454979R97335j476654N64665L297724k02404p744867j0254392m719492
39404H4916894K290670M222999J457676k317805m990098n393736k559062J951812
39396G9579350M451089L846472K856068L143036K938055J215610O8524K49277
39388I8347481j600537p463094j2871018j1835641n056511R94821K168165O0465
$$ plain form
39380 62744131 60847626 58768730 58226683 59796780 62157145 63513306 64415766 67298125
39372 67298125 72302809 75915411 75383703 72296534 69784277 68401926 67361493 67641686
39364 67641686 70256944 72791132 71851558 68779833 68729859 73231689 77534858 77013171 72902910
39355 72902910 69490305 68462330 68836682 70301632 73270738 76575981 78066754 77250780
39347 77250780 75179958 72314454 68808740 66239509 66150564 66879897 64768233 59128553
39339 59128553 53305446 49874847 47504225 44072257 40397557 38702542 39210528 40619116
39331 40619116 42594032 45255900 47007968 45559213 41160001 36722541 34492245 34292594
39323 34292594 35082804 36207686 36530708 34318626 29445414 24751923 23765135 27024707
$$ packed form
39380F2744131j896505k078896n42047J570097K360365J356161R02460K882359
39372F7298125N004684L612602n31708l087169k512257j382351j040433K80193
39364F7641686K615258K534188r39574l071725m9974M501830M303169n21687m110261
39355G2902910l412605j027975L74352J464950K969106L305243J490773q15974
39347G7250780k070822k865504l505714k569231q8945P29333k111664n639680
39339E9128553n823107l430599k370622l431968l674700j695015N07986J408588
39331D0619116J974916K661868J752068j448755m399212m437460k230296j99651
39323C4292594P90210J124882L23022k212082m873212m693491r86788L259572
$$ plain form
39315 27024707 31276319 32397320 28993117 23204586 18142631 14879394 12461998 10518776
39307 10518776 10315480 12449846 14866892 14773143 12040184 9336238 9045296 10971631 12618508
39298 12618508 10855281 4248527 -4789050 -10899072 -10555830 -5649575 -1046760 529786
39290 529786 -399688 -2561994 -4576351 -3910531 1113962 7771289 10671952 8070558 3532623
39281 3532623 259966 -3029023 -8691278 -15479671 -19772259 -19585143 -15241803 -7905827
39273 -7905827 267137 6067169 7641983 5976644 2598854 -2061030 -5998043 -4258418
39265 -4258418 5606626 18013949 23885368 21104334 16590076 16988169 21044366 23321322
39257 23321322 22335598 21495307 23235514 25955897 27438822 28262357 29558576 29092909 23045953
$$ packed form
39315B7024707M251612J121001l404203n788531n061955l263237k417396j943222
39307A0518776k03296K134366K417046r3749k732959k703946k90942J926335J646877
39298A2618508j763227o606754r037577o110022L43242M906255M602815J576546
39290E29786r29474k162306k014357O65820N024493O657327K900663k601394m537935
39281C532623l272657l288989n662255o788393m292588J87116M343340P335976
39273g905827Q172964N800032J574814j665339l377790m659884l937013J739625
39265d258418R865044J2407323N871419k781034m514258L98093M056197K276956
39257B3321322r85724q40291J740207K720383J482925Q23535J296219m65667o046956
$$ plain form
39248 23045953 12222374 3231506 1102536 2817793 1412613 -4561847 -9355472 -7724929
39240 -7724929 -611177 7457010 12759907 12858609 6654069 -3430479 -12045656 -15819843
39232 -15819843 -15222229 -10573571 -758963 11458076 17990977 14232052 5662650 526310
39224 526310 -624649 -2040470 -2892158 1411403 9060630 11779069 6424020 -954604
39216 -954604 -5128353 -8630620 -14921108 -20906909 -21492909 -17288051 -12633022 -9040741
39208 -9040741 -5534884 -3238180 -4517919 -8285202 -10236868 -7759252 -1714926 6219896
39200 6219896 14945439 22303603 24612829 19527730 9262687 296492 -1498572 3214864
39192 3214864 7181791 4656906 -1316815 -2846305 2393840 9164869 13124663 15492444
$$ packed form
39248B3045953j0823579q990868k128970J715257j405180n974460m793625J630543
39240g724929P113752Q068187N302897R8702o204540j0084548q615177l774187
39232a5819843N97614M648658R814608J2217039O532901l758925q569402n136340
39224E26310j150959j415821q51688M303561P649227K718439n355049p378624
39216i54604m173749l502267o290488n985801n86000M204858M655029L592281
39208i040741L505857K296704j279739l767283j951666K477616O044326P934822
39200F219896Q725543P358164K309226n085099j0265043q966195j795064M713436
39192C214864L966927k524885n973721j529490N240145O771029L959794K367781
$$ plain form
39184 15492444 17409131 15919361 9881351 4803996 6047743 10519667 11079444 6964885
39176 6964885 3637035 3441194 2956082 78618 -2363014 -2100422 -1669334 -4133030 -7722765
39167 -7722765 -8022723 -4135374 26467 699248 -975412 -202408 5288588 11580345 13120475
39158 13120475 10412089 9564937 13110775 15613247 11488646 3216175 -2809897 -5328431
39150 -5328431 -7218657 -7678033 -2691451 6508527 12487563 11227221 6988184 4874359
39142 4874359 3621820 -611848 -7252777 -12273575 -13821108 -13360768 -12669069 -12338172 -12014582
39133 -12014582 -10227679 -5586655 274560 3179021 1778774 -58686 1200598 3292280
39125 3292280 1627707 -3680648 -8356044 -10615490 -12842137 -16119525 -17279512 -13428252
$$ packed form
39184A5492444J916687j489770o038010n077355J243747M471924N59777m114559
39176F964885l327850j95841m85112k877464k441632K62592M31088k463696l589735
39167g722765k99958L887349M161841O72781j674660P73004N490996O291757J540130
39158A3120475k708386q47152L545838K502472m124601q272471o026072k518534
39150e328431j890226m59376M986582R199978N979036j260342m239037k113825
39142D874359j252539m233668o640929n020798j547533M60340O91699L30897L23590
39133a2014582J786903M641024N861215K904461j400247j837460J259284K091682
39125C292280j664573n308355m675396k259446k226647l277388j159987L851260
$$ plain form
39117 -13428252 -6616907 -1600876 -669508 -2988508 -7649927 -14292957 -20827225 -23794583
39109 -23794583 -22487768 -20360298 -20225568 -20028235 -16465054 -11439013 -10503134 -14524752
39101 -14524752 -17591888 -15236244 -10420666 -8067037 -7474989 -4811553 -413382 1808161
39093 1808161 849067 -959396 -3425127 -8709844 -15478999 -18197768 -13963697 -5962565
39085 -5962565 1181752 5737534 7812114 8204796 9087503 11350929 10848486 2908392 -8580213
39076 -8580213 -13602003 -9828321 -6279213 -9130596 -12007615 -7078394 1412734 3729145
39068 3729145 -238046 -2477344 -692894 -259351 -3000613 -4102493 -1549140 378958
39060 378958 -606744 -1151359 223640 -131053 -2786317 -1387235 7323252 15729251 14277985
$$ packed form
39117a3428252O811345N016031R31368k319000m661419o643030o534268k967358
39109b3794583J306815K127470J34730J97333L563181N026041R35879m021618
39101a4524752l067136K355644M815578K353629N92048K663436M398171K221543
39093A808161r59094j808463k465731n284717o769155k718769M234071Q001132
39085e962565P144317M555782K074580L92682Q82707K263426n02443p940094j1488605
39076h580213n021790L773682L549108k851383k877019M929221Q491128K316411
39068C729145l967191k239298J784450M33543k741262j101880K553353J928098
39060C78958r85702n44615J374999l54693k655264J399082Q710487Q405999j451266
$$ plain form
39051 14277985 4165130 -5331860 -9340290 -10851270 -13327802 -16065333 -17013130 -15481581
39043 -15481581 -11575864 -6505322 -3529897 -5248375 -9748133 -12312212 -10910933 -7378897
39035 -7378897 -3817461 -1276309 -1659518 -6626110 -13493247 -16117433 -11908279 -4926548
39027 -4926548 256194 4823998 12476987 21855372 26515536 22760371 14113770 6761541
39019 6761541 3141609 1870633 1795366 2918334 3700216 791529 -6795909 -14864180 -17397797
39010 -17397797 -12497086 -3712055 4256132 9775852 13932220 17218515 17871678 13952780
39002 13952780 6783000 1254768 1519603 6515081 11127363 11831588 9399822 5897638
38994 5897638 1964290 -1525851 -2576128 -1926480 -4549129 -12400113 -17939324 -11659070
$$ packed form
39051A4277985j0112855r496990m008430j510980k476532k737531r47797J531549
39043a5481581L905717N070542K975425j718478m499758k564079J401279L532036
39035g378897L561436K541152l83209m966592o867137k624186M209154O981731
39027d926548N182742M567804P652989R378385M660164l755165q646601p352229
39019F761541l619932j270976p5267J122968P81882k908687p587438q068271k533617
39010a7397797M900711Q785031P968187N519720M156368L286295O53163l918898
39002A3952780p169780n528232K64835M995478M612282P04225k431766l502184
38994E897638l933348l490141j050277O49648k622649p850984n539211O280254
$$ plain form
38986 -11659070 3676545 13354730 7971359 -5495456 -13536609 -11577974 -4545643 3059394
38978 3059394 10151215 14290614 11991568 4894367 -432196 -774330 275600 -1227951
38970 -1227951 -4354329 -6738093 -8602763 -9935540 -7550229 481596 9827521 14076120
38962 14076120 12937384 11824568 13360457 13744846 8937015 932051 -4477416 -4280805
38954 -4280805 -603069 2303432 1845785 -1120061 -2886404 -275031 5065299 6716083
38946 6716083 -77934 -12161640 -20466099 -18637922 -8645427 1883241 6236989 2766311
38938 2766311 -4955378 -10888295 -11183716 -7491857 -4598000 -4291158 -3716611 -823452 1689199
38929 1689199 616431 -2339195 -3611412 -4407076 -8804605 -15309900 -16383851 -8599684
$$ packed form
38986a1659070J5335615R678185n383371j3466815q041153J958635P032331P605037
38978C059394P091821M139399k299046p097201n326563l42134J049930j503551
38970a227951l126378k383764j864670j332777K385311Q031825R345925M248599
38962A4076120j138736j112816J535889L84389m807831q004964n409467J96611
38954d280805L677736K906501m57647k965846j766343K611373N340330J650784
38946F716083o794017j2083706q304459J828177R992495J0528668M353748l470678
38938B766311p721689n932917k95421L691859K893857L06842N74547K893159K512651
38929A689199j072768k955626j272217p95664m397529o505295j073951P784167
$$ plain form
38921 -8599684 1863093 7238024 7372475 6681723 5686742 1494821 -4941461 -8300818
38913 -8300818 -6328245 -2892943 -2101134 -3255840 -3607149 -2919987 -2816034 -3576356 -3955361
38904 -3955361 -3206350 -1651626 187563 2013923 3680680 4952889 4844951 1929792
38896 1929792 -3025593 -5464703 -1040983 8258741 14926602 14198820 8937641 4720775
38888 4720775 2965733 1626322 277165 517404 2109676 2839176 3018475 6546695 15191084
38879 15191084 24067161 26029309 20271431 13626822 12170599 13962121 12749287 7480062
38871 7480062 3964112 6109822 9773754 8736228 3855963 1413172 3529026 5730907
38863 5730907 4749060 3436750 5575749 10145275 14055252 17231506 21087334 24049101
$$ packed form
38921h599684J0462777N374931J34451o90752r94981m191921o436282l359357
38913h300818J972573L435302P91809j154706l51309O87162J03953p60322l79005
38904c955361P49011J554724J839189J826360J666757J272209j07938k915159
38896A929792m955385k439110M423720R299724O667861p27782n261179m216866
38888D720775j755042j339411j349157K40239J592272P29500J79299L528220Q644389
38879A5191084Q876077J962148n757878o644609j456223J791522j212834n269225
38871G480062l515950K145710L663932j037526m880265k442791K115854K201881
38863E730907r81847j312310K138999M569526L909977L176254L855828K961767
$$ plain form
38855 24049101 22531010 15662151 6425226 -1049456 -3579851 -452380 4541435 4840771
38847 4840771 -1659289 -8827899 -9293058 -3406860 2953473 7620389 13270146 19563107
38839 19563107 20830035 14200864 5150093 1421463 4452394 9787943 13338089 13885002
38831 13885002 11159273 5181387 -2239985 -7579242 -8101287 -4049201 1557778 5447056
38823 5447056 7013752 8386394 10941184 12933337 12027034 8577268 4107382 -1447151
38815 -1447151 -7269314 -8344930 -246844 12923983 21421764 21839264 20147144 20816451
38807 20816451 19770464 12363204 2326835 -3103103 -2731259 -171022 3275017 7982732
38799 7982732 11003655 8939575 4788844 5130435 10446320 14357373 12932257 8854930
$$ packed form
38855B4049101j518091o868859r236925p474682k530395L127471M993815K99336
38847D840771o500060p168610m65159N886198O360333M666916N649757O292961
38839A9563107J266928o629171r050771l728630L030931N335549L550146N46913
38831A3885002k725729n977886p421372n339257n22045M052086N606979L889278
38823E447056J566696J372642K554790J992153r06303l449766m469886n554533
38815a447151n822163j075616Q098086J3170827Q497781M17500j692120O69307
38807B0816451j045987p407260j0036369n429938L71844K560237L446039M707715
38799G982732L020923k064080m150731L41591N315885L911053j425116m077327
$$ plain form
38791 8854930 5325151 1627645 -3117641 -6686515 -7014822 -5339934 -3751442 -2092090
38783 -2092090 1109801 6593912 13803392 20283805 22186279 18430867 13558033 12491770
38775 12491770 13352350 10517965 4275469 1063312 3383919 6350167 6277855 5659223 6267365
38766 6267365 4349137 -2317862 -8654950 -9535939 -7769634 -8336698 -9059608 -4633676 2897839
38757 2897839 5828761 2158718 -1967535 -1469620 2284431 5955061 8336840 8835274
38749 8835274 6920196 4535017 4741007 6752614 6371043 2398111 -1518087 -2622842
38741 -2622842 -2364424 -2231984 -399916 4828572 11125397 14133626 11460025 3438499
38733 3438499 -7475087 -16581523 -19062321 -14639134 -8533034 -6029214 -7280262 -8429106
$$ packed form
38791H854930l529779l697506m745286l568874l28307J674888J588492J659352
38783b092090L201891N484111P209480O480413J902474l755412m872834j066263
38775A2491770Q60580k834385o242496l212157K320607K966248p2312o18632O08142
38766F267365j918228o666999o337088q80989J766305n67064p22910M425932P531515
38757B897839K930922l670043m126253M97915L754051L670630K381779M98434
38749H835274j915078k385179K05990K011607l81571l972932l916198j104755
38741b622842K58418J32440J832068N228488O296825L008229k673601q021526
38733C438499j0913586r106436k480798M423187O106100K503820j251048j148844
$$ plain form
38725 -8429106 -6201843 -392000 6480067 10800213 10436360 6574242 2260640 -643787
38717 -643787 -1935186 -1676649 -575156 -466036 -1414038 150559 6194692 11379374 8485318
38708 8485318 -518694 -5589788 -2235613 3122676 4285519 4083763 6775573 8740800
38700 8740800 4746810 -1142956 -6126 8501251 15729929 16745178 15228450 14562384
38692 14562384 12008959 5050795 -2776319 -6701346 -6980819 -6174448 -3581229 3100867
38684 3100867 12482330 19981906 23026714 22814239 21386698 19555183 17613807 15857535
38676 15857535 13970418 11384028 8676742 7614916 9272545 12387639 13754696 10517651
38668 10517651 2851584 -5322929 -9147907 -7235315 -3128231 -1875161 -5172984 -10010720
$$ packed form
38725h429106K227263N809843O872067M320146l63853l862118m313602k904427
38717f43787j291399K58537J101493J09120r48002J564597O044133N184682k894056
38708H485318r004012n071094L354175N358289J162843k01756K691810J965227
38700H740800l993990n889766J136830Q507377P228678J015249j516728o66066
38692A4562384k553425o958164p827114l925027k79473Q06371K593219O682096
38684C100867R381463P499576L044808k12475j427541j831515j941376j756272
38676A5857535j887117k586390k707286j061826J657629L115094J367057l237045
38668A0517651p666067q174513l824978J912592M107084J253070l297823m837736
$$ plain form
38660 -10010720 -11769280 -8318125 -1227301 6524831 13398545 19461491 24215022 25534141
38652 25534141 21494457 12789234 2936884 -3523725 -3339657 3266704 11850390 16610465
38644 16610465 15365986 10824442 6076019 622280 -7165912 -15220110 -18543378 -14802735
38636 -14802735 -6644981 1836148 8488439 12315934 12063673 7778300 2508280 -7782
38628 -7782 308890 -565831 -5689955 -12290318 -13726693 -7054694 2953582 9152814 10194106
38619 10194106 10579061 13238025 16093303 16746754 15972350 14156095 8771238 -637375
38611 -637375 -8705541 -10446228 -8225053 -6932547 -4908350 2982128 14237650 19093615
38603 19093615 13771205 6029287 4310795 7426597 8743845 5368016 -876918 -6947377
$$ packed form
38660a0010720j758560L451155P090824P752132O873714O062946M753531J319119
38652B5534141m039684q705223r852350o460609J84068O606361Q583686M760075
38644A6610465j244479m541544m748423n453739p788192q054198l323268L740643
38636a4802735Q157754Q481129O652291L827495k52261m285373n270020k516062
38628g782L16672q74721n124124o600363j436375O671999J0008276O199232J041292
38619A0194106L84955K658964K855278O53451p74404j816255n384857r408613
38611f37375q068166j740687K221175J292506K024197P890478J1255522M855965
38603A9093615n322410p741918j718492L115802J317248l375829o244934o070459
$$ plain form
38595 -6947377 -8896362 -3247668 7110056 12378143 6524455 -4633249 -11072092 -10816374
38587 -10816374 -8656843 -6266855 -1753460 2391140 -13741 -8503001 -13957770 -10232046
38579 -10232046 -2043060 2251384 938590 -1855701 -3277554 -3547734 -3068432 -1956650
38571 -1956650 -1457002 -2761806 -5128501 -7246443 -9249404 -11348039 -12007549 -9972602
38563 -9972602 -6891173 -5257056 -4536261 -2064062 2506319 6293509 6986513 5334685
38555 5334685 3322240 1734819 289629 -1275818 -3055930 -4890546 -5927361 -5404344
38547 -5404344 -4395197 -5368611 -8844082 -11544800 -9532764 -2876607 4352988 8754921
38539 8754921 10521111 11086236 9816958 5027613 -2451019 -8848676 -10918059 -8615696
$$ packed form
38595f947377j948985N648694J0357724N268087n853688j1157704o438843K55718
38587a0816374K159531K389988M513395M144600k404881q489260n454769L725724
38579a0232046Q188986M294444j312794k794291j421853k70180M79302J111782
38571a956650M99648j304804k366695k117942k002961k098635o59510K034947
38563i972602L081429J634117P20795K472199M570381L787190O93004j651828
38555E334685k012445j587421j445190j565447j780112j834616j036815N23017
38547e404344J009147r73414l475471k700718K012036O656157P229595M401933
38539H754921J766190N65125j269278m789345p478632o397657k069383K302363
$$ plain form
38531 -8615696 -4554754 -2324836 -4844894 -11717197 -17798502 -17473680 -11801213 -8338161
38523 -8338161 -11472985 -15966546 -13830571 -5343931 1641812 2420872 13856 -1540092
38515 -1540092 -2849807 -5541765 -7557702 -6129164 -2755195 -1091286 -1238414 -32437
38507 -32437 3205127 4656919 817856 -6598964 -11807113 -10706194 -5315574 -2094005
38499 -2094005 -4710825 -8789127 -6461018 2940975 10209950 7326306 -1424787 -4028082
38491 -4028082 4159557 14530198 15599912 5624170 -7034979 -13335716 -10892813 -3703556
38483 -3703556 2504164 4512704 2846916 -291079 -3809817 -7826403 -11573568 -13104657
38475 -13104657 -11751609 -9431781 -8556554 -9626767 -11570998 -13273403 -13830820 -12319959
$$ packed form
38531h615696M060942K229918k520058o872303o081305L24822N672467L463052
38523h338161l134824m493561K135975Q486640O985743P79060k407016j553948
38515a540092j309715k691958k015937J428538L373969J663909j47128J205977
38507c2437L237564J451792l839063p416820n208149J100919N390620L221569
38499b094005k616820m078302K328109R401993P268975k883644q751093k603295
38491d028082Q187639J0370641J069714r975742j2659149o300737K442903P189257
38483c703556O207720K008540j665788l137995l518738m016586l747165j531089
38475a3104657J353048K319828Q75227j070213j944231j702405n57417J510861
$$ plain form
38467 -12319959 -8434646 -2946099 2774336 6807181 6495586 631674 -7103744 -9687005
38459 -9687005 -4501432 2282270 2644311 -2753053 -5109749 929030 10689761 16774642
38451 16774642 18908487 22066141 26988380 28318142 22863093 14575011 8583198 4184200
38443 4184200 -2097756 -8892035 -10676228 -5991287 -138592 1710836 49002 -2265811
38435 -2265811 -4670282 -6919567 -6138076 -824414 4335435 3311930 -2312820 -5161506
38427 -5161506 -3302238 -3160756 -8772857 -14495946 -13221504 -7061586 -3788543 -5640304
38419 -5640304 -8242804 -9163905 -10481013 -12331532 -10562138 -3260040 5317403 10057599
38411 10057599 10305217 7516092 1907435 -5116594 -8852473 -5977716 752668 6220873
$$ packed form
38467a2319959L885313N488547N720435M032845l11595n863912p735418k583261
38459i687005N185573O783702L62041n397364k356696O038779R760731O084881
38451A6774642K133845L157654M922239J329762n455049q288082n991813m398998
38443D184200o281956o794279j784193M684941N852695J849428j661834k314813
38435b265811k404471k249285P81491N313662N159849j023505n624750k848686
38427e161506J859268J41482n612101n723089J274442O159918L273043j851761
38419e640304k602500r21101j317108j850519J769394P302098Q577443M740196
38411A0057599K47618k789125n608657p024029l735879K874757O730384N468205
$$ plain form
38403 6220873 9409878 12392480 14847909 14210569 10359614 5605972 435871 -5978167
38395 -5978167 -10920387 -9173761 -582442 8255580 12395864 14242380 17489357 19705996
38387 19705996 16271820 9125059 5239547 6551466 7468619 4182548 1091694 4253158
38379 4253158 12209895 18231300 19877247 21032533 24339880 26861371 25359688 21496012
38371 21496012 18135544 13709898 5254891 -4337309 -7738376 -2730054 4462545 7374671
38363 7374671 6789596 7391271 10579530 14132434 16220880 15896573 11836105 4800603 -439000
38354 -439000 -191453 2479799 2065795 -554497 466049 5780456 8846851 5810960 937470
38345 937470 -923381 -1341481 -3349775 -4458257 -246147 8000717 14216567 14081533 6983570
$$ packed form
38403F220873L189005K982602K455429o37340l850955m753642n170101o414038
38395e978167m942220J746626Q591319Q838022M140284J846516L246977K216639
38387A9705996l434176p146761l885512J311919R17153l286071l090854L161464
38379D253158P956737O021405J645947J155286L307347K521491j501683l863676
38371B1496012l360468m425646q455007r592200l401067N008322P192599K912126
38363G374671n85075O01675L188259L552904K088446l24307m060468p035502n239603
38354d39000K47547K671252m14004k620292J020546N314407L066395l035891m873490
38345I37470j860851m18100k008294j108482M212110Q246864O215850j35034p097963
$$ plain form
38336 6983570 -5211612 -16797869 -19420398 -11032286 -1222966 -795528 -7810052 -11484578
38328 -11484578 -8610417 -6609894 -9142424 -9102011 -1025640 8091341 8060923 208565 -5298235
38319 -5298235 -3909990 -615668 -400829 -2254194 -3727472 -5199607 -7083015 -7353739
38311 -7353739 -4986332 -2846484 -3948542 -6508641 -5811631 -615213 4927950 6531090
38303 6531090 5203693 5659192 9628475 12828673 9933661 1329484 -7149708 -10795019
38295 -10795019 -10059149 -8096523 -7127807 -8103417 -11042096 -13856168 -13196434 -8598027 -3781134
38286 -3781134 -1712984 -664333 2055290 4770423 3800965 -190960 -2689212 -1992524
38278 -1992524 -939260 -1182717 -243794 3482158 6570580 5119320 1456030 2108666 8913315
$$ packed form
38336F983570j2195182j1586257k622529Q388112R809320M27438p014524l674526
38328a1484578K874161K000523k532530M0413Q076371R116981l0418p852358n506800
38319e298235J388245L294322K14839j853365j473278j472135j883408k70724
38311g353739K367407K139848j102058k560099O97010N196418N543163J603140
38303F531090j327397M55499L969283L200198k895012q604177q479192l645311
38295a0795019P35870J962626R68716r75610k938679k814072O59734M598407M816893
38286c781134K068150J048651K719623K715133r69458l991925k498252O96688
38278a992524J053264k43457R38923L725952L088422j451260l663290O52636O804649
$$ plain form
38269 8913315 15646336 15478536 9833651 6803720 10694994 16487340 17138954 13891034
38261 13891034 14551627 21718679 28419492 27989662 23026107 19800431 17961034 12442619
38253 12442619 3446714 -3039971 -4756810 -5895315 -8753414 -9708357 -6566422 -3426469
38245 -3426469 -3756932 -4170418 -581271 3982472 4169854 1684433 2725642 7555702 9815169
38236 9815169 6447938 1680322 -380109 -1227490 -3429089 -5407063 -4274645 -864917
38228 -864917 1360885 726009 -1718073 -4323001 -6047464 -6451784 -5598884 -3204526 1890329
38219 1890329 9310019 14471209 11865677 2177776 -7288207 -11085279 -11151202 -11636524 -12219199
38210 -12219199 -10652702 -8777524 -10198580 -12929017 -10366623 -957919 8001281 8991561
$$ packed form
38269H913315O733021j67800n644885l029931L891274N792346O51614l247920
38261A3891034O60593P167052O700813m29830m963555l225676j839397n518415
38253A2442619q995905o486685j716839j138505k858099r54943L141935L139953
38245c426469l30463m13486L589147M563743J87382k485421J041209M830060K259467
38236I815169l367231m767616k060431q47381k201599j977974J132418L409728
38228h64917K225802o34876k444082k604928j724463m04320Q52900K394358N094855
38219A890329P419690N161190k605532r687901r465983l797072o5923m85322n82675
38210a2219199J566497J875178j421056k730437K562394R408704Q959200R90280
$$ plain form
38202 8991561 3443679 -890524 226370 3733270 4795777 2879561 1199528 2175569
38194 2175569 5422977 9585457 13827807 16603522 14949110 7591902 -1580044 -5932431
38186 -5932431 -2977753 3206922 7583200 9911512 13058571 17715219 21688538 23345685
38178 23345685 22888502 20783811 17731340 15881499 17111016 19844180 20384461 17936378
38170 17936378 15536456 15035469 13833586 8357766 -869118 -9208994 -12147655 -8983928
38162 -8983928 -3386391 -464934 -1871564 -3777383 -1311552 5349715 11464412 13625456
38154 13625456 12041802 7444909 315302 -5865568 -5685792 1058883 7398623 7759885
38146 7759885 5030372 5383596 9368812 12682934 13314206 12990347 13063637 13657122 15680894
$$ packed form
38202H991561n547882m334203J116894L506900J062507j916216j680033R76041
38194B175569L247408M162480M242350K775715j654412p357208r171946m352387
38186e932431K954678O184675M376278K328312L147059M656648L973319J657147
38178B3345685m57183k104691l052471j849841J229517K733164N40281k448083
38170A7936378k399922n00987j201883n475820r226884q339876k938661L163727
38162h983928N597537K921457j406630j905819K465831O661267O114697K161044
38154A3625456j583654m596893p129607o180870J79776O744675O339740L61262
38146G759885k729513L53224L985216L314122O31272l23859P3290N93485K023772
$$ plain form
38137 15680894 18893467 18837650 10888558 -2520653 -13287184 -16486510 -13636000 -7534084
38129 -7534084 624622 8079502 10212848 6224895 1150083 -357859 785018 914947
38121 914947 -1525798 -5589287 -9103068 -9007515 -3974485 2023253 3007744 -352156 -155010
38112 -155010 7977651 18444307 23625463 23581589 23055465 22963400 20788851 16713395 13232471
38103 13232471 10128303 5474184 727725 -560536 1431346 3488935 5464070 10065267
38095 10065267 16163159 18098561 13472240 6900374 3854842 4683581 6841329 9297723
38087 9297723 12028543 14041594 14777094 15554663 17164713 17374272 13023556 4121509 -5298228
38078 -5298228 -10091093 -7842292 -1030532 4708532 5885229 4429212 4257172 5853069
$$ packed form
38137A5680894L212573n5817p949092j3409211j0766531l199326K850510O101916
38129g534084Q158706P454880K133346l987953n074812j507942J142877J29929
38121I14947k440745m063489l513781R5553N033030N997738R84491l359900J97146
38112a55010Q132661J0466656N181156m3874n26124r2065k174549m075456l480924
38103A3232471l104168m654119m746459j288261J991882K057589J975135M601197
38095A0065267O097892J935402m626321o571866l045532Q28739K157748K456394
38087I297723K730820K013051P35500P77569J610050K09559m350716q902047r419737
38078e298228m792865K248801O811760N739064J176697j456017j72040J595897
$$ plain form
38070 5853069 6987667 7632658 9998538 13513722 14049723 9456061 2368842 -3727216
38062 -3727216 -7766410 -9243358 -7094775 -2559377 314880 -708579 -3959019 -7976555
38054 -7976555 -13563679 -19258432 -19591149 -12251522 -3299906 -161987 -2096618 -2820309
38046 -2820309 -321250 1951576 2549857 4207481 7904909 10441729 9735858 8095765
38038 8095765 8189642 9345317 9773702 9319313 8165434 5784450 3175329 3424660 7806688
38029 7806688 13548736 17538870 20019495 22279112 22904784 19569053 13534273 9280357
38021 9280357 9599536 13238203 17459960 20905161 23359237 24263540 22667642 18602140
38013 18602140 14173715 12710442 15697695 20307377 21377223 16800914 9828811 5032694
$$ packed form
38070E853069J134598O44991K365880L515184N36001m593662p087219o096058
38062c727216m039194j476948K148583M535398K874257j023459l250440m017536
38054g976555n587124n694753l32717P339627Q951616L137919j934631p23691
38046b820309K499059K272826N98281J657624L697428K536820p05871j640093
38038H095765R3877J155675M28385m54389j153879k380984k609121K49331M382028
38029G806688N742048L990134K480625K259617O25672l335731o034780m253916
38021I280357L19179L638667M221757L445201K454076R04303j595898m065502
38013A8602140m428425j463273K987253M609682J069846m576309o972103m796117
$$ plain form
38005 5032694 3426407 3154837 3478249 5361517 8558308 10977831 11563531 11585151 12250965
37996 12250965 12912786 12488564 10941918 8642380 6240369 5876066 9717847 15645273
37988 15645273 17418549 11998192 4023111 -727358 -3759067 -10374943 -19244936 -22555659
37980 -22555659 -17766134 -12125614 -11880475 -13103482 -8680824 242083 6466608 7520692
37972 7520692 7056843 6682808 3873331 -1132811 -3240200 39999 4217949 4009737 94879
37963 94879 -3024654 -2613506 1446310 8394744 16397351 22747085 26392605 28443705 29179184
37954 29179184 27515644 24648133 24411506 27829295 30813059 29590195 24828777 18272263
37946 18272263 10148098 3365994 4781032 16345024 28909443 31618891 25061687 18358894
$$ packed form
38005E032694j606287k71570L23412J883268L196791K419523N85700K1620O65814
37996A2250965O61821m24222j546646k299538k402011l64303L841781N927426
37988A5645273J773276n420357p975081m750469l031709o615876q869993l310723
37980b2555659M789525N640520K45139j223007M422658Q922907O224525J054084
37972G520692m63849l74035k809477n006142k107389L280199M177950k08212l914858
37963I4879l119533M11148M059816O948434Q002607O349734L645520K051100P35479
37954B9179184j663540k867511k36627L417789K983764j222864m761418o556514
37946A8272263q124165o782104J415038J1563992J2564419K709448o557204o702793
$$ plain form
37938 18358894 15215374 10788025 2226761 -5902122 -9028321 -8847566 -8932387 -8996791 -6871475
37929 -6871475 -2561704 2589892 8006311 12961706 16145362 17749380 19287071 20142149
37921 20142149 17627523 12062915 8298928 9972261 15147304 19632293 21620264 21063156
37913 21063156 17916566 13944426 13361269 18178509 24639395 27168994 24451586 19319981
37905 19319981 14504270 11169110 10031214 10878501 11636213 10278354 7453194 5970951
37897 5970951 8344920 15179896 24034591 29320707 26362259 17215151 9633910 8487508
37889 8487508 11323480 14212286 17469763 21981770 24411675 21798905 17975958 18976525
37881 18976525 23589011 25010953 21261309 17011438 14563959 10521115 3992464 975777
$$ packed form
37938A8358894l143520m427349q561264q128883l126199J80755q4821o4404K125316
37929f871475M309771N151596N416419M955395L183656J604018J537691Q55078
37921B0142149k514626n564608l763987J673333N175043M484989J987971n57108
37913B1063156l146590l972140n83157M817240O460886K529599k717408n131605
37905A9319981m815711l335160j137896Q47287P57712j357859k825160j482243
37897E970951K373969O834976Q854695N286116k958448r147108p581241j146402
37889H487508K835972K888806L257477M512007K429905k612770l822947J000567
37881A8976525M612486J421942l749644m249871k447479m042844o528651l016687
$$ plain form
37873 975777 5591949 12129640 12014118 5931893 2821170 7523969 14969891 17492032
37865 17492032 13522736 7239102 2907695 2077729 4303882 7819027 10112867 10118820 9823763
37856 9823763 11838709 15234060 16005492 12695926 9365203 10770870 15980626 19618722
37848 19618722 18993811 16875029 16794749 18769549 20959007 22707023 24073315 24764876 25577796
37839 25577796 28620401 33817060 37408810 36523285 33089007 30395394 28215748 24984638
37831 24984638 22386003 22932320 24611175 23544726 21207642 22564735 26458087 25019803
37823 25019803 15601349 6854476 7931634 16092087 20698856 16817794 9239118 4498680
37815 4498680 4600564 8687182 15616116 22971271 27041228 26348130 23901284 24479214 30051313
$$ packed form
37873I75777M616172O537691j15522o082225l110723M702799P445922K522141
37865A7492032l969296o283634m331407q29966K226153L515145K293840N953k95057
37856I823763K014946L395351P71432l309566l330723J405667N209756L638096
37848A9618722o24911k118782q0280J974800K189458J748016J366292O91561Q12920
37839B5577796L042605N196659L591750q85525l434278k693613k179646l231110
37831B4984638k598635N46317J678855j066449k337084J357093L893352j438284
37823B5019803r418454q746873J077158Q160453M606769l881062p578676m740438
37815D498680J01884M086618O928934P355155M069957o93098k446846N77930N572099
$$ plain form
37806 30051313 38000662 43301245 43068536 39854702 39182305 42265350 43031605 35463990
37798 35463990 22676081 14308070 14523020 17330179 16004954 12714778 14468437 22209877
37790 22209877 29596903 32626630 35102786 42045640 51401781 56235068 53731925 48207793
37782 48207793 45001477 44662421 44439397 42828271 40353065 37468496 34406178 32442614
37774 32442614 32455476 32104393 27694899 20427189 17915451 26228254 41492920 52849705
37766 52849705 54062983 49191296 45850236 46273993 47651934 48469821 49922411 51663029
37758 51663029 51241786 49433878 51633694 60442666 70096602 72933631 69605973 67525690
37750 67525690 69671790 71102566 68111589 64597321 65391847 68327830 68674105 68272094
$$ packed form
37806C0051313P949349N300583k32709l213834o72397L083045P66255p567615
37798C5463990j2787909q368011K14950K807159j325225l290176J753659P741440
37790B2209877P387026L029727K476156O942854R356141M833287k503143n524132
37782D8207793l206316l39056k23024j611126k475206k884569l062318j963564
37774C2442614J2862l51083m409494p267710k511738Q312803J5264666J1356785
37766E2849705J213278m871687l341060M23757J377941Q17887J452590J740618
37758E1663029m21243j807908K199816Q808972R653936K837029l327658k080283
37750F7525690K146100J430776k990977l514268P94526K935983L46275m02011
$$ plain form
37742 68272094 73542409 85288653 96985883 104186423 110084711 119707239 133076161 146600747
37734 146600747 157522418 164342806 166125929 164366240 163016797 163964337 165001662 164996052
37726 164996052 167945266 177743625 191135521 200917162 205454352 210019807 218176686 226749808
37718 226749808 231512179 234074272 239807214 250776469 263846107 275270738 284537672
37711 284537672 293000604 300464864 304916043 305789380 305932933 308452174 311881783 311094729
37703 311094729 304118157 295250758 288864190 282727297 271894804 258040324 249286240 249475377
37695 249475377 252645759 250979638 244178080 237251397 232337974 227595054 222487635 218928670
37687 218928670 216974644 213689862 207379332 199875974 193794684 190224750 189592668 191639476
$$ packed form
37742F8272094N270315J1746244J1697230P200540N898288R622528J3368922J3524586
37734A46600747J0921671O820388J783123j759689j349443R47540J037325n610
37726A64996052K949214R798359J3391896R781641M537190M565455Q156879Q573122
37718B26749808M762371K562093N732942J0969255J3069638J1424631R266934
37711B84537672Q462932P464260M451179Q73337J43553K519241L429609p87054
37703C11094729o976572q867399o386568o136893j0832493j3854480q754084J89137
37695B49475377L170382j666121o801558o926683m913423m742920n107419l558965
37687B18928670j954026l284782o310530p503358o081290l569934o32082K046808
$$ plain form
37679 191639476 193631322 191808427 186053414 180364220 177565947 176751624 177118490 180033927
37671 180033927 184861784 187356872 186090289 186040376 190488582 193440619 187383529 175880310
37663 175880310 169554038 170077868 168000108 158597209 149864151 149535876 152951908 151531473
37655 151531473 146612779 145495484 147925867 146775062 140828564 136995219 138709287 140904407
37647 140904407 139292753 137280998 139707960 145286870 149454310 150551946 149226575 145004666
37639 145004666 137423586 128598181 121752115 118659287 119953196 125306652 131589460 133913402
37631 133913402 130800369 125677491 121349923 116247785 108614415 101006364 97245742 97356947
37623 97356947 98506810 98525280 95786914 88759079 79276738 73338019 74377550 78030317
$$ packed form
37679A91639476J991846j822895n755013n689194k798273q14323L66866K915437
37671A80033927M827857K495088j266583m9913M448206K952037o057090j1503219
37663A75880310o326272N23830k077760r402899q733058l28275L416032j420435
37655A51531473m918694j117295K430383j150805n946498l833345J714068K195120
37647A40904407j611654k011755K426962N578910M167440J097636j325371m221909
37639A45004666p581080q825405o846066l092828J293909N353456O282808K323942
37631A33913402l113033n122878m327568n102138p633370p608051l760622J11205
37623I7356947J149863J8470k738366p027835r482341n938719J039531L652767
$$ plain form
37615 78030317 77844714 73940852 71220708 70970172 69824104 66163997 61930223 58096181
37607 58096181 53628016 49401643 47991211 48495680 46463934 40652773 35514447 34909836
37599 34909836 37101197 38150629 36925231 34348571 30541762 25363524 20034607 16298804
37591 16298804 15217951 17468966 22666964 27680361 28414265 24774273 21608366 23286042
37583 23286042 29196492 35445225 38754419 37976422 34500221 32233136 34386219 39005977
37575 39005977 40360900 35803226 28259153 21070685 14426433 8668278 6526129 8654724
37567 8654724 10623958 8358154 3916988 2132843 3959259 6864154 9220626 10095762
37559 10095762 7254909 562224 -4385328 -1792464 5710693 9638905 7142557 4345571
$$ packed form
37615G8030317j85603l903862k720144k50536j146068l660107m233774l834042
37607E8096181m468165m226373j410432N04469k031746n811161n138326o04611
37599C4909836K191361J049432j225398k576660l806809n178238n328917l735803
37591A6298804j080853K251015N197998N013397P33904l639992l165907J677676
37583B3286042N910450O248733L309194p77997l476201k267085K153083M619758
37575C9005977J354923m557674p544073p188468o644252n758155k142149K128595
37567H654724J969234k265804m441166j784145J826416K904895K356472Q75136
37559A0095762k840853o692685m947552K592864P503157L928212k496348k796986
$$ plain form
37551 4345571 7014668 13375280 18634496 21743743 23889354 23750650 18933272 11001143
37543 11001143 5261686 5103038 8618538 11285354 10787075 8737629 8056201 9083074
37535 9083074 9053736 5910761 1352212 -1657408 -3451290 -7036852 -13022710 -18296492
37527 -18296492 -20702589 -22044209 -24541218 -26713562 -25391300 -20492315 -15274796 -12347737
37519 -12347737 -11467688 -11069771 -10229380 -9061166 -8534588 -9933534 -13337654 -16658006 -17360748
37510 -17360748 -15283310 -12652912 -11101725 -9849960 -7470339 -4415817 -2583350 -2642973
37502 -2642973 -3010937 -1860539 744985 3525768 6283027 10390707 16714302 23631607
37494 23631607 27402373 24493825 14460529 1853293 -5350733 -1855233 9127485 17841483
$$ packed form
37551D345571K669097O360612N259216L109247K145611j38704m817378p932129
37543A1001143n739457j58648L515500K666816m98279k049446o81428J026873
37535I083074k9338l142975m558549l009620j793882l585562n985858n273782
37527a8296492k406097j341620k497009k172344J322262M898985N217519K927059
37519a2347737Q80049L97917Q40391J168214N26578j398946l404120l320352p02742
37510a7360748K077438K630398J551187J251765K379621L054522J832467n9623
37502b642973l67964J150398K605524K780783K757259M107680O323595O917305
37494B3631607L770766k908548j0033296j2607236p204026L495500J0982718Q713998
$$ plain form
37486 17841483 17406216 10297201 4341899 3982875 7582279 11838033 15459344 18193764
37478 18193764 19134711 17586790 14440886 11667433 10763779 11557423 11896750 9304062 4275771
37469 4275771 995660 2547239 5878905 4396726 -3761816 -12566646 -14655235 -9468757
37461 -9468757 -3420796 -2853002 -7920454 -13094396 -13173253 -8745905 -5217145 -6291721 -10092408
37452 -10092408 -12866925 -14045583 -14666408 -12961444 -6303365 2908509 8443378 8285369
37444 8285369 6806905 7498694 8487512 7711054 7596034 10754537 14914881 16367355 15355363
37435 15355363 13854008 11050723 5935434 1914360 3302361 8577621 12554153 14518604
37427 14518604 18655953 26255696 32886986 34469379 31701305 27264642 22664284 19011917
$$ packed form
37486A7841483m35267p109015n955302l59024L599404M255754L621311K734420
37478A8193764R40947j547921l145904k773453r03654P93644L39327k592688n028291
37469D275771l280111J551579L331666j482179q158542q804830k088589N186478
37461i468757O047961N67794n067452n173942p8857M427348L528760j074576l800687
37452a0092408k774517j178658o20825J704964O658079R211874N534869j58009
37444H285369j478464O91789R88818p76458j15020L158503M160344J452474j011992
37435A5355363j501355k803285n115289m021074J388001N275260L976532J964451
37427A4518604M137349P599743O631290J582393k768074m436663m600358l652367
$$ plain form
37419 19011917 17032451 14962938 10169002 4208395 2485717 7092493 13417964 15682506
37411 15682506 12648548 6325248 -1265796 -7906506 -11450347 -12945206 -16204151 -21537043
37403 -21537043 -23443418 -18141663 -10254717 -7463848 -10413155 -12550062 -9219636 -2707417
37395 -2707417 1809029 1833643 -1368205 -4531198 -4736176 -2060589 -159339 -2605934 -8756576
37386 -8756576 -14511967 -16317274 -12756062 -3645661 9318691 21096809 25531560 20540480
37378 20540480 10137648 827872 -3446489 -3156860 -1148858 886541 3737060 7980713
37370 7980713 11138368 10148052 6364973 4107624 3221007 -1978947 -13387777 -23653032
37362 -23653032 -24989845 -19649637 -15465242 -13676934 -8538193 1724786 11075317 14011365
$$ packed form
37419A9011917j979466k069513m793936n960607j722678M606776O325471K264542
37411A5682506l033958o323300p591044o640710l543841j494859l258945n332892
37403b1537043j906375N301755P886946K790869k949307k136907L330426O512219
37395b707417M516446K4614l201848l162993k04978K675587J901250k446595o150642
37386h756576n755391j805307L561212R110401J2964352J1778118M434751m991080
37378B0540480j0402832r309776m274361K89629K008002K035399K850519M243653
37370G980713L157655r90316l783079k257349q86617n199954j1408830j0265255
37362b3653032j336813N340208M184395J788308N138741J0262979R350531K936048
$$ plain form
37354 14011365 11465605 6701526 1189402 -3181891 -3343123 343909 3109659 2342514
37346 2342514 1138453 2621868 4959518 5193204 3999014 3042246 1293590 -2114353
37338 -2114353 -4713320 -4565104 -4278401 -6608463 -8598313 -5219555 2482598 7595042
37330 7595042 5244883 -3184576 -12693756 -18018951 -15715679 -7077388 1491235 4573520
37322 4573520 3737799 4441293 8328966 12451435 14846179 16197233 16367219 14085716 10455119
37313 10455119 8364638 7862621 6401901 4276512 5076885 9393637 12827863 12540733
37305 12540733 11531691 13528358 17373262 20031188 22184958 26577218 32264634 34676820
37297 34676820 31608845 26397921 24406585 27616540 32808280 34272749 28682035 18116188
$$ packed form
37354A4011365k545760m764079n512124m371293j61232L687032K765750p67145
37346B342514j204061J483415K337650K33686j194190r56768j748656l407943
37338b114353k598967J48216K86703k330062j989850L378758P702153N112444
37330G595042k350159q429459r509180n325195K303272Q638291Q568623L082285
37322D573520q35721P03494L887673M122469K394744J351054J69986k281503l630597
37313A0455119k090481n02017j460720k125389Q00373M316752L434226k87130
37305A2540733j009042J996667L844904K657926K153770M392260N687416K412186
37297C4676820l067975n210924j991336L209955N191740J464469n590714j0565847
$$ plain form
37289 18116188 8027628 1898476 -1362926 -4514528 -7913801 -9547650 -8413386 -6372371
37281 -6372371 -5864151 -5922378 -1739371 9769250 23779679 29986830 23656213 12097026
37273 12097026 6776728 10465857 16184183 17848315 16693480 16377730 16997294 16591272
37265 16591272 14766544 11872803 7373223 1803073 -1888984 -1456649 2013010 6365961
37257 6365961 10801918 13968577 12616230 5410305 -3912298 -10346933 -12903526 -13056896
37249 -13056896 -9918782 -1240093 11197600 21183090 24060037 20888612 16295976 14013788
37241 14013788 14409516 14448923 10185944 1197785 -7568939 -10277087 -6474556 -1120606
37233 -1120606 1412458 1228452 762551 1259008 2511720 4417812 7250961 10852129 14305737
$$ packed form
37289A8116188j0088560o129152l261402l151602l399273j633849J134264K041015
37281f372371N08220n8227M183007J1508621J4010429O207151o330617j1559187
37273A2097026n320298L689129N718326J664132j154835l15750O19564m06022
37265A6591272j824728k893741m499580n570150l692057M32335L469659M352951
37257F365961M435957L166659j352347p205925r322603o434635k556593j53370
37249a3056896L138114Q678689J2437693R985490K876947l171425m592636k282188
37241A4013788L95728L9407m262979q988159q766724k708148L802531N353950
37233a120606K533064j84006m65901M96457J252712J906092K833149L601168L453608
$$ plain form
37224 14305737 16167418 14936335 10212198 4043489 387640 1790386 6069341 7390948
37216 7390948 2138767 -6519551 -11685677 -10528713 -6658570 -4000765 -1983330 401313
37208 401313 -319340 -7292028 -15541041 -15942773 -7621439 136764 363249 -3220593 -3220220
37199 -3220220 1848728 9058200 16851619 23944955 26402470 21860877 14577560 11026298
37191 11026298 11836648 12457377 10229417 6450861 2810492 17455 -1047925 -475420
37183 -475420 -435982 -2132915 -3656331 -3794103 -4691523 -6820364 -5418411 2373584 10545132
37174 10545132 11440341 7171989 5962403 9020953 9880743 6360752 3989490 6139843
37166 6139843 9198873 9891298 9797108 9885436 7665299 2744313 -1400685 -3953927 -8135925
$$ packed form
37224A4305737J861681j231083m724137o168709l655849J402746M278955J321607
37216G390948n252181q658318n166126J156964L870143K657805K017435K384643
37208D01313p20653o972688q249013m01732Q321334P758203K26485l583842L73
37199c220220N068948P209472P793419P093336K457515m541593p283317l551262
37191A1026298Q10350O20729k227960l778556l640369k793037j065380N72505
37183d75420L9438j696933j523416j37772q97420k128841J401953P791995Q171548
37174A0545132Q95209m268352j209586L058550Q59790l519991k371262K150353
37166F139843L059030O92425r4190Q8328k220137m920986m144998k553242m181998
$$ plain form
37157 -8135925 -13026962 -11573156 -1199647 10457947 15437638 14748795 12729608 9018947
37149 9018947 2933852 -256187 4109033 11095140 12137780 7722855 6118057 10506502
37141 10506502 15083202 14532766 10867716 9106157 10836362 13916697 15491559 13961875
37133 13961875 9779852 4808165 187457 -4138623 -7313769 -7611023 -5696373 -4297008
37125 -4297008 -2912881 2493051 11610750 16985503 13886414 7942430 6739338 8321417
37117 8321417 5871564 518673 48204 5576873 8975340 5439901 667779 2235652
37109 2235652 9898506 17928000 22357111 22534655 19166650 13982042 8930545 3814937
37101 3814937 -2791096 -9164561 -10397244 -4672657 3404713 8062046 8705527 8784794 9994146
$$ packed form
37157h135925m891037J453806J0373509J1657594M979691o88843k019187l710661
37149I018947o085095l190039M365220O986107J042640m414925j604798M388445
37141A0506502M576700n50436l665050j761559J730205L080335J574862j529684
37133A3961875m182023m971687m620708m326080l175146k97254J914650J399365
37125d297008J384127N405932R117699N374753l099089n943984j203092J582079
37117H321417k449853n352891m70469N528669L398467l535439m772122J567873
37109B235652P662854Q029494M429111J77544l368005n184608n051497n115608
37101C814937o606033o373465j232683N724587Q077370M657333O43481P9267J209352
$$ plain form
37092 9994146 10089568 6394873 157503 -3558941 -1272752 3820555 4493471 -1585201 -8281911
37083 -8281911 -8616228 -3227694 1769169 2644672 97074 -3707184 -5602875 -1794689
37075 -1794689 6564563 10601702 3437062 -8675472 -12529681 -5134329 3314792 4725455
37067 4725455 2970187 5349303 11745757 17046880 18771575 17385888 13142823 7061094
37059 7061094 2112561 179326 483074 2711793 7555964 12380882 11921532 6421901
37051 6421901 3351394 6664911 9886918 5594006 -2886582 -6072934 -1491019 4883659
37043 4883659 8693965 11528906 14921407 16225940 12486597 4750532 -2925265 -6556378
37035 -6556378 -4280185 2078305 7336472 7128147 2047351 -3661924 -6826513 -7307624
$$ packed form
37092I994146R5422l694695o237370l716444K286189N093307O72916o078672o696710
37083h281911l34317N388534M996863Q75503k547598l804258j895691L808186
37075a794689Q359252M037139p164640j2112534l854209P395352Q449121J410663
37067D725455j755268K379116O396454N301123J724695j385687m243065o081729
37059G061094m948533j933235L03748K228719M844171M824918m59350n499631
37051F421901l070507L313517L222007m292912q480588l186352M581915O374678
37043D883659L810306K834941L392501J304533l739343p736065p675797l631113
37035f556378K276193O358490N258167k08325n080796n709275l164589m81111
$$ plain form
37027 -7307624 -6493364 -5775758 -5629183 -4682168 -902448 5045148 9426983 9809084 7572143
37018 7572143 4649671 912000 -2881304 -3196136 1292684 5698679 4698824 634955
37010 634955 833792 7307261 13838285 13992013 8273433 2208417 238760 3002842 8748419
37001 8748419 15506270 21631301 24827812 22419989 14724652 7179534 5454894 8217445
36993 8217445 8950639 5636082 3122416 3882235 3077274 -2651433 -7650872 -5123659 2056137
36984 2056137 5834092 5011346 4941161 7401895 9014920 8847112 9455245 10269809 7750782
36975 7750782 2805938 347016 291158 -3021880 -10285149 -14101927 -9926607 -2906689
36967 -2906689 517975 1260673 2688282 2961954 -1317403 -7711299 -10499384 -8492651
$$ packed form
37027g307624Q14260P17606J46575R47015L779720N947596M381835L82101k236941
37018G572143k922472l737671l793304l14832M488820M405995r99855m063869
37010F34955J98837O473469O531024J53728n718580o065016j969657K764082N745577
37001H748419O757851O125031L196511k407823p695337p545118j724640K762551
36993H217445P33194l314557k513666P59819q04961n728707m999439K527213P179796
36984B056137L777955q22746p0185K460734J613025j67808O08133Q14564k519027
36975G750782m944844k458922n5858l313038p263269l816778M175320P019918
36967b906689L424664P42698J427609K73672m279357o393896k788085K006733
$$ plain form
36959 -8492651 -5239839 -3234063 -2297874 -1996300 -1564831 860375 4989473 6237022 1287903
36950 1287903 -5613434 -6851912 -1518341 3507048 3069227 -238350 -1211515 801546
36942 801546 2936421 4577326 8101315 13761745 17155435 14102790 6842120 2591435
36934 2591435 5460235 12204385 17252584 19249260 19918247 18833890 13982762 7295176
36926 7295176 4772871 9029324 14658776 13416599 2887357 -10930881 -18571660 -14710756
36918 -14710756 -2756128 8102235 12144761 12718247 16436111 23633870 28811258 29415938
36910 29415938 28430443 27678026 24697219 18629527 13879186 14583463 19453959 24918665
36902 24918665 29306939 31153132 28074021 21313137 17297190 20049881 25173463 25808616
$$ packed form
36959h492651L252812K005776R36189L01574M31469K425206M129098J247549m949119
36950A287903o901337j238478N333571N025389m37821l307577r73165K013061
36942H01546K134875J640905L523989N660430L393690l052645p260670m250685
36934B591435K868800O744150N048199J996676O68987j084357m851128o687586
36926G295176k522305M256453N629452j242177j0529242j3818238p640779L860904
36918a4710756J1954628J0858363M042526N73486L717864P197759N177388O04680
36910B9415938r85495p52417k980807o067692m750341P04277M870496N464706
36902B4918665M388274J846193l079111o760884m015947K752691N123582O35153
$$ plain form
36894 25808616 21827228 18660137 19338313 22099509 24163303 24213610 22978943 24137454
36886 24137454 31398500 41315981 43428656 32845767 18896448 14971947 22784128 33374558
36878 33374558 40664972 45620869 48575615 47011275 42196332 39642439 40466121 39284881
36870 39284881 33221189 26351948 22315386 18963811 14027257 10230275 10521640 13184300
36862 13184300 15950605 20412875 27878990 35018712 38356348 39404170 40603241 39958288
36854 39958288 35339732 30965198 33020596 40383585 46057789 47323614 48452260 53066981
36846 53066981 59563146 65173230 69125561 69918369 64753968 55000804 48146441 50050891
36838 50050891 57382297 61516347 58751824 53379519 51569145 55852603 65567976 78612673
$$ packed form
36894B5808616l981388l167091O78176K761196K063794N0307j234667J158511
36886B4137454P261046R917481K112675j0582889j3949319l924501P812181J0590430
36878C3374558P290414M955897K954746j564340m814943k553893Q23682j181240
36870C9284881o063692o869241m036562l351575m936554l796982K91365K662660
36862A3184300K766305M462270P466115P139722L337636J047822J199071o44953
36854C9958288m618556m374534K055398P362989N674204J265825J128646M614721
36846E3066981O496165N610084L952331P92808n164401r753164o854363J904450
36838E0050891P331406M134050k764523n372305j810374M283458R715373J3044697
$$ plain form
36830 78612673 90774614 96447804 93762519 88566248 90172362 102043750 118427680 131150190
36822 131150190 137926601 142399709 147810018 153789758 159430264 166400924 177155242 191363806
36814 191363806 205785615 217320585 225363513 231653572 238516021 246796798 255018913 261140902
36806 261140902 265509304 271105671 280060061 290678078 298857372 301927720 300313292 296161654
36798 296161654 291636897 288316488 286820839 286336055 284915347 280742413 273470793 264888777
36790 264888777 258336288 256449116 258564656 260830598 259745607 255242549 249538115 243775223
36782 243775223 237516467 231389384 227905702 228235218 229408498 226445556 217048910 203252334
36774 203252334 189175906 178636147 174193286 175836164 179728826 180424678 176018521 170004383
$$ packed form
36830G8612673J2161941N673190k685285n196271J606114J1871388J6383930J2722510
36822A31150190O776411M473108N410309N979740N640506O970660J0754318J4208564
36814A91363806J4421809J1534970Q042928O290059O862449Q280777Q222115O121989
36806B61140902M368402N596367Q954390J0618017Q179294L070348j614428m151638
36798B96161654m524757l320409j495649m84784j420708m172934p271620q582016
36790B64888777o552489j887172K115540K265942j084991m503058n704434n762892
36782B43775223o258756o127083l483682L29516J173280k962942r396646j3796576
36774B03252334j4076428j0539759m442861J642878L892662O95852m406157o014138
$$ plain form
36766 170004383 166927132 167712575 170597831 174369263 177806267 177611994 171090601 161012324
36758 161012324 154007327 153095307 155014259 155989601 156476745 158123498 159500443 158120727
36750 158120727 154535371 151183777 148515693 145096644 140568034 136034919 132402103 130323814
36742 130323814 130449801 131589460 130329028 125100593 119072016 116176031 115808600 114464495
36734 114464495 110931798 106405207 101213866 95641134 92543438 94173504 96954421 94498021
36726 94498021 85919429 76276566 68726560 61857126 55487371 52683502 53591235 53188656
36718 53188656 48776864 44677362 45212485 47251110 44725831 37649343 31584446 29726885
36710 29726885 29931174 28880481 25757522 22205232 20998475 23802222 28471307 30456377
$$ packed form
36766A70004383l077251P85443K885256L771432L437004j94273o521393j0078277
36758A61012324p004997r12020J918952R75342M87144J646753J376945j379716
36750A58120727l585356l351594k668084l419049m528610m533115l632816k078289
36742A30323814J25987J139659j260432n228435o028577k895985l67431j344105
36734A14464495l532697m526591n191341n572732l097696J630066K780917k456400
36726I4498021q578592r642863p550006o869434o369755k803869R07733m02579
36718E3188656m411792m099502N35123K038625k525279p076488o064897j857561
36710B9726885K04289j050693l122959l552290j206757K803747M669085J985070
$$ plain form
36702 30456377 28871293 28499165 32918177 38488529 39186673 35226297 32049827 31714291
36694 31714291 30256618 24151489 15300115 8211398 4964139 4348290 4414544 4929871 7737155
36685 7737155 14219646 22090507 26621008 26311636 24804859 24985611 24269358 19591148 14462865
36676 14462865 15429713 21965041 25605030 20771135 12074804 8244659 11582376 16288561
36668 16288561 16114255 11294046 7332630 7716639 9334745 6787524 482176 -3131896
36660 -3131896 -486430 4143737 5437676 4524128 5035469 5418168 1823684 -3227581 -2569005
36651 -2569005 4908412 12140633 13945101 12917521 13059235 13515985 12240749 11251904 14079096
36642 14079096 20559126 26954339 29169262 24831378 15737908 9254988 12337821 21908610
$$ packed form
36702C0456377j585084l72128M419012N570352O98144l960376l176470l35536
36694C1714291j457673o105129q851374p088717l247259o15849O6254N15327K807284
36685G737155O482491P870861M530501l09372j506777J80752p16253m678210n128283
36676A4462865R66848O535328L639989m833895q696331l830145L337717M706185
36668A6288561j74306m820209l961416L84009J618106k547221o305348l614072
36660c131896K645466M630167J293939r13548N11341L82699l594484n051265O58576
36651b569005P477417P232221J804468j027580J41714M56750j275236r88845K827192
36642A4079096O480030O395213K214923m337884r093470o482920L082833R570789
$$ plain form
36634 21908610 26393125 20084311 10629087 7772265 10048110 9176837 3642270 -390444
36626 -390444 -469424 -1829125 -8185240 -15031861 -15631503 -9874978 -3724016 -1643465 -2184562
36617 -2184562 -550801 5835223 14261446 18899399 16180024 7781140 -1587262 -8039116
36609 -8039116 -9828350 -6989719 -1281820 4894373 10758172 16753474 21158224 20152426
36601 20152426 13387507 6357732 3977573 4413599 3062677 141298 -574653 992205
36593 992205 835727 -2227884 -4446672 -3049538 -26942 1491892 1236560 783553 1351917
36584 1351917 3585040 6953363 8933734 7625348 5297207 5922807 9097629 10636148
36576 10636148 9806248 10890260 15616102 19148864 17058570 12105943 9839385 10540824
$$ packed form
36634B1908610M484515o308814r455224k856822K275845q71273n534567m032714
36626c90444p8980j359701o356115o846621n99642N756525O150962K080551n41097
36617b184562J633761O386024Q426223M637953k719375q398884r368402o451854
36609h039116j789234K838631N707899O176193N863799N995302M404750j005798
36601B0152426o764919p029775k380159M36026j350922k921379p15951J566858
36593I92205j56478l063611k218788J397134L022596J518834k55332m53007N68364
36584A351917K233123L368323J980371j308386k328141O25600L174822J538519
36576A0636148q29900J084012M725842L532762k090294m952627k266558P01439
$$ plain form
36568 10540824 10288701 8210928 7853596 11469680 16578847 18823107 16290948 11087003
36560 11087003 7800523 9255564 12429145 10629280 1998956 -6319954 -5905402 2325764
36552 2325764 8886471 6784585 -1492557 -8119607 -7863848 -1235086 7396583 13282881
36544 13282881 14390137 12326363 10132022 9564863 10930129 13935316 17055216 17612053
36536 17612053 14850934 11717515 11023756 11210631 9178963 6170088 6610291 11146053
36528 11146053 15100453 14783671 11645393 9044175 8383721 9695818 12582194 15094315
36520 15094315 14981291 13373780 13561720 14838968 12386873 5787976 2252261 6790468
36512 6790468 13717681 14034727 8253313 4978357 7989903 11842395 11061690 7479166
$$ packed form
36568A0540824k52123k077773l57332L616084N109167K244260k532159n203945
36560A1087003l286480J455041L173581j799865q630324q318910M14552Q231166
36552B325764O560707k101886q277142o627050K55759O628762Q631669N886298
36544A3282881J107256k063774k194341n67159J365266L005187L119900N56837
36536A7612053k761119l133419o93759J86875k031668l008875M40203M535762
36528A1146053L954400l16782l138278k601218o60454J312097K886376K512121
36520A5094315j13024j607511J87940J277248k452095o598897l535715M538207
36512F790468O927213L17046n781414l274956L011546L852492p80705l582524
$$ plain form
36504 7479166 6189036 8708860 12484091 14082715 11434072 5701087 1548129 2302463
36496 2302463 4725455 2903595 -2269239 -3118942 3412121 10384965 10651637 6802245
36488 6802245 6229782 10240907 13919644 14206280 12066051 8103910 2175133 -2741541
36480 -2741541 -1919018 4727306 11698726 14144593 11631046 5824993 -1306323 -6570060
36472 -6570060 -7284480 -5062150 -4004975 -4496729 -3337872 -876871 -2139772 -8134806
36464 -8134806 -11734136 -6860917 2436687 7401911 6108043 4009376 4892551 7262037
36456 7262037 9348880 11942751 14951637 15600523 12062919 6139589 1161204 -389614
36448 -389614 3085053 11155145 19117943 20464129 13893241 5404826 1237917 972272
$$ packed form
36504G479166j290130K519824L775231J598624k648643n732985m152958P54334
36496B302463K422992j821860n172834q49703O531063O972844K66672l849392
36488F802245n72463M011125L678737K86636k140229l962141n928777m916674
36480b741541Q22523O646324O971420K445867k513547n806053p131316n263737
36472f570060p14420K222330J057175m91754J158857K461001j262901n995034
36464h134806l599330M873219R297604M965224j293868k098667Q83175K369486
36456G262037K086843K593871L008886O48886l537604n923330m978385j550818
36448c89614L474667Q070092P962798J346186o570888q488415m166909k65645
$$ plain form
36440 972272 -20005 -3514082 -7039603 -8232477 -7090305 -4166367 128077 3831330
36432 3831330 4167753 1544910 367577 3557732 7749678 6607931 -1456862 -11310901
36424 -11310901 -17068182 -17751106 -16124352 -14081687 -11190760 -6895650 -2330094 -28038
36416 -28038 -2581344 -10539244 -20298632 -25363202 -22080039 -13811390 -7317469 -5364003
36408 -5364003 -5243756 -4050422 -1894387 700867 4713054 9765864 12277322 9274007
36400 9274007 2500122 -3315508 -4862876 -1655718 4439978 9072130 7637716 698703
36392 698703 -5105300 -4832956 -1773401 -2533681 -7751628 -12220694 -12653915 -10154183 -5829775
36383 -5829775 355395 6174604 8237853 7445560 7942496 9574642 7559857 1775151
$$ packed form
36440I72272r92277l494077l525521j192874J142172K923938M294444L703253
36432C831330L36423k622843j177333L190155M191946j141747q064793r854039
36424a1310901n757281o82924J626754K042665K890927M295110M565556K302056
36416b8038k553306p957900r759388n064570L283163Q268649O493921J953466
36408e364003J20247J193334K156035K595254M012187N052810K511458l003315
36400I274007o773885n815630j547368L207158O095696M632152j434414o939013
36392F98703n804003K72344L059555p60280n217947m469066m33221K499732M324408
36383e829775O185170N819209K063249p92293M96936J632146k014785n784706
$$ plain form
36375 1775151 -557477 4121713 8106809 2313465 -10053267 -16746997 -11821168 -1399214
36367 -1399214 5557190 6515484 4534123 2871462 2353981 1534218 -1535249 -6009391 -7261878
36358 -7261878 -1813272 7166956 12269931 9791857 2692634 -3942399 -7308017 -7114427
36350 -7114427 -5178152 -5272729 -9823034 -15837382 -17485358 -13783012 -10177291 -10843597 -12939943
36341 -12939943 -11145114 -5172270 409251 2294783 1419634 360630 30892 -833067
36333 -833067 -3777495 -8101900 -10530213 -8937377 -6107995 -6923261 -11206637 -13068067
36325 -13068067 -9473987 -5738340 -8573635 -16170703 -20152267 -16787000 -11384453 -10365794
36317 -10365794 -12732340 -11674036 -2761178 11205977 22602218 25527812 21003476 15903196
$$ packed form
36375A775151k332628M679190L985096n793344j2366732o693730M925829J0421954
36367a399214O956404R58294j981361j662661n17481q19763l069467m474142j252487
36358g261878N448606Q980228N102975k478074p099223o635033l365618J93590
36350g114427J936275r4577m550305o014348j647976L702346L605721o66306k096346
36341a2939943J794829N972844N581521J885532q75149j059004l29738q63959
36333h33067k944428m324405k428313J592836K829382q15266m283376j861430
36325a3068067L594080L735647k835295p597068l981564L365267N402547J018659
36317a0365794k366546J058304Q912858J3967155J1396241K925594m524336n100280
$$ plain form
36309 15903196 15567286 17870433 16762752 11420366 8200888 11655043 16841147 14420263
36301 14420263 2368830 -11247552 -17810659 -17161523 -15146899 -14667455 -12815175 -6945586
36293 -6945586 -43934 2582890 596484 -563418 3216385 9288507 11636745 8216734
36285 8216734 2860896 588456 3081888 8533261 13710504 15671244 13343506 8466234
36277 8466234 3974903 1065775 -984114 -2191552 -1291431 1504094 3686909 4092212
36269 4092212 5146960 9086573 13734909 15159183 13428742 12141533 12526937 12123318
36261 12123318 10286190 10718825 15537536 19731533 15694086 2704177 -11446555 -18748473
36253 -18748473 -18471398 -15643840 -14200159 -13397584 -10423050 -4989777 -460879 -347463
$$ packed form
36309A5903196l35910K303147j107681n342386l219478L454155N186104k420884
36301A4420263j2051433j3616382o563107O49136K014624M79444J852280N869589
36293f945586O901652K626824j986406j159902L779803O072122K348238l420011
36285H216734n355838k272440K493432N451373N177243J960740k327738m877272
36277H466234m491331k909128k049889j207438R00121K795525K182815M05303
36269D092212J054748L939613M648336J424274j730441j287209L85404m03619
36261A2123318j837128M32635M818711M193997m037447j2989909j4150732p301918
36253a8748473K77075K827558J443681Q02575K974534N433273M528898J13416
$$ plain form
36245 -347463 -4323830 -8619562 -10243669 -9537720 -8300530 -7199196 -6152686 -5494013 -4836635
36236 -4836635 -2153870 3587271 9660358 12006601 10042776 6494065 2869651 -1586482
36228 -1586482 -6136885 -7606585 -4984356 -1799831 -1385996 -2188523 -709026 2680322
36220 2680322 4312739 2979170 1722193 3217447 5863361 5953169 2615993 -921251
36212 -921251 -1299346 514349 184547 -3791064 -6623769 -2720260 6149904 12073599 10952340
36203 10952340 6773707 4035771 1006325 -5176248 -10873211 -9722907 -2252437 4531253
36195 4531253 6743754 6906989 7408818 6963816 5265834 5208494 7340355 6943032 545303
36186 545303 -8084129 -12242187 -10106817 -5073079 -802051 663445 -1949162 -7993049
$$ packed form
36245c47463l976367m295732j624107P05949J237190J101334J046510O58673O57378
36236d836635K682765N741141O073087K346243j963825l548711l624414m456133
36228a586482m550403j469700K622229L184525M13835q02527J479497L389348
36220B680322J632417j333569j256977J495254K645914Q9808l337176l537244
36212i21251l78095J813695l29802l975611k832705L903509Q870164N923695j121259
36203A0952340m178633k737936l029446o182573n696963J150304P470470O783690
36195D531253K212501J63235N01829m45002j697982n7340K131861l97323o397729
36186E45303q629432m158058K135370N033738M271028J465496k612607o043887
$$ plain form
36178 -7993049 -13874235 -16156290 -14962244 -12377698 -9374997 -6868246 -7558222 -12983632
36170 -12983632 -19940380 -23491847 -22912558 -21333542 -20171307 -17607578 -12551133 -6406932
36162 -6406932 -131975 7338950 16441525 24950889 29820144 29834194 26152784 21453064
36154 21453064 18215065 16268617 12572874 5238424 -3127809 -8500016 -10896028 -13514507
36146 -13514507 -16859134 -17698515 -14609936 -10589109 -8188585 -5343165 1029195 9141599
36138 9141599 13109068 9391808 718787 -6446675 -7504443 -3061098 2523079 5582346
36130 5582346 5755894 4201564 976263 -3853079 -7454888 -5513971 2893268 13278023
36122 13278023 19227859 17241537 8841331 -435285 -4699352 -2352039 3084609 7895864
$$ packed form
36178g993049n881186k282055J194046K584546L002701K506751o89976n425410
36170a2983632o956748l551467N79289J579016J162235K563729N056445O144201
36162f406932O274957P470925R102575Q509364M869255J4050l681410m699720
36154B1453064l237999j946448l695743p334450q366233n372207k396012k618479
36146a3514507l344627q39381L088579M020827K400524K845420O372360Q112404
36138I141599L967469l717260q673021p165462j057768M443345N584177L059267
36130E582346J73548j554330l225301m829342l601809J940917Q407239J0384755
36122A3278023N949836j986322q400206r276616m264067K347313N436648M811255
$$ plain form
36114 7895864 12170278 16527714 17513682 11368886 1721438 -2329346 2654844 9983075
36106 9983075 11569259 6976537 1417968 -1281545 -712740 1909667 4341245 4250661 1874005
36097 1874005 -405577 -2419077 -6615250 -12225153 -13531177 -7484648 903021 5091048
36089 5091048 5503000 6550014 8159316 6481379 1974704 707127 6597893 16389670
36081 16389670 23297610 23106612 16832588 9840380 7605595 9803959 9783389 2616013
36073 2616013 -8028764 -14254922 -13144857 -7677824 -713609 6584865 11460113 10655848
36065 10655848 5442713 856346 -739131 -1376578 -2857951 -4721232 -6642432 -8220558
36057 -8220558 -6636127 239471 8425153 11287010 8751629 6777567 6981984 4296043
$$ packed form
36114G895864M274414M357436R85968o144796r647448m050784M984190P328231
36106I983075J586184m592722n558569k699513N68805K622407K431578r0584k376656
36097A874005k279582k013500m196173n609903j306024O046529Q387669M188027
36089E091048M11952J047014J609302j677937m506675j267577N890766R791777
36081A6389670O907940j90998o274024o992208k234785K198364k0570p167376
36073B616013j0644777o226158J110065N467033O964215P298474M875248q04265
36065A0655848n213135m586367j595477o37447j481373j863281j921200j578126
36057h220558J584431O875598Q185682K861857k535381j974062K04417k685941
$$ plain form
36049 4296043 -2816237 -7715320 -5481122 -573102 808864 78355 1612614 3577630
36041 3577630 789558 -5974545 -10576608 -10360905 -8460656 -7600426 -6593250 -3259694
36033 -3259694 2828214 10454454 16878004 18700597 15108387 8894128 2245535 -5711487
36025 -5711487 -14368589 -18414638 -13918890 -4902620 1299991 3035357 3466623 3198355
36017 3198355 311776 -3578582 -4409049 -2949825 -4403417 -9865683 -14308627 -14294790 -11890871
36008 -11890871 -9531247 -6787311 -3865970 -2458257 -1316010 2694441 6856095 3122268
36000 3122268 -9684293 -21210645 -22611569 -17933215 -15760680 -15383333 -10238600 -1325316
35992 -1325316 3300001 1829190 1408985 5621771 8381304 4433007 -1573701 -2198859
$$ packed form
36049D296043p112280m899083K234198M908020J381966p30509J534259J965016
36041C577630k788072o764103m602063K15703J900249Q60230J007176L333556
36033c259694O087908P626240O423550J822593l592210o214259o648593p957022
36025e711487q657102m046049M495748R016270O202611J735366M31266k68268
36017C198355k886579l890358q30467J459224j453592n462266m442944J3837K403919
36008a1890871K359624K743936K921341J407713J142247M010451M161654l733827
36000C122268j2806561j1526352j400924M678354K172535L77347N144733Q913284
35992a325316M625317j470811m20205M212786K759533l948297o006708o25158
$$ plain form
35984 -2198859 2090228 5763476 8108853 13213521 21287990 26473956 24156385 15866885
35976 15866885 6030356 -2142686 -6580105 -6347638 -3650475 -2518571 -3599539 -3457085
35968 -3457085 -880713 273161 -2058675 -2564115 4629849 15938831 21518827 17920674
35960 17920674 11152844 6534561 2399542 -3480057 -7646493 -5844997 288655 6306587
35952 6306587 11224850 15716758 17155412 12488665 4549602 -364525 -903959 -1533847
35944 -1533847 -4965305 -8580186 -8939272 -5566538 200078 5964960 7699832 3206218
35936 3206218 -3070863 -3686202 1885366 5918994 3060003 -2757365 -4940286 -2894370
35928 -2894370 151419 3925720 10204426 17018490 19069863 14121670 5641352 -1103955
$$ packed form
35984b198859M289087L673248K345377N104668Q074469N185966k317571q289500
35976A5866885r836529q173042m437419K32467K697163J131904j080968J42454
35968c457085K576372J153874k331836n05440P193964J1308982N579996l598153
35960A7920674o767830m618283m135019n879599m166436J801496O133652O017932
35952F306587M918263M491908J438654m666747p939063m914127n39434o29888
35944a533847l431458l614881l59086L372734N766616N764882J734872m493614
35936C206218o277081o15339N571568M033628k858991n817368k182921K045916
35928b894370L045789L774301O278706O814064K051373m948193q480318o745307
$$ plain form
35920 -1103955 -3433931 -2311855 -1144132 -2912149 -6762308 -8540369 -6445896 -4321251
35912 -4321251 -6602148 -11640074 -13733431 -11103525 -7678360 -6332538 -4510053 1114921
35904 1114921 8652830 13125205 13328505 12974740 14624550 15772190 12840061 6645207
35896 6645207 980714 -2773005 -5885707 -7632295 -5145466 801344 4669040 3637829
35888 3637829 1727914 2452543 1853036 -5205256 -15185999 -19681115 -17285403 -13764683
35880 -13764683 -10939085 -4243200 7053557 15879781 17260676 14983160 14230132 13969621
35872 13969621 11138326 6539238 1997550 -2726546 -5695439 -1759772 8672974 16032266
35864 16032266 13378427 6219992 3567445 5105947 5731730 7107985 13822324 21586041
$$ packed form
35920a103955k329976J122076J167723j768017l850159j778061K094473K124645
35912d321251k280897n037926k093357K629906L425165J345822J822485N624974
35904A114921P537909M472375K03300l53765J649810J147640k932129o194854
35896F645207n664493l753719l112702j746588K486829N946810L867696j031211
35888C637829j909915P24629n99507p058292r980743m495116K395712L520720
35880a3764683K825598O695885J1296757Q826224J380895k277516p53028k60511
35872A3969621k831295m599088m541688m724096k968893L935667J0432746P359292
35864A6032266k653839p158435k652547J538502O25783J376255O714339P763717
$$ plain form
35856 21586041 21089742 12595573 5553932 3756027 2124779 -761773 927300 7888778
35848 7888778 11189181 5897811 -685456 -1496586 -1748083 -9663478 -21471058 -25593158
35840 -25593158 -18912784 -9933612 -6459251 -7643270 -8939593 -8709895 -7835296 -6878760
35832 -6878760 -6049184 -5941386 -6543677 -6300876 -3308748 2238462 7040312 7306838 3384507
35823 3384507 380345 2175505 6281657 7629347 6036725 5697040 8013456 10086999
35815 10086999 10605115 11679846 13478545 12623025 8356344 5130852 5848086 6989537
35807 6989537 4082840 -1614641 -5353973 -4852388 -1309161 2388354 2297447 -3745045 -11355213
35798 -11355213 -12102497 -3893423 5725303 10030892 11498983 14935511 17734290 13978176
$$ packed form
35856B1586041m96299q494169p041641j797905j631248k886552J689073O961478
35848G888778L300403n291370o583267q11130k51497p915395j1807580m122100
35840b5593158O680374Q979172L474361j184019j296323K29698Q74599R56536
35832f878760Q29576J07798o02291K42801K992128N547210M801850K66526l922331
35823C384507l004162J795160M106152J347690j592622l39685K316416K073543
35815A0086999N18116J074731J798699q55520m266681l225492P17234J141451
35807F989537k906697n697481l739332N01585L543227L697515r0907o042492p610168
35798a1355213p47284Q209074R618726M305589J468091L436528K798779l756114
$$ plain form
35790 13978176 4824240 -2461174 -4190367 -2798202 -1216020 -742010 -3301054 -9638601
35782 -9638601 -15658702 -16168884 -12053783 -8576651 -7208264 -4922976 -1387538 -425156
35774 -425156 -3134403 -5356699 -4034007 -1292586 -92973 -115801 -291219 -1582240 -4471574
35765 -4471574 -6460014 -4709235 496599 6555479 11167273 13020511 11759082 8739869
35757 8739869 6663612 7246434 9446027 9932214 5261242 -4801458 -14964245 -17575043
35749 -17575043 -10547214 -592273 3861685 1255047 -3965385 -7913980 -8933922 -5295708
35741 -5295708 3047833 11163936 13178337 9980924 8044378 10053201 11521332 7737583
35733 7737583 -394718 -8739780 -14138552 -15029639 -11777069 -7873591 -7524871 -10823970
$$ packed form
35790A3978176r153936p285414j729193J392165J582182M74010k559044o337547
35782i638601o020101n10182M115101L477132J368387K285288L535438R62382
35774d25156k709247k222296J322692K741421J199613k2828j75418j291021k889334
35765d471574j988440J750779N205834O058880M611794J853238j261429l019213
35757H739869k076257N82822K199593M86187m670972j0062700j0162787k610798
35749a7575043P027829R954941M453958k606638n220432l948595j019942L638214
35741e295708Q343541Q116103K014401l197413j936546K008823J468131l783749
35733G737583q132301q345062n398772q91087L252570L903478L48720l299099
$$ plain form
35725 -10823970 -14074160 -15015521 -14269670 -11904802 -7174405 -1979073 459921 1294799
35717 1294799 5234116 12649337 17805479 16896538 12578957 8239877 3325862 -2531463
35709 -2531463 -6347559 -7013634 -8835447 -14851715 -20531219 -19566731 -13154456 -8073756
35701 -8073756 -7358208 -8151817 -7965031 -7955905 -9297896 -9962667 -6698662 1075677 9892643
35692 9892643 14787220 14378098 13307360 17216311 24946327 29027396 25101363 17317587
35684 17317587 12494679 12355388 13799635 13620424 10604594 6119251 4652663 9939341
35676 9939341 18215038 19910205 11359252 125011 -5361051 -6348619 -8503852 -11089616
35668 -11089616 -9073960 -3188813 320459 -731894 -2571822 -3303094 -5447738 -9225916
$$ packed form
35725a0823970l250190r41361P45851K364868M730397N195332K438994Q34878
35717A294799L939317P415221N156142r08941m317581m339080m914015n857325
35709b531463l816096o66075j821813o016268n679504R64488O412275N080700
35701h073756P15548p93609J86786R126j341991o64771L264005P774339Q816966
35692I892643M894577m09122j070738L908951P730016M081069l926033p783776
35684A7317587m822908j39291J444247j79211l015830m485343j466588N286678
35676I939341Q275697J695167q550953j1234241n486062r87568k155233k585764
35668a1089616K015656N885147L509272j052353j839928p31272k144644l778178
$$ plain form
35660 -9225916 -9867871 -4496410 3130657 7721497 8758539 9114012 10249834 11466168
35652 11466168 12196196 12856676 13974019 15264320 15169185 11788056 5386541 -875190 -4199436
35643 -4199436 -5009135 -4879208 -3363255 514173 5080850 7342094 6389678 2709726 -4254183
35634 -4254183 -14156963 -22609724 -24296672 -19208637 -12443704 -8302787 -7872079 -11172952
35626 -11172952 -16944545 -20457130 -16618220 -6579038 2555212 5779069 4743198 3670305
35618 3670305 4373834 6465349 9186962 11527448 12887694 14406418 17352460 20150437
35610 20150437 19942376 17329176 16370791 19195421 23281195 24449236 20176155 10544872
35602 10544872 -796159 -7234731 -4908445 2008949 5662531 4266181 3314629 6932012
$$ packed form
35660i225916o41955N371461P627067M590840J037042L55473J135822J216334
35652A1466168P30028O60480J117343J290301r5135l381129o401515o261731l324246
35643d199436q09699J29927J515953L877428M566677K261244r52416l679952o963909
35634d254183r902780q452761j686948N088035O764933M140917M30708l300873
35626a1172952n771593l512585L838910J0039182R134250L223857j035871j072893
35618C670305P03529K091515K721613K340486J360246J518724K946042K797977
35610B0150437k08061k613200r58385K824630M085774J168041m273081r631283
35602A0544872j1341031o438572K326286O917394L653582j396350r51552L617383
$$ plain form
35594 6932012 12842185 16843037 17464013 14706025 8755177 1949227 -1842630 -1509786
35586 -1509786 1041717 5444210 12904085 20720212 22655219 17448647 11748159 11344070
35578 11344070 14243206 15925301 16679937 19175627 22455912 23186349 20525117 15879694
35570 15879694 10075860 4214069 944656 1291847 2047300 -629301 -6639803 -13012282
35562 -13012282 -17066743 -16724448 -11203399 -3933942 -958368 -3322089 -4973425 -1715444
35554 -1715444 2177848 975342 -3008008 -2905938 2442204 7891372 10003136 9654837
35546 9654837 7346147 1667149 -6791641 -14052090 -16096768 -11490467 -1734427 8561960
35538 8561960 13805401 12775359 9878340 8300761 5211502 -2215541 -9720268 -10664142
$$ packed form
35594F932012N910173M000852O20976k757988n950848o805950l791857L32844
35586a509786K551503M402493P459875P816127J935007n206572n700488m04089
35578A1344070K899136J682095P54636K495690L280285P30437k661232m645423
35570A5879694n803834n861791l269413L47191P55453k676601o010502o372479
35562a3012282m054461L42295N521049P269457K975574k363721j651336L257981
35554a715444L893292j202506l983350J02070N348142N449168K111764l48299
35546I654837k308690n678998q458790p260449k044678M606301R756040J0296387
35538H561960N243441j030042k897019j577579l089259p427043p504727r43874
$$ plain form
35530 -10664142 -5342658 270255 2971929 3514915 1676862 -2712523 -5450548 -2633504
35522 -2633504 1057353 -2542290 -11153275 -12720252 -2717285 8437449 10215306 6195766
35514 6195766 6539013 12162563 14745343 9866009 2291988 -2031992 -3252101 -4909715
35506 -4909715 -7557839 -7709364 -2470674 6284111 13417750 16380715 17791132 20368714
35498 20368714 21375921 16208949 6952517 2174001 6469039 14391072 17332247 13255891
35490 13255891 6943481 3243191 3019799 4049859 3192074 -1496006 -8879548 -15343286
35482 -15343286 -17933616 -16111362 -10698813 -3241186 3430585 6614399 6508611 5493768
35474 5493768 4434401 2170888 -1364103 -4670731 -7397690 -9936098 -10310501 -6162428
$$ packed form
35530a0664142N321484N612913K701674N42986j838053m389385k738025K817044
35522b633504L690857l599643q610985j566977J0002967J1154734J777857m019540
35514F195766L43247N623550K582780m879334p574021m323980j220109j657614
35506d909715k648124j51525N238690Q754785P133639K962965J410417K577582
35498B0368714J007207n166972r256432m778516M295038P922033K941175m076356
35490A3255891o312410l700290k23392J030060q57785m688080p383542o463738
35482a5343286k590330J822254N412549P457627O671771L183814j05788j014843
35474E493768j059367k263513l534991l306628k726959k538408l74403M148073
$$ plain form
35466 -6162428 -592336 -504564 -6918320 -12317167 -10940235 -6614538 -6002294 -8679805 -9579592
35457 -9579592 -7993886 -7716750 -9591345 -9955958 -6744733 -2340108 532354 2184908
35449 2184908 4340338 7670195 11425851 13593036 11655207 5232284 -2489376 -7927892
35441 -7927892 -10883777 -12954558 -13427629 -10092090 -3932983 534014 876375 344863 4158024
35432 4158024 13110940 22066890 24758133 19729422 11324285 4755121 1089601 -1785146
35424 -1785146 -4438244 -5001621 -3108453 -1491274 -2343576 -4754802 -7192765 -9844300
35416 -9844300 -12778458 -14470290 -14170442 -13293520 -12663641 -11289225 -9807610 -11336511 -15681118
35407 -15681118 -16489551 -8901414 2563201 8974399 8411815 7154655 9831116 13505541
$$ packed form
35466f162428N570092Q7772o413756n398847J376932M325697O12244k677511q99787
35457i579592J585706K77136j874595l64613L211225M404625K872462J652554
35449B184908K155430L329857L755656K167185j937829o422923p721660n438516
35441g927892k955885k070781m73071L335539O159107M466997L42361n31512L813161
35432D158024Q952916Q955950K691243n028711q405137o569164l665520k874747
35424a785146k653098n63377J893168J617179q52302k411226k437963k651535
35416i844300k934158j691832K99848Q76922O29879J374416J481615j528901m344607
35407a5681118q08433P588137J1464615O411198n62584j257160K676461L674425
$$ plain form
35399 13505541 12714057 6625708 -477952 -3852622 -2575982 -308493 -1491030 -5862318
35391 -5862318 -8140063 -4481554 2755030 8429023 10253619 8873981 5583325 3112399
35383 3112399 5185579 10980113 13232352 7022072 -2362754 -6176077 -4308132 -3769955
35375 -3769955 -6811854 -8455122 -5851030 -2279260 -529500 465372 494355 -3385519 -10415818
35366 -10415818 -14727035 -13653888 -11573877 -12046958 -12181711 -9206257 -6873446 -9437559
35358 -9437559 -13435759 -11975452 -5082790 178300 -540238 -3622774 -2570818 4354696
35350 4354696 12016512 12991994 5045124 -5769306 -11418259 -11187170 -11245350 -14685472 -17100929
35341 -17100929 -14209953 -8613070 -5018492 -2982029 726149 5394276 7006566 4186128
$$ packed form
35399A3505541p91484o088349p103660l374670J276640K267489j182537m371288
35391e862318k277745L658509P236584N673993J824596j379638l290656k470926
35383C112399K073180N794534K252239o210280r384826l813323J867945N38177
35375c769955l041899j643268K604092L571770J749760R94872K8983l879874p030299
35366a0415818m311217J073147K080011m73081j34753K975454K332811k564113
35358i437559l998200J460307O892662N261090p18538l082536J051956O925514
35350D354696P661816R75482p946870j0814430n648953K31089n8180l440122k415457
35341a7100929K890976N596883L594578K036463L708178M668127J612290k820438
$$ plain form
35333 4186128 -437462 -3658655 -3464766 926991 7646648 12282251 12165884 8985184
35325 8985184 5182308 729061 -3773798 -4565760 146073 5189696 3678955 -3942978
35317 -3942978 -10364904 -9954177 -3334230 5120811 10752767 10993176 7611862 5049610
35309 5049610 3993748 -122220 -8776348 -15084081 -12558585 -5111399 -1188120 -1351812
35301 -1351812 -360951 824119 -4166379 -13839475 -17249997 -9196279 2054666 6766259
35293 6766259 5529243 3799138 1936232 -2488008 -7709688 -10148528 -10369029 -10523879
35285 -10523879 -8811900 -2665580 4715133 7240634 4351294 1076539 290246 247092
35277 247092 -3908 2065245 8061814 15084390 18462488 16409332 11179868 6886862
$$ packed form
35333D186128m623590l221193J93889M391757O719657M635603j16367l180700
35325H985184l802876m453247m502859p91962M711833N043623j510741p621933
35317c942978o421926M10727O619947Q455041N631956K40409l381314k562252
35309E049610j055862m115968q654128o307733K525496P447186L923279j63692
35301a351812R90861J185070m990498r673096l410522Q053718J1250945M711593
35293F766259j237016j730105j862906m424240n221680k438840k20501j54850
35285a0523879J711979O146320P380713K525501k889340l274755p86293m3154
35277B47092k51000K069153N996569P022576L378098k053156n229464m293006
$$ plain form
35269 6886862 6272136 8548656 10736702 11623089 12686872 13979963 11911559 4126047
35261 4126047 -5414694 -9974124 -7825513 -3191145 -253466 175361 -1331175 -3787921
35253 -3787921 -4317338 33956 7358872 11197748 7899446 1115316 -3091169 -3372956
35245 -3372956 -3108882 -5140130 -9024556 -12439864 -12958299 -9084945 -1847420 4700198
$$ packed form
35269F886862o14726K276520K188046Q86387J063783J293091k068404p785512
35261D126047r540741m559430K148611M634368K937679M28827j506536k456746
35253c787921n29417M351294P324916L838876l298302o784130m206485k81787
35245c372956K64074k031248l884426l415308n18435L873354P237525O547618
$$ [...]
##END NTUPLES=NMR SPECTRUM
##END=
