##TITLE=31Pdec_DE-63_23_oil
 D2O, 64 sc
 8.8.2024
##JCAMPDX= 6.0         $$ Bruker NMR JCAMP-DX V2.0
##DATA TYPE= NMR SPECTRUM
##DATA CLASS= NTUPLES
##ORIGIN= UXNMR, Bruker Analytische Messtechnik GmbH
##OWNER= root
$$ XWIN-NMR		Version 3.5
$$ Thu Aug  8 14:17:08 2024 Russian Standard Time (UT+4h)  she@DPX200
##.OBSERVE FREQUENCY= 81.013821
##.OBSERVE NUCLEUS= ^31P
##.ACQUISITION MODE= SIMULTANEOUS
##.ACQUISITION SCHEME= undefined
##.AVERAGES= 64
##.DIGITISER RES= 17
##SPECTROMETER/DATA SYSTEM= spect
##.PULSE SEQUENCE= zgpg30
##.SOLVENT NAME= D2O
##.SHIFT REFERENCE= (INTERNAL, D2O, 0, 198.062)
##AUDIT TRAIL= $$ (NUMBER, WHEN, WHO, WHERE, WHAT)
$$ ##TITLE= Audit trail, XWIN-NMR		Version 3.5
$$ ##JCAMPDX= 5.01
$$ ##ORIGIN= Bruker BioSpin GmbH
$$ ##OWNER= she
$$ F:/spectra/data/she/nmr/P31/2/pdata/1/auditp.txt
$$ ##AUDIT TRAIL=  $$ (NUMBER, WHEN, WHO, WHERE, WHAT)
(   1,<2024-08-08 14:16:04.32 +0400>,<she>,<DPX200>,
      <created by zg, POWCHK disabled, PULCHK disabled
       configuration hash MD5:
       00 E9 B6 7A A2 85 ED C7 34 08 36 98 17 FE 4E 26
       data hash MD5: 32K
       92 87 9E 12 F7 39 1D AC 3A D8 FF 28 1C B5 9C D8>)
(   2,<2024-08-08 14:16:07.01 +0400>,<she>,<DPX200>,
      <Start of raw data processing
       efp BC_mod = 2 LB = 1.5 FT_mod = 6 PKNL = 1 PHC0 = 2684.276 PHC1 = 94.48804 SI = 64K 
       data hash MD5: 64K
       9C AE D8 3B FB 7F 53 0C A5 D6 C5 C1 AB 72 8E D9>)
(   3,<2024-08-08 14:16:29.34 +0400>,<she>,<DPX200>,
      <pk PHC0 = -16.52729 PHC1 = -10.4 
       data hash MD5: 64K
       6A EC AB 2C AC 2C 6E 8D C1 6A 2D 73 13 E4 53 C1>)
(   4,<2024-08-08 14:16:33.89 +0400>,<she>,<DPX200>,
      <abs ABSG = 5 
       data hash MD5: 64K
       FD 46 66 05 DD 2A 87 9F 2D BA AF 2F 13 4C D5 10>)
$$ ##END=
$$ 
$$ hash MD5
$$ 17 55 2A D9 D4 BD C1 41 1E E8 31 0A 70 72 2A F1
##$RELAX= 
##$RELAX= 
##$RELAX= 
##$RELAX= 
##$RELAX= 
##$RELAX= 
##$RELAX= 
##$RELAX= 
$$ Bruker specific parameters
$$ --------------------------
##$DU= <F:/spectra>
##$EXPNO= 2
##$NAME= <P31>
##$PROCNO= 1
##$TYPE= <nmr>
##$USER= <she>
##$AMP= (0..31)
100 100 100 100 100 100 100 100 100 100 100 100 100 100 100 100 100 100 
100 100 100 100 100 100 100 100 100 100 100 100 100 100 
##$AQSEQ= 0
##$AQ_mod= 1
##$AUNM= <au_zg>
##$AUTOPOS= <>
##$BF1= 81.014009
##$BF2= 200.13
##$BF3= 200.13
##$BF4= 200.13
##$BF5= 200.13
##$BF6= 200.13
##$BF7= 200.13
##$BF8= 200.13
##$BYTORDA= 1
##$CFDGTYP= 0
##$CFRGTYP= 5
##$CHEMSTR= <none>
##$CNST= (0..31)
1 1 145 1 1 1 1 1 1 1 1 1 1 1 1 1 1 1 1 1 1 1 1 1 1 1 1 1 1 1 1 1 
##$CPDPRG= <waltz16>
##$CPDPRG1= <>
##$CPDPRG2= <waltz16>
##$CPDPRG3= <>
##$CPDPRG4= <mlev>
##$CPDPRG5= <mlev>
##$CPDPRG6= <mlev>
##$CPDPRG7= <mlev>
##$CPDPRG8= <mlev>
##$CPDPRGB= <>
##$CPDPRGT= <>
##$D= (0..31)
0 1 0 0 0 0 0 0 0 0.06 0 0.03 2e-05 3e-06 0 0 0.0002 0 0 0 0 0 0 0 0 0 
0 0 0 0 0 0 
##$DATE= 1723112163
##$DBL= (0..7)
120 120 120 11 120 120 24 19 
##$DBP= (0..7)
150 150 150 150 150 150 150 150 
##$DBP07= 0
##$DBPNAM0= <>
##$DBPNAM1= <>
$$ [...]
##$SUBNAM3= <"">
##$SUBNAM4= <"">
##$SUBNAM5= <"">
##$SUBNAM6= <"">
##$SUBNAM7= <"">
##$SUBNAM8= <"">
##$SUBNAM9= <"">
##$SW= 400.765351723535
##$SWIBOX= (0..15)
0 1 3 0 0 0 0 0 0 0 0 0 0 0 0 0 
##$SW_h= 32467.5324675325
##$TD= 32768
##$TD0= 1
##$TE= 0
##$TE2= 300
##$TE3= 300
##$TEG= 300
##$TL= (0..7)
0 120 53 12 22 120 120 120 
##$TP= (0..7)
150 150 150 150 150 150 150 150 
##$TP07= 0
##$TPNAME0= <>
##$TPNAME1= <>
##$TPNAME2= <>
##$TPNAME3= <>
##$TPNAME4= <>
##$TPNAME5= <>
##$TPNAME6= <>
##$TPNAME7= <>
##$TPOAL= (0..7)
0.5 0.5 0.5 0.5 0.5 0.5 0.5 0.5 
##$TPOFFS= (0..7)
0 0 0 0 0 0 0 0 
##$TUNHIN= 0
##$TUNHOUT= 0
##$TUNXOUT= 0
##$USERA1= <user>
##$USERA2= <user>
##$USERA3= <user>
##$USERA4= <user>
##$USERA5= <user>
##$V9= 5
##$VALIST= <valist>
##$VCLIST= <CCCCCCCCCCCCCCC>
##$VD= 0
##$VDLIST= <DDDDDDDDDDDDDDD>
##$VPLIST= <PPPPPPPPPPPPPPP>
##$VTLIST= <TTTTTTTTTTTTTTT>
##$WBST= 1024
##$WBSW= 4
##$XGAIN= (0..3)
0 0 0 0 
##$XL= 0
##$YL= 0
##$YMAX_a= 19234
##$YMIN_a= -18315
##$ZGOPTNS= <>
##$ZL1= 120
##$ZL2= 120
##$ZL3= 120
##$ZL4= 120
##$ABSF1= 198.0616
##$ABSF2= -202.7028
##$ABSG= 5
##$ABSL= 3
##$ALPHA= 0
##$AQORDER= 0
##$ASSFAC= 0
##$ASSFACI= 0
##$ASSFACX= 0
##$ASSWID= 0
##$AUNMP= <proc_1d>
##$AZFE= 0.1
##$AZFW= 0.5
##$BCFW= 0
##$BC_mod= 2
##$BYTORDP= 0
##$COROFFS= 0
##$CY= -3
##$DATMOD= 1
##$DC= 0
##$DFILT= <>
##$DTYPP= 0
##$F1P= 0
##$F2P= 0
##$FCOR= 1
##$FTSIZE= 65536
##$FT_mod= 6
##$GAMMA= 0
##$GB= 0
##$INTBC= 1
##$INTSCL= 9.790993e-09
##$ISEN= 30
##$LB= 1.5
##$LEV0= 0
##$LPBIN= 0
##$MAXI= 10000
##$MC2= 0
##$MEAN= 0
##$ME_mod= 0
##$MI= 50
##$NCOEF= 0
##$NC_proc= -7
##$NLEV= 6
##$NOISF1= 182.463
##$NOISF2= 159.3651
##$NSP= 0
##$NTH_PI= 0
##$NZP= 0
##$OFFSET= 198.0616
##$PC= 4
##$PHC0= 2667.749
##$PHC1= 84.08804
##$PH_mod= 1
##$PKNL= yes
##$PPARMOD= 0
##$PSCAL= 0
##$PSIGN= 0
##$REVERSE= no
##$SF= 81.0140089999434
##$SI= 65536
##$SIGF1= 159.3651
##$SIGF2= -187.1042
##$SINO= 113.3802
##$SIOLD= 16384
##$SREGLST= <1H.CDCl3>
##$SSB= 0
##$STSI= 65536
##$STSR= 0
##$SW_p= 32467.5324675325
##$SYMM= 0
##$S_DEV= 0
##$TDeff= 32768
##$TDoff= 0
##$TI= <>
##$TILT= no
##$TM1= 0
##$TM2= 0
##$TOPLEV= 0
##$USERP1= <user>
##$USERP2= <user>
##$USERP3= <user>
##$USERP4= <user>
##$USERP5= <user>
##$WDW= 1
##$XDIM= 65536
##$YMAX_p= 321756380
##$YMIN_p= -26807975
$$ End of Bruker specific parameters
$$ ---------------------------------
##NTUPLES= NMR SPECTRUM
##VAR_NAME=  FREQUENCY,     SPECTRUM/REAL,   SPECTRUM/IMAG
##SYMBOL=    X,             R,               I
##VAR_TYPE=  INDEPENDENT,   DEPENDENT,       DEPENDENT
##VAR_FORM=  AFFN,          ASDF,            ASDF
##VAR_DIM=   65536,         65536,           65536
##UNITS=     HZ,            ARBITRARY UNITS, ARBITRARY UNITS
##FACTOR=    0.49542278885378, 1,            1
##FIRST=     16045.7642231865, 0,            0
##LAST=      -16421.768244346, 0,            0
##MIN=       -16421.768244346, -26807975,    0
##MAX=       16045.7642231865, 321756380,    0
$$ Real data points
##PAGE= N=1
##DATA TABLE= (X++(R..R)), XYDATA
$$ [...]
40312a505991J734616J486973N65490k7233k82913m55267k99863L47909R48458
$$ -1505991 228625 1715598 2281088 2253855 1970942 1515675 1215812 1563721 2512179
40303B512179Q37189J19717m19302j98853N04740P17527l10816k144153l310649
$$ 2512179 3349368 3469085 3049783 2850930 3355670 4073197 3762381 1618228 -1692421
40294a692421k752726r79667N57124J016346O61384P1337m44608o28619j76838
$$ -1692421 -4445147 -5424814 -4867690 -3851344 -3189960 -3118623 -3563231 -4191850 -4368688
40285d368688P81788J489294J242124K14153o23239m88352L52184Q85385O27804
$$ -4368688 -3586900 -2097606 -855482 -641329 -1264568 -1752920 -1400736 -515351 112453
40276A12453K95618P51646J551088J393849J02811q82861m91338M58145N33865
$$ 112453 408071 1159717 2710805 4104654 4207465 3324604 2833266 3291411 3825276
40267C825276k52577o80245j49837P25237J125721P82111o5322p42741m94533
$$ 3825276 3572699 2892454 2742617 3467854 4593575 5375686 5310364 4567623 4073090
40258D073090N25297J042902K31766j042570j445884r91256n30202k02148J41501
$$ 4073090 4598387 5641289 5873055 4830485 3384601 2393345 1863143 1660995 1802496
40249A802496k73626j980314l369804k292969M40498J666475M09840p98365p6199
$$ 1802496 1528870 -451444 -3821248 -6114217 -5673719 -4007244 -3597404 -4395769 -4471968
40240d471968J053299O79672k51264k1066N64621k50151j686376j525910O2546
$$ -4471968 -3418669 -2738997 -2990261 -3011327 -2446706 -2696857 -4383233 -5909143 -5846597
40231e846597Q42909M35139Q26607K557360L388968J898909j58375o57354j86147
$$ -5846597 -5003688 -4568549 -3741942 -1184582 2204386 4103295 3944920 3287566 3101419
40222C101419m36761j120236p07682O40789J129882J50836q53128o30702K72810
$$ 3101419 2664658 1544422 836740 1477529 2607411 2758247 1905119 1274417 1547227
40213A547227O95763M97521K70753J24013m49719j682913l026283l571137k816944
$$ 1547227 2242990 2740511 3011264 3135277 2685558 1002645 -2023638 -5594775 -8411719
40204h411719j064417Q50666K192456K676294K305452J217806j37176j046879
$$ -8411719 -9476136 -8625470 -6433014 -3756720 -1451268 -233462 -370638 -1417517
40196a417517j149672p87657m17397J8064O76125J165669J046013P07485Q07852
$$ -1417517 -2567189 -3354846 -3772243 -3754179 -3078054 -1912385 -866372 -158887 648965
40187F48965R44421J12213j294743j400229M24852K113967J546312m13499j290281
$$ 648965 1593386 1705599 410856 -989373 -564521 1549446 3095758 2682259 1391978
40178A391978p38208o97184j826191k204323m82832J745530K220875J153114L98654
$$ 1391978 653770 -43414 -1869605 -4073928 -4556760 -2811230 -590355 562759 961413
40169I61413N88331Q62830P48002M82799r7614j223862j951904j049325Q51696
$$ 961413 1549744 2412574 3160576 3643375 3545761 2321899 369995 -679330 172366
40160A72366J714433Q94624k23044o70373j120344k006264k248764j023667O05119
$$ 172366 1886799 2781423 2558379 1888006 767662 -1238602 -3487366 -4511033 -3905914
40151c905914J129262O69676M02011P38514J229581J560972J530988O80182r05231
$$ -3905914 -2776652 -2106976 -1704965 -966451 263130 1824102 3355090 4035272 3130041
40142C130041j956688j385160P0661P07024J56088l05865K39812J079495R29714
$$ 3130041 1173353 -211807 -141146 565878 721966 416101 655913 1735408 2665122
40133B665122l49078j523412j395678l10895N6422j171071k561647k012050K46906
$$ 2665122 2316044 792632 -603046 -913941 -857519 -2028590 -4590237 -6602287 -6355381
40124f355381J773495J362704N97722J032133J649025P89673q19098j095242J65443
$$ -6355381 -4581886 -3219182 -2621460 -1589327 59698 849371 30273 -1064969 -899526
40115h99526J255069J327476J062248P09175l05373j541604j459215J11637J251588
$$ -899526 355543 1683019 2745267 3454442 3149069 1607465 148250 259887 1511475
40106A511475O69534m25811l41514M98878M05500r09505k016769j934775j310115
$$ 1511475 2181009 1755198 1413684 1912562 2318062 1408557 -608212 -2542987 -3853102
40097c853102j106835j040003j03997J603410K543594J727529K98050J5321N60043
$$ -3853102 -4959937 -5999940 -6103937 -4500527 -1956933 -229404 68646 83967 644010
40088F44010J3242j790190k459554o41193J588252J665371J82460n82342k85220
$$ 644010 657252 -1132938 -3592492 -4233685 -2645433 -980062 -797602 -1379944 -1665164
40079a665164k5844N16808K215511L460893J700690j897020l135875r49554R07545
$$ -1665164 -1691008 -1174200 1041311 4502204 6202894 4305874 1169999 220445 1127990
40070A127990k27382k032624j447374N29311J185564N39630J88127j69421j579319
$$ 1127990 900608 -1132016 -2579390 -2050079 -864515 -324885 -136758 -306179 -1885498
40061a885498k741917j667938M87477P58729q89217j523111Q7759J979958K506043
$$ -1885498 -4627415 -6295353 -5807876 -5049147 -5938364 -7461475 -7373716 -5393758 -2887715
40052b887715K316211K177221J576844M28310k29110j70814m64346j213472j101621
$$ -2887715 -571504 1605717 3182561 3610871 3381761 3210947 2746601 1533129 431508
40043D31508p0965J6516j358410j980122n24581Q21277k67708k214603j747805
$$ 431508 360543 377059 -981351 -2961473 -3486054 -2664777 -2932485 -5147088 -6894893
40034f894893J049704K917999K195804N27633l34321o96684j126315q67859N49868
$$ -6894893 -5845189 -2927190 -731386 -203753 -538074 -1234758 -2361073 -3228932 -2679064
40025b679064J766654J220903n80340j751724j439475m29378K68243L95370J49997
$$ -2679064 -912410 308493 -271847 -2023571 -3463046 -3892424 -3624181 -3228811 -3078814
40016c078814j94131l01494q992M11431O30492P52467R54316Q82413J12997q85675
$$ -3078814 -3272945 -3574439 -3583431 -3172000 -2541508 -1789041 -834725 47688 160685 -724990
40006g24990j072504k45242O37286P81279M41483J58589m1564j66984J53052Q28849
$$ -724990 -1797494 -2042736 -1405450 -624171 -182688 -24099 -65663 -232647 -79595 749254
39996G49254Q68610k10506j242260r58040j10735m55478j848576k223719p45071
$$ 749254 1617864 1407358 165098 -792942 -903677 -1359155 -3207731 -5431450 -6176521
39987f176521Q77649J005694L52647M97928J431647J933025J479396M84657o53168
$$ -6176521 -5298872 -4293178 -3940531 -3442603 -2010956 -77931 1401465 1886122 1232954
39978A232954j550196j559978o97139j95547r01760j731784j088860P08838J880404
$$ 1232954 -317242 -1877220 -2574359 -2769906 -3671666 -5403450 -6492310 -5783472 -3903068
39969c903068J674233R06522K89572k10507m66522k00516R6330k65614p41330
$$ -3903068 -2228835 -1322313 -1032741 -1243248 -1709770 -1910286 -1813956 -2079570 -2820900
39960b820900k85515N60916K32023j043986j147230N77283K035087J557481L63803
$$ -2820900 -3106415 -2545499 -2313476 -3357462 -4504692 -3927409 -1892322 -334841 28962
39951B8962L51012J134557J117683K17300m40803o62072j066582j410625r41142
$$ 28962 379974 1514531 2632214 2849514 2408711 1746639 680057 -730568 -1671710
39942a671710j21211j40915p80052n92843N80117J087283K8053j248793j118676
$$ -1671710 -1792921 -1933836 -2713888 -3306731 -2726614 -1639331 -1611278 -2860071 -3978747
39933c978747O1303P42526M00477j72903l47210l24691l71712k84538Q0279L12404
$$ -3978747 -3917444 -3174918 -2774441 -2947344 -3294554 -3619245 -3990957 -4275495 -4195216 -3882812
39923c882812m8728p10352p83829J34159J365888J934921J709087J294469R39831
$$ -3882812 -3931540 -4641892 -5425721 -5291562 -3925674 -1990753 -281666 1012803 1952634
39914A952634K92588n92081q76726j83506M99261P3736r12233q57826N67502J775242
$$ 1952634 2245222 1653141 776415 592909 1092170 1165906 253673 -604153 -36651 1738591
39904A738591J305386l20054j399857j177615m45933k03347m03096k91267L88207
$$ 1738591 3043977 2723923 1324066 146451 -299482 -502829 -905925 -1197192 -808985
39895h08985J002525R23502M27796K78158N33707M01264m95299j307422j005983
$$ -808985 193540 1117042 1544838 1822996 2356703 2757967 2262668 955246 -50737
39886e0737J21598P42031J85246p90901j084078n19043K63522P64134J026228
$$ -50737 70861 812892 998138 207237 -876841 -1395884 -1132362 -368228 658000
39877F58000J204587J118830M16918q72363k112512k550871k021111r68295J82951
$$ 658000 1862587 2981417 3398335 2525972 413460 -2137411 -4158522 -5126817 -4943866
39868d943866J307216K142692K140759J200525J65485j754O32025J147409R02919
$$ -4943866 -3636650 -1493958 646801 1847326 2012811 2011057 2643082 3790491 4693410
39859D693410l9147j338794k466609k534354j053821R42769J552083K88775j110384
$$ 4693410 4654263 3315469 848860 -1685494 -2739315 -1796546 -244463 44312 -1066072
39850a066072q56811O22435J451577Q05306m06532j097460j116215p33695j05401
$$ -1066072 -1922883 -1300448 151129 956435 549903 -547557 -1663772 -2397467 -2502868
39841b502868M05793L24369N048O07318K377299L695686K860620L87417j580812
$$ -2502868 -2097075 -1772706 -1767658 -1160340 1216959 4912645 7773265 8160682 6579870
39832F579870j963494j630993j523523j248128k08281R67664J189218N21747K583
$$ 6579870 4616376 2985383 1461860 213732 5451 973115 2162333 2684080 2686663
39823B686663Q3617J84856k34313r46954j392771j242259m82587N04667R31448
$$ 2686663 2770280 2955136 2720823 1773869 381098 -861161 -1343748 -839081 92367
39814I2367K56075j045014j848346j598072p16377J30655N89288M80166j58333
$$ 92367 348442 -696572 -2544918 -4142990 -4859367 -4728712 -4139424 -3659258 -3817591
39805c817591p48543n95124J63849O92996P22548Q60246J316753J261672J36565
$$ -3817591 -4566134 -5161258 -4997409 -4304413 -3581865 -2721619 -1404866 -143194 -6629
39796f629j164145j346106m69462L01561M12274L59277M65186L01740k80181m48432
$$ -6629 -1170774 -2516880 -2986342 -2684781 -2272507 -1913230 -1448044 -1146304 -1426485 -1874917
39786a874917M90636J695187J439489o88130k935361l212346j381366Q43068J990227
$$ -1874917 -1384281 310906 1750395 1062265 -1873096 -5085442 -6466808 -5623740 -3633513
39777c633513K001652J371548K88200q26735r84148J57974J423739J510192O87267
$$ -3633513 -1631861 -260313 27887 -798848 -1782996 -1625022 -201283 1308909 1996176
39768A996176L6874l23626q54704j065808j95878R25312P88721r7958J79312J372420
$$ 1996176 2033050 1709424 854720 -211088 -406966 518346 1307067 1209109 1388421 2760841
39758B760841R26976j627738l120317j422915J028212J004837m94942k86906J510603
$$ 2760841 3687817 2060079 -1060238 -2483153 -1454941 -450104 -945046 -1231952 278651
39749B78651J828690n8570j416898o52637M05215p5285j128974j141657m85210
$$ 278651 2107341 2048771 631873 -20764 384451 309166 -819808 -1961465 -2446675
39740b446675k75249k40911M17113J278717J402936R06491N31806L56183M9705
$$ -2446675 -2721924 -2962835 -2545722 -1267005 135931 1042422 1574228 1930411 1980116
39731A980116k17286j13320J40068J75162O0732j09164n24561j010492q79006
$$ 1980116 1762830 1649510 1789578 1964740 2025472 1916308 1391747 381255 -497751
39722d97751l1809O38763N69395L17541L57165J45070o83988j203734m82651P38964
$$ -497751 -529560 109203 678598 996139 1353304 1498374 814386 -389348 -871999 -133035
39712a33035R32415m6472p99806k59995J117641J953708J247362o54115k104373
$$ -133035 799380 752908 -46898 -306893 810748 2764456 4011818 3357703 1253330
39703A253330j728787j73093N89406k0239m38843M33679J427801J124353K39816
$$ 1253330 -475457 -648550 -59144 -79383 -518226 -84547 1343254 2467607 2707423
39694B707423K52804P36952J75513j106245j054086R50353K934539K834790P72339
$$ 2707423 2960227 3697179 3872692 2766447 1712361 2662714 5597253 8432043 9204382
39685I204382j575151k724090k205358p06663L05425j7787q02270o17775M19327
$$ 9204382 7629231 4905141 2699783 1993120 2298545 2280758 1478488 860713 1280040
39676A280040Q77975K26662n78324p83028o19093j61382R82854K302143K284349
$$ 1280040 2158015 2384677 1806353 1023325 404232 242850 1225704 3527847 5812196
39667E812196N61050j194804j477136q35487n15841m41989N1097M13082m76989
$$ 5812196 6373246 5178442 3701306 2865819 2349978 1907989 1959086 2372168 1895179
39658A895179k160387k656705r25111J748442L149306K339225L20016j093670
$$ 1895179 -265208 -2921913 -3847024 -2098582 1050724 3389949 3709965 2616295
39650B616295j003618k12974j17231q16447j014350p9088P91146L18372p77967
$$ 2616295 1612677 1399703 1282472 466025 -548325 -627413 163733 482105 -295862
39641b95862p42532N90599J556673J065753q5807o47481m83563j30202K43919
$$ -295862 -1038394 -447795 1108878 2174631 2088824 1441343 957780 827578 1071497
39632A071497O43159O61193p4782j188228j909741j905772j282120j54636J155702
$$ 1071497 1714656 2375849 2301067 1112839 -796902 -2702674 -3984794 -4139430 -2983728
39623b983728J852922J413104M74745J45737M20654K23072p55694j301555m01229
$$ -2983728 -1130806 282298 757043 902780 1323434 1546506 790812 -510743 -911972
39614i11972J136473J720099J068689K01090k98588p35449j049761n01374Q97545
$$ -911972 224501 1944600 3013289 3214379 2915791 2180342 1130581 629207 1526752
39605A526752J783461J057105o86088k051655k447441k081721j183992j89787
$$ 1526752 3310213 4367318 3681230 1629575 -817866 -2899587 -4083579 -4273366
39597d273366K4323p22162j080992J91806K143373K668530J509303N21943P15335
$$ -4273366 -4249043 -4971205 -6052197 -5860391 -3717018 -1048488 460815 982758 1698093
39588A698093Q33012k99910j617572j334271M00566J777378J698994O31699n50913
$$ 1698093 2531105 2231195 613623 -720648 -320082 1457296 3156290 3787989 3237076
39579C237076j374664j549613j039478m28800l78552o42802l60156O43236J582147
$$ 3237076 1862412 312799 -726679 -1155479 -1534031 -2176833 -2536989 -1893753 -311606
39570c11606J813677J465277Q23310j26456j213697j797719j450712n33659K92977
$$ -311606 1502071 2967348 3790658 3664202 2450505 652786 -797926 -1331585 -1038608
39561a038608Q10086J162691J359401J227204O85268j84887j112217j503446q03669
$$ -1038608 -228522 934169 2293570 3520774 4206042 4021155 2908938 1405492 601823
39552F01823N58115J046557l36885k420770k830890q43382J625825K401817J533143
$$ 601823 1159938 2206495 1869610 -551160 -3382050 -4225432 -2599607 -197790 1335353
39543A335353N11958j47607j036620j857804j236226Q56608K203598J151273r07865
$$ 1335353 1847311 1699704 663084 -1194720 -2430946 -1574338 629260 1780533 872668
39534H72668j435985k73706N68298J69016l49885k36536l19579j048421j230463
$$ 872668 -563317 -837023 -268725 -99709 -449594 -686130 -1005709 -2054130 -3284593
39525c284593j329J393375J310236K13509j12340P45667J471011J107258J30479
$$ -3284593 -3285922 -1892547 -582311 -368802 -481142 264525 1735536 2842794 2973273
39516B973273n71357o93760m51980l86927j108902k375331k714950j069255J390310
$$ 2973273 2401916 1708156 1256176 869249 -239653 -2614984 -5329934 -6399189 -5008879
39507e008879K357891J316449M0295j3093O09232P90275N84158N98151O70170
$$ -5008879 -2650988 -1334539 -1294244 -1307337 -698105 92170 676328 1274479 1944649
39498A944649K58847m72188r36941j040376r37543l23382J039641K316890K184460
$$ 1944649 2203496 1731308 794367 -246009 -1183552 -1506934 -467293 1849597 4034057
39489D034057N51544j124259j518099q14311r0565J17385R7115P6775k42773j000406
$$ 4034057 4585601 3461342 1943243 1128932 1038367 1155752 1252867 1329642 1086869 86463
39479H6463j455322o11697J324731K717240K231596M52083q52838q37864j68188
$$ 86463 -1368859 -1980556 -655825 2061415 4293011 4745094 3892256 3054392 2886204
39470B886204L78068Q13408J131091O96063p18233k008240j877425n82981L76708
$$ 2886204 3264272 4077680 5208771 5904834 5186601 3178361 1300936 717955 1094663
39461A094663J93304n00003q22992p20266n51438l20738J57803O78592P54630
$$ 1094663 1287967 787964 -35028 -755294 -1306732 -1627470 -1469667 -791075 -36445
39452c6445L01259j03137J91436J090645J707123J319893K88215l52524k23904
$$ -36445 264814 161677 353113 1443758 3150881 4470774 4758989 4406465 4182561
39443D182561q489k98072o62924m12755K30294M87424K23806r5228m77196j360442
$$ 4182561 4174072 3876000 3213076 2800321 3030615 3518039 3741845 3646617 3169421 1808979
39433A808979k342395k087809j71809J782012J718489l93700k481505k666773
$$ 1808979 -533416 -2621225 -2793034 -1011022 707467 313767 -2167738 -4834511
39425d834511j049258Q18787J675381J508164J073776Q48791O47574K43304K439
$$ -4834511 -5883769 -5064982 -3389601 -1881437 -807661 41130 688704 932008 934447
39416I34447M19971J081774P90131q71109k622285k794516j312709L09876Q84194
$$ 934447 1354418 2436192 3226323 2355214 -267071 -3061587 -4374296 -4064420 -3180226
39407c180226O91649N47102N21955K14817j91797J279Q77453J558777J304491
$$ -3180226 -2488577 -1941475 -1419520 -1204703 -1396500 -1395221 -517768 1041009 2345500
39398B345500M76562l964J61250M98811N89151M44494R5735n18598j047817p94414
$$ 2345500 2822062 2818098 2979348 3478159 4067310 4511804 4607539 4088941 3041124 2246710
39388B246710K49813R91681N29744m93180n85088O98470K284248K955877K470291
$$ 2246710 2496523 3488204 4017948 3524768 2939680 3638150 5922398 8878275 11348566
39379A1348566J312531J67847k10405N33968J682999J981561J201497L87823J84912
$$ 11348566 12661097 12828944 12618539 13152507 14835506 16817067 18018564 18406387 18591299
39370A8591299o2147q53984j298723n44272L51114m34712k697340m109614l142131
$$ 18591299 18529152 17675168 16376445 15832173 16183287 15748575 13051235 8941621 5799490
39361E799490q13764Q40737R47334r34j063160j358104n15145P00736Q90458k41662
$$ 5799490 4985726 5826463 6773797 6772863 5709703 4351599 3836454 4537190 5427648 5185986
39351E185986j306718r99123K57352J179963J441627J589995J617038Q45984p18677
$$ 5185986 3879268 2880145 3137497 4317460 5759087 7349082 8966120 9812104 9093427
39342I093427j971621j994793j128035m37502n36917j155231j544925j146167
$$ 9093427 7121806 5127013 3998978 3561476 3024559 1869328 324403 -821764
39334h21764p1750R75275J392783J210368P98359L33699j06477k37709P5444L22456
$$ -821764 -893514 81761 1474544 2684912 3483271 3816970 3710493 3472784 3548228 3870684
39324C870684j26808r82046j188524l16730P97714J133223P21513L66336M44361
$$ 3870684 3743876 2761830 1573306 1256576 2054290 3187513 3909026 4275362 4719723
39315D719723N28150J68461m17554o64820m32360j27846n7111m481K87760N21882
$$ 4719723 5247873 5416334 4998780 4333960 3901600 3773754 3716643 3712162 3999922 4521804
39305D521804K28694l60370m56565J70992Q76046J148455J214778J243314P80316
$$ 4521804 4750498 4390128 3933563 4104555 4980601 6129056 7343834 8587148 9367464
39296I367464l22686j157459q91926j42386j70105j040912j644373j321883m27136
$$ 9367464 9044778 7887319 6995393 6853007 6682902 5641990 3997617 2675734 2248598
39287B248598N08255J036517M97964j122968k178953r20161J682980K532542M96399
$$ 2248598 2756853 3793370 4291334 3168366 989413 69252 1752232 4284774 4781173
39278D781173j913718k014163l38542R31259J300465J667736J824703P08834j180861
$$ 4781173 2867455 853292 514750 1446009 2746474 4414210 6238913 6947747 5766886
39269E766886j958885j147707k58275j73576N2444J032838J594545P16208o11705
$$ 5766886 3808001 2660294 2402019 2228443 2280887 3313725 4908270 5624478 5012773
39260E012773r33875n39095m83240l67966Q99616K562955K462335L45863j330017
$$ 5012773 4078898 3539803 3056563 2688597 3588213 6151168 8613503 8959366 7629349
39251G629349q30262M19437K80988o60538k31778J443595J710399n53358k905520
$$ 7629349 6799087 7218524 7499512 6838974 6607196 8050791 9761190 9207832 6302312
39242F302312k651261n20669P07558K03605l29151K74152J021154N93189p99475
$$ 6302312 3651051 3130382 3837940 4041545 3712394 3986546 5007700 5600889 4801414
39233D801414k037515k391769j643459j3495J433489J399144N5873q78265m57081
$$ 4801414 2763899 372130 -1271329 -1284824 148665 1547809 1603682 725417 268336
39224B68336K57723J67328M0536J033393K330226K073235J99576j413903j572458
$$ 268336 526059 693387 733923 1767316 4097542 6170777 6370353 4956450 3383992
39215C383992r24104l73127J06818O38038P59450K39062m02923p43549j000320
$$ 3383992 2459888 2086761 2193579 2831617 3591067 3830129 3427206 2683657 1683337
39206A683337j264448j062709k62139L69811K08798k01728J01674J068536J601629
$$ 1683337 418889 -643820 -905959 -536148 -327350 -529078 -427404 641132 2242761
39197B242761Q57794q42600k380721k873911k324887j307045j51712J174699K317863
$$ 2242761 3100555 2257955 -122766 -2996677 -5321564 -6628609 -6780321 -5605622 -3287759
39188c287759K399708J227484k1477k22966J27115j30713q03587p39751L8804
$$ -3287759 -888051 339433 317956 94990 222105 91392 -712195 -1451946 -1413142
39179a413142L40523K8667L25213J367012J439346k77308j971127j710671k73474
$$ -1413142 -1072619 -1043952 -718739 648273 2087619 1810311 -160816 -1871487 -2144961
39170b144961K77772k51176m26731R9476K26376l96745q01478n99984o64318j317783
$$ -2144961 -1867189 -2118365 -2545096 -2445620 -2219244 -2615989 -3417467 -4017451 -4681769 -5999552
39160e999552j409013j03961J578613K078308J339084N04705J45568q1037k63072
$$ -5999552 -7408565 -7512526 -5933913 -3855605 -2516521 -2011816 -1866248 -1947285 -2210357
39151b210357O1375Q04577R73890O6562q73177n03776Q17727J363433M58419n80960
$$ -2210357 -2148982 -1344405 -370515 -303953 -1177130 -1680906 -863179 500254 958673 377713
39141C77713n00066L2185k73135j020534p24249O09902J260254L92355p46072
$$ 377713 -122353 -90168 -363303 -1383837 -2108086 -1498184 -237930 154425 -591647
39132e91647q21817j50308L47871N73568O66825K40427o64634r65009j40326N62372
$$ -591647 -1413464 -1563772 -1215901 -642333 24492 264919 -399715 -1364724 -1505050 -942678
39122i42678m9973j015937o14926Q14872J338719M44525k87892K84229J316600
$$ -942678 -992651 -2008588 -2623514 -1808642 -469923 -25398 -313290 -29061 1287539
39113A287539J433710M94001n93147r40408l08708O16376O07944o53466j793974
$$ 1287539 2721249 3215250 2622103 1681695 1372987 1989363 2597307 1943841 149867
39104A49867j436948k80592q6496q80008r38286L15350J324963R13300J2858q1192
$$ 149867 -1287081 -1567673 -1654169 -2534177 -3472463 -3157113 -1832150 -918850 -905992 -987184
39094i87184K99348J69864k49195K9754J067170J821419J398270j21429j747229
$$ -987184 -687836 -517972 -767167 -737413 329757 2151176 3549446 3428017 1680788
39085A680788k201847j116612K15825J95398p91174o95222J117602K612864J867364
$$ 1680788 -521059 -1637671 -1421846 -1226448 -2017622 -2712844 -1595242 1017622 2884986
39076B884986k44754j446542j076778k29501L68476R87554J648418J667631O21506
$$ 2884986 2640232 1193690 116912 -112589 255887 1243441 2891859 4559490 5180996
39067E180996j047924k381364k397473p18823J663234K859511K099539O57712
$$ 5180996 4133072 1751708 -645765 -1364588 298646 3158157 5257696 5915408
39059E915408o817j58865p46507j408651j130786l01993k77378j021280j015554
$$ 5915408 5908591 5749726 5003219 3594568 2463782 2161789 1884411 863131 -152423
39050a52423K27411J259597Q95814j20412m65170j31247l8719m80842q54887o01839
$$ -152423 74988 1334585 2230399 2109987 1644817 1513570 1474851 994009 139122 -462717
39040d62717J91361R27962R33889L2672j109816j522989r57809j02512K41012
$$ -462717 -271356 656606 1590495 1623167 513351 -1009638 -1967447 -2069959 -1828947
39031a828947j11336p25009r12540k81138O78063Q94508J88435o0261J328627
$$ -1828947 -1940283 -2665292 -3577832 -3858970 -3180907 -2286399 -2097964 -2158225 -829598
39022h29598L271082L403294J168814j376915k205167j575375j059917j303775
$$ -829598 2441484 5844778 7013592 5636677 3431510 1856135 796218 -507557
39014e07557j590545j073743K84504J742041K337730J674386L46830o65735r84969
$$ -507557 -2098102 -3171845 -2887341 -1145300 1192430 2866816 3213646 2547911 1562942
39005A562942q06760j83760Q38474J526853R85074m95664j637470j892302j865734
$$ 1562942 756182 572422 1410896 2937749 3922823 3427159 1789689 -102613 -1968347
38996a968347j856061j316797k34661L58896J7267k63534K67665P90310L56614
$$ -1968347 -3824408 -5141205 -5375866 -5016970 -4999703 -5263237 -4995572 -4205262 -3848648
38987c848648m61076o01726j86066J79672P93306J970209K581062J339320q41988
$$ -3848648 -4309724 -4911450 -5097516 -4917844 -4124538 -2154329 426733 1766053 924065
38978I24065j640909m28651J111108J540647J172944P46491K35916m32759q32298
$$ 924065 -716844 -1145495 -34387 1506260 2679204 3425695 3661611 3228852 2396554
38969B396554q40953q99518r87606m94631M36469P47247K70017K84097J327466
$$ 2396554 1555601 656083 -331523 -826154 -389685 357562 627579 911676 2239142
38960B239142J854044M80360j496630j563210N22300K392533K170188M13653j240826
$$ 2239142 4093186 4573546 3076916 1513706 2036006 4428539 6598727 7012380 5771554
38951E771554k020011k057660j559999p23670L4191L77785L55520J44873j57237
$$ 5771554 3751543 1693883 133884 -589786 -555595 -177810 177710 322583 165346
38942A65346l13165k1460M65873L23526p27702j653737j135994P01661K205258
$$ 165346 -147819 -169279 296594 620120 -107582 -1761319 -2897313 -2195652 9606
38933I606J985535L65022j182439j658844j241002n90819k7543M50672P44077
$$ 9606 1995141 2360163 1177724 -481120 -1722122 -2312941 -2340484 -1889812 -1145735
38924a145735O96875M69141M13642M75575J50798o62814j191984p42100J15922
$$ -1145735 -448860 20281 433923 909498 1060296 397482 -794502 -1536602 -1420680
38915a420680J36615p34317j052605J5539J188994P51489q19372j336578R241
$$ -1420680 -1284065 -2018382 -3070987 -3055448 -1866454 -1114965 -1934337 -3270915 -3261674
38906c261674J585139J812482J199492Q83091N52049n40240j427401l95400K053584
$$ -3261674 -1676535 135947 1335439 2218530 2770579 2230339 802938 407538 2461122
38897B461122L261283J900265l56480j376590j145702p68372m02988L02189P62149
$$ 2461122 5722405 7622670 7266190 5889600 4743898 3975526 3572538 3874727 4636876
38888D636876J52768r56252j229658n77666r3734j07249K08729J116927J622850
$$ 4636876 4789644 3833392 2603734 2026068 1932334 1825085 2033814 3150741 4773591
38879D773591J003887q6443o54968o53029o00883n95854l57732J12302M40754
$$ 4773591 5777478 5691035 5036067 4383038 3782155 3186301 2828569 2940871 3381625
38870C381625K95493l17388r60345r51717l6238J077797J282098K90574j019964
$$ 3381625 3677118 3359730 2399385 1447668 1411430 2489227 3771325 4061899 3041935
38861C041935j522745q44113L97633J055811M54300p10439r56548o782N86246
$$ 3041935 1519190 675077 1072710 2128521 2582821 1872382 915834 909052 1495298
38852A495298k91843j340959o63562J116288J599980L25165n94831J808N47574
$$ 1495298 1203455 -137504 -801066 315222 1915202 2240367 1645536 1647344 2194918
38843B194918l64703j455907q48934R03742J813698J397925P12744J92667o32798
$$ 2194918 1830215 374308 -474626 429116 2242814 3640739 4353483 4546150 3913352
38834C913352j629787k016161j739824j459653j242307o09429K05572L73626j20637
$$ 3913352 2283565 267404 -1472420 -2932073 -4174380 -4783809 -4578237 -4204611 -4325248
38825d325248l82607j1014M50511N21996K98514l6843l21350j40404O58382J365793
$$ -4325248 -4707855 -4718869 -4268358 -3746362 -3447848 -3484691 -3806041 -3946445 -3288063 -1922270
38815a922270J248755P05521N83300P39262M94196J28445M56969J124506R28898
$$ -1922270 -673515 32006 615306 1354568 1848764 1977209 2434178 3558684 4487582
38806D487582j34291p54025m18379r1941m75380j059232j235002r18659J48282
$$ 4487582 4353291 3599266 3180887 3088946 2613566 1554334 319332 -599327 -451045
38797d51045K071873L473154K390092q02861l223963l118593j840979j167662
$$ -451045 1620828 5093982 7484074 6681213 3457250 338657 -1502322 -2669984
38789b669984o46763P36765K003996J480531l35132j311133o47608M63938Q98819
$$ -2669984 -3316747 -2579982 -575986 904545 569413 -741720 -1389328 -925390 -26571
38780b6571P68858N89726N27679N29652M03464m8054m44235k2114R48150R34597
$$ -26571 742287 1332013 1859692 2389344 2792808 2744754 2300519 2278405 3226555 4161152
38770D161152o73441k193555j775917J1306J195215J166679P84533M17249k62633
$$ 4161152 3487711 1294156 -481761 -470455 724760 1891439 2675972 3093221 2830588
38761B830588r34291r10102n35557n93747n96556M75802J952211K059630P70887
$$ 2830588 1896297 986195 450638 -143109 -739665 -263863 1688348 3747978 4518865
38752D518865p9090J97002K19076p79209j546569j075468k90306k43102l59426
$$ 4518865 4439775 4636777 4855853 4076644 2530075 1454607 1164301 921199 561773
38743E61773J02122L47120n76702j815619j767492l98114R10019J281661R22050
$$ 561773 663895 1011015 434313 -1381306 -3148798 -3546912 -2636893 -1355232 -433182
38734d33182L07364p4614K99762J198982J365137J28325j272909j209713k5324
$$ -433182 -125818 -200432 99330 1298312 2663449 2791774 1518865 309152 283828
38725B83828M97008k27068r45664o60621L8856J72051k43674o70837j087977j703773
$$ 283828 780836 553768 -391896 -1052517 -1013661 -841610 -1085284 -1756121 -2844098 -4547871
38715d547871k058080j305056N04167K061442K166780J173599M77326N65874M03501
$$ -4547871 -6605951 -7911007 -7406840 -5345398 -3178618 -2005019 -1527693 -961819 -558318
38706e58318p44204j724384q90645J303898K534635J573176l05088j278388j049535
$$ -558318 -1302522 -3026906 -3917551 -2613653 -79018 1494158 1189070 -89318 -1138853
38697a138853l39552M17706R47020P47567j06556n92287j34639M35900K90156
$$ -1138853 -1478405 -1060699 -113679 633888 527332 -64955 -199594 236306 526462
38688E26462M385L38284N84230k46193j289429p81111J102980K257050J632906
$$ 526462 530847 869131 1453361 1207168 -82261 -863372 239608 2496658 4129564
38679D129564M39815k6102m0963k43843l19711O5185J91326o51220j789910j997674
$$ 4129564 4569379 4543277 4502314 4258471 3938760 4003945 4195271 3544051 1754141 -243533
38669b43533j218115m47134k18852j98615j44340k91238o21052n68929J28761
$$ -243533 -1461648 -1908782 -2127634 -2326249 -2470589 -2761827 -3382879 -3951808 -3823047
38660c823047Q30075P51129O6489l14699m1560K20167r7203m66228l9374R19879
$$ -3823047 -2992972 -2241843 -2175354 -2490053 -2531613 -2311446 -2408649 -2874877 -2914251 -1994372
38650a994372J311084R03236P01214J222179J489991N80261o93759p90344L38772
$$ -1994372 -683288 219948 921162 2143341 3633332 4213593 3519834 2729490 3068262
38641C068262J239028J007718K24848k31231k68901k32040k84826m52290o83171
$$ 3068262 4307290 5315008 5539856 5308625 5039724 4807684 4522858 4070568 3387397
38632C387397p07757l70924j14476m80520j159063j305187q21568m13934k40237
$$ 3387397 2679640 2308716 2194240 1713720 554657 -750530 -1572098 -1986032 -2226269
38623b226269M09418J627052K146172R68946r44759j638122n71497Q12840R70376
$$ -2226269 -1816851 -189799 1956373 2925319 1980560 342438 -229059 583781 1554157
38614A554157m7301j036105j195164o84096J22717J150714K080222K005846N31177
$$ 1554157 1506856 470751 -724413 -1408509 -1285792 -135078 1945144 3950990 4482167
38605D482167j108764j211402j9127L78195q84729j933201q71671J264526J980351
$$ 4482167 3373403 2162001 2142874 2521069 1636340 -296861 -1168532 95994 2076345
38596B076345R07934n2993J83189P28678P23546N05806L59393q0399n66188j27630
$$ 2076345 2984279 2931286 3114475 3843153 4566699 5072505 5431898 5351499 4785311 4657681
38586D657681R88650R58596r72713k967972k963932j331514J07553O30637P82274
$$ 4657681 5646331 6604927 5632214 2664242 -299690 -1631204 -1523651 -893014 -110740
38577a10740Q47864O27773K61180M7723k21961q08829j310076j223147p28986
$$ -110740 737124 1364897 1626077 1673800 1451839 643010 -667066 -1890213 -2619199
38568b619199j98416M06708R16978O38870m20559r64092j46998J027878J285580
$$ -2619199 -2817615 -2410907 -1493929 -855059 -1275618 -2239710 -2386708 -1358830 -73250
38559g3250J048206J344268J712154J004670m16838j241967j457305j959790k276108
$$ -73250 974956 2319224 4031378 5036048 4619210 3377243 1919938 -39852 -2315960
38550b315960j021495J275472K231279J086828r8444L52195J385703J313740M53010
$$ -2315960 -3337455 -2061983 169296 1256124 1157680 1509875 2895578 4209318 4662328
38541D662328Q4622J16667m66206j596444k164770j703047p58177J76175J032311
$$ 4662328 4746950 4863617 4397411 2800967 636197 -1066850 -1825027 -1648852 -616541
38532f16541J629205J698744J434225J296349J255565P72111m15732j832020k660129
$$ -616541 1012664 2711408 4145633 5441982 6697547 7469658 7053926 5221906 2561777
38523B561777k510742j817822j336373j121721m67226P23137J278014M96869k42397
$$ 2561777 51035 -1766787 -3103160 -4224881 -4692107 -3968970 -2690956 -2194087 -2436484
38514b436484O79326K146934J500952j119673k343952n55726J391718M42253j991884
$$ -2436484 -1757158 389776 1890728 771055 -1572897 -2128623 -736905 -294652 -2286536
38505b286536k393319n76576N10412k30690o27744Q64297K782716L142373K012676
$$ -2286536 -4679855 -5256431 -4746019 -4976709 -5604453 -4740156 -1957440 1184933 3197609
38496C197609N09512q86354j835697j603424k92292O60265L72185k23701l3235
$$ 3197609 3707121 2820767 985070 -618354 -910646 -250381 121804 -101897 -135132
38487a35132M96063M80482K20747L54924M36909r5850m00927N59673J835824J440698
$$ -135132 360931 841413 1062160 1417084 1853993 1758143 1357216 1916889 3752713 5193411
38477E193411n76484j868907j013384N96825Q43172l28497j179995n57388R12539
$$ 5193411 4616927 2748020 1734636 2331461 3174633 2846136 1666141 1108753 2021292
38468B021292J747591J103893n80998k047406k296876j391226k40671L11720J38062
$$ 2021292 3768883 4872776 4291778 2244372 -52504 -1443730 -1684401 -1372681 -1234619
38459a234619k41003k14459K26726K86307p24619k148153k373657r08565P47455
$$ -1234619 -1475622 -1690081 -1463355 -1177048 -1901667 -4049820 -6423477 -7332042 -6584587
38450f584587J037309L53684O2426K55684o3625r29899j170516k63379J013297
$$ -6584587 -5547278 -5193594 -5131168 -4875484 -4939109 -5869008 -7039524 -7302903 -6289606
38441f289606J926092K372450K020359N07303j158988j163665M81566J562572
$$ -6289606 -4363514 -1991064 29295 536598 -622390 -1786055 -1304489 258083
38433B58083P56430o13735r33858n75013m31834l6413R99288J324208l4688j214514
$$ 258083 1014513 400778 -533080 -1108093 -1539927 -1576340 -577052 747156 712468 -502046
38423e02046Q9178K569530K644193k80373k836033k464118m37851Q25306J033314
$$ -502046 -412868 2156662 4800855 4520482 1684449 -779669 -1217520 -392214 641100
38414F41100J185293J343345Q69287k13325j299696j838555j267834N47184K291025
$$ 641100 1826393 3169738 4039025 3825700 2526004 687449 -580385 -33201 2257824
38405B257824K077370P1529j326746p72718K90049L13536J31061J008697J898814
$$ 2257824 4335194 4406723 3079977 2307259 2597308 2910844 3041905 4050602 5949416
38396E949416R47978j280150k460394j882178r66530o53481m53909k12400p04372
$$ 5949416 6897394 5617244 3156850 1274672 308142 -345339 -799248 -1011648 -1716020
38387a716020j885240k255419q23845J445489K843482K704684J519577J21445
$$ -1716020 -3601260 -5856679 -6680524 -5235035 -2391553 313131 1832708 1954153
38379A954153p34480o66903k3781M56218M88562L28427J17428k05063m32382l03745
$$ 1954153 1219673 552770 528989 985207 1473769 1802196 1919624 1714561 1282179 978434
38369I78434j57772n45659j150229r72147K04794J333170J394938N50384k88723
$$ 978434 820662 275003 -875226 -1847373 -1642579 -309409 1085529 1635913 1347190
38360A347190n21028k24343J75622L98832N76752Q88500Q81376k05968j988985
$$ 1347190 826162 601819 777441 1176273 1753025 2641525 3522901 3316933 1327948
38351A327948k627127r67895J541106K299689O95056j375613k021279j195125
$$ 1327948 -1299179 -2267074 -725968 1573721 2268777 893164 -1128115 -2323240
38343b323240M0393Q63406R54961L79015l29705n20044q4932O00953J202768J365864
$$ -2323240 -2282847 -1419441 -464480 -85465 -415170 -935214 -1020146 -419193 783575 2149439
38333B149439O13091q53104j738908j117036J46833O01339L18567L59118O61260
$$ 2149439 2762530 1909426 170518 -946518 -799685 -198346 120221 479339 1140599
38324A140599L00464m10766j65703R07307J204459M03126P4490Q94274J445504
$$ 1140599 1441063 1030297 864594 1771901 2976360 3379486 3453976 4348250 5793754
38315E793754P86242Q8926M05607P11698k65124j864178k713062k710039k262133
$$ 5793754 6579996 6668922 7074529 7786227 7521103 5656925 2943863 233824 -2028309
38306b028309r92805J079590K403338J817537N27100K94819P12404K85245p14496
$$ -2028309 -3021114 -1941524 461814 2279351 2806451 3101270 3813674 4098919 3384423
38297C384423p60618J58205O22633L91763O40961J523748J671750N12477q25470
$$ 3384423 2623805 2782010 3404643 3796406 4437367 5961115 7632865 8145342 7319872
38288G319872j437849j768089k206741k126982j087634K23286R53847J043714
$$ 7319872 5882023 4113934 1907193 -219789 -1307423 -1084137 -130290 913424
38280I13424P67500K99644N8455M07683P14621p2552j510925j708107J4366J824392
$$ 913424 1680924 1980568 2039023 2446706 3161327 3088775 1577850 -130257 -115891 1708501
38270A708501J742629J96265r49357r89134o35180l00543L00822R50625Q28347
$$ 1708501 3451130 3647395 2698038 1708904 1073724 773181 1074003 2024628 2852975
38261B852975k0052l53660M53173J239812O43294p83589j233852k65008N30826
$$ 2852975 2832923 2479263 2932436 4172248 4815542 4031953 2798101 2533093 3063919
38252C063919j32904j356583j368712M1204J457066J770136J079989j10210j426105
$$ 3063919 2931015 1574432 205720 246924 1703990 3474126 4554115 4443905 3017800
38243C017800k306203k231917j465905o99816R837R47951J557041R70430k23302
$$ 3017800 711597 -1520320 -2986225 -3686041 -3676204 -2728253 -1171212 -200782 -424084
38234d24084m18722M74623P74660o9621l41862J036792K439161K019688N98048
$$ -424084 -842806 -368183 406477 336856 -5006 1031786 3470947 5490635 6088683
38225F088683O9066K40878m99069k153710k986431k162783o73393L04781N25578
$$ 6088683 6157749 6398627 5899558 3745848 759417 -1403366 -2076759 -1771978 -1246400
38216a246400L25310L18998J034235J871350J284517q84701k502919k063977j043869
$$ -1246400 -921090 -602092 432143 2303493 3588010 2703309 200390 -1863587 -2907456
38207b907456j366606k078064j160208O81060J217222P62578J455150K889813
$$ -2907456 -4274062 -6352126 -7512334 -6831274 -5614052 -4851474 -3396324 -506511
38199e06511K408442M6999q70128Q30154K028632M21239j750706j522256J56414
$$ -506511 1901931 1948930 1078802 1908956 3937588 4358827 2608121 1085865 1242279
38190A242279M96965n20109o48966P14153J850196J475892J70620p51885n57258
$$ 1242279 1739244 1219135 570169 1284322 3134518 4610410 4781030 4029145 3471887
38181C471887L44106N20682q85684k364868j491471J299098K646980J055469q33440
$$ 3471887 3815993 4336675 3450991 1086123 -405348 893750 3540730 4596199 3762759
38172C762759n13421M95059l39882j939594j430944Q08719J594611m1426j726736
$$ 3762759 3249338 3744397 3404515 1464921 33977 842696 2437307 2395881 669145
38163F69145j821102j442475j688782j605692j97605J573404K189930J634780
$$ 669145 -1151957 -2594432 -4283214 -5888906 -6086511 -4513107 -2323177 -688397
38155f88397Q91198L83387p1662m11736k85201L71304J110868J239696L92180
$$ -688397 202801 586188 514526 102790 -182411 188893 1299761 2539457 2931637
38146B931637q82149j420842p99536K1708j250n18255m04303M96416J153704Q10862
$$ 2931637 2049488 628646 -170890 -149182 -150432 -668687 -1072990 -576574 577130 1387992
38136A387992n0029l14543M70794J412419J075346n73952j545540l39111J385698
$$ 1387992 1337963 1023420 1494214 2906633 3981979 3408027 1862487 1523376 2909074
38127B909074O76756k117544l267566j087458J416354J168053l98982j10785J749117
$$ 2909074 3585830 1468286 -1799280 -2886738 -1470384 -302331 -701313 -812098 937019
38118I37019K360210J149558J39621J31323l7558n11751K6885J425328J638430
$$ 937019 3297229 4446787 4586408 4717731 4680173 4168422 4195307 5620635 7259065
38109G259065k4208j744345k042364j529605j117573o35616J619K28532J45820
$$ 7259065 7234857 5490512 3448148 1918543 800970 165354 166973 395505 541325
38100E41325N48836J092456M16199j303589k034069r11555M69733P11435N22044
$$ 541325 1090161 2182617 2598816 1295227 -738842 -1650397 -1180664 -469229 52815
38091E2815Q70049J156572N78006k81433n56786n04925o55990p41746m43033r7585
$$ 52815 922864 2079436 2657442 2376009 1819223 1314298 658308 -83438 -526471 -624056
38081f24056R1154M13251P21763M79827O2360L50378P55152k36113k063710k180717
$$ -624056 -532902 -119651 602112 1081939 1144299 1494677 2249829 2013716 -49994 -2230711
38071b230711q4131J457573O77953m41161K60251J446741R03773l55183J43054
$$ -2230711 -2314842 -857269 -179316 -620477 -360226 1086515 1990288 1635105 1778159
38062A778159J868985K022534J48721j185016m36736Q83657P66014p45452k129752
$$ 1778159 3647144 5669678 5818399 4633383 4196647 5080304 5846318 5100866 2971114
38053B971114k142962p33949P84660P06447r52417j984163q52270R63798J165683
$$ 2971114 828152 94203 878863 1585310 632893 -1351270 -2203540 -1239742 -74059
38044g4059J59929J56954J411688J937194Q97956k41809l65873k26368o30496
$$ -74059 85870 242824 1654512 3591706 4489662 4247853 3881980 3655612 3025116
38035C025116j089662j108090j110060j230368p40644M06180R14626J05310p05219
$$ 3025116 1935454 827364 -282696 -1513064 -2253708 -1847528 -932902 -827592 -1532811
38026a532811l3586J429083J621879q7570k003030k088246k30244J736075K082852
$$ -1532811 -1566397 -137314 1484565 1396995 -606035 -2694281 -2924525 -1188450 894402
38017H94402R71838r2735l39227l80995o29473l49636Q09782J556728O66371r26083
$$ 894402 1866240 1773505 1434278 1053283 423810 74174 883956 2440684 3107055 2180972
38007B180972j402818p72742m52379o27212j78632Q60746J068308J98166k23012
$$ 2180972 778154 5412 -446967 -1074179 -1252811 -392065 676243 874409 651397
37998F51397M41108P70447k02592j227068r00470P6339J99414m90549q51845n36400
$$ 651397 1092505 1862952 1660360 433292 -467178 -390839 -191425 -681974 -1533819 -2070219
37988b070219m6405M16344Q73910Q87308J45503o47803n37783L01305Q24700M99106
$$ -2070219 -2116624 -1700280 -826370 60938 206441 -441362 -979145 -677840 146860 645966
37978F45966l07613j030944j342450j141155o43072k11657K04487R65983J816289
$$ 645966 338353 -692591 -2035041 -3176196 -3819268 -4030925 -3826438 -2860455 -1044166
37969a044166J828978P26964n52818j139477j204500j060488l03777J237439K573774
$$ -1044166 784812 1511776 958958 -180519 -1385019 -2445507 -2749284 -1511845 1061929
37960A061929K628773J629563N55035j05700k09363N11920J687893J964065O93876
$$ 1061929 3690702 5320265 5875300 5769600 5560237 6072157 7760050 9724115 10417991
37951A0417991q21023j137413q57521j379224k271533j942646m94341L04601j41151
$$ 10417991 9596968 8459555 7602034 6222810 3951277 2008631 1514290 1818891 1677740
37942A677740o32399n91423q48654j528379j426647l03877M37745L79454J001827
$$ 1677740 1045341 453918 -394736 -1923115 -3349762 -3653639 -3215894 -2836440 -1834613
37933a834613K541156K491611m75580l351038k612566L43851J155991q85894k086956
$$ -1834613 706543 3198154 2722574 -628464 -3241030 -2897179 -1741188 -2627082 -4714038
37924d714038m55342J410328R32326m69582l25291P41358P25436J40031R07522
$$ -4714038 -5169380 -3759052 -2826726 -3296308 -3621599 -2880241 -2154805 -2014774 -1107252
37915a107252K391417J954927n82693k227875j263991L46973L36603l97996L50842
$$ -1107252 1284165 3239092 2656399 428524 -835467 -488494 -151891 -549887 -199045
37906a99045K259222K772624Q68999j408247j576122L24172J996825J541621p04063
$$ -199045 2060177 4832801 5701800 4293553 2717431 3041603 5038428 6580049 5875986
37897E875986k794910l211958k061305m58716O98741J057761N38533m48081q32575
$$ 5875986 3081076 -130882 -2192187 -2650903 -1952162 -894401 -355868 -803949 -1636524
37888a636524L8808J167924Q17044j087162k502301j718961O15515K499701K832592
$$ -1636524 -1597716 -429792 387252 -699910 -3202211 -4921172 -4305657 -1805956 1026636
37879A026636K004703Q79873l4803o68265j124101j232861m32240J350121K850276
$$ 1026636 3031339 3911212 3876409 3208144 2084043 851182 418942 1769063 4619339
37870D619339K518352N46231j224238j598330j035541k34928O69435J101493J69758
$$ 4619339 7137691 7683922 6459684 4861354 3825813 3590885 4260320 5361813 5531571
37861E531571j356942j270324O12166J394655o50912k961294k332248J74588J127488
$$ 5531571 4174629 2904305 3516471 4911126 4260214 1298920 -1033328 -858740 268748
37852B68748J90640K6097J282879J603229N5659j119400l79258O56549K03837
$$ 268748 459388 485485 1768364 3371593 3427252 2307852 1928594 2585143 2788980
37843B788980q49494r04526l21271k80455o46878o83406n43625n74407l59823
$$ 2788980 1939486 1034960 713689 433234 -213644 -897050 -1440675 -2015082 -2374905
37834b374905K86878O31574L91798L75369P32258K95479j086492j465134L04493
$$ -2374905 -2088027 -1456453 -1064655 -689286 42972 338451 -748041 -2213175 -1908682
37825a908682K368580K507924J322319O67057M89716k92594j074055n27293N50077
$$ -1908682 459898 2967822 4290141 4957198 5446914 5154320 4080265 3552972 4103049
37816D103049K41563j061703j130006K49686P73188n63178j814987j184011M61457
$$ 4103049 4344612 3282909 2152903 2402589 3175777 2612599 797612 -386399 75058
37807G5058J297389J024443M89900J78845J19981L01517M40861J91308n9551L55785
$$ 75058 1372447 2396890 2886790 3065635 3185616 3487133 3927994 4119302 4059751 4415536
37797D415536R12156K31338j683414k983052k396098p91649M10114J060563J576234
$$ 4415536 5327692 5559030 3875616 892564 -1503534 -2295183 -1885069 -824506 751728
37788G51728J637961Q39649j55275l14778L16758Q09159O83970L09539J71851
$$ 751728 2389689 3229338 3074063 2759285 3076043 3885202 4569172 4878711 5050562
37779E050562L36371N35772M90910K65753K83358O37656N97222n00177j994633
$$ 5050562 5386933 5922705 6413615 6679368 6962726 7600382 8197604 7697427 5702794
37770E702794k469318j578857l29193M91446R95762J184046O28186l86179p36757
$$ 5702794 3233476 1654619 1325426 1816872 2812634 3996680 4624866 4238687 3501930
37761C501930j19812M04587J92930M0816N80948J001637N19727l9342M83774J598576
$$ 3501930 3382118 3786705 3979635 4020451 4601399 5603036 6122763 6083421 6567195 8165771
37751H165771J880051J081444K25307K9289M10386J123822J767981J576383L29658
$$ 8165771 10045822 11127266 11352573 11381862 11792248 12916070 14684051 16260434 16590092
37742A6590092q99478r67934k03711L07219L91290N06037L85190m95065j444135
$$ 16590092 15690614 14722680 14518969 14826188 15217478 15723515 16108705 15613640 14169505
37733A4169505j218522j12840K23441p64979j767896j588770n31788N26348J162091
$$ 14169505 12950983 12838143 13061584 12296605 10528709 8939939 8408151 8934499 10096590
37724A0096590J160516N05290o3213K29794O55398k89960k183267k512362j58058
$$ 10096590 11257106 11762396 11699183 11928977 12584375 12294415 10111148 7598786 7440728
37715G440728K641218L126048J428694l11196r94251j001537n66568L11268P94087
$$ 7440728 10081946 13207994 14636688 14325492 13331241 12329704 11763136 12074404 12868491
37706A2868491n6544j567554k108516j397568n87825j26096P01690J869320K106937
$$ 12868491 12811947 11244393 9135877 7738309 7150484 7024388 7726078 9595398 11702335
37697A1702335R81032r1730J97106J319305J978102J752844Q66995m66920j517805
$$ 11702335 12683367 12591637 12788743 14108048 16086150 17838994 18705989 18239069 16721264
37688A6721264j117725N06842J192294l42717k187185j635172Q34697K183883
$$ 16721264 15603539 16110381 17302675 16959958 14772773 13137601 13972298 16156181
37680A6156181J210624k8138L70125J531003J650674P12072l4432j06794P5828
$$ 16156181 17366805 17338667 17708792 19239795 20890469 21602541 21568109 21461315 21537143
37671B1537143K87206M91933L71910q3897j44680N02796R11572L57338j45966
$$ 21537143 21824349 22316282 22688192 22604295 22459615 22962411 23873983 24231321 24085355
37662B4085355O85898K082087K200295J123525P94754J801488K421213J622586
$$ 24085355 24771253 26853340 29053635 30177160 30971914 32773402 35194615 36817201
37654C6817201R31124J945241L676783M122767L313990K869791L230780L363846
$$ 36817201 37748325 39693566 43370349 47493116 50807106 53676897 56907677 60271523
37646F0271523L007509L224596M434966N630860O152776O810333Q464476J0660612
$$ 60271523 63279032 66503628 70938594 76569454 82722230 89532563 97997039 108657651
37638A08657651J2499195J3888838J5117317J6117301J7061388J8722424K1052862
$$ 108657651 121156846 135045684 150163001 166280302 183341690 202064114 223116976
37631B23116976K2213457K0509987J6862696J3751895J1806078R127985M367306
$$ 223116976 245330433 265840420 282703116 296455011 308261089 317389074 321756380
37624C21756380j149105n190729p282888q552552r831754j1092707j2252215j3396712
$$ 321756380 320607275 315416546 308133658 299581106 289749352 278656645 266404430 253007718
37616B53007718j4325423j4641520j4180910j2876050j0650085q062052o409255
$$ 253007718 238682295 224040775 209859865 196983815 186333730 178271678 171862423
37609A71862423o217942o173679m781956k744808k212475l645531m955727m237840
$$ 171862423 165644481 159470802 154688846 151944038 149731563 146086032 141130305 136892465
37601A36892465k060166l69356j79615j090912k215956k780833k417595j477796
$$ 136892465 134832299 134462943 134283328 133192416 130976460 128195627 125778032 124300236
37593A24300236n58563M87643K138468L587826L045114M55037j633017j262820
$$ 124300236 123741673 124229316 126367784 129955610 133000724 133455761 131822744 130559924
37585A30559924K29773M58609k76017J84603J934874K612678J168800m96790n58781
$$ 130559924 130789697 131248306 130972289 131156892 133091766 135704444 136873244 136376454 135817673
37576A35817673J99724J49170o30233j108862j304042j769729j948918q73981
$$ 135817673 136017397 136166567 135536334 134427472 133123430 131353701 129404783 128530802
37568A28530802Q18443J301390J19446j103688r10400K51194J172517J787238
$$ 128530802 129349245 130650635 130770081 129666393 128755993 129007187 130179704 131966942
37560A31966942K927451M609288N641062N148193L730400K563308J791548O05777
$$ 131966942 134894393 139503681 145144743 150292936 154023336 156586644 158378192 158983969
37552A58983969j143927k393958k446975k304611l455873n717982p369076p374633
$$ 158983969 157840042 155446084 152999109 150694498 147238625 141520643 134151567 126776934
37544A26776934o403488n493310m866574m524983m877398n900157o483006n668476
$$ 126776934 120373446 114880136 110013562 105488579 100611181 94711024 88228018 82559542
37536H2559542m128645l435726m076264n093992n617218n799707o050620o151895
$$ 82559542 78430897 74995171 70918907 65824915 60207697 54407990 48357370 42205475
37528D2205475n630277m548711l442194k685235k314266k301007k486927k213737
$$ 42205475 36575198 32026487 28584293 25899058 23584792 21283785 18796858 16583121
37520A6583121o74944J837926L467939K490332m38043k642380k449911r70928
$$ 16583121 15908177 17746103 21214042 23704374 23266331 20623951 18174040 17203112
37512A7203112k31446n04621o42425l13550l25543r13546j289696j084002q37169
$$ 17203112 16971666 16467045 15824620 15511070 15185527 14271981 12982285 11898283 11061114
37503A1061114p76967m64159p84j59364q25734q15355J00680N64432r0353n73448
$$ 11061114 10284147 9819988 9819204 9659840 8834106 8018751 8119431 8683863 8593510 8020062
37493H020062J32955Q89825L36448p09393o73110J20447L07679O9755N35113J240151
$$ 8020062 8153017 9042842 9379290 8669897 7996787 8117234 8424913 8494668 9029781 10269932
37483A0269932P21173o09448q33864P7386j0537j652532k569955j362350R7512
$$ 10269932 10991105 10381657 9547793 9625179 9614642 7962110 5392155 4029805 4127317
37474D127317k43432j346106j154635j99418m36596j550001j337378M54927J527098
$$ 4127317 3883885 2537779 1383144 1183726 747130 -802871 -2140249 -1685322 -158224
37465a58224P42997j27951M70424J212186J60308j757764j797795N44765K669890
$$ -158224 584773 456822 927246 2139432 2299740 541976 -1255819 -711054 1958836
37456A958836K393433N56514p30302j010320j255781j600849j109700K11661R16229
$$ 1958836 4352269 4908783 4178481 3168161 1912380 311531 -798169 -586508 329721
37447C29721L29891j34645R18305K401884J982778m94594k462126j899201J86898
$$ 329721 659612 524967 1443272 3845156 5827934 5333340 2871214 972013 1158911
37438A158911J365354R12257J99225L39536O81709K3064j452457k235979j422320
$$ 1158911 2524265 3436522 3635747 3975283 4656992 4680056 3227599 991620 -430700
37429d30700R4875P55264K57451l34769l21596k87534q84429j527406j157604
$$ -430700 -335825 419439 676890 342121 20525 -267009 -1151438 -2678844 -3836448
37420c836448J33209J167237J235388P69762M69844M86518N61964M05348j13063
$$ -3836448 -3703239 -2536002 -1300614 -530852 -61008 425510 987474 1392822 1279759
37411A279759o90146o71837O9113O73323M59290J39092P89526J895377J838711
$$ 1279759 589613 -82224 -13111 660212 1119502 1258594 2048120 3943497 5782208
37402E782208M27848n90450l5627J129569J515796J275257J221296J031667k19308
$$ 5782208 6210056 5619606 5583979 6713548 8229344 9504601 10725897 11757564 11538256
37393A1538256k202216l350001k745764j092819K64981O74244M99892N45697J138899
$$ 11538256 9336040 5986039 3240275 2147456 2412437 3086681 3586573 4132270 5271169
37384E271169J650988J204785q3035j133172j320524j080879q22977k36971P06754
$$ 5271169 6922157 8126942 8043907 6910735 5590211 4509332 3686355 3449384 4156138
37375D156138J084334K74295r10028j334926j083799q42685m86940M36809J365203
$$ 4156138 5240472 5514767 4604739 3269813 2186014 1343329 856389 1293198 2658401
37366B658401J270134K87946n18264q10543j060098j161692m56353P79130J315737
$$ 2658401 3928535 4216481 3698217 2887674 1827576 665884 209531 988661 2304398
37357B304398P41480k2427k61023k62694k62870P4185O25499N46968l22712r63712
$$ 2304398 3045878 3023451 2762428 2499734 2236864 2311049 2936548 3483516 3160804 2197092
37347B197092p43591l32252l30020j95154N20863J008261M41188n16365o80479
$$ 2197092 1453501 1121249 791229 596075 1116938 2125199 2566387 2050022 1369543
37338A369543j19985K57151K86946M57021O89784M94133M4455q3126j3070k48017
$$ 1369543 1249558 1506709 1793655 2250676 2940460 3434593 3479048 3395922 3382852 3134835
37328C134835m85264q318Q65934J039461L64197j72516j41819k38112q19139j156049
$$ 3134835 2649571 2641253 3507187 4546648 4910845 4738329 4596510 4358398 3539259 2383210
37318B383210o90624N1088M29278O42921J075771J494662J498396J062869K01331
$$ 2383210 1692586 1743674 2172952 2815873 3891644 5386306 6884702 7947571 8148902
37309H148902j080672k075421j709151k71068L46082q49952k240023j691658M17451
$$ 8148902 7068230 4992809 3283658 3012590 3358672 2508720 268697 -1422961 -1005510
37300a005510J778602J317351K31381o0638M11716P54585L31993r15829k340173
$$ -1005510 773092 2090443 2321824 2261186 2672902 3427487 3759480 2843651 503478
37291E03478k681543j263946Q45889J878198J579994J243409J479950J444111
$$ 503478 -2178065 -3442011 -2596122 -717924 862070 2105479 3585429 5029540
37283E029540O81086J56137N24224P52182k42202j590351j609300l53253M99560
$$ 5029540 5710626 5866763 6390987 7143169 6900967 5310616 3701316 3348063 3847623
37274C847623J27430n18473m69396j31128l36395q79039p83540K86094J513662
$$ 3847623 3975053 3456580 2987184 2856056 2519661 1640622 857082 1143176 2656838
37265B656838J839026J027278k67272j250763j541172j119246k67571K71765k24551
$$ 2656838 4495864 5523142 5255870 4005107 2463935 1344689 1077118 1348883 1124332
37256A124332j250200j081317R26435K678462J647117j321564k597749p08939
$$ 1124332 -125868 -1207185 -280750 2397712 4044829 2723265 125516 -583423
37248e83423J528607J146381p66497j121889L95809J325950N60231l77967l93329
$$ -583423 945184 2091565 1325068 203179 598988 1924938 2485169 2107202 1713873
37239A713873m89464j418321j857288m71028J641678K241127R77955l54109l87815
$$ 1713873 1224409 -193912 -2051200 -2522228 -880550 1360577 2338532 1984423 1596608
37230A596608K37415J38501p71793j171168k00411J159613J237085J9398p23174
$$ 1596608 1834023 1972524 1200731 29563 -170848 988765 2225850 2245248 1522074
37221A522074m8695O95430N1898j097955r06256M33076J057195M70274N8303M99128
$$ 1522074 1473379 2168809 2220707 1122752 216496 649572 1706767 2177041 2235344 2734472
37211B734472Q22017M70604J91858J88369n21728j931609k275487p35226R32773
$$ 2734472 3556489 4027093 4218951 4407320 3885592 1953983 -321504 -1056730 -123957
37202a23957J002123L20114M87320R99430L03296j322464k086184j329927M112
$$ -123957 878166 1198280 1685600 2685030 2988326 1665862 -420322 -1750249 -1746137
37193a746137J104751J747396J443056m7013j519823j365892J86413J332732J152542
$$ -1746137 -641386 1106010 2549066 2502053 982230 -383662 -197249 1135483 2288025
37184B288025L59906l38842j050613j655388j455762l63204O68068Q41945L52685
$$ 2288025 2647931 2309089 1258476 -396912 -1852674 -2215878 -1547810 -705865 -353180
37175c53180j88007m06394k01539J42795j1776p54001j047601k3840J473473J796379
$$ -353180 -541187 -947581 -1149120 -1006325 -1018101 -1772102 -2819703 -2843543 -1370070 426309
37165D26309P41614l32002n14010k02413K2718J06543m598m30980p93645o09045
$$ 426309 1167923 835921 321911 119498 142216 248759 244161 -186819 -980464 -1589509
37155a589509j90360j09913m6444N42216R64775J67194j134406j068814N68045
$$ -1589509 -1779869 -1889782 -1936226 -1394010 -429235 -262041 -1396447 -2465261 -1897216
37146a897216K012638K224186J827188J104628n43983k424677k389061j90753
$$ -1897216 115422 2339608 4166796 5271424 4727441 2302764 -86297 -277050
37138b77050J335094J94372j742615j716373k45111J88166p19353j053768j67835
$$ -277050 1058044 1252416 -490199 -2206572 -2451683 -2263517 -2982870 -4036638 -4204473
37129d204473N30733K88350J01204O61709J178695R07981L30710J15098R1402
$$ -4204473 -3673740 -3385390 -3284186 -2622477 -1443782 -535801 -205091 -89993 1409
37120A409r0360j92544J42031P63489J202673J057818K01582q74205j136647j58692
$$ 1409 -88951 -281495 -139464 624025 1826698 2884516 3086098 2211893 1075246 916554
37110I16554J051728J213407M98870J02201L25026L19122k95774q80153j062602
$$ 916554 1968282 3181689 3680559 3782760 4107786 4426908 4131134 3250981 2188379
37101B188379j302137j746243j719853r37968j60244O1578L28851J260814K216907
$$ 2188379 886242 -860001 -2579854 -3517822 -3678066 -3616488 -3287637 -2026823 190084
37092A90084K105077R36906l05102r53767r90841m68616M73362J167729Q93228
$$ 190084 2295161 3232067 2926965 1973198 982357 513741 987103 2154832 3048060
37083C048060j37098r51640j042105p66985n05621j74027K11366K75865J7216
$$ 3048060 2910962 1959322 917217 150232 -355389 -529416 -318050 -42185 -24969
37074b4969O8449O05196O61493n11992j829867j361897R86541L023860K980964
$$ -24969 43480 648676 1310169 798177 -1031690 -2393587 -1407046 1616814 4597778
37065D597778J561251N14303J93004k65658j024637j323593r95902p45788p57417
$$ 4597778 6159029 6673332 6866336 6600678 5576041 4252448 3256546 2510758 1753341
37056A753341m08450K63156K09739q02723j323699k52582J265475J319656k456
$$ 1753341 1344891 1608047 1817786 1015063 -308636 -561218 704257 2023913 2021457
37047B021457p86517p1841R32696P26587m81812j305619j106588o50603q82125
$$ 2021457 1234940 1163099 2095795 2822382 2340570 1034951 -71637 -722240 -1604365
37038a604365j553616j472904j35013J352137J496702L74375m21163J26298J243910
$$ -1604365 -3157981 -4630885 -4765898 -3413761 -1917059 -1542684 -1963847 -1837549 -593639
37029e93639J570957P48446o30381j770903j769792M1006K831528M161902K428899
$$ -593639 977318 1725764 1095383 -675520 -2445312 -2404306 427222 4589124 7018023
37020G018023r67178l067455k658067j015859K36899N95496J34718q96846j631004
$$ 7018023 6050845 2983390 325323 -690536 -453637 141859 276577 -620269 -2251273
37011b251273j114167K20938Q21644K53388j01079O85523J398162M68690j441114
$$ -2251273 -3365440 -3144502 -2322858 -2069470 -2170549 -1485026 -86864 381826 -1059288
37002a059288k105984o89626J282161J998577J344260M37045o309j99185m94500
$$ -1059288 -3165272 -3854898 -2572737 -574160 770100 1207145 1200836 1001651 507151
36993E07151p04402m30703J59861K98915m03546j177530q12202P30458J928438
$$ 507151 -197251 -627954 -468093 -169178 -572724 -1750254 -2562456 -1831998 96440
36984I6440J342560o08215k000659j533533J10323J199560R38384J22685j34852
$$ 96440 1439000 830785 -1169874 -2703407 -2593084 -1393524 -455140 -332455 -467307
36975d67307K04698M07219K96694M61533R91395Q98212n15008k271665k639316
$$ -467307 -262609 144610 441304 902837 1894232 2792444 2277436 5771 -2633545
36966b633545j269506M52355J217635J081163P30128L82295n42o4333N37375J317924
$$ -2633545 -3903051 -3450696 -2233061 -1151898 -421770 -39475 -40017 -104350 433025 1750949
36956A750949J300281L01218o72547n99616K97447Q37058L34298o32869j082133
$$ 1750949 3051230 3352448 2679901 2080285 2377732 3214790 3549088 2916219 1834086
36947A834086q80531o50473n67147m171J269963K179247J387115r05643k897767
$$ 1834086 953555 303082 -264065 -268236 1001727 3180974 4568089 3662446 764679
36938G64679l022153j392121O11022J683974J412687K97633o30666n20066N27293
$$ 764679 -2257474 -3649595 -3038573 -1354599 58088 355721 -274945 -795011 -267718
36929b67718J413505J093004k55117j320730j097091o3984L93790k49332r76662
$$ -267718 1145787 2238791 1983674 662944 -434147 -498131 -104341 -353673 -1330335
36920a330335o38892M46153R83416M97097k61750o45566p96045p89364k58364
$$ -1330335 -1969227 -1523074 -539658 -42561 -304311 -949877 -1745922 -2535286 -2793650
36911b793650N60238N27335p09151j634942o75251J500313K736962K162768R76221
$$ -2793650 -2233412 -1706077 -2415228 -4050170 -4725421 -3225108 -488146 1674622 2650843
36902B650843N27889P46514O82374j87742j413110j888460q72081Q97545J627770
$$ 2650843 3178732 3925246 4607620 4419878 3006768 1118308 246227 1143772 2771542
36893B771542O90800l21789J68179J237703Q20416r68902j933219j272097p41239
$$ 2771542 3462342 3140553 3308732 4546435 5366851 4397949 2464730 1192633 451394
36884D51394j606731k491499j615182L46273J295689P03823m2228J40306Q48821
$$ 451394 -1155337 -3646836 -5262018 -4915745 -3620056 -2916233 -2958461 -2818155 -1969334
36875a969334J159180P32745q7139o07887k99063N10144P15146k03554j235012
$$ -1969334 -810154 -77409 -164548 -772435 -1071498 -561354 153792 -49762 -1284774
36866a284774r71991N21194J736785J570183M19480o44339j110671j105782p57475
$$ -1284774 -2256765 -1735571 1214 1571397 1990877 1346538 235867 -869915 -1627390
36857a627390p0602O42006P55607Q5986o45163o11686q2272j57235j131560j897678
$$ -1627390 -1697992 -1055986 -300379 -214393 -859556 -1471242 -1553514 -1710749 -2842309 -4739987
36847d739987j468708l24725N19422J045325J752778K250980J730887O11646K33120
$$ -4739987 -6208695 -6533420 -6013998 -4968673 -3215895 -964915 765972 1377618 1610738
36838A610738Q01499J032332J44440j061835j524618j165109l91488N33605J179762
$$ 1610738 2412237 3444569 3589009 2527174 1002556 -162553 -554041 -20436 1159326
36829A159326J058836M93662L80461P59463P30880O7916m09341m35208p56543
$$ 1159326 2218162 2711824 3092285 3851748 4582628 4650544 4241203 3805995 3049452
36820C049452j427644j298253n9362Q42257M39444j73418K19409R58486R60423
$$ 3049452 1621808 323555 264193 1106450 1545894 1372476 1591885 2550371 3510794
36811C510794P10821J022683J083942j82841j736015j580905J90100J575107J564663
$$ 3510794 4221615 5244298 6328240 6145399 4409384 2828479 3018579 4593686 6158349
36802F158349R17990K64360n65089j250746r21049K88285J130784R51971J73258
$$ 6158349 7076339 7340699 6775610 5524864 4603815 4892100 6022884 6974855 7148113
36793G148113q91437k150833k660511j242145J417700K944537K155118L49216
$$ 7148113 6256676 4105843 1445332 203187 1620887 4565424 6720542 7069758
36785G069758q10725j237301j506864j429933o19657M33043Q50355M10543m78287
$$ 7069758 6259033 5021732 3514868 2084935 1465278 1898321 2748676 3159219 2680932
36776B680932j273819j406868o23784M39327Q12516N77024P16863J293204J038525
$$ 2680932 1407113 245 -623539 -184212 628304 1205328 1922191 3215395 4253920
36767D253920n45617j950505j630421k68052K47360m61947r66856l20872O76269
$$ 4253920 3708303 1757798 127377 -140675 106685 -355262 -1322118 -1642990 -966721
36758i66721Q37332K27724j73148O6384L66604M7950p77420j378459j205110l29416
$$ -966721 -129389 98335 -74813 -8429 358175 406125 -371295 -1749754 -2954864 -3284280
36748c284280O93135J139480N41325p40805j523165r99898J40125N87251L71488
$$ -3284280 -2591145 -1451665 -910340 -1651145 -3174310 -4174208 -4034083 -3446832 -3075344
36739c075344Q09127K190909K896655J668340m51300j631557j687925j609116
$$ -3075344 -2266217 -75308 2821347 4489687 4038387 2406830 718905 -890211
36731h90211j492327o06907R22388K092818K480794K341380J576913J12604r87274
$$ -890211 -2382538 -2989445 -2067057 25761 2506555 4847935 6424848 6537452 5550178
36722E550178m70779J079921J814199J230508N96292O97723R28618Q68093J000644
$$ 5550178 5079399 6159320 7973519 9204027 9800319 10498042 11426660 12294753 13295397
36713A3295397J423825J467168J050708Q54927P80285l6310j258190j332556q4274
$$ 13295397 14719222 16186390 17237098 18092025 18872310 18836000 17577810 16245254 16160980
36704A6160980O64196n4948q88776o62357l22940r38357j636147j292842o60037
$$ 16160980 16825176 16770228 15881452 15219095 14896155 13957798 12321651 11028809 10368772
36695A0368772q82182j266138n86082M97260M83848l00575k78681O03989Q14489
$$ 10368772 9486590 8220452 7634370 8131630 8615478 8314903 8036222 8640211 9454700
36686I454700j65158j090993r62251j85834M54922O56082K78591o17412j309113
$$ 9454700 9289542 8198549 7236298 7050464 7505386 8161468 8440059 7822647 6513534
36677F513534j047881j92495K70943K13393K80872M80145J38932o01646n31388
$$ 6513534 5465653 5273158 5544101 5757494 6038366 6518511 6657443 6055797 5524409
36668E524409R05372K527605K646315R67027j066484j695132o26068N93056L73877
$$ 5524409 6429781 8957386 11603701 12570728 11504244 9809112 9183044 9776100 10149977
36659A0149977p55882p32495R74892K195655R65426j586103k744703j766899k09257
$$ 10149977 9394095 8661600 9636492 11832147 12797573 11211470 8466767 6699868 6490611
36650F490611P61361J435927J956130J566346P8742j316888j486762p31351j46425
$$ 6490611 7251972 8687899 10644029 12210375 12289117 10972229 9485467 8754116 8607691
36641H607691k34131o00685o44544k88900j59481q37848j784917j675926k98850
$$ 8607691 8373560 7772875 7128331 6839431 6679950 5842102 4057185 2381259 2082409
36632B082409P82973L69102n21797k63538P28013P08529m72144j133458n09332
$$ 2082409 2865382 3234484 2712687 2449149 3177162 3885691 3413547 2280089 1770757
36623A770757J78584j26185p42688n93430J52549O02568M33437l775k76182j90644
$$ 1770757 1949341 1823156 1080468 487038 639587 1242155 1675592 1671817 1395635 1204991
36613A204991O910k44079r26417j017314J60697J629176K002566J530102J303022
$$ 1204991 1211901 967822 41405 -975909 -815212 813964 2816530 4346632 5649654
36604E649654R12864r34622l492300m144144k160539O3564N71541L95469J096781
$$ 5649654 6562518 5627896 2135596 -2008548 -4169087 -4105523 -3533982 -3138513 -2041732
36595b041732J898354J305149m2570m61840j18267m54903j310045j002761O90281
$$ -2041732 -143378 1161771 1119201 657361 539094 84191 -1225854 -2228615 -1538334
36586a538334J821419J073235m27482q70944q9739P42891Q99960O90210O24773
$$ -1538334 283085 1356320 928838 57894 -31845 711046 1611006 2301216 2925989
36577B925989O97304N10227j80366j108634j664376j448295o31935K32052O34788
$$ 2925989 3623293 4133520 3953154 2844520 1180144 -268151 -900086 -668034 -33246
36568c3246L94344k21460o46794n70962l12171l43071o09671p72345q59945r84262
$$ -33246 361098 139638 -507156 -1078118 -1390289 -1733360 -2343031 -3115376 -3975321 -4959583
36558d959583o72358N00558J710448J585406L21692k60240O77894J649774R84715
$$ -4959583 -5631941 -5131383 -3420935 -1835529 -1513837 -1774077 -1096183 553591 1538306
36549A538306p97978j845068j430955m89887j54754o17440j130922o71871Q99903
$$ 1538306 740328 -1104740 -2535695 -3025582 -3180336 -3797776 -4928698 -5600569 -4700666
36540d700666K130103J361946q54017k045846j082585M13395Q33245R47634J942343
$$ -4700666 -2570563 -1208617 -2062634 -4108480 -5191065 -4777670 -3944425 -2996791 -1054448
36531a054448K779493J743496m81006j663187j322738q46650p44113k21612O05718
$$ -1054448 1725045 3468541 2987535 1324348 1610 -845040 -1589153 -1810765 -1205047
36522a205047N39748l90196p02754L9226O38332N64314O05431P30359k00612j735934
$$ -1205047 -665299 -1055495 -1758249 -1719023 -1080691 -516377 89054 819413 618801 -1117133
36512a117133j521986Q63425K332717N77746k273844k773001j158878l88570j291795
$$ -1117133 -2639119 -1775694 557023 1134769 -1139075 -3912076 -5070954 -5459524 -6751319
36503f751319j775702n66104J095339J806725J730559J425964Q62835J88018p8370
$$ -6751319 -8527021 -9093125 -7997786 -6191061 -4460502 -3034538 -2171703 -1983685 -2062055
36494b062055o1232l63335o80988j14279J001005J348233R74145J324662K363010
$$ -2062055 -2123287 -2486622 -3167610 -3281889 -2280884 -932651 41494 1366156 3729166
36485C729166J957980o43223k924546k501933o49413k32553j397642j789307m21645
$$ 3729166 5687146 5043923 2119377 -382556 -1031969 -1264522 -2662164 -4451471 -4873116
36476d873116J147319J482144R16827K00957n91270j193786p84367O91113J949203
$$ -4873116 -3725797 -2243653 -1326826 -1125869 -1717139 -2910925 -3695292 -3004179 -1054976
36467a054976J852422O99873l75524n73369J95177J268197J487344M04559p98005
$$ -1054976 797446 1497319 1121795 548426 743603 2011800 3499144 3903703 3105698
36458C105698o86150K64995L47598n60382p38864L68271R37920m00667k331955
$$ 3105698 2419548 2684543 3032141 2471759 1732895 2101166 3039086 2638419 306464
36449C06464k835423j899615p60277K26244J256153J708492R02835m63865j160664
$$ 306464 -2528959 -4428574 -5188851 -4962607 -3706454 -1997962 -1095127 -1558992 -2719656
36440b719656j017075l95167Q48847K325665K331637J75562j855178j299439O44675
$$ -2719656 -3736731 -4131898 -3283051 -957386 1374251 1549813 -305365 -1604804 -960129
36431i60129R08603n03737o92322J061137K002768N36881j239725j130040r245
$$ -960129 -51526 -555263 -1247585 -186448 1816320 2353201 1113476 -16564 -25809
36422b5809M33005M94074Q54406M86208j322259k654308j379621J309266K356431
$$ -25809 407196 901270 1755676 2241884 919625 -1734683 -3114304 -1805038 551393
36413E51393J066663n09177q78283n13469j78744P6687J64356j65658n87617n45519
$$ 551393 1618056 1108879 230596 -282873 -461617 -384930 -220574 -386232 -973849 -1519368
36403a519368j58033K23151P59396J314493Q54539q44463j945546r20955Q11493
$$ -1519368 -1677401 -1454250 -694854 619639 1474178 629715 -1315831 -2236786 -1425293
36394a425293R28185L3409O31133K650170L231720J393457l02527J25912J178933
$$ -1425293 -497108 -463699 167434 2817604 6049324 7442781 7140254 7266166 8445099
36385H445099P48322n85578j178997j265829j960946k723121k193756p53857l1451
$$ 8445099 9193421 8607843 7428846 6163017 4202071 1478950 -714806 -1468663 -1500114
36376a500114k65952j56465P82129J486745J099765J3820j001761j510335j173934
$$ -1500114 -1766066 -1922531 -1140402 346343 1446108 1459928 458167 -1052168 -2226102
36367b226102j5880R74293P11851l15052m85278N41621J205748M76644m52865
$$ -2226102 -2241982 -1267689 -555838 -870890 -1356168 -814547 391201 867845 414980
36358D14980m9741J016752Q04407q40942j875565r93548N52419R07113K46099
$$ 414980 365239 1381991 2186398 1345456 -530109 -1523657 -971238 -64125 181974
36349A81974K11331J312093K250218J793768J90691j445134k202181j671880j92377
$$ 181974 393305 1705398 3955616 5749384 5940075 4494941 2292760 620880 428503
36340D28503R50534O20707n32670p14347L05440O20315p75762k024768j068583
$$ 428503 1379037 1999744 1467074 752727 1058167 1678482 902720 -1122048 -2190631
36331b190631J075692J828359R84087O67113J556622J748890k2144k261164k888615
$$ -2190631 -1114939 713420 1697507 2364620 3921242 5670132 5647988 3386824 498209
36322D98209j873224n55076L23299P57144P16711L81330L83464R12212J239050
$$ 498209 -1375015 -1930091 -1606792 -849648 -132937 248393 631857 1544069 2783119
36313B783119Q26432J42092k66299o29125j185737j451461j021859k92592K97180
$$ 2783119 3609551 3751643 3485344 2856219 1670482 219021 -802838 -1095430 -798250
36304g98250Q30965J106661M36258r07659j338547j84774R90412O70799k58793
$$ -798250 32715 1139376 1575634 667975 -670572 -855346 135066 805865 547072
36295E47072j56166M90461l5465j535893j983777o81246Q09535J154957P59625
$$ 547072 390906 881367 845902 -689991 -2673768 -3355014 -2545479 -1390522 -630897
36286f30897L66862p7891n48576m72756J44150M19006K7608k77453j05936p9209
$$ -630897 -264035 -341926 -890502 -1363258 -1219108 -800102 -772494 -1049947 -1155883 -1235092
36276a235092m47869m25988L35980R28684P05014L60930N43329O53123J55096
$$ -1235092 -1682961 -2108949 -1772969 -844285 -139271 221659 764988 1418111 1573207
36267A573207j82516K88704O15044j88152j074885m10066J140343J257798o07672
$$ 1573207 1390691 1679395 2294439 2106287 1031402 621336 1761679 3019477 2411805
36258B411805k460550k631629j577320l39307R89651K352743K761239J494125
$$ 2411805 -48745 -2680374 -4257694 -4597001 -3607350 -1254607 1506632 3000757
36250C000757n63131j825586j739300q75469J30956R78294J448410J437065J040142
$$ 3000757 2437626 612040 -1127260 -2002729 -1871773 -893479 554931 1991996 3032138
36241C032138L15591o62741j389077j239836m31644J06448N5225k6296J8123l42156
$$ 3032138 3347729 2684988 1295911 56075 -375569 -269121 -213896 -240192 -222069 -564225
36231e64225q69609l97012R58608J127942q56509k715054j887689N86848J614199
$$ -564225 -1433834 -1830846 -872238 255704 -600805 -3315859 -5203548 -4616700 -3002501
36222c002501O28517j72838J53087J47810p60738q87063O35768K040193J700319
$$ -3002501 -2373984 -2546822 -2393735 -2245925 -3006663 -3893726 -3257958 -1217765 482554
36213D82554N00444j76384p27794j748949k112337q31662P05871O89188j77364
$$ 482554 982998 806614 78820 -1670129 -3782466 -4614128 -3908257 -3219069 -3396433
36204c396433m3420Q45001Q12881q5800k39561N23058O95861j41218p26264m64866
$$ -3396433 -3439853 -2594852 -1781971 -1867771 -2107332 -1584274 -888413 -1029631 -1755895 -2220761
36194b220761j26284N0635P14536J500522J018528o66283j655457j011036P8440
$$ -2220761 -2347045 -2296410 -1581874 -81352 937176 270893 -1384564 -2395600 -2317160
36185b317160N88571R74927J360024O99590r55830j522661J00698J866011J304322
$$ -2317160 -1728589 -753662 606362 1305952 350122 -1172539 -1071841 794170 2098492
36176B098492r67879k371013j900107o44185M23919J264855J731797J354422K02434
$$ 2098492 1130613 -1240400 -3140507 -3784692 -3360773 -2095918 -364121 990301 1192735
36167A192735j026664j665203j298719M3610J374788J359115J17782o72232k37265
$$ 1192735 166071 -1499132 -2797851 -2754241 -1379453 -20338 97444 -574788 -812053
36158h12053J21403o39369j373220o89277N79812P32647q8747n29985m51137o33275
$$ -812053 -690650 -1330019 -2703239 -3392516 -2812704 -2080057 -2168804 -2698789 -3149926 -3783201
36148c783201p98639j25816P63901N57147l59272n04349m6631n00670j652485
$$ -3783201 -4581840 -4707656 -3943755 -3386608 -3745880 -4250229 -4296860 -4797530 -6450015
36139f450015j398135P80766K601243K211930O22849j77327J96171R37801J538283
$$ -6450015 -7848150 -7067384 -4466141 -2254211 -1631362 -1808689 -1612518 -674717 863566
36130H63566J702471J008640k96780j164021j170759j032187j101676o97710L52129
$$ 863566 2566037 3574677 3277897 2113876 943117 -89070 -1190746 -1888456 -1536327
36121a536327R71950O18000L53756R55681J318646K15702j475116j917625r06016
$$ -1536327 -564377 53623 407379 1363060 2681706 2897408 1422292 -495333 -1401349
36112a401349K19331O13702M22403j97825j034637j211092j36072J196503J304028
$$ -1401349 -1182018 -568316 -145913 -343738 -1378375 -2589467 -2725539 -1529036 -225008
36103b25008L80931j15584J70786K50189r1794J41618J000309R39635o29633j814802
$$ -225008 155923 40339 211125 461314 369520 511138 1511447 2451082 1821449 6647
36093F647p58963J522664K546645J817407R65853P50617N2926j672557k891324
$$ 6647 -752316 770348 3316993 5134400 6100253 6850870 6903796 5231239 2339915
36084B339915k140656l70785L49789k81632p39854j43304P76796J238961J426960
$$ 2339915 199259 -171526 178263 -103369 -843223 -986527 -209731 1029230 2456190
36075B456190J486092Q71818m73447j362177q18260M24288R11451M31411n6818
$$ 2456190 3942282 4814100 4340653 2978476 2160216 2584504 3495955 3927366 3870548
36066C870548o2636j737j47992k56581l13946o72219j207185j218796n35835L647
$$ 3870548 3807912 3806175 3658183 3401602 3087656 2415437 1208252 -10544 -546379 -542732
36056e42732l45661j143765j264921k56257J158413J843773J315327N5417j102072
$$ -542732 -888393 -2032158 -3297079 -3553336 -2394923 -551150 764177 819594 -282478
36047b82478j723563j778768j200489o4668Q41181N50767o15331j051532L018
$$ -282478 -2006041 -3784809 -4985298 -5049966 -4208785 -3658018 -4273349 -5324881 -5321863
36038e321863J235185J090443M894m44652n683J70197k92485l53014N91909J568616
$$ -5321863 -4086678 -2996235 -2991341 -3435993 -3441676 -3271479 -3563964 -3916978 -3325069 -1756453
36028a756453J389902K83056m88500j69078P46939J135077N26758k01007J37687
$$ -1756453 -366551 -83495 -571995 -741073 5866 1140943 1667701 1466694 1604381
36019A604381J153068J005606q96492k509593j805992J98075Q96958j06814q48452
$$ 1604381 2757449 3763055 2866563 356970 -1449022 -1250947 -353989 -460803 -1309255
36010a309255l92742M9508k74220l36778N05130J139874P19320K75086Q85750
$$ -1309255 -1701997 -1652489 -1926709 -2263487 -1758357 -618483 100837 375923 1261673
36001A261673J655225J090003n03179j506591j251425m90992k0973Q1334M2298
$$ 1261673 2916898 4006901 3503722 1997131 745706 254714 233741 315075 357373
35992C57373J1364J7265n9500k65794l11362k0469J19662l23097p11448k05525
$$ 357373 368737 386002 326502 60708 -250654 -271123 -151461 -474558 -1186006 -1391531
35982a391531N93314M01047m43780l37070P25783Q40248n66130j446235l04077
$$ -1391531 -798217 -397170 -840950 -1178020 -452237 388011 -178119 -1624354 -1928431
35973a928431J371159J387674r1903j373123j692743j300059l54460P36036J015832
$$ -1928431 -557272 830402 738499 -634624 -2327367 -3627426 -3981886 -3245850 -2230018
35964b230018L79238R4249P49039J128682M05344k73435O5890L23500n40681j297327
$$ -2230018 -1850780 -1756531 -1007492 121190 526534 253099 318989 642489 101808 -1195519
35954a195519n65478N92428O37553M27718J331621K056540O55404j469815j237283
$$ -1195519 -1760997 -1168569 -531016 -103298 1228323 3284863 3940267 2470452 1233169
35945A233169R88444J681475l47468k298594j831832M00J127029J012766r730
$$ 1233169 2221613 3903088 3555620 1257026 -574806 -574406 552623 1565389 1555659
35936A555659j452414j962682l50963J972686K100539r8831j485209m11788Q04726
$$ 1555659 103245 -1859437 -2210400 -237714 1862825 1763994 278785 -133003 671723
35927F71723l05540k578604l162471j403689J029079K508337K428773J043773
$$ 671723 366183 -2212421 -5374892 -6778581 -5749502 -3241165 -812392 231381
35919B31381m46467p26120o9188O0980m81072k93751P58700Q92982l83269r42498
$$ 231381 -215086 -941206 -1010394 -949414 -1430486 -1724237 -965537 -72555 -455824 -1398322
35909a398322M68025J781105P23520j637110k710373k044858q50254N89358K429694
$$ -1398322 -930297 850808 1574328 -62782 -2773155 -4818013 -5668267 -5078909 -2649215
35900b649215L341601J825156j041501k552872j848629m37804M44811J002049
$$ -2649215 692386 2517542 1476041 -1076831 -2925460 -3363264 -2918453 -1916404
35892a916404J465958J366338M69865p72388j753715j879251p24755J048778J759007
$$ -1916404 -450446 915892 1385757 613369 -1140346 -3019597 -3744352 -2695574 -936567
35883i36567Q08276k39401K4404O34541J7105j208843j289555k86642L39196M41244
$$ -936567 -128291 -367692 -343288 291253 308358 -900485 -2190040 -2476682 -2137486 -1696242
35873a696242J012908J672002R42941q81971j705784q59182l5221m24368j125701
$$ -1696242 -683334 988668 1931609 1049638 -656146 -1515328 -1550549 -1974917 -3100618
35864c100618j137687q14326m42278N99458K131104K491530R44971p68144p46168
$$ -3100618 -4238305 -5052631 -5494909 -4895451 -2764347 -272817 672154 -95990 -842158
35855h42158M43950R07297J91132n62486n47459p059N75798Q66336N35105l57744
$$ -842158 -398208 509089 700221 137735 -409724 -416783 159015 1025351 1560456 1202712
35845A202712j059802q95073n8135Q47193J553619J865725J306843j54132j489386
$$ 1202712 142910 -752163 -810298 36895 1590514 3456239 4763082 4608950 3119564
35836C119564j600375p01516j2117k38956r62946j367810j031905j26062P09633
$$ 3119564 1519189 817673 805556 566600 -396346 -1764156 -2796061 -2922123 -2212490
35827b212490P99610J08275o57352q66451o08578k78663L7937L52676L99781Q4727
$$ -2212490 -1412880 -1304605 -1961957 -2828408 -3436986 -3715649 -3677712 -3325036 -2925255 -2840528
35817b840528M105P96313K017209K326389J002232j129481k504380k341997j198321
$$ -2840528 -2836423 -2040110 -22901 2303488 3305720 2176239 -328141 -2670138 -3868459
35808c868459j54226L00959M77482P37908R27777P65891M43759L22514K06654
$$ -3868459 -4022685 -3721726 -3244244 -2506336 -1578559 -812668 -368909 -46395 160259
35799A60259m02526j278757j445128m93494P29983J219224R92247N98746N3853
$$ 160259 -242267 -1521024 -2966152 -3459646 -2729663 -1510439 -518192 80554 134407
35790A34407q29610j422552p86152O78818J244633J09708j243757q36906J167062
$$ 134407 -695203 -2117755 -2903907 -2225089 -980456 -870748 -2114505 -2951411 -1784349
35781a784349K605770J946849j59900j997543k507904j659298o7873J160202R99953
$$ -1784349 821421 2768270 2608370 610827 -1897077 -3556375 -3624248 -2464046 -1464093
35772a464093k93909j109727l73160J000746J405873P38761J63515J15015j4214
$$ -1464093 -1758002 -2867729 -3240889 -2240143 -834270 -95509 68006 183021 168807
35763A68807k69337J72102J297732J746387P67652n18134p42531j96590j23459
$$ 168807 -100530 71572 1369304 3115691 3883343 3365209 2622678 2426088 2302629
35754B302629q59892j680832j963513j630769q56160l8205L42725L50729N01141
$$ 2302629 1442737 -238095 -2201608 -3832377 -4688537 -4726742 -4384017 -4033288 -3532147
35745c532147O61927j424j390216j960692q29863P29815J138207P95501J020949
$$ -3532147 -2870220 -2871644 -4261860 -6222552 -7052415 -6322600 -5184393 -4388892 -3367943
35736c367943J630754J398711L75678j64688J01322K45152m1499k1872M32633
$$ -3367943 -1737189 -338478 37200 -127488 -26166 218986 177487 155615 588248
35727E88248M07654m16433j083567p89739J26772R33781J217039P18722m36238
$$ 588248 995902 579469 -504098 -1293837 -1167065 -233284 983755 1702477 1266239
35718A266239j296030j014070j83519K4319j30046N52994J727208J485172o84380
$$ 1266239 -29791 -1043861 -1227380 -1203061 -1333107 -780113 947095 2432267 1747887
35709A747887k785217k944826j540048J02051J481318K377112K073607M99629
$$ 1747887 -1037330 -3982156 -5522204 -5420153 -3938835 -1561723 511884 1011513
35701A011513r06890p32244O79644J845718J766054L96645j489226k380028j179546
$$ 1011513 104623 -627621 52023 1897741 3663795 4060440 2571214 191186 -988360
35692i88360J065909J874314M66850j194881j295506m92867k74762o05629o45552
$$ -988360 77549 1951863 2418713 1223832 -71674 -564541 -839303 -1444932 -2090484
35683b090484m41546l69789p5646N49718N32401n05472j069513Q4853J723648
$$ -2090484 -2532030 -2901819 -2977465 -2427747 -1895346 -2400818 -3470331 -3385478 -1661830
35674a661830J893496Q25992Q3816j74309q38859j554999j156991P3039Q13581
$$ -1661830 231666 1057658 1141474 967165 128306 -1426693 -2583684 -2510645 -1697064
35665a697064R25697J064537O93650r23908k251518j060201J528405J886568o44717
$$ -1697064 -771367 293170 986820 62912 -2188606 -3248807 -1720402 166166 -478551
35656d78551k479391j209765R32004R53905m18293o90638J77524M33276J3449
$$ -478551 -2957942 -4167707 -3235703 -2281798 -2700091 -3390729 -3213205 -2779929 -2766480
35647b766480L60894J340924J126809o96282k170008j651645J62508J495771J574565
$$ -2766480 -2405586 -1064662 62147 -634135 -2804143 -4455788 -4293280 -2797509 -1222944
35638a222944Q69065J04356l64677n52502n59027k99846K92874P87870N75561
$$ -1222944 -353879 -249523 -614200 -1166702 -1725729 -2025575 -1732701 -944831 -369270
35629c69270o2636o488J012277J613942N74471j226801j773084n07706J067159
$$ -369270 -431906 -438394 573883 2187825 2762296 1535495 -237589 -745295 321864
35620C21864J293498L1900j511020j977271r76114N06240J053831N10980J25815
$$ 321864 1615362 1647262 136242 -1841029 -2817143 -2310903 -1257072 -746092 -620277
35611f20277N54677P21156l62951j659471j520978l71848j08306j022917j322132
$$ -620277 -65600 655556 292605 -1366866 -2887844 -3259692 -3367998 -4390915 -5713047
35602e713047m2566J425549J500029N35464j83914k92962q5506N42113J651270
$$ -5713047 -5755613 -4330064 -2830035 -2294571 -2478485 -2771447 -2856953 -2314840 -663570
35593f63570K469114K205215J215271L98158j01071o54310j106007j019928o33891
$$ -663570 1805544 4010759 5226030 5624188 5523117 4868807 3762800 2742872 2108981
35584B108981n09156m57103J06978Q63588P79757k93253j233207j087596m7272
$$ 2108981 1599825 1142722 1249700 2113288 2893045 2599792 1366585 278989 231717
35575B31717J185392K097283K202076J149725n37486j634610j611566j187817
$$ 231717 1417109 3514392 5716468 6866193 6328707 4694097 3082531 1894714
35567A894714j105361j155293r40678p34551q15944p09585L24P30253P93541O89822
$$ 1894714 789353 -365940 -1306618 -2041169 -2857113 -3566698 -3566374 -2836121 -2042580 -1352758
35557a352758J275928K005279J459344l02372j435689r06158o6578o51976k133768
$$ -1352758 -76830 1928449 3387793 3085421 1649732 743574 676996 25020 -2108748
35548b108748k387463o84207J279127J618928N63677j55964L08582J042864R05095
$$ -2108748 -4496211 -5180418 -3901291 -2282363 -1718686 -1874650 -1566068 -523204 381891
35539C81891P4505n19811p21114j076082j381531n90391J318030K568106J753782
$$ 381891 456396 -63415 -784529 -1860611 -3242142 -3832533 -2514503 53603 1807385
35530A807385n8897p43371j20148M1187j043400j957816j322422K39977J268527
$$ 1807385 1748488 1005117 884969 926156 -117244 -2075060 -3397482 -3157505 -1888978
35521a888978J468603J493894J513247J118611K77599n38822r87885j001618o02548
$$ -1888978 -420375 1073519 2586766 3705377 3982976 3444154 2456269 1454651 852103
35512H52103r4833j4547l36043k43678O40969J360658Q11221o05608j488201j318467
$$ 852103 757270 742723 406680 163002 803971 2164629 2975850 2370242 882041 -436426
35502d36426q23092n77928l28748J55786N29859N25857M20806M55306L85085L4182
$$ -436426 -1259518 -1837446 -2166194 -2010408 -1480549 -954692 -533886 -78580 306505 340687
35492C40687k01104P0192M32864M2547j109380j773738p63800J334034K387880
$$ 340687 139583 209775 642639 685186 -424194 -2197932 -2961732 -1627698 760182
35483G60182J164550q95608j262018M21774J818032J003818j088308k161120j485427
$$ 760182 1924732 1029124 -232894 188880 2006912 3010730 1922422 -238698 -1724125
35474a724125j85878P10363J138097J173815P01938N6551l6788N45256J079136
$$ -1724125 -1910003 -1199640 -61543 1112272 1814210 1870761 1833973 2379229 3458365
35465C458365R27592K13615m55244n23822P0743O17868K42807p30555q12147M28253
$$ 3458365 4385957 4599572 4144328 3620506 3691249 4309117 4551924 3821369 3009222 3437475
35455C437475J158124k64390k460344k637837o88481O15918k07019j341705p74122
$$ 3437475 4595599 4331209 1870865 -766972 -1455453 -839535 -1046554 -2388259 -3162381
35446c162381P29145J257539P32409M00362M23333n1884q76767q20533L77936
$$ -3162381 -2433236 -1175697 -443288 -42926 380407 328523 -548244 -1368777 -990841
35437i90841J363374J029519J116l64763J24163K96077o76056j851396j410680
$$ -990841 372533 1402052 1403168 1038405 1162568 1458645 782589 -1068807 -2479487
35428b479487Q48949K650023J778023r16596k385949j296717M45894O13902m35483
$$ -2479487 -1630538 1019485 2797508 1880912 -505037 -1801754 -1355860 -741958 -1177441
35419a177441q16955J58275J646428K760977K979893J733236q54556l095087l101842
$$ -1177441 -1994396 -1836121 -189693 2571284 5551177 7284413 6429857 3334770 232928
35410B32928j098073Q02171J179684O22162L92826Q51569J448449J457108M96887
$$ 232928 -865145 -62974 1116710 1738872 2131698 2983267 4431716 5888824 6385711
35401F385711j021800j921971j383631l98R29828R40098M25324m47771j616668
$$ 6385711 5363911 3441940 2058309 2057911 2987739 3927837 4353161 3905390 2288722
35392B288722k118635q17371J547134K581247J210183q86750j632877j069850
$$ 2288722 170087 -647284 899850 3481097 4691280 3804530 2171653 1101803
35384A101803m58538r5292M65062Q21966J09863j263446j822499j054259P9661
$$ 1101803 643265 547973 1013035 1835001 1944864 681418 -1141081 -2195340 -2115679
35375b115679P82179J254969J614927J313186K07574r18835j542931k029151k405744
$$ -2115679 -1333500 -78531 1536396 2849582 3057156 2138321 595390 -1433761 -3839505
35366c839505j763231O8561J419261Q49889n07203m13956J149660K028902J172256
$$ -3839505 -5602736 -5534175 -4114914 -3265025 -3772228 -4186184 -3036524 -1007622 164634
35357A64634j22110n85572o47774r31544q52357Q9077J007687R39320L70378K21164
$$ 164634 42524 -543048 -1190822 -2122366 -2974723 -2885646 -1877959 -938639 -568261 -347097
35347c47097K98589M0897j53513K55757O44723K00197n40102n99828k78985m11971
$$ -347097 -48508 -7611 -161124 94633 739356 939553 399451 -200377 -479362 -891333
35337h91333o96237m66607k99808q69424j063785L31331J774240P49647j808269
$$ -891333 -1587570 -2054177 -2353985 -3223409 -4287194 -3955863 -2181623 -1431976 -3240245
35328c240245k204790M22583K596502J740824l28369q96310l21221k08284j99515
$$ -3240245 -5445035 -5022452 -2425950 -685126 -1013495 -1909805 -2231026 -2439310 -2638825
35319b638825O70403J397174O61850m01197R8292J485493J644149N01411l83327
$$ -2638825 -1968422 -571248 90602 -310595 -212303 1273190 2917339 3418750 3035423
35310C035423q66820j851359k432582p71641K065918K519863k95743k795384j792806
$$ 3035423 2168603 317244 -2115338 -2886979 -821061 1698802 1403059 -1392325 -3185131
35301c185131J185690K300053M61157j945569k509520j222859L28122R39587O94864
$$ -3185131 -1999441 300612 761769 -1183800 -3693320 -4916179 -4588057 -3648470 -2953606
35292b953606M06637M63775M52618L8088l18323j16126K05652q3233p23196p73722
$$ -2953606 -2546969 -2083194 -1630576 -1592488 -1910811 -2026937 -1821285 -1904518 -2627714 -3401436
35282c401436L8056J162408K125412K685341K463301J387681J38705p46816j629264
$$ -3401436 -3363380 -2200972 -75560 2609781 5073082 6460763 6599468 5852652 4223388
35273D223388k648330k747076j213106O56720J122470N07995L14252N71424K11393
$$ 4223388 1575058 -1172018 -2385124 -1728404 -605934 -97939 216313 787737 999130
35264I99130n33566n30961j67389p65733j756172j226413O03291J394564N54880
$$ 999130 465564 -65397 -232786 -998519 -2754691 -3981104 -3377813 -1983249 -1428369
35255a428369K4654N44617L92317j012471j521565L1035J575893J312703O43927
$$ -1428369 -1403715 -859098 -466781 -1479252 -3000817 -2969782 -1393889 -81186 562741
35246E62741J233339J742090L12885j788675k015562n13827N55626M56858K3536
$$ 562741 1796080 3538170 3851055 2062380 46818 -467009 88617 545475 569011
35237E69011n23329j334286j474538j83519J272607J309817N86746N29873N28772
$$ 569011 45682 -1288604 -2763142 -2946661 -1674054 -364237 222509 752382 1281154
35228A281154o71080j904456j060408J084501J770183O63949R1397Q64735J182855
$$ 1281154 610074 -1294382 -2354790 -1270289 499894 1163843 1255240 2119975 3302830
35219C302830J25778q67645p65166l98878l50917K3170O60014M17295n38961n18025
$$ 3302830 3428608 2560963 1795797 1396919 1046002 1069172 1729186 2146481 1607520 1089495
35209A089495O54885J020453p2566o92409J49297N26323r92776k569803j999714
$$ 1089495 1744380 2764833 2692267 1999858 2149155 2675478 1682702 -887101 -2886815
35200b886815j89022P32941R17107J726833K586819J735317o16927k392131k515072
$$ -2886815 -3075837 -2342896 -1425789 301044 2887863 4623180 4006253 1614122 -900950
35191i00950j615741l63379Q84656J250544K36310q21076j84579J573355K236389
$$ -900950 -2516691 -2880070 -1995414 -744870 -508560 -1329636 -1514215 59140 2295529
35182B295529J198026L7887k25973l86139j104926j629685j233398m59761j16698
$$ 2295529 3493555 3531442 3305469 2919330 1814404 184719 -1048679 -1508440 -1625138
35173a625138j55010j92738j57997R4384Q24267J624216J580663O27451k41586
$$ -1625138 -1780148 -1972886 -2130883 -2036499 -1212232 411984 1992647 2620098 2378512
35164B378512m49720m35040m41619l8117N95259L54214q77559j384331L941J821543
$$ 2378512 1928792 1493752 1052133 1014016 1609275 1963489 1085930 -298401 -294460 1527083
35154A527083J834249J99092r78929p90775l58348n53550p69049m62913k72358
$$ 1527083 3361332 3560424 2581495 1790720 1432372 878822 109773 -353140 -625498
35145f25498o82455q66273J5320J223110J328334K03700r34601j198638p95809
$$ -625498 -1307953 -2174226 -2158906 -935796 392538 596238 -338363 -1537001 -2332810
35136b332810k72846J38933M32756P65480J415526K181833K082675N25954j403575
$$ -2332810 -2605656 -2466723 -2033967 -1268487 147039 2328872 4411547 4937501 3533926
35127C533926j943355j015476l60399r33301j471437n10589J255066J859252O94085
$$ 3533926 1590571 575095 214696 -718605 -2190042 -2700631 -1445565 413687 1107772
35118A107772r92556j906969j779000p33874J044410K647087K615071O29422j576070
$$ 1107772 115216 -1791753 -3570753 -4304627 -3260217 -613130 2001941 2631363 1055293
35109A055293j869876j62149J475374J240802l55602j262240m56187Q88896J059527
$$ 1055293 -814583 -976732 498642 1739444 1383842 121602 -334585 554311 1613838
35100A613838L5603o85572k50274N76322P70961L62356j21925n63218q57297m87563
$$ 1613838 1649441 963869 713595 1289917 2060878 2423234 2301309 1738091 880794 393231
35090C93231N11014R00346k09404j660966j510582K16173J500565J168018K85024
$$ 393231 904245 1804591 1595187 -65779 -1576361 -1360188 140377 1308395 1593419
35081A593419K59641Q61544R59452L17621k91935l32414q9353j21883n32541p76093
$$ 1593419 1853060 2714604 3674056 3991677 3699742 3367328 3277975 3156092 2623551 1847458
35071A847458k10045R47731J455799M17716j351560k108784j329279k14720P9849
$$ 1847458 1637413 2585144 4040943 4458659 3107099 998315 -330964 -545684 -465835
35062d65835k01826k21743J17878K67224l450k96676j52890K91222K54397p90560
$$ -465835 -667661 -889404 -771526 -504302 -507752 -804428 -957318 -666096 -411699 -1202259
35052a202259k021149j783701J54007J714271J049704p45670j084514M12847J651092
$$ -1202259 -3223408 -5007109 -4853102 -3138831 -2089127 -2834797 -3919311 -3506464 -1855372
35043a855372J411673P13648M15736j45200j114390j011146P64091K232798J536973
$$ -1855372 -443699 269949 685685 540485 -573905 -1585051 -820960 1411838 2948811
35034B948811k04522p70413k65159l77849j138476r59319L54855J053517J88789
$$ 2948811 2744289 1973876 1708717 1330868 192392 -766927 -412072 641445 830234
35025H30234j055558j276237n08574M95373J242521J280675L20286q52556p58459
$$ 830234 -225324 -1501561 -2010135 -1514762 -272241 1008434 1328720 476164 -282295
35016b82295P89305K035328J371401o18404j937183j551896k99406M20402K60992
$$ -282295 507010 2542338 3913739 3295335 1358152 -193744 -493150 -72748 188244
35007A88244k273K09083M33975O3305l95652K8031R39097Q30714l94509q05454
$$ 188244 185971 395054 829029 892334 496682 524713 1463810 2294524 1900015 1094561
34997A094561N91106J882795R58245j121917j665964m56798J86937p54417j683850
$$ 1094561 1685667 3568462 4526707 3404790 1738826 1282028 1468965 714548 -969302
34988i69302j311304m85208j81855K40875J436421K324119J549564k48288j093974
$$ -969302 -2280606 -2765814 -2947669 -2706794 -1270373 1053746 2603310 2355022 1261048
34979A261048j99838J226200J541141L92371j035956j289210l30568K66191o35043
$$ 1261048 1061210 2287410 3828551 4220922 3184966 1895756 1565188 1831379 1196336
34970A196336j961047j820813l31948N10621j62418r87496p35923l7520J00669
$$ 1196336 -764711 -2585524 -2917472 -2406851 -2569269 -3556765 -4292688 -4330208 -4229539
34961d229539r6538j20896l29008r17449r88901K1763J067203J048112O80799
$$ -4229539 -4326077 -4446973 -4775981 -5693430 -6682331 -6660568 -5593365 -4545253 -3864454
34952c864454J216186K060973J496360n00118j872815j124193R54805K476193
$$ -3864454 -2648268 -587295 909065 408947 -1463868 -2588061 -1633256 842937
34944H42937K411472J112650l34888r88514p41794k79252j49476j45610J11384
$$ 842937 3254409 4367059 4032171 3043657 2301863 2022611 1873135 1727525 1838909
34935A838909M52762M86417J53803n02248j494479k248064j617840N33872K463198
$$ 1838909 2291671 2778088 2931891 2429643 935164 -1312900 -2930740 -2396868 66330
$$ [...]
##END NTUPLES=NMR SPECTRUM
##END=
