##TITLE=31Pdec_DE-63_22_oil
 D2O, 64 sc
 8.8.2024
##JCAMPDX= 6.0         $$ Bruker NMR JCAMP-DX V2.0
##DATA TYPE= NMR SPECTRUM
##DATA CLASS= NTUPLES
##ORIGIN= UXNMR, Bruker Analytische Messtechnik GmbH
##OWNER= root
$$ XWIN-NMR		Version 3.5
$$ Thu Aug  8 15:26:34 2024 Russian Standard Time (UT+4h)  she@DPX200
##.OBSERVE FREQUENCY= 81.013821
##.OBSERVE NUCLEUS= ^31P
##.ACQUISITION MODE= SIMULTANEOUS
##.ACQUISITION SCHEME= undefined
##.AVERAGES= 64
##.DIGITISER RES= 17
##SPECTROMETER/DATA SYSTEM= spect
##.PULSE SEQUENCE= zgpg30
##.SOLVENT NAME= D2O
##.SHIFT REFERENCE= (INTERNAL, D2O, 0, 198.062)
##AUDIT TRAIL= $$ (NUMBER, WHEN, WHO, WHERE, WHAT)
$$ ##TITLE= Audit trail, XWIN-NMR		Version 3.5
$$ ##JCAMPDX= 5.01
$$ ##ORIGIN= Bruker BioSpin GmbH
$$ ##OWNER= she
$$ F:/spectra/data/she/nmr/P31/2/pdata/1/auditp.txt
$$ ##AUDIT TRAIL=  $$ (NUMBER, WHEN, WHO, WHERE, WHAT)
(   1,<2024-08-08 15:25:32.07 +0400>,<she>,<DPX200>,
      <created by zg, POWCHK disabled, PULCHK disabled
       configuration hash MD5:
       00 E9 B6 7A A2 85 ED C7 34 08 36 98 17 FE 4E 26
       data hash MD5: 32K
       0B 55 90 9F 2D 1C 83 E6 2D 16 96 82 29 9C 90 82>)
(   2,<2024-08-08 15:25:34.25 +0400>,<she>,<DPX200>,
      <Start of raw data processing
       efp BC_mod = 2 LB = 1.5 FT_mod = 6 PKNL = 1 PHC0 = 2671.901 PHC1 = 84.08804 SI = 64K 
       data hash MD5: 64K
       4D B0 35 8A E0 9C 54 96 70 73 7F 4A D5 9B 90 D7>)
(   3,<2024-08-08 15:25:51.59 +0400>,<she>,<DPX200>,
      <pk PHC0 = -2.947184 PHC1 = 0 
       data hash MD5: 64K
       32 65 3A 87 AF 41 B8 3D 2F EC D8 B7 C2 31 20 22>)
(   4,<2024-08-08 15:25:55.54 +0400>,<she>,<DPX200>,
      <abs ABSG = 5 
       data hash MD5: 64K
       6F AB 7B D9 E5 29 67 5C 61 6E 67 BD 75 65 6C 5F>)
$$ ##END=
$$ 
$$ hash MD5
$$ D0 B3 AB D7 A9 45 FA D2 08 C7 01 59 0E E7 AC 94
##$RELAX= 
##$RELAX= 
##$RELAX= 
##$RELAX= 
##$RELAX= 
##$RELAX= 
##$RELAX= 
##$RELAX= 
$$ Bruker specific parameters
$$ --------------------------
##$DU= <F:/spectra>
##$EXPNO= 2
##$NAME= <P31>
##$PROCNO= 1
##$TYPE= <nmr>
##$USER= <she>
##$AMP= (0..31)
100 100 100 100 100 100 100 100 100 100 100 100 100 100 100 100 100 100 
100 100 100 100 100 100 100 100 100 100 100 100 100 100 
##$AQSEQ= 0
##$AQ_mod= 1
##$AUNM= <au_zg>
##$AUTOPOS= <>
##$BF1= 81.014009
##$BF2= 200.13
##$BF3= 200.13
##$BF4= 200.13
##$BF5= 200.13
##$BF6= 200.13
##$BF7= 200.13
##$BF8= 200.13
##$BYTORDA= 1
##$CFDGTYP= 0
##$CFRGTYP= 5
##$CHEMSTR= <none>
##$CNST= (0..31)
1 1 145 1 1 1 1 1 1 1 1 1 1 1 1 1 1 1 1 1 1 1 1 1 1 1 1 1 1 1 1 1 
##$CPDPRG= <waltz16>
##$CPDPRG1= <>
##$CPDPRG2= <waltz16>
##$CPDPRG3= <>
##$CPDPRG4= <mlev>
##$CPDPRG5= <mlev>
##$CPDPRG6= <mlev>
##$CPDPRG7= <mlev>
##$CPDPRG8= <mlev>
##$CPDPRGB= <>
##$CPDPRGT= <>
##$D= (0..31)
0 1 0 0 0 0 0 0 0 0.06 0 0.03 2e-05 3e-06 0 0 0.0002 0 0 0 0 0 0 0 0 0 
0 0 0 0 0 0 
##$DATE= 1723116331
##$DBL= (0..7)
120 120 120 11 120 120 24 19 
##$DBP= (0..7)
150 150 150 150 150 150 150 150 
##$DBP07= 0
##$DBPNAM0= <>
##$DBPNAM1= <>
##$DBPNAM2= <>
$$ [...]
##$SUBNAM3= <"">
##$SUBNAM4= <"">
##$SUBNAM5= <"">
##$SUBNAM6= <"">
##$SUBNAM7= <"">
##$SUBNAM8= <"">
##$SUBNAM9= <"">
##$SW= 400.765351723535
##$SWIBOX= (0..15)
0 1 3 0 0 0 0 0 0 0 0 0 0 0 0 0 
##$SW_h= 32467.5324675325
##$TD= 32768
##$TD0= 1
##$TE= 0
##$TE2= 300
##$TE3= 300
##$TEG= 300
##$TL= (0..7)
0 120 53 12 22 120 120 120 
##$TP= (0..7)
150 150 150 150 150 150 150 150 
##$TP07= 0
##$TPNAME0= <>
##$TPNAME1= <>
##$TPNAME2= <>
##$TPNAME3= <>
##$TPNAME4= <>
##$TPNAME5= <>
##$TPNAME6= <>
##$TPNAME7= <>
##$TPOAL= (0..7)
0.5 0.5 0.5 0.5 0.5 0.5 0.5 0.5 
##$TPOFFS= (0..7)
0 0 0 0 0 0 0 0 
##$TUNHIN= 0
##$TUNHOUT= 0
##$TUNXOUT= 0
##$USERA1= <user>
##$USERA2= <user>
##$USERA3= <user>
##$USERA4= <user>
##$USERA5= <user>
##$V9= 5
##$VALIST= <valist>
##$VCLIST= <CCCCCCCCCCCCCCC>
##$VD= 0
##$VDLIST= <DDDDDDDDDDDDDDD>
##$VPLIST= <PPPPPPPPPPPPPPP>
##$VTLIST= <TTTTTTTTTTTTTTT>
##$WBST= 1024
##$WBSW= 4
##$XGAIN= (0..3)
0 0 0 0 
##$XL= 0
##$YL= 0
##$YMAX_a= 12112
##$YMIN_a= -8310
##$ZGOPTNS= <>
##$ZL1= 120
##$ZL2= 120
##$ZL3= 120
##$ZL4= 120
##$ABSF1= 198.0616
##$ABSF2= -202.7028
##$ABSG= 5
##$ABSL= 3
##$ALPHA= 0
##$AQORDER= 0
##$ASSFAC= 0
##$ASSFACI= 0
##$ASSFACX= 0
##$ASSWID= 0
##$AUNMP= <proc_1d>
##$AZFE= 0.1
##$AZFW= 0.5
##$BCFW= 0
##$BC_mod= 2
##$BYTORDP= 0
##$COROFFS= 0
##$CY= -3
##$DATMOD= 1
##$DC= 0
##$DFILT= <>
##$DTYPP= 0
##$F1P= 0
##$F2P= 0
##$FCOR= 1
##$FTSIZE= 65536
##$FT_mod= 6
##$GAMMA= 0
##$GB= 0
##$INTBC= 1
##$INTSCL= 9.790993e-09
##$ISEN= 30
##$LB= 1.5
##$LEV0= 0
##$LPBIN= 0
##$MAXI= 10000
##$MC2= 0
##$MEAN= 0
##$ME_mod= 0
##$MI= 50
##$NCOEF= 0
##$NC_proc= -9
##$NLEV= 6
##$NOISF1= 182.463
##$NOISF2= 159.3651
##$NSP= 0
##$NTH_PI= 0
##$NZP= 0
##$OFFSET= 198.0616
##$PC= 4
##$PHC0= 2668.954
##$PHC1= 84.08804
##$PH_mod= 1
##$PKNL= yes
##$PPARMOD= 0
##$PSCAL= 0
##$PSIGN= 0
##$REVERSE= no
##$SF= 81.0140089999434
##$SI= 65536
##$SIGF1= 159.3651
##$SIGF2= -187.1042
##$SINO= 113.3802
##$SIOLD= 16384
##$SREGLST= <1H.CDCl3>
##$SSB= 0
##$STSI= 65536
##$STSR= 0
##$SW_p= 32467.5324675325
##$SYMM= 0
##$S_DEV= 0
##$TDeff= 32768
##$TDoff= 0
##$TI= <>
##$TILT= no
##$TM1= 0
##$TM2= 0
##$TOPLEV= 0
##$USERP1= <user>
##$USERP2= <user>
##$USERP3= <user>
##$USERP4= <user>
##$USERP5= <user>
##$WDW= 1
##$XDIM= 65536
##$YMAX_p= 448665946
##$YMIN_p= -115506470
$$ End of Bruker specific parameters
$$ ---------------------------------
##NTUPLES= NMR SPECTRUM
##VAR_NAME=  FREQUENCY,     SPECTRUM/REAL,   SPECTRUM/IMAG
##SYMBOL=    X,             R,               I
##VAR_TYPE=  INDEPENDENT,   DEPENDENT,       DEPENDENT
##VAR_FORM=  AFFN,          ASDF,            ASDF
##VAR_DIM=   65536,         65536,           65536
##UNITS=     HZ,            ARBITRARY UNITS, ARBITRARY UNITS
##FACTOR=    0.49542278885378, 1,            1
##FIRST=     16045.7642231865, 0,            0
##LAST=      -16421.768244346, 0,            0
##MIN=       -16421.768244346, -115506470,   0
##MAX=       16045.7642231865, 448665946,    0
$$ Real data points
##PAGE= N=1
##DATA TABLE= (X++(R..R)), XYDATA
$$ [...]
$$ plain form
40031 -1222005 -3470360 -4590782 -3971592 -3554434 -3440134 -1663501 2526277 6754375 7016790
40022 7016790 1406729 -7001604 -11990207 -10491385 -6266399 -5514624 -9688712 -14850222
40014 -14850222 -17208815 -16306210 -13003823 -7859839 -2634623 -616351 -3452082 -8812173
40006 -8812173 -12474991 -12262628 -9644746 -8122353 -9950567 -13824535 -16295875 -15943416
39998 -15943416 -14745585 -14521603 -14463416 -14092002 -15538478 -19219192 -20017764 -13163181 -2599060
39989 -2599060 2504670 -404786 -4941798 -6047247 -5967682 -7714589 -9128472 -7599584
39981 -7599584 -5394085 -5318244 -5212892 -2086871 1479246 801905 -2945864 -3803923 600500
39972 600500 6357735 8696878 6394533 1375971 -2563803 -1554310 4010959 7721879
$$ packed form
40031a222005k248355j120422O19190M17158J14300J776633M189778M228098K62415
40022G016790n610061q408333m988603J498822M224986P51775m174088n161510
40014a4850222k358593R02605L302387N143984N225216K018272k835731n360091
40006h812173l662818K12363K617882J522393j828214l873968k471340L52459
39998a5943416J197831K23982N8187L71414j446476l680714p98572O854583J0564121
39989b599060N103730k909456m537012j105449P9565j746907j413883J528888
39981g599584K205499P5841J05352L126021L566117o77341l747769q58059M404423
39972F00500N757235K339143k302345n018562l939774J009493N565269L710920
$$ plain form
39964 7721879 3840046 -4667489 -8950962 -5122942 1798753 4989513 2628543 -3087137
39956 -3087137 -9470122 -14274727 -16477888 -17732319 -20341057 -22895089 -21149657 -14320743
39948 -14320743 -6894744 -2485891 351913 3576795 4436352 -1178798 -11860627 -21095912
39940 -21095912 -24405859 -23211771 -21222047 -19197343 -14481019 -4997145 7230476 17060585
39932 17060585 20793330 19009116 14502449 9071895 4032449 1925117 4034428 6654041
39924 6654041 3945657 -4512497 -12516359 -14803232 -12529208 -9904490 -9014572 -9888950
39916 -9888950 -12092269 -13820429 -12800084 -10506768 -11617611 -16390889 -18340126 -13951210
39908 -13951210 -9795689 -13310085 -20344835 -20525328 -13289679 -8774322 -11661394 -14063257
$$ packed form
39964G721879l881833q507535m283473L828020O921695L190760k360970n715680
39956c087137o382985m804605k203161j254431k608738k554032J745432O828914
39948a4320743P425999M408853K837804L224882Q59557n615150j0681829r235285
39940b1095912l309947J194088J989724K024704M716324R483874J2227621R830109
39932A7060585L732745j784214m506667n430554n039446k107332K109311K619613
39924F654041k708384q458154q003862k286873K274024K624718Q89918q74378
39916i888950k203319j728160J020345K293316j110843m773278j949237M388916
39908a3951210M155521l514396p034750j80493P235649M515357k887072k401863
$$ plain form
39900 -14063257 -8571059 370310 4767316 6152283 11811640 21273155 25383707 19064847
39892 19064847 8188487 2074118 3825245 9728035 14505841 15377233 13493695 12648184
39884 12648184 14664144 15966792 11571400 2721782 -3251749 -2327931 457008 -2476228
39876 -2476228 -11247589 -18188370 -16528228 -6928299 3899845 8818739 5228434 -2909920
39868 -2909920 -7823801 -4880633 2630566 7095616 4936804 -508613 -4507682 -6464806
39860 -6464806 -8315830 -9792384 -8417735 -3733594 1393510 4460538 6112479 7867035
39852 7867035 8778827 6546446 1378079 -3391587 -4876204 -3260817 -500764 1874591
39844 1874591 2851031 1624209 -1190144 -3267894 -3316366 -3211968 -5471648 -9458242 -12519242
$$ packed form
39900a4063257N492198Q941369M397006J384967N659357R461515M110552o318860
39892A9064847j0876360o114369J751127N902790M777806Q71392j883538q45511
39884A2648184K015960J302648m395392q849618n973531R23818K784939k933236
39876b476228q771361o940781J660142R599929J0828144M918894l590305q138354
39868b909920m913881K943168P511199M465050k158812n445417l999069j957124
39860f464806j851024j476554J374649M684141N127104L067028J651941J754556
39852G867035R11792k232381n168367m769666j484617J615387K760053K375355
39844A874591R76440j226822k814353k077750m8472J04398k259680l986594l061000
$$ plain form
39835 -12519242 -14186388 -15968565 -16974580 -13925687 -7154609 -2451963 -3641755 -6609588
39827 -6609588 -5197406 -725857 155324 -3359019 -3807563 3351955 11633586 11346819 2611655
39818 2611655 -4623033 -2902903 4934826 11030044 11658434 8893217 5704845 2842654
39810 2842654 444003 -282890 968929 995007 -4894324 -17029879 -28984363 -32850988
39802 -32850988 -26702989 -15678624 -6467407 -2614830 -4493910 -10532970 -17302290 -21131577
39794 -21131577 -21699888 -22303487 -24803113 -26163136 -22300065 -13884922 -5650369 -817155
39786 -817155 1112659 1551702 689125 -1595766 -4939869 -8905703 -12346968 -12570855 -7507232
39777 -7507232 1066657 8727401 13061329 14806960 14449936 11214167 6681516 5738598
$$ packed form
39835a2519242j667146j782177j006015L048893O771078M702646j189792k967833
39827f609588J412182M471549Q81181l514343m48544P159518Q281631k86767q735164
39818B611655p234688J720130P837729O095218O28390k765217l188372k862191
39810B842654k398651p26893J251819K6078n889331j2135555j1954484l866625
39802c2850988O147999J1024365R211217L852577j879080o039060o769320l829287
39794b1131577n68311o03599k499626j360023L863071Q415143Q234553M833214
39786h17155J929814M39043q62577k284891l344103l965834l441265k23887N063623
39777g507232Q573889P660744M333928J745631l57024l235769m532651r42918
$$ plain form
39769 5738598 10872003 17544710 18393842 11270632 825053 -6989027 -9476264 -6963132
39761 -6963132 -1263171 4536904 6843430 3940070 -2547882 -9099033 -13085890 -14207976
39753 -14207976 -13676562 -12238895 -9138261 -3468138 3468500 8236608 8569750 6071845
39745 6071845 4812238 7408669 12759753 16988952 16327420 10196402 2244505 -2717296
39737 -2717296 -3729724 -4442591 -7781393 -11615769 -11930347 -8809346 -5857040 -3971632
39729 -3971632 202585 7965826 14142621 12272843 2821789 -6866172 -10504498 -8223023
39721 -8223023 -4110776 -1438337 -1608026 -5257032 -11444211 -16189677 -14586916 -5768920
39713 -5768920 5219737 11705742 11375945 7490968 4731763 4960413 7038156 9369722
$$ packed form
39769E738598N133405O672707Q49132p123210j0445579p814080k487237K513132
39761f963132N699961N800075K306526k903360o487952o551151l986857j122086
39753a4207976N31414J437667L100634N670123O936638M768108L33142k497905
39745F071845j259607K596431N351084M229199o61532o131018p951897m961801
39737b717296j012428p12867l338802l834376l14578L121001K952306J885408
39729c971632M174217P763241O176795j869778r451054r687961l638326K281475
39721h223023M112247K672439j69689l649006o187179m745466J602761Q817996
39713e768920J0988657O486005l29797l884977k759205K28650K077743K331566
$$ plain form
39705 9369722 11403739 12922718 13042555 10608450 5475549 -826963 -5734813 -7164479
39697 -7164479 -4932481 -989351 2081288 3333612 4224344 6643478 10201807 12276990
39689 12276990 11176916 8402349 6838191 7384782 8760441 10162818 12048796 13969610
39681 13969610 14058615 12116978 11141026 13417982 16312492 14664189 7149442 -2086490
39673 -2086490 -8162639 -9646544 -8036084 -5716136 -5146050 -7563128 -11118976 -12180129
39665 -12180129 -9752038 -6806383 -5906374 -5564151 -2929492 1585928 4895089 5568342
39657 5568342 5035475 4504258 2797933 -2027005 -9770036 -17031016 -19042938 -13783784
39649 -13783784 -5190894 -862724 -4827334 -13418528 -19803060 -21316839 -20205530 -18493354
$$ packed form
39705I369722K034017J518979J19837k434105n132901o302512m907850j429666
39697g164479K231998L943130L070639J252324Q90732K419134L558329K075183
39689A2276990j100074k774567j564158N46591J375659J402377J885978J920814
39681A3969610Q9005j941637r75952K276956K894510j648303p514747r235932
39673b086490o076149j483905J610460K319948N70086k417078l555848j061153
39665a2180129K428091K945655R00009L42223K634659M515420L309161O73253
39657E568342n32867n31217j706325m824938p743031p260980k011922N259154
39649a3783784Q592890M328170l964610q591194o384532j513779J111309J712176
$$ plain form
39641 -18493354 -15553933 -10787223 -5317876 76239 5975870 11722328 14173945 11233045
39633 11233045 5184669 400917 -1470134 -2188277 -3491501 -5061393 -5870140 -5648187
39625 -5648187 -4477632 -2388341 -135332 764336 -235263 -1744112 -2330923 -2833312 -5419915
39616 -5419915 -10487172 -15915457 -19573822 -20986462 -20037948 -16029358 -9487433 -3300247
39608 -3300247 -104418 274116 -1063128 -4605525 -9846735 -11853442 -5529586 6266716
39600 6266716 14096754 13497563 10412498 11846608 15465396 13412753 3814279 -7005735
39592 -7005735 -13077786 -14874875 -16475269 -20087464 -24067999 -24477873 -19114479 -11461357
39584 -11461357 -8391526 -11365678 -13159995 -7861864 -897229 -2257784 -11429100 -17528994
$$ packed form
39641a8493354K939421M766710N469347N394115N899631N746458K451617k940900
39633A1233045o048376m783752j871051p18143j303224j569892q08747K21953
39625e648187J170555K089291K253009Q99668r99599j508849n86811n02389k586603
39616e419915n067257n428285l658365j412640R48514M008590O541925O187186
39608c300247L195829L78534j337244l542397n241210k006707O323856J1796302
39600F266716P830038n99191l085065J434110L618788k052643r598474j0820014
39592g005735o072051j797089j600394l612195l980535m09874N363394P653122
39584a1461357L069831k974152j794317N298131O964635j360555r171316o099894
$$ plain form
39576 -17528994 -15240735 -11681432 -13877465 -17670120 -15406593 -8741622 -6058106 -10096843
39568 -10096843 -15386560 -16965217 -15396619 -13034787 -10807578 -9886601 -12189708 -17281533
39560 -17281533 -21435653 -21298595 -16916621 -10681634 -5128354 -2183472 -2585232 -4981969
39552 -4981969 -6730029 -6492755 -5612653 -6454838 -9513705 -12439833 -12458228 -9978028 -8561429
39543 -8561429 -10034487 -11201923 -8052288 -1933790 2315727 3695473 5442899 7798221
39535 7798221 6592778 1270751 -2083818 240392 3401056 2092052 -635804 611809
39527 611809 3299335 946498 -5376891 -8258083 -5531935 -2195538 -984526 356739
39519 356739 1759367 -114614 -3318334 -227290 10215794 18058624 15637035 8382620
$$ packed form
39576a7528994K288259L559303k196033l792655K263527O664971K683516m038737
39568a0096843n289717j578657J568598K361832K227209R20977k303107n091825
39560a7281533m154120J37058M381974O234987N553280K944882m01760k396737
39552d981969j748060K37274Q80102q42185l058867k926128j8395K480200J416599
39543h561429j473058j167436L149635O118498M249517J379746J747426K355322
39535G798221j205443n322027l354569K324210L160664j309004k727856J247613
39527F11809K687526k352837o323389k881192K726148L336397J211012J341265
39519C56739J402628j873981l203720L091044J0443084P842830k421589p254415
$$ plain form
39511 8382620 5947023 8256748 7700024 1188179 -7447113 -14649510 -19526919 -20250431
39503 -20250431 -15028299 -7113636 -3050364 -4496895 -6007791 -2327489 5422072 12164779
39495 12164779 14902236 14851599 14876607 15750423 14995601 10139262 2963505 -1883609 -3317574
39486 -3317574 -5519374 -11100271 -16194898 -15978757 -12062511 -9879836 -10856743 -11964828
39478 -11964828 -11389419 -9428281 -4880687 3653828 12846030 16588667 13695378 8736335
39470 8736335 4717031 560931 -3076469 -2134825 3629651 7697511 5457132 943956
39462 943956 -130216 300787 -3148821 -8567883 -7947502 672029 9253388 10434004 6824214
39453 6824214 5865406 8929090 10271474 5815872 -1418713 -5850468 -6372144 -6413795 -8005185
$$ packed form
39511H382620k435597K309725n56724o511845q635292p202397m877409p23512
39503b0250431N222132P914663M063272j446531j510896L680302P749561O742707
39495A2164779K737457n0637K5008Q73816p54822m856339p175757m847114j433965
39486c317574k201800n580897n094627K16141L916246K182675r76907j108085
39478a1964828N75409J961138M547594Q534515R192202L742637k893289m959043
39470H736335m019304m156100l637400R41644N764476M067860k240379m513176
39462I43956j074172M31003l449608n419062O20381Q619531Q581359J180616l609790
39453F824214r58808L063684J342384m455602p234585m431755n21676m1651j591390
$$ plain form
39444 -8005185 -8479545 -4057468 4790869 13110098 16241101 13877561 9790827 8472778
39436 8472778 11419005 15426896 15139766 8849000 1191258 -1867809 -27365 2238457
39428 2238457 3294710 6919629 15546716 24690697 27474457 22568599 14319977 6660842
39420 6660842 752557 -2125525 75303 6549791 12526406 13874608 11236905 8120830
39412 8120830 6275207 4514309 1186734 -3831076 -9328898 -13572407 -14667768 -11119350
39404 -11119350 -2940016 7596874 16687111 21188863 20708204 17626528 14921247 13913587
39396 13913587 13922794 13519649 11821039 8996138 5946500 3409847 1371201 -413802 -1703665
39387 -1703665 -2308067 -2774925 -3062002 -910494 5976658 15430031 21184828 19682373 14520062
$$ packed form
39444h005185m74360M422077Q848337Q319229L131003k363540m086734j318049
39436H472778K946227M007891k87130o290766p657742l059067J840444K265822
39428B238457J056253L624919Q627087R143981K783760m905858q248622p659135
39420F660842n908285k878082K200828O474488N976615J348202k637703l116075
39412H120830j845623j760898l327575n017810n497822m243509j095361L548418
39404a1119350Q179334J0536890R090237M501752m80659l081676k705281j007660
39396A3913587R207m03145j698610k824901l049638k536653k038646j785003j289863
39387a703665o04402m66858k87077K151508O887152R453373N754797j502455n162311
$$ plain form
39378 14520062 11971173 13953091 17986424 21964691 24977219 24691634 19157069 11916875
39370 11916875 10181347 15396141 19824619 16245028 8088619 5294311 11244727 18535153
39362 18535153 18537410 11609104 5877550 7788784 15758134 22527375 22467538 16458508 10166368
39353 10166368 8048656 9480300 10473440 7970375 2052621 -4488059 -7577416 -4507187
39345 -4507187 2697522 7627855 5855433 490038 -1586581 955735 2115444 -2414035
39337 -2414035 -8306707 -8230597 -1931173 4111359 6612066 9672230 16743017 22756499
39329 22756499 19205950 5923722 -7138743 -11120621 -7309138 -2558049 598775 4210753
39321 4210753 6864723 2463250 -9960177 -20668514 -19504556 -9624578 -4407658 -10224667
$$ packed form
39378A4520062k548889J981918M033333L978267L012528k85585n534565p240194
39370A1916875j735528N214794M428478l579591q156409k794308N950416P290426
39362A8535153K257o928306n731554J911234P969350O769241n9837o009030o292140
39353A0166368k117712J431644R93140k503065n917754o540680l089357L070229
39345d507187P204709M930333j772422n365395k076619K542316J159709m529479
39337b414035n892672P6110O299424O042532K500707L060164P070787O013482
39329B2756499l550549j3282228j3062465l981878L811483M751089L156824L611978
39321D210753K653970m401473j2423427j0708337J163958R879978N216920n817009
$$ plain form
39313 -10224667 -18719359 -19065167 -12094899 -6694340 -5798319 -3501507 3866373 11027114
39305 11027114 11600597 7917738 7962462 14325551 20925752 20991645 14671349 7345442 2972341
39296 2972341 1320857 684200 971237 3459767 8453192 13990786 16924327 15194595
39288 15194595 9320451 2077032 -3205588 -4588925 -2621127 258811 1968578 2915277
39280 2915277 5549865 11208149 17570163 20120656 16654209 9992639 5592838 6305079
39272 6305079 9891182 11950913 10739965 8256088 6768855 5773324 3434622 118001
39264 118001 -1314182 1019748 5618421 9428320 11264648 12606581 15391044 19650112
39256 19650112 23181965 23281909 19101730 12564229 6746915 3369144 2114167 1864362
$$ packed form
39313a0224667q494692l45808O970268N400559Q96021K296812P367880P160741
39305A1027114N73483l682859M4724O363089O600201O5893o320296p325907m373101
39296B972341j651484o36657K87037K488530M993425N537594K933541j729732
39288A5194595n874144p243419n282620j383337J967798K879938J709767R46699
39280B915277K634588N658284O362014K550493l466447o661570m399801P12241
39272F305079L586103K059731j210948k483877j487233r95531k338702l316621
39264A18001j432183K333930M598673L809899J836328J341933K784463M259068
39256A9650112L531853R9944m180179o537501n817314l377771j254977k49805
$$ plain form
39248 1864362 1608835 649214 -321210 1601328 8761328 18277770 22699564 17729947 7826545
39239 7826545 1599172 2661975 7651800 12209836 15107952 16103598 13761307 7798644
39231 7798644 1267328 -2283813 -3024838 -4382826 -8649991 -14080105 -16096830 -11190090
39223 -11190090 -667199 9166919 12087929 7959512 2363352 -95376 13515 122467
39215 122467 -80964 73728 -692016 -3783782 -7304948 -7920841 -5534877 -2912613 -1291689
39206 -1291689 -37505 -273282 -4112775 -9186767 -8902125 -1176970 6987711 7762484 2605644
39197 2605644 -638115 954699 2952165 2947307 5835240 15531150 25754571 25736739 14764963
39188 14764963 4676025 5125528 11405338 12043590 5310165 613877 3199285 5925765
$$ packed form
39248A864362k55527r59621r70424J922538P160000R516442M421794m969617r903402
39239G826545o227373J062803M989825M558036K898116R95646k342291n962663
39231G798644o531316l551141p41025j357988m267165n430114k016725M906740
39223a1190090J0522891R834118K921010m128417n596160k458728J08891J08952
39215A22467k03431J54692p65744l091766l521166o15893K385964K622264J620924
39206a291689J254184k35777l839493n073992K84642P725155Q164681P74773n156840
39197B605644l243759J592814J997466m858K887933R695910J0223421j7832j0971776
39188A4764963j0088938M49503O279810O38252o733425m696288K585408K726480
$$ plain form
39180 5925765 1030413 -6785381 -7305293 -1226761 537345 -5717626 -10233088 -5216804
39172 -5216804 2566530 2091707 -5628657 -11012656 -11858160 -14842084 -21156961 -21664137 -10531522
39163 -10531522 4661041 12499714 11793170 9754345 10350095 11683837 12847989 15594439
39155 15594439 18375338 15359203 4442086 -7989953 -13705932 -11530567 -6649938 -3155520
39147 -3155520 -1099891 -373796 -3135253 -10059913 -16499617 -15924271 -7688771 1018157
39139 1018157 2500898 -3459146 -10530132 -13638361 -13545948 -13857778 -15984815 -18019622 -17065998
39130 -17065998 -11947481 -4758803 237159 957200 470811 2870021 6050835 2651862
39122 2651862 -9964661 -24555987 -31937310 -30916795 -26710971 -22563945 -17890356 -12854645
$$ packed form
39180E925765m895352p815794n19912O078532J764106o254971m515462N016284
39172e216804P783334m74823p720364n383999q45504k983924o314877n07176J1132615
39163a0531522J5192563P838673p06544k038825N95750J333742J164152K746450
39155A5594439K780899l016135j0917117j2432039n715979K175365M880629L494418
39147c155520K055629P26095k761457o924660o439704N75346Q235500Q706928
39139A018157J482741n960044p070986l108229R2413l11830k127037k034807R53624
39130a7065998N118517P188678M995962P20041m86389K399210L180814l398973
39122B651862j2616523j4591326p381323J020515M205824M147026M673589N035711
$$ plain form
39114 -12854645 -9320330 -7691041 -7494700 -10427985 -17631016 -24460851 -24278138 -18195862
39106 -18195862 -14490277 -16485486 -17987826 -14181710 -10130363 -12861453 -20404283 -25246713
39098 -25246713 -24835397 -21995322 -18097985 -13114393 -10258042 -12531465 -15280178 -10358009
39090 -10358009 1320958 9128306 6778114 -134655 -3657269 -3486681 -2979700 -1588499
39082 -1588499 2370069 5764536 4362029 156190 -1295493 557247 1327355 -508530
39074 -508530 -2128966 -2974742 -6477429 -13201549 -17777512 -15961288 -10621348 -6922730
39066 -6922730 -4639750 403340 8876920 16254024 18458383 15865021 11309965 6908103
39058 6908103 3578589 1392607 -647504 -3398158 -5273763 -3051136 3703767 10631014
$$ packed form
39114a2854645L534315J629289J96341k933285p203031o829835J82713O082276
39106a8195862L705585j995209j502340L806116M051347k731090p542830m842430
39098b5246713M11316K840075L897337M983592K856351k273423k748713M922169
39090a0358009J1678967P807348k350192o912769l522614J70588N06981J391201
39082a588499L958568L394467j402507m205839j451683J852740P70108j835885
39074e08530j620436q45776l502687o724120m575963J816224N339940L698618
39066f922730K282980N043090Q473580P377104K204359k593362m555056m401862
39058F908103l329514k185982k040111k750654j875605K222627O754903O927247
$$ plain form
39050 10631014 12699502 9329155 4069888 548614 417923 3465960 6663683 4306478
39042 4306478 -6459707 -19576964 -23926395 -15573992 -2838847 3531185 1990751 -1521507
39034 -1521507 -3651526 -6333235 -10582606 -13801289 -14592130 -15247487 -17040089 -16915038 -11827725
39025 -11827725 -3700908 2774875 5438404 5486775 4845308 4943468 6345855 7222668 3788048
39016 3788048 -5086176 -14790169 -19076363 -16600423 -11275214 -7015117 -4594113 -3237920
39008 -3237920 -2664432 -2906302 -3593498 -4047751 -3857529 -3793235 -5935764 -11032677 -15430245
38999 -15430245 -13677004 -5814613 1215558 2290108 1081771 4313952 11744718 17183248
38991 17183248 17916449 16906662 15598277 11204102 3349312 -2390820 -1536222 2490719
$$ packed form
39050A0631014K068488l370347n259267l521274j30691L048037L197723k357205
39042D306478j0766185j3117257m349431Q352403J2735145O370032j540434l512258
39034a521507k130019k681709m249371l218683p90841o55357j792602J25051N087313
39025a1827725Q126817O475783K663529M8371o41467R8160J402387Q76813l434620
39016C788048q874224r703993m286194K475940N325209M260097K421004J356193
39008c237920N73488k41870o87196m54253J90222O4294k142529n096913m397568
38999a5430245J753241P862391P030171J074550j208337L232181P430766N438530
38991A7183248P33201j009787j308385m394175p854790n740132Q54598M026941
$$ plain form
38983 2490719 2648748 -3002273 -10488119 -16094288 -19601925 -21756174 -21574911 -17133337
38975 -17133337 -8163288 2257235 8856551 8475080 3569543 -322898 -994671 -1112274
38967 -1112274 -2731425 -3616733 -1307134 1934097 1663477 -2529389 -6572383 -7314699 -5653615
38958 -5653615 -4067211 -3291160 -2355051 -806002 -6211 -2030171 -7009204 -11916660 -13144150
38949 -13144150 -10335265 -6283920 -2975177 378652 4921942 9824065 13140346 13277112
38941 13277112 9374439 2576621 -3005529 -3924081 -2505430 -4218234 -8840979 -9516615
38933 -9516615 -3273834 3279946 3510676 729623 1936667 5606091 4162790 -2953929
38925 -2953929 -7670251 -5764892 -2977362 -5840548 -12860239 -18254853 -19175702 -15587910
$$ packed form
38983B490719J58029n651021p485846n606169l507637k154249J81263M441574
38975a7133337Q970049J0420523O599316l81471m905537l892441o71773j17603
38967a112274j619151q85308K309599L241231k70620m192866m042994p42316J661084
38958e653615J586404P76051R36109J549049P99791k023960m979033m907456j227490
38949a3144150K808885M051345L308743L353829M543290M902123L316281J36766
38941A3277112l902673o797818n582150r18552J418651j712804m622745o75636
38933i516615O242781O553780K30730k781053J207044L669424j443301p116719
38925b953929m716322J905359K787530k863186p019691n394614r20849L587792
$$ plain form
38917 -15587910 -7780702 1535064 6227858 2785728 -4240263 -6569167 -1026585 8387202
38909 8387202 15671888 17532404 14526435 10405506 9456141 12058908 13407731 8549200
38901 8549200 -1729794 -11386822 -14837537 -11148540 -3538413 3967627 9775484 15179261
38893 15179261 21242963 25981910 26464899 23166521 19532868 17263820 15094531 12451614
38885 12451614 10686369 9980154 8989940 8679940 12096782 18591217 22996392 23040902 22623240
38876 22623240 24399945 24398450 18881246 12044479 10925077 15756427 21120286 23957283
38868 23957283 24632918 22655698 17624012 12344202 8777158 3272342 -7160127 -16399938
38860 -16399938 -15724569 -7301721 -1427489 -588581 2606976 9849253 11768720 3509934
$$ packed form
38917a5587910P807208R315766M692794l442130p025991k328904N542582R413787
38909H387202P284686J860516l005969m120929r49365K602767J348823m858531
38901H549200j0278994r657028l450715L688997P610127P506040N807857N403777
38893A5179261O063702M738947M82989l298378l633653k269048k169289k642917
38885A2451614j765245p06215r90214l10000L416842O494435M405175M4510m17662
38876B2623240J776705j495n517204o836767j119402M831350N363859K836997
38868B3957283O75635j977220n031686n279810l567044n504816j0432469r239811
38860a6399938O75369Q422848N874232Q38908L195557P242277J919467q258786
$$ plain form
38852 3509934 -5451594 -5068997 728605 2620619 1578466 4860403 11195132 12047290
38844 12047290 6224564 2119338 4593409 9289921 11991495 14867671 19886704 23203559
38836 23203559 20749365 14680432 10320522 10075726 13120190 17645304 20869573 20187215
38828 20187215 16806496 15069983 15975595 15090196 9694550 4095078 3777201 7201922
38820 7201922 8049133 3952963 -1475903 -4500177 -4829652 -3447493 -1022090 594528
38812 594528 -1113351 -5348436 -6869673 -1154848 10054397 19877368 22860326 19780695
38804 19780695 16048891 15703638 17255290 16027060 10609423 5332725 4664429 6310718
38796 6310718 3029734 -7774190 -18980528 -20828996 -12035484 -1132111 3398007 1602961
$$ packed form
38852C509934q961528L82597N797602J892014j042153L281937O334729Q52158
38844A2047290n822726m105226K474071M696512K701574K876176N019033L316855
38836B3203559k454194o068933m359910k44796L044464M525114L224269o82358
38828B0187215l380719j736513R05612q85399n395646n599472l17877L424721
38820G201922Q47211m096170n428866l024274l29475J382159K425403J616618
38812E94528j707879m235085j521237N714825J1209245R822971K982958l079631
38804A9780695l731804l45253J551652j228230n417637n276698o68296J646289
38796F310718l280984j0803924j1206338j848468Q793512J0903373M530118j795046
$$ plain form
38788 1602961 -587351 115038 1602795 1218203 -457968 -1762598 -2715517 -3375565 -1952912
38779 -1952912 2166801 5073610 2090373 -5197874 -9697972 -7646969 -2989274 -1012595
38771 -1012595 -1088644 1139066 6862599 13201588 17798061 20322776 19727012 14049736 4074473
38762 4074473 -5817196 -11928294 -14408192 -15377721 -16361634 -18597353 -22821447 -26510156
38754 -26510156 -24154433 -13869516 -2136050 2217670 -1453306 -5207233 -3445848 -39345
38746 -39345 -2094368 -9885538 -16567292 -16250188 -9062046 589999 7178542 6220975 -2335709
38737 -2335709 -12106638 -15522766 -12594964 -10973287 -15542054 -21846028 -22750327 -17787728
38729 -17787728 -11457613 -5331007 2050263 8598243 8946937 2858013 -2427792 -1262976
$$ packed form
38788A602961k190312P02389J487757l84592j676171j304630r52919o60048J422653
38779a952912M119713K906809k983237p288247m500098K051003M657695J976679
38771a012595p6049K227710N723533O338989M596473K524715n95764n677276r975263
38762D074473r891669o111098k479898r69529r83913k235719m224094l688709
38754b6510156K355723J0284917J1733466M353720l670976l753927J761385L406503
38746c9345k055023p791170o681754L17104P188142R652045O588543r57567q556684
38737b335709r770929l416128K927802J621677m568767o303974r04299M962599
38729a7787728O330115O126606P381270O547980L48694o088924n285805J164816
$$ plain form
38721 -1262976 3327235 5030147 3041787 1352752 1893309 3106386 4202416 6292214
38713 6292214 9107885 10317676 8979409 6975663 6250972 6890473 8494263 11008851
38705 11008851 13144284 12151040 6811831 -574369 -6504543 -9707466 -11275817 -12237574
38697 -12237574 -12256108 -10621004 -7774764 -5541850 -5545173 -7071191 -7105675 -3529372 2062800
38688 2062800 6129105 7727353 9564190 13925506 19259027 22071209 21051125 17819207
38680 17819207 14368504 11551887 9941951 10229496 11897700 12821574 11545974 9386635
38672 9386635 8879969 10374324 11863531 12536931 14332357 18357609 21607130 20103568
38664 20103568 14635942 10048410 8332076 5727483 -1831421 -13339848 -24766799 -33519971
$$ packed form
38721a262976M590211J702912j988360j689035N40557J213077J096030K089798
38713F292214K815671J209791j338267k003746p24691O39501J603790K514588
38705A1008851K135433r93244n339209p386200n930174l202923j568351r61757
38697a2237574j8534J635104K846240K232914l323j526018l4484L576303N592172
38688B062800M066305J598248J836837M361316N333521K812182j020084l231918
38680A7819207l450703k816617j609936K87545J668204R23874j275600k159339
38672I386635n06666J494355J489207O73400J795426M025252L249521j503562
38664B0103568n467626m587532j716334k604593p558904j1508427j1426951q753172
$$ plain form
38656 -33519971 -37989102 -35387112 -24423605 -9150151 3955577 12592666 18759230 22684228
38648 22684228 21277816 13881981 5500412 1959365 4437204 10379927 16827139 20654031
38640 20654031 18477501 9680532 -1749966 -10863540 -16065165 -17876357 -15400712 -7411110
38632 -7411110 3633635 11985900 13890175 10678051 6095640 2070792 -2064987 -6943909
38624 -6943909 -10714503 -9920465 -3389805 5331829 10937612 11696975 10100225 8396445
38616 8396445 6392468 4339884 4326647 6591456 7766815 5890327 4185193 5896634
38608 5896634 7994199 5210153 -1097598 -4020266 -1081347 2797690 3649449 3882775
38600 3882775 6445292 8835006 7461649 4274790 3799093 5679465 5525958 2306101
$$ packed form
38656c3519971m469131K601990J0963507J5273454J3105728Q637089O166564L924998
38648B2684228j406412p395835q381569l541047K477839N942723O447212L826892
38640B0654031k176530q796969j1430498r113574n201625j811192K475645P989602
38632g411110J1044745Q352265J904275l212124m582411m024848m135779m878922
38624f943909l770594P94038O530660Q721634N605783P59363j596750j703780
38616H396445k003977k052584j3237K264809J175359j876488j705134J711441
38608E896634K097565k784046o307751k922668K938919L879037Q51759K33326
38600C882775K562517K389714j373357l186859m75697J880372j53507l219857
$$ plain form
38592 2306101 -552526 -1852858 -4846203 -10428610 -13051910 -8029176 -257124 -76118
38584 -76118 -10305493 -22242953 -26461111 -23749961 -22187750 -26099967 -32204934 -35565138
38576 -35565138 -34611662 -29711189 -21367062 -12151047 -6971555 -8257097 -12674717 -14910919
38568 -14910919 -12838790 -7109997 1246948 9367458 11445034 4053578 -8229965 -16782674
38560 -16782674 -18018928 -14677299 -9325299 -2044638 5449268 9495891 10014959 10995381
38552 10995381 13271789 12159035 5434828 -1381138 -1956881 2758944 7872900 12123174
38544 12123174 16732434 19787340 18168774 13770641 11712232 12624677 12327409 9424277
38536 9424277 7580863 9021483 11056023 11308968 11861422 15112177 18813648 18539750 13227560
$$ packed form
38592B306101k858627j300332k993345n582407k623300N022734P772052J81006
38584g6118j0229375j1937460m218158K711150J562211l912217o104967l360204
38576c5565138R53476M900473Q344127R216015N179492j285542m417620k236202
38568a4910919K072129N728793Q356945Q120510K077576p391456j2283543q552709
38560a6782674j236254L341629N352000P280661P493906M046623N19068R80422
38552A0995381K276408j112754o724207o815966n75743M715825N113956M250274
38544A2123174M609260L054906j618566m398133k058409R12445k97268k903132
38536I424277j843414J440620K034540K52945N52454L250755L701471k73898n312190
$$ plain form
38527 13227560 5769416 -430151 -3526129 -3315791 -1192672 750517 1551954 1368104
38519 1368104 -282286 -3773619 -6364461 -3434768 5143084 12784322 13140247 7014631
38511 7014631 -422419 -6659353 -11999235 -14699391 -11545607 -3684310 3027595 5149377
38503 5149377 5174944 6028146 6152733 3382378 329697 1191389 4694406 5157548 697631
38494 697631 -4113012 -4945221 -2963754 -1235332 425711 3623538 6949390 7509520 5787968
38485 5787968 5020803 5945130 5943966 3814115 1740812 1601433 2841641 5307876 10263398
38476 10263398 16179622 17305302 10345949 209314 -5046390 -3619288 -366494 1042923
38468 1042923 1690939 3050895 3893719 3322871 3215322 5105356 6980981 5679116 1154594
$$ packed form
38527A3227560p458144o199567l095978K10338K123119J943189Q01437j83850
38519A368104j650390l491333k590842K929693Q577852P641238L55925o125616
38511G014631p437050o236934n339882k700156L153784P861297O711905K121782
38503E149377K5567Q53202J24587k770355l052681Q61692L503017M63142m459917
38494F97631m810643q32209J981467J728422J661043L197827L325852N60130j721552
38485E787968p67165R24327j164k129851k073303j39379J240208K466235M955522
38476A0263398N916224J125680o959353j0136635n255704J427102L252794J409417
38468A042923O48016J359956Q42824n70848j07549J890034J875625j301865m524522
$$ plain form
38459 1154594 -3669164 -6524442 -7606183 -8027471 -7684208 -5115180 358463 6413101
38451 6413101 8851967 6098420 1385618 -1337842 -2433295 -4808242 -8121033 -8582469
38443 -8582469 -4882929 -501148 1230716 1125095 1638339 3364765 5752154 8432871
38435 8432871 9954948 8073298 3488928 568215 2063834 5790227 8578193 10052674
38427 10052674 9904459 5939509 -657568 -2445060 5234256 14900688 14231790 2080184
38419 2080184 -10404436 -15285987 -16375995 -19543550 -22422190 -19439161 -11658489 -4904601
38411 -4904601 -934767 3233196 8420987 11415691 10150227 6270640 2012107 -1684225
38403 -1684225 -3317737 -938050 4236765 7224939 4506657 -1677180 -5856282 -5104406
$$ packed form
38459A154594m823758k855278j081741m21288L43263K569028N473643O054638
38451F413101K438866k753547m712802k723460j095453k374947l312791m61436
38443h582469L699540M381781J731864j05621N13244J726426K387389K680717
38435H432871J522077j881650m584370k920713J495619L726393K787966J474481
38427A0052674j48215l964950o597077j787492P679316R666432o68898j2151606
38419B080184j2484620m881551j090008l167555k878640K983029P780672O753888
38411d904601L969834M167963N187791K994704j265464l879587m258533l696332
38403a684225j633512K379687N174815K988174k718282o183837m179102P51876
$$ plain form
38395 -5104406 -1235624 1464557 -618772 -8315597 -18561370 -25377783 -23873393 -14589960
38387 -14589960 -3430545 3695826 6053012 7055008 8462911 7925695 3790352 37143
38379 37143 2497954 10156210 14523645 9941657 1244773 -2264361 1591491 6359695
38371 6359695 6254173 2623005 343419 1483221 4555693 7702768 10360866 12735743
38363 12735743 14971173 16261179 14657011 9440889 4056084 4129038 10913852 18632757
38355 18632757 20394169 15412049 8371393 3028860 -838413 -4621859 -7911330 -9210398
38347 -9210398 -8048652 -5547970 -3507625 -3009353 -3355686 -2668412 -72277 3363912 6352251
38338 6352251 8722192 10062717 8871435 5007911 1378235 633838 1549454 1637691 1945649
$$ packed form
38395e104406L868782K700181k083329p696825j0245773o816413J504390R283433
38387a4589960J1159415P126371K357186J001996J407903n37216m135343l753209
38379C7143K460811P658256M367435m581988q696884l509134L855852M768204
38371F359695j05522l631168k279586J139802L072472L147075K658098K374877
38363A2735743K235430J290006j604168n216122n384805P2954O784814P718905
38355A8632757J761412m982120p040656n342533l867273l783446l289471j299068
38347i210398J161746K500682K040345M98272l46333O87274K596135L436189K988339
38338F352251K369941J340525j191282l863524l629676p44397R15616Q8237L07958
$$ plain form
38329 1945649 5200549 9830402 10704600 6639200 2620385 3056945 7054927 12019123
38321 12019123 17138996 20715284 19143202 12708134 8036201 9763501 13386136 11954371
38313 11954371 6599733 3756991 4319554 3360960 -52696 -968024 2344093 4975887
38305 4975887 3568196 1206025 1082153 1530117 1030291 2175186 6109419 8416499 5798024
38296 5798024 2186491 2536249 4746232 4135385 2410579 5021845 11963858 18467198
38288 18467198 23007233 26705206 25898607 14852279 -2423103 -12278905 -7836309 1768385
38280 1768385 3819587 -2125030 -7090877 -6876497 -5592690 -6590571 -7528948 -6010131 -4439775
38271 -4439775 -6109569 -9644381 -10655728 -7650751 -3605600 -1877559 -2803900 -5008284
$$ packed form
38329A945649L254900M629853Q74198m065400m018815M36560L997982M964196
38321A2019123N119873L576288j572082o435068m671933J727300L622635j431765
38313A1954371n354638k842742N62563r58594l413656r15328L312117K631794
38305D975887j407691k362171j23872M47964m99826J144895L934233K307080k618475
38296E798024l611533L49758K209983o10847j724806K611266O942013O503340
38288A8467198M540035L697973q06599j1046328j7275382r855802M442596R604694
38280A768385K051202n944617m965847K14380J283807r97881r38377J518817J570356
38271d439775j669794l534812j011347L004977M045151J728041r26341k204384
$$ plain form
38263 -5008284 -8111275 -12280272 -16110583 -17575672 -17219430 -17549845 -18265752 -15389633 -7548101
38254 -7548101 2820 1403406 -1979564 -4099319 -2795263 -547865 2079450 7007752
38246 7007752 12041113 10994097 3415989 -2180484 680593 7232339 8402442 2918744
38238 2918744 -3230486 -6355318 -7644428 -7629860 -4511789 1435708 6588780 8002700
38230 8002700 5431098 -380961 -7710260 -12714049 -12806775 -11418789 -14815372 -23284570
38222 -23284570 -29878342 -29232039 -23329821 -16809044 -11130030 -6275501 -4072261 -5648521
38214 -5648521 -8207297 -8507264 -7844390 -9431030 -11923199 -10178585 -2891345 4598434
38206 4598434 6687408 3679422 -299689 -2890353 -4157998 -3339980 1215762 8334555
$$ packed form
38263e008284l102991m168997l830311j465089L56242l30415p15907K876119P841532
38254g548101P550921J400586l382970k119755J304056K247398K627315M928302
38246G007752N033361j047016p578108n596473K861077O551746J170103n483698
38238B918744o149230l124832j289110J4568L118071N947497N153072J413920
38230H002700k571602n812059p329299n003789r2726J387986l396583q469198
38222b3284570o593772O46303N902218O520777N679014M854529K203240j576260
38214e648521k558776k99967O62874j586640k492169J744614P287240P489779
38206D598434K088974l007986l979111k590664j267645Q18018M555742P118793
$$ plain form
38198 8334555 13438676 13718242 12004448 12975568 16438920 17310125 12494886 5007283 136475
38189 136475 -139517 2520413 5649136 6849210 3953886 -2402938 -7342825 -6288087
38181 -6288087 -910500 2599972 1583684 37417 2622558 8578778 13539208 15005515
38173 15005515 13479268 9702415 3819481 -2716450 -6816708 -6544149 -3539415 -1886922
38165 -1886922 -4309985 -9340081 -12528447 -11186887 -7906221 -8267290 -14477363 -22112744
38157 -22112744 -24028689 -17250982 -5655801 3685228 6465135 4125653 1660311 2445272
38149 2445272 5178152 6176215 4224717 1793067 1114587 793215 -2003425 -6840364 -9939171
38140 -9939171 -9381328 -8078311 -9534364 -12160359 -11107161 -5840225 -1988019 -3523913
$$ packed form
38198H334555N104121K79566j713794R71120L463352Q71205m815239p487603m870808
38189A36475k75992K659930L128723J200074k895324o356824m939887J054738
38181f288087N377587L510472j016288j546267K585141N956220M960430J466307
38173A5005515j526247l776853n882934o535931m100258K72559L004734J652493
38165a886922k423063n030096l188366J341560L280666l61069o210073p635381
38157b2112744j915945O777707J1595181R341029K779907k339482k465342P84961
38149B445272K732880R98063j951498k431650o78480l21372k796640m836939l098807
38140i939171N57843J303017j456053k625995J053198N266936L852206j535894
$$ plain form
38132 -3523913 -6564440 -4803299 1293081 5779357 6430143 6431488 6633665 3436041 -2800315
38123 -2800315 -4414007 3144771 13219103 16711247 14255417 12088137 9802826 2003236
38115 2003236 -9205104 -13874027 -8140701 465784 4482597 5166382 6286481 7355442
38107 7355442 7792620 10357726 14619455 13944309 6039423 186296 5159790 14619230
38099 14619230 14805131 4672247 -2424466 1990246 10575911 12312931 7735295 6103297
38091 6103297 11552807 17926640 16810683 7404056 -2300932 -3623347 3596838 10965191
38083 10965191 11615738 7974001 6751104 8830604 9125619 5478593 1895140 2032221
38075 2032221 4662849 7389740 10215876 13004552 13467897 10688377 7517433 6551870
$$ packed form
38132c523913l040527J761141O096380M486276O50786J345K02177l197624o236356
38123b800315j613692P558778J0074332L492144k455830k167280k285311p799590
38115B003236j1208340m668923N733326Q606485M016813O83785J120099J068961
38107G355442M37178K565106M261729o75146p904886n853127M973494R459440
38099A4619230J85901j0132884p096713M414712Q585665J737020m577636j631998
38091F103297N449510O373833j115957r406627r704988j322415P220185P368353
38083A0965191O50547l641737j222897K079500K95015l647026l583453J37081
38075B032221K630628K726891K826136K788676M63345k779520l170944r65563
$$ plain form
38067 6551870 6302364 4081895 288106 -2956651 -5069424 -5725906 -2420956 6557480
38059 6557480 17293006 22382957 18997772 12191282 8706358 9264988 9068333 5233586
38051 5233586 802599 -388675 -622207 -5855916 -15939638 -22190572 -18063800 -8356467
38043 -8356467 -2721460 -2729038 -1878628 2679009 6167320 5273574 3780506 5710361 9084098
38034 9084098 10901806 12923542 17114660 19716935 16098452 8720719 4159566 4003106
38026 4003106 4639790 4809820 6917939 10577583 10925388 5383406 -2007472 -5022103 -1564850
38017 -1564850 5097590 8959861 5374018 -4160500 -11258700 -8337948 2424989 11225694
38009 11225694 12101140 8460051 6546668 7992892 10974417 14617367 18696297 21186946
$$ packed form
38067F551870k49506k220469l793789l244757k112773o56482L304950Q978436
38059F557480J0735526N089951l385185o806490l484924N58630j96655l834747
38051E233586m430987j191274k33532n233709j0083722o250934M126772R707333
38043h356467N635007p578Q50410M557637L488311q93746j493068J929855L373737
38034I084098J817708K021736M191118K602275l618483p377733m561153j56460
38026D003106O36684J70030K108119L659644L47805n541982p390878l014631L457253
38017a564850O662440L862271l585843r534518p098200K920752J0762937Q800705
38009A1225694Q75446l641089j913383J446224K981525L642950M078930K490649
$$ plain form
38001 21186946 19427239 13151496 4913396 -1542739 -2898479 1470327 7746757 10462107
37993 10462107 8195133 4165117 386974 -5108967 -13108937 -19070606 -17954864 -10869674
37985 -10869674 -3043154 3117275 8864898 14145784 16428049 14984966 12570955 11585408
37977 11585408 11286620 10074974 8416046 8112724 9910284 12733862 14678499 14810545
37969 14810545 14771586 17705666 23966631 28941948 27730839 21492534 16126172 14614410
37961 14614410 14118891 11521291 8197047 7211528 8787475 11386189 15115500 20726535
37953 20726535 26237895 27892889 24870715 20862544 20190625 23368673 26873781 26966325
37945 26966325 23875189 21888226 24036355 27108083 24844898 16943170 11121811 13443454
$$ packed form
38001B1186946j759707o275743q238100o456135j355740M368806O276430K715350
37993A0462107k266974m030016l778143n495941p999970n961669J115742P085190
37985a0869674P826520O160429N747623N280886K282265j443083k414011r85547
37977A1585408k98788j211646j658928l03322J797560K823578J944637J32046
37969A4810545l8959K934080O260965M975317j211109o238305n366362j511762
37961A4614410m95519k597600l324244r85519J575947K598714L729311N611035
37953B0726535N511360J654994l022174m008171o71919L178048L505108R2544
37945B6966325l091136j986963K148129L071728k263185p901728n821359K321643
$$ plain form
37937 13443454 19943256 22217532 18853149 15575297 14921657 12403957 4568946 -4845017
37929 -4845017 -9886346 -9237826 -4883538 2090929 10256236 15443731 14459222 9966221
37921 9966221 7725514 9810851 13930528 18295451 23089968 27337451 28236736 24547716
37913 24547716 18256335 12632251 10433713 12943214 17877346 19353094 13806922 5570349
37905 5570349 2381809 5208442 7096641 3109223 -3343809 -6200022 -4522695 -1609853
37897 -1609853 367908 1494917 2083343 2548984 3892592 6125475 7681993 7955656 8317205
37888 8317205 8955828 7343854 2209680 -3293315 -4955310 -2168649 2730046 7161511
37880 7161511 8129334 2808377 -7026144 -13988408 -12765701 -6751515 -2975632 -2840004
$$ packed form
37937A3443454O499802K274276l364383l277852o53640k517700p835011r413963
37929d845017n041329O48520M354288O974467Q165307N187495r84509m493001
37921I966221k240707K085337M119677M364923M794517M247483Q99285l689020
37913B4547716o291381n624084k198538K509501M934132J475748n546172q236573
37905E570349l188540K826633J888199l987418o453032k856213J677327K912842
37897a609853J977761J127009N88426M65641J343608K232883J556518K73663L61549
37888H317205O38623j611974n134174n502995j661995K786661M898695M431465
37880G161511R67823n320957r834521o962264J222707O014186L775883J35628
$$ plain form
37872 -2840004 -2773960 -1794626 -2097999 -2960968 -802604 3855990 5754470 3177803 1367254
37863 1367254 4817752 10642897 12893966 10173984 5803564 2828493 1670188 1203017
37855 1203017 259179 -859173 29874 3963566 7908277 8381541 7679192 11343718 18501470
37846 18501470 20916320 14611435 6421993 4373326 6939104 8000075 7981874 12027919
37838 12027919 19228186 22340984 18817389 14244967 12469160 9399232 1043948 -7778172
37830 -7778172 -8966584 -2872367 1700742 -715676 -5772003 -6591430 -3396222 -1918595
37822 -1918595 -4163314 -5782416 -3525084 -578982 -1108557 -2947105 -1141764 2551868
37814 2551868 258560 -10384220 -20961058 -22080818 -14194511 -4838920 1107794 3751182
$$ packed form
37872b840004O6044R79334l03373q62969K158364M658594J898480k576667j810549
37863A367254L450498N825145K251069k719982m370420k975071j158305m67171
37855A203017r43838j118352Q89047L933692L944711M73264p02349L664526P157752
37846A8501470K414850o304885q189442k048667K565778J060971j8201M046045
37838A2027919P200267L112798l523595m572422j775807l069928q355284q822120
37830g778172j188412O094217M573109k416418n056327q19427L195208J477627
37822a918595k244719j619102K257332K946102n29575j838548J805341L693632
37814B551868k293308j0642780j0576838j119760P886307R355591N946714K643388
$$ plain form
37806 3751182 3880337 2165158 1439287 4323439 8513108 8894068 4612121 136855 -873507
37797 -873507 979549 3629760 6084038 8034429 10400788 15701748 23633553 27180468
37789 27180468 19245438 3854407 -5922801 -3664489 3122014 4923206 2839393 3334487
37781 3334487 5620550 2788022 -5706451 -10548561 -3756003 11124392 22241329 20684352
37773 20684352 7848311 -6229745 -11420676 -6281258 1319186 3325826 199228 -1269397
37765 -1269397 2817036 9656841 14477771 15471361 13705333 11444041 11510659 15427360 20776663
37756 20776663 22718144 19723538 16061548 16960260 22437138 27280602 26437018 19577878
37748 19577878 11159308 6773402 8726049 14300614 18387188 17881817 13419425 7637515
$$ packed form
37806C751182J29155j715179p25871K884152M189669L80960m281947m475266j010362
37797h73507J853056K650211K454278J950391K366359N300960P931805L546915
37789B7180468p935030j5391031r777208K258312O786503J801192k083813M95094
37781C334487K286063k832528q494473m842110O792558J4880395J1116937j556977
37773B0684352j2836041j4078056n190931N139418P600444K006640l126598j468625
37765a269397M086433O839805M820930R93590j766028k261292O6618L916701N349303
37756B0776663J941481k994606l661990Q98712N476878M843464q43584o859140
37748A9577878q418570m385906J952647N574565M086574n05371m462392n781910
$$ plain form
37740 7637515 2896213 251076 -731098 -1068391 -298056 3956955 12754097 22887427
37732 22887427 29353104 30442265 28166213 24161184 18349568 11937578 8101944 8037630
37724 8037630 9036893 8298748 6518558 6277079 9095876 15231638 23488596 29774676 29556048
37715 29556048 24385940 22257161 27710717 34957230 35460534 29337217 23525363 21093957
37707 21093957 19491603 18363415 20906954 26280251 28683784 26850551 26892556 31647656
37699 31647656 34775283 31437940 27775089 31302023 37218829 34848541 25374843 21778265
37691 21778265 29981671 40571974 43003073 39031080 36496330 37132349 37691325 38130954
37683 38130954 40891719 44551558 45361965 44321145 46708660 54537789 64373622 72628874
$$ packed form
37740G637515m741302k645137r82174l37293P70335M255011Q797142J0133330
37732B2887427O465677J089161k276052m005029n811616o411990l835634o4314
37724H037630R99263p38145j780190k41479K818797O135762Q256958O286080k18628
37715B9556048n170108k128779N453556P246513N03304o123317n811854k431406
37707B1093957j602354j128188K543539N373297K403533j833233M2005M755100
37699C1647656L127627l337343l662851L526934N916806k370288r473698l596578
37691B1778265Q203406J0590303K431099l971993k534750O36019N58976M39629
37683C8130954K760765L659839Q10407j040820K387515P829129R835833Q255252
$$ plain form
37675 72628874 78318222 80428237 77586324 71569938 66767628 64375099 60777576 53625572
37667 53625572 46232288 43496609 45735252 48730887 48336585 43693987 37706597 35349803
37659 35349803 39149792 45025125 45346894 38173884 30913882 32148390 41783096 52097148
37651 52097148 56734127 55245727 50017107 43118925 37118272 35681477 41027996 51384548
37643 51384548 61728736 67100535 66280487 63525009 65577633 74773929 85596104 90377193
37635 90377193 88122703 84977408 85872103 89055947 90254636 89156301 89116850 92142228
37627 92142228 96861296 100734570 102020461 100043093 95819064 92534431 93350041 98063298
37619 98063298 103337368 106817242 109786545 115068477 123376577 132646526 140301792 145365328
$$ packed form
37675G2628874N689348K110015k841913o016386m802310k392529l597523p152004
37667E3625572p393284k735679K238643K995635l94302m642598n987390k356794
37659C5349803L799989N875333L21769p173010p260002J234508R634706J0314052
37651E2097148M636979j488400n228620o898182o000653j436795N346519J0356552
37643E1384548J0344188N371799q20048k755478K052624R196296J0822175M781089
37635I0377193k254490l145295Q94695L183844J198689j098335l9451L025378
37627I2142228M719068L873274J285891j977368m224029l284633Q15610M713257
37619I8063298N274070L479874K969303N281932Q308100R269949P655266N063536
$$ plain form
37611 145365328 148807923 152578344 158048716 164841343 171297373 176281849 180059063 183235262
37603 183235262 185829386 188157775 191731603 197988020 206510582 215683491 224761922 234029366
37595 234029366 243412117 252898150 264395593 280794482 301941723 323117534 338884351
37588 338884351 347616955 351799243 355657497 363334780 376758900 392987173 405651305
37581 405651305 411914861 416500351 425591468 438064092 446848005 448457624 446500914 445232610
37573 445232610 444691834 444111496 445139362 448077962 448665946 442778350 431711116 418890468
37565 418890468 404244536 387015286 371948104 365797335 367129687 365825114 355055787
37558 355055787 339012844 326043073 318392773 312353723 305141117 296968879 287821107 276534733
$$ packed form
37611A45365328L442595L770421N470372O792627O456030M984476L777214L176199
37603A83235262K594124K328389L573828O256417Q522562R172909R078431R267444
37595B34029366R382751R486033J1497443J6398889K1147241K1175811J5766817
37588C38884351Q732604M182288L858254P677283J3424120J6228273J2664132
37581D05651305O263556M585490R091117J2472624Q783913J609619j956710j268304
37573D45232610n40776n80338J027866K938600N87984n887596j1067234j2820648
37565D18890468j4645932j7229250j5067182o150769J332352j304573j0769327
37558C55055787j6042943j2969771p650300o039050p212606q172238r147772j1286374
$$ plain form
37550 276534733 263198447 249576541 237007539 225871137 216610016 209099729 201699549
37543 201699549 193437046 186423770 183014124 180977055 175373781 165808513 157546007 153627161
37535 153627161 150310992 143903232 138220836 139469852 145183391 144797459 132711858 115595748
37527 115595748 103906380 100119694 98926115 95969096 91686092 87789564 84759922 83381841
37519 83381841 84995299 88910459 92367636 94448912 97572124 103327325 108842448 109648961
37511 109648961 105263600 99711357 96399798 94080722 88912514 80339735 73861592 76261780
37503 76261780 87278656 97694365 97908421 87675864 75051293 66631778 62348794 59661563
37495 59661563 58064131 57506729 56594762 55423995 56669217 60220166 60164534 52167960 41542914
$$ packed form
37550B76534733j3336286j3621906j2569002j1136402r261121p510287p400180
37543B01699549q262503p013276l409646k037069n603274r565268q262506l918846
37535A53627161l316169o407760n682396J249016N713539l85932j2085601j7116110
37527A15595748j1689368l786686j193579k957019m283004l896528l029642j378081
37519H3381841J613458L915160L457177K081276L123212N755201N515123Q06513
37511A09648961m385361n552243l311559k319076n168208q572779o478143K400188
37503G6261780J1016876J0415709K14056j0232557j2624571q419515m282984k687231
37495E9661563j597432n57402r11967j170767J245222L550949n5632p996574j0625046
$$ plain form
37486 41542914 37817737 41720367 43893181 38012590 29344960 26818581 30835974 33674967
37478 33674967 30167142 23380922 19225721 18649728 17303313 12259073 7096444 8524644
37470 8524644 17785300 27610380 29789150 24429628 18910564 18387876 20959374 22589856
37462 22589856 22745179 23001941 23120417 21514328 18188047 14820256 12799170 12822626 15240814
37453 15240814 18968520 21125611 19784645 16565322 14884229 16074545 18606138 20615053
37445 20615053 21743269 22592523 23310340 22667926 18490703 10154895 1058592 -3179020
37437 -3179020 -348365 5741488 9547789 9489767 8193250 8633365 11747597 16477257 20112529
37428 20112529 19664655 15093207 10459645 9833589 12761530 15882052 18171488 21816033
$$ packed form
37486D1542914l725177L902630K172814n880591q667630k526379M017393K838993
37478C3674967l507825o786220m155201n75993j346415n044240n162629J428200
37470H524644R260656R825080K178770n359522n519064n22688K571498J630482
37462B2589856J55323K56762J18476j606089l326281l367791k021086K3456K418188
37453A5240814L727706K157091j340966l219323j681093J190316K531593K008915
37445B0615053J128216Q49254P17817o42414m177223q335808r096303m237612
37437c179020K830655O089853L806301n8022j296517M40115L114232M729660L635272
37428B0112529m47874m571448m633562o26056K927941L120522K289436L644545
$$ plain form
37420 21816033 27890516 33735294 35307714 30640800 21135735 11356100 7247072 11766070
37412 11766070 21292013 28284532 28526210 24443214 20909745 19678449 18918486 16573699
37404 16573699 12618917 8586722 5864340 4453656 3477080 3136229 5059138 9294986
37396 9294986 12221561 10266921 5499445 4233676 9222301 16380299 20767627 22577464
37388 22577464 24563048 26337635 25194952 21425426 18756998 19133903 20235882 19207684
37380 19207684 16546117 15137950 17067347 22242568 28672704 33222047 33460141 29752956
37372 29752956 24619498 19741664 15237960 12280492 13665502 19618568 25097736 24598665
37364 24598665 19201950 15813705 19005218 26154452 31341394 31553420 27885499 23005670
$$ packed form
37420B1816033O074483N844778J572420m666914r505065r779635m109028M518998
37412A1766070R525943O992519K41678m082996l533469j231296p59963k344787
37404A6573699l954782m032195k722382j410684r76576l40851J922909M235848
37396I294986K926575j954640m767476j265769M988625P157998M387328J809837
37388B2577464J985584J774587j142683l769526k668428L76905J101979j028198
37380A9207684k661567j408167J929397N175221O430136M549343K38094l707185
37372B9752956n133458m877834m503704k957468J385010N953066N479168m99071
37364B4598665n396715l388245L191513P149234N186942K12026l667921m879829
$$ plain form
37356 23005670 19334939 18075113 18055841 16611932 13135394 10486888 11360013 14874240
37348 14874240 18674623 22439138 26538962 29086469 28109753 25577240 25039261 25827783
37340 25827783 24400648 21490310 22098578 26722234 28661672 23727526 17440867 17545574
37332 17545574 23271465 27826619 28864713 30091477 33561838 36596925 36712838 34462339
37324 34462339 30771050 25950465 21582303 18621431 13650328 3001004 -8510739 -10150221
37316 -10150221 197178 10775634 10463641 3007074 139612 4765043 9371640 9444824
37308 9444824 9211660 12312387 14838140 12096904 6729534 4588756 5756526 5264401
37300 5264401 1458329 -1659868 -938454 1405260 1582389 -186932 56275 5453373 15215262
$$ packed form
37356B3005670l670731j259826j9272j443909l476538k648506Q73125L514227
37348A4874240L800383L764515M099824K547507r76716k532513n37979P88522
37340B5827783j427135k910338O08268M623656J939438m934146o286659J04707
37332A7545574N725891M555154J038094J226764L470361L035087J15913k250499
37324C4462339l691289m820585m368162k960872m971103j0649324j1511743j639482
37316a0150221J0347399J0578456l11993p456567k867462M625431M606597P3184
37308I444824k33164L100727K525753k741236n367370k140778J167770m92125
37300E264401l806072l118197P21414K343714J77129j769321K43207N397098R761889
$$ plain form
37291 15215262 24901964 29198720 26178340 19800977 16311821 16985483 16848913 12486593
37283 12486593 7968619 9010780 13371984 12697631 4023143 -6090188 -10443324 -9115940
37275 -9115940 -6086040 -2983898 52237 1631569 1785709 3738511 7970518 8032868 -1415223
37266 -1415223 -14993347 -22300193 -21790821 -20846299 -22012811 -18335829 -5245745 11128170
37258 11128170 22198209 26743347 27153595 22175926 10774115 -938898 -4981378 -2524089
37250 -2524089 -2376284 -8183867 -13533078 -11423730 -3326210 4037381 7371704 8815994
37242 8815994 10685535 11397714 7804433 638104 -4399897 -2657606 3373118 6883180
37234 6883180 5627641 4155975 6003708 8144497 6174942 957674 -4127445 -9184345
$$ packed form
37291A5215262R686702M296756l020380o377363l489156O73662j36570m362320
37283A2486593m517974J042161M361204o74353q674488j0113331m353136J327384
37275i115940L029900L102142L036135J579332J54140J952802M232007O2350r448091
37266a415223j3578124p306846N09372R44522j166512L676982J3090084J6373915
37258A1128170J1070039M545138M10248m977669j1401811j1713013m042480K457289
37250b524089J47805n807583n349211K109348Q097520P363591L334323J444290
37242H815994J869541P12179l593281p166329n038001J742291O030724L510062
37234F883180j255539j471666J847733K140789j969555n217268n085119n056900
$$ plain form
37226 -9184345 -15744164 -20959719 -19958438 -13616238 -8509450 -8493787 -10889124 -11770412 -10674014
37217 -10674014 -8788035 -6420754 -4201280 -3986200 -6690116 -10663528 -12857610 -10586181
37209 -10586181 -3300881 5146008 7824592 2124814 -5377573 -5918906 407853 5729496
37201 5729496 6042268 5429157 7515258 9357234 7032158 2051370 -1561515 -2525790 -1145012
37192 -1145012 3354065 10612768 17288861 20717563 21644986 20687852 15853200 7173069
37184 7173069 148902 70857 5504709 11498296 16471320 21439160 25159775 25495508 23996738
37175 23996738 23876114 24430552 22436386 18243459 15413113 14738228 13677074 11621150
37167 11621150 10581271 10287836 7847622 3348325 849025 2155370 4154824 4394742
$$ packed form
37226i184345o559819n215555J001281O342200N106788J5663k395337q81288J096398
37217a0674014J885979K367281K219474K15080k703916l973412k194082K271429
37209a0586181P285300Q446889K678584n699778p502387n41333O326759N321643
37201E729496L12772o13111K086101J841976k325076m980788l612885r64275J380778
37192a145012M499077P258703O676093L428702R27423r57134m834652q680131
37184G173069p024167p8045N433852N993587M973024M967840L720615L35733j498770
37175B3996738j20624N54438j994166m192927k830346o74885j061154k055924
37167A1621150j039879k93435k440214m499297k499300J306345J999454K39918
$$ plain form
37159 4394742 5121018 9072951 14452426 16774754 13692648 6465816 -1071115 -4072788
37151 -4072788 -285694 6561595 9947614 8299855 6218552 6986385 8363208 7977439
37143 7977439 7998208 10699701 13530317 13260257 11871945 13315484 16837489 18832344 19507044
37134 19507044 21867674 24767467 22964816 14963863 5850585 1009347 977099 3301274
37126 3301274 5204864 3402404 -4006166 -13470414 -18010896 -15505525 -10937183 -8193910
37118 -8193910 -4506228 3277588 11604181 14888884 14057461 14179389 15296806 12283308
37110 12283308 3947527 -3990224 -6667050 -5705838 -4839189 -4295188 -2519513 -305088
37102 -305088 -40024 -2487467 -6197179 -8586322 -7022219 -1708712 1903490 -1972800
$$ packed form
37159D394742P26276L951933N379475K322328l082106p226832p536931l001673
37151d072788L787094O847289L386019j647759k081303P67833J376823l85769
37143G977439K0769K701493K830616k70060j388312J443539L522005J994855O74700
37134A9507044K360630K899793j802651q000953r113278m841238l2248K324175
37126C301274J903590j802460p408570r464248m540482K505371M568342K743273
37118h193910L687682P783816Q326593L284703q31423J21928J117417l013498
37110A2283308q335781p937751k676826R61212Q66649N44001J775675K214425
37102c05088K65064k447443l709712k389143J564103N313507L612202l876290
$$ plain form
37094 -1972800 -10142974 -11192831 324959 15019240 19681123 13678444 7271696 5687590
37086 5687590 3642266 -3208312 -9938826 -9914447 -4796763 -1474101 -2284976 -3502800 -2074064
37077 -2074064 584348 1470369 -252689 -2743755 -3350487 -1300305 858891 -314703
37069 -314703 -4837585 -9263811 -11307041 -11647053 -10380020 -5706115 1546928 6137299
37061 6137299 4806099 1163649 23337 25674 -2818077 -6814285 -6522392 -2182035 -88232
37052 -88232 -2463317 -3666284 844139 7705770 11761404 14040499 18353474 23120087
37044 23120087 22788699 16804786 11529385 11501392 12672271 7467835 -4802505 -15702407
37036 -15702407 -16812628 -9431800 -2968085 -3731340 -8038634 -8241537 -3173575 1195618
$$ packed form
37094a972800q170174j049857J1517790J4694281M661883o002679o406748j584106
37086E687590k045324o850578o730514K4379N117684L322662q10875j217824J428736
37077b074064K658412Q86021j723058k491066o06732K050182K159196j173594
37069c14703m522882m426226k043230l40012J267033M673905P253043M590371
37061F137299j331200l642450j140312K337k843751l996208K91893M340357K093803
37052h8232k375085j202967M510423O861631M055634K279095M312975M766613
37044B3120087l31388n983913n275401k7993J170879n204436j2270340j0899902
37036a5702407j110221P380828O463715p63255m307294k02903N067962M369193
$$ plain form
37028 1195618 921704 -579148 1818464 7092561 8870231 3224247 -6329859 -11776321
37020 -11776321 -8169234 1302208 8105769 7269331 2767806 2119394 6497055 9496905
37012 9496905 5973444 -1515843 -6424360 -5255921 749255 7990804 12438202 11689467
37004 11689467 7429265 4059121 3354948 2778640 442232 -1572497 -1257008 -684935 -2469744
36995 -2469744 -4690287 -3168918 2637845 9085999 12144821 9278102 133593 -11254906
36987 -11254906 -17556420 -15550527 -10370608 -8455239 -9086209 -7905383 -5784601 -7284662
36979 -7284662 -11858560 -14177068 -13119707 -12913772 -14534018 -13722398 -9568439 -7468015
36971 -7468015 -10344881 -13808834 -13667131 -11529835 -8842100 -2479494 8054873 15660829
$$ packed form
37028A195618k73914j500852K397612N274097J777670n645984r554106n446462
37020a1776321L607087R471442O803561q36438m501525o48412M377661K999850
37012I496905l523461p489287m908517J168439O005176P241549M447398p48735
37004A1689467m260202l370144p04173n76308k336408k014729L15489N72073j784809
36995b469744k220543J521369N806763O448154L058822k866719r144509j1388499
36987a1254906o301514K005893N179919J915369o30970J180826K120782j500061
36979g284662m573898k318508J057361K05935j620246Q11620M153959K100424
36971g468015k876866l463953J41703K137296K687735O362606J0534367P605956
$$ plain form
36963 15660829 14999001 11511318 13306860 18367165 18425424 12526264 7436093 5900817
36955 5900817 3905952 125257 -745844 3717268 9282284 11482982 10434460 7385349
36947 7385349 2719442 -557562 1925617 8069020 9212160 1890307 -6302485 -7293248
36939 -7293248 -3345856 -1668137 -3267891 -4101469 -3608084 -4138045 -3472890 3950677 17345623
36930 17345623 27667428 27732146 19684139 10288343 2846227 -3299693 -7974470 -8549545
36922 -8549545 -3251783 5459247 11758459 11453487 6324044 2243483 2413779 4399354
36914 4399354 4930006 4632511 5235344 4941025 1076772 -3979505 -4359687 1727874 10085637
36905 10085637 16432547 20207874 22007023 21508002 19304825 17104864 14591624 9444710
$$ packed form
36963A5660829o61828l487683J795542N060305N8259n899160n090171j535276
36955E900817j994865l780695q71101M463112N565016K200698j048522l049111
36947G385349m665907l277004K483179O143403J143140p321853q192792r90763
36939g293248L947392J677719j599754q33578M93385n29961O65155P423567J3394946
36930A7345623J0321805O4718q048007r395796p442116o145920m674777n75075
36922h549545N297762Q711030O299212l04972n129443m080561J70296J985575
36914D399354N30652k97495O02833k94319l864253n056277l80182O087561Q357763
36905A0085637O346910L775327J799149m99021k203177k199961k513240n146914
$$ plain form
36897 9444710 1862810 -4433299 -7258720 -8335888 -8755888 -6187772 403084 6890129
36889 6890129 8647893 6466419 4049671 1871781 -2266457 -7913403 -11424407 -10553762
36881 -10553762 -6478258 -1543522 2427726 4348076 5126600 7873747 13985527 19989216
36873 19989216 21540215 19670901 19221696 21421887 22328545 19221884 14333924 10767948
36865 10767948 8513959 6653864 6307885 8635792 12061750 14088969 14396501 13950294
36857 13950294 12489315 9308791 5563559 3263097 2215820 257330 -3001050 -4407774
36849 -4407774 -498368 7938357 15540056 17284201 13656946 10091333 10814821 14295877
36841 14295877 15766674 12908207 7101689 325071 -5913671 -8738466 -5122453 3213568
$$ packed form
36897I444710p581900o296109k825421j077168m20000K568116O590856O487045
36889F890129J757764k181474k416748k177890m138238n646946l511004Q70645
36881a0553762M075504M934736L971248J920350P78524K747147O111780O003689
36873A9989216J550999j869314m49205K200191R06658l106661m887960l565976
36865A0767948k253989j860095l45979K327907L425958K027219L07532m46207
36857A3950294j460979l180524l745232k300462j047277j958490l258380j406724
36849d407774L909406Q436725P601699J744145l627255l565613P23488L481056
36841A4295877J470797k858467n806518o776618o238742k824795L616013Q336021
$$ plain form
36833 3213568 9310565 8165066 2497439 -1171782 -367870 2421861 5177721 8633756
36825 8633756 12873798 15313932 13845427 9885198 6639560 5736978 6975383 9939845
36817 9939845 13782966 16091287 14471791 9931323 6801095 7954132 11342261 13003670
36809 13003670 12623723 13598665 17412523 20781419 19945207 15613822 11461856 9386508
36801 9386508 8896982 9865101 12454905 14645353 13374733 8831306 4680121 3302354
36793 3302354 3654740 4420431 5676569 6077553 2471294 -4778938 -9447916 -6304260 1726316
36784 1726316 7015466 6391538 3119814 939725 396120 895884 2111424 2410392 -434788
36775 -434788 -5351499 -7654191 -4585037 823494 3284327 1260871 -2246344 -3939352
$$ packed form
36833C213568O096997j145499n667627l669221Q03912K789731K755860L456035
36825H633756M240042K440134j468505l960229l245638r02582J238405K964462
36817I939845L843121K308321j619496m540468l130228J153037L388129J661409
36809A3003670l79947R74942L813858L368896q36212m331385m151966k075348
36801I386508m89526R68119K589804K190448j270620m543427m151185j377767
36793C302354L52386P65691J256138M00984l606259p250232m668978L143656Q030576
36784A726316N289150o23928l271724k180089n43605M99764J215540K98968k845180
36775d34788m916711k302692L069154N408531K460833k023456l507215j693008
$$ plain form
36767 -3939352 -3555388 -3113081 -3925427 -4835120 -3622759 -273552 1983761 5189 -5271630
36758 -5271630 -9452061 -9295817 -5620279 -1692043 78178 -319117 -1298626 -1723536 -2265277
36749 -2265277 -4085077 -6070700 -5250513 -1172246 2210724 1202220 -2956998 -6817388
36741 -6817388 -10123337 -14526725 -18327671 -17678660 -13128870 -9634098 -8789438 -6363238
36733 -6363238 31444 5888998 6091593 2055773 -1609675 -3886944 -5713857 -4575088
36725 -4575088 2856120 13484547 19278290 16874976 11016681 7390356 6382967 5399763
36717 5399763 3368349 845591 -1229302 -1048251 2776964 7632729 7962915 2479088
36709 2479088 -2719036 -1280300 5925624 13969374 21435008 29501965 35218882 32662390
$$ packed form
36767c939352L83964M42307q12346r09693J212361L349207K257313j978572n276819
36758e271630m180431J56244L675538L928236J770221l97295r79509m24910n41741
36749b265277j819800j985623Q20187M078267L382970j008504m159218l860390
36741f817388l305949m403388l800946O49011M549790L494772Q44660K426200
36733f363238O394682N857554K02595m035820l665448k277269j826913J138769
36725d575088P431208J0628427N793743k403314n858295l626325j007389r83204
36717E399763k031414k522758k074893J81051L825215M855765L30186n483827
36709B479088n198124J438736P205924Q043750P465634Q066957N716917k556492
$$ plain form
36701 32662390 22245646 12957000 12103011 17142108 21204097 22475655 22972807 21251131
36693 21251131 13678244 3077004 -882064 7024706 20414513 28743274 28519036 23829669
36685 23829669 19104587 16034481 15751430 18731796 22304686 22463393 19075903 16064937
36677 16064937 15667418 15778295 14165175 12125023 11925093 12901223 12317060 8844648 3647648
36668 3647648 -951629 -2846722 -1338895 2235629 6106467 10327649 15591221 19940548
36660 19940548 19748258 14837815 9353714 5963859 2622313 -2524694 -6502437 -5456443
36652 -5456443 -818808 2469645 2415439 940457 -319443 -1301554 -1438335 -143793 1109025
36643 1109025 802013 684440 2897210 4494777 202591 -8676743 -13729178 -10119489
$$ packed form
36701C2662390j0416744r288646q53989N039097M061989J271558M97152j721676
36693B1251131p572887j0601240l959068P906770J3389807Q328761k24238m689367
36685B3829669m725082l070106k83051K980366L572890J58707l387490l010966
36677A6064937l97519J10877j613120k040152j99930R76130n84163l472412n197000
36668C647648m599277j895093J507827L574524L870838M221182N263572M349327
36660A9940548j92290m910443n484101l389855l341546n147007l977743J045994
36652e456443M637635L288453n4206j474982j259900r82111j36781J294542J252818
36643A109025l07012j17573K212770J597567m292186q879334n052435L609689
$$ plain form
36635 -10119489 -3052994 -480840 -3493517 -7794694 -11195550 -14648745 -17703480 -18177706
36627 -18177706 -16322570 -14937533 -14523483 -12175407 -7035114 -3487882 -5671512 -10431854
36619 -10431854 -9769972 -1083702 8407674 10072014 4554576 176835 1402153 4070549
36611 4070549 3663797 2642303 5032661 8166612 6556743 1771590 884374 5394768
36603 5394768 9506513 10597892 13123679 18963682 22161400 18711197 14309659 15103608
36595 15103608 16598583 10553958 -1041335 -8508194 -9082730 -9184391 -12131425 -13364968
36587 -13364968 -9985534 -6062332 -4637765 -2121861 4414499 10636821 11299200 8506525
36579 8506525 7883293 9935233 10925257 10071295 10330436 12861331 15189596 14777088 11349984
$$ packed form
36635a0119489P066495K572154l012677m301177l400856l453195l054735m74226
36627a8177706J855136J385037M14050K348076N140293L547232k183630m760342
36619a0431854O61882Q686270R491376J664340n517438m377741J225318K668396
36611D070549m06752j021494K390358L133951j609869m785153q87216M510394
36603E394768M111745J091379K525787N840003L197718l450203m401538P93949
36595A5103608J494975o044625j1595293p466859n74536j01661k947034j233543
36587a3364968L379434L923202J424567K515904O536360O222322O62379k792675
36579H506525o23232K051940R90024q53962K59141K530895K328265m12508l427104
$$ plain form
36570 11349984 6158636 1355625 -771778 -92867 940578 778201 793884 2146352 3297374
36561 3297374 2983896 2721634 3491339 3095484 299781 -1718720 -373655 1127313 -1188641
36552 -1188641 -4684423 -3852178 824846 4558165 7118569 12061844 17343076 15387312
36544 15387312 4599422 -6854143 -11830219 -12059730 -11907136 -10962371 -7343658 -2771084
36536 -2771084 488827 3161833 5300747 4164000 296841 31229 5854770 9593104
36528 9593104 2903591 -9304803 -14537787 -9670212 -3533972 -3253215 -6679284 -9316976
36520 -9316976 -10458638 -9815490 -5115857 3201985 10048407 11787195 10169391 7737800
36512 7737800 3942226 -1139204 -3741988 -1192161 3383379 5019165 3354022 1826901
$$ packed form
36570A1349984n191348m803011k127403O78911J033445j62377J5683J352468J151022
36561C297374l13478k62262P69705l95855k795703k018501J345065J500968k315954
36552a188641l495782Q32245M677024L733319K560404M943275N281232j955764
36544A5387312j0787890j1453565m976076k29511J52594R44765L618713M572574
36536b771084L259911K673006K138914j136747l867159k65612N823541L738334
36528I593104o689513j2208394n232984M867575O136240K80757l426069k637692
36520i316976j141662O43148M699633Q317842O846422J738788j617804k431591
36512G737800l795574n081430k602784K549827M575540J635786j665143j527121
$$ plain form
36504 1826901 2534175 5129058 9052743 13476904 16025366 14549426 9912008 5060224
36496 5060224 1772163 -323041 -2274440 -4451739 -5744148 -3664883 2915181 10496022
36488 10496022 13016317 8780602 2985488 1432347 3929415 6202250 6344058 6460956
36480 6460956 8751690 12295263 13676405 10029733 2447493 -3393167 -2232906 4339889
36472 4339889 9149025 8243242 5123485 4365490 5044361 3963445 1984103 2369663 4682979
36463 4682979 5094694 2193722 -1403638 -2952600 -1895457 1106726 4298891 4693388
36455 4693388 1122704 -3015985 -3223262 241744 2847712 1585444 -2571970 -7177291
36447 -7177291 -10167933 -10012535 -7162114 -4490587 -3270744 -388199 6532316 13244469
$$ packed form
36504A826901P07274K594883L923685M424161K548462j475940m637418m851784
36496E060224l288061k095204j951399k177299j292409K079265O580064P580841
36488A0496022K520295m235715n795114j553141K497068K272835J41808J16898
36480F460956K290734L543573J381142l646672p582240n840660J160261O572795
36472D339889M809136r05783l119757p57995O78871j080916j979342L85560K313316
36463D682979M11715k900972l597360j548962J057143L002183L192165L94497
36455D693388l570684m138689k07277L465006K605968j262268m157414m605321
36447g177291k990642J55398K850421K671527J219843K882545O920515O712153
$$ plain form
36439 13244469 13530291 8552475 5298613 5843268 5074604 358718 -3697872 -3163766 -1071836
36430 -1071836 -1542723 -2923147 -1920418 -629679 -3734001 -10706130 -15842761 -15493185
36422 -15493185 -11702929 -8998192 -9909136 -13071566 -14302802 -10807498 -5170814 -2888613
36414 -2888613 -5068524 -6918618 -4933762 -1498374 9017 176660 162474 -2071729 -7330938
36405 -7330938 -11013317 -9214047 -5832996 -6939517 -10253629 -7755557 1795583 10539182
36397 10539182 12680393 10907665 9529654 7760073 3285405 -2841587 -8953525 -16132307
36389 -16132307 -24348164 -28511128 -23451148 -11535637 -1246878 1351588 -3147391 -10702772
36381 -10702772 -17761000 -22081945 -22971373 -21937199 -21361166 -21551467 -20144679 -14983659
$$ packed form
36439A3244469K85822m977816l253862N44655p68664m715886m056590N34106K091930
36430a071836m70887j380424J002729J290739l104322o972129n136631L49576
36422a5493185L790256K704737r10944l162430j231236L495304N636684K282201
36414b888613k179911j850094J984856L435388J507391J67643j4186k234203n259209
36405g330938l682379J799270L381051j106521l314112K498072R551140Q743599
36397A0539182K141211j772728j378011j769581m474668o126992o111938p178782
36389a6132307q215857m162964N059980J1915511J0288759K598466m498979p555381
36381a0702772p058228m320945q89428J034174N76033j90301J406788N161020
$$ plain form
36373 -14983659 -6726397 1900300 8768328 13645794 17089932 18759235 17376743 12341725
36365 12341725 4796513 -3109994 -9276668 -11694374 -9013079 -2727727 2177036 1213897
36357 1213897 -4689046 -10082077 -11077645 -8648526 -5514948 -2260129 1905831 6456680
36349 6456680 9953204 12366754 14794582 16734188 15457317 9156959 119003 -6296253
36341 -6296253 -6448743 -2227969 448238 -2622904 -10093384 -17389477 -21794934 -23599069
36333 -23599069 -22839266 -17860525 -8685793 113648 2666694 -1840671 -7697833 -8349273
36325 -8349273 -2925629 3365043 4940301 1367217 -2805272 -3181233 182064 3719367
36317 3719367 4710881 3471373 1125851 -3222790 -11323029 -21710487 -28653496 -26929837
$$ packed form
36373a4983659Q257262Q626697O868028M877466L444138J669303j382492n035018
36365A2341725p545212p906507o166674k417706K681295O285352M904763r63139
36357A213897n902943n393031r95568K429119L133578L254819M165960M550849
36349F456680L496524K413550K427828J939606j276871o300358r037956o415256
36341f296253j52490M220774K676207l071142p470480p296093m405457j804135
36333b3599069P59803M978741R174732Q799441K553046m507365n857162o51440
36325h349273N423644O290672J575258l573084m172489l75961L363297L537303
36317C719367R91514j239508k345522m348641q100239j0387458o943009J723659
$$ plain form
36309 -26929837 -17377601 -6045410 2358950 8181655 13232984 16377101 15679294 13083987
36301 13083987 12494945 13154480 9628718 150920 -9203141 -11721138 -8264484 -4720429
36293 -4720429 -3753737 -3237372 -1302908 1520940 4685772 7876091 8720566 4416912 -3186942
36284 -3186942 -7576537 -4502672 3149550 8782548 8857772 5401524 3045411 4168802
36276 4168802 6395011 5512121 1529446 -388425 2852425 7013619 6627162 3944600
36268 3944600 5747401 12005831 14717244 9290905 313128 -6483749 -11102115 -14049472
36260 -14049472 -11017870 401991 12964020 16330602 9844683 2287746 -394141 -890161
36252 -890161 -3603445 -7787854 -9836741 -8538871 -5553224 -2734499 -772306 459013
$$ packed form
36309b6929837R552236J1332191Q404360N822705N051329L144117o97807k595307
36301A3083987n89042O59535l525762r477798r354061k517997L456654L544055
36293d720429R66692N16365J934464K823848L164832L190319Q44475m303654p603854
36284c186942m389595L073865P652222N632998P5224l456248k356113J123391
36276D168802K226209q82890l982675j917871L240850M161194l86457k682562
36268C944600J802801O258430K711413n426339q977777o796877m618366k947357
36260a4049472L031602J1419861J2562029L366582o485919p556937k681887m96020
36252h90161k713284m184409k048887J297870K985647K818725J962193J231319
$$ plain form
36244 459013 888512 -709316 -5655022 -12299969 -15898537 -13811890 -9189851 -6732628
36236 -6732628 -6549692 -5785214 -4727335 -6453422 -10581559 -12349535 -9168477 -4098558
36228 -4098558 -1290800 -1400491 -2960242 -4852989 -5626247 -3675767 -405790 -287352 -5102918
36219 -5102918 -10480490 -10955716 -6675509 -2359513 -1211697 -2846445 -6064924 -10194244
36211 -10194244 -13647903 -14350968 -12775807 -12359174 -15148231 -18133376 -15975947 -7698173
36203 -7698173 1090034 4367745 3388495 5373575 13534841 21624669 21712074 15182602 10986426
36194 10986426 13207522 16132811 13690994 8269517 5796127 6120822 4342276 100581
36186 100581 -780511 5177891 13956437 19351283 19554672 16138144 10045536 2145596 -4412710
$$ packed form
36244D59013M29499j597828m945706o644947l598568K086647M622039K457223
36236f732628J82936P64478J057879j726087m128137j767976L181058N069919
36228d098558K807758j09691j559751j892747p73258J950480L269977J18438m815566
36219e102918n377572m75226M280207M315996J147816j634748l218479m129320
36211a0194244l453659p03065J575161M16633k789057k985145K157429Q277774
36203g698173Q788207L277711r79250J985080Q161266Q089828Q7405o529472m196176
36194A0986426K221096K925289k441817n421477k473390L24695j778546m241695
36186A00581q81092N958402Q778546N394846K03389l416528o092608p899940o558306
$$ plain form
36177 -4412710 -6557787 -5714209 -6437136 -10063536 -12613669 -10217050 -4089080 1912586
36169 1912586 6707941 11928254 17070526 18248759 13185335 5090809 -618616 -2338477
36161 -2338477 -2923589 -4932523 -7514277 -8314349 -6569398 -3515237 -1089487 -1043302 -4069317
36152 -4069317 -8622372 -11424718 -10501104 -7547957 -6279690 -8368488 -11795633 -13407341
36144 -13407341 -12429314 -10936342 -11164656 -13140546 -15229733 -16159341 -15357895 -11750048 -4310296
36135 -4310296 5232447 12144830 13254270 10858157 9821724 11270501 11865530 9626810
36127 9626810 7479246 9322477 14591798 18891202 19168060 16520539 14228643 14281666 15787205
36118 15787205 16186899 14247825 11807367 11551999 13125904 13335640 10835815 8257538
$$ packed form
36177d412710k145077Q43578p22927l626400k550133K396619O127970O001666
36169A912586M795355N220313N142272J178233n063424q094526n709425j719861
36161b338477n85112k008934k581754q00072J744951L054161K425750M6185l026015
36152d069317m553055k802346R23614K953147J268267k088798l427145j611708
36144a3407341R78027J492972k28314j975890k089187r29608Q01446L607847P439752
36135d310296R542743O912383J109440k396113j036433J448777N95029k238720
36127I626810k147564J843231N269321M299404K76858k647521k291896N3023J505539
36118A5787205L99694j939074k440458k55368J573905K09736k499825k578277
$$ plain form
36110 8257538 8054454 8498346 6525128 3102746 2381665 5638541 9104787 8541400 3754004
36101 3754004 -2153809 -6100290 -6875001 -5412824 -4010035 -3931726 -3627949 -1181578 1579859
36092 1579859 669993 -3111883 -2523612 7432056 21390930 28395999 24212420 15004582
36084 15004582 8615246 6412672 5348115 4008286 2976287 1298157 -3225040 -10239400
36076 -10239400 -16543682 -20298119 -22906833 -25503006 -25929755 -21466585 -13362179 -6133903
36068 -6133903 -2373014 -467249 1741379 3080565 855990 -4309844 -8019638 -7245865
36060 -7245865 -3928560 -1767018 -835786 2031881 7774114 12912375 13864383 11088155
36052 11088155 7359035 4039176 1148092 -941062 -2919435 -8014175 -17866970 -27335467
$$ packed form
36110H257538k03084M43892j973218l422382p21081L256876L466246n63387m787396
36101C754004n907813l946481p74711J462177J402789P8309L03777K446371K761437
36092A579859r09866l781876N88271R955668J3958874P005069m183579r207838
36084A5004582o389336k202574j064557j339829j031999j678130m523197p014360
36076a0239400o304282l754437k608714k596173m26749M463170Q104406P228276
36068f133903L760889J905765K208628J339186k224575n165834l709794P73773
36060g245865L317305K161542R31232K867667N742233N138261R52008k776228
36052A1088155l729120l319859k891084k089154j978373n094740r852795r468497
$$ plain form
36044 -27335467 -28209065 -19506669 -9819399 -6961499 -8979895 -8686903 -3815232 1856757
36036 1856757 5439680 7693316 9105345 8278055 5593174 4455491 6636346 9103759
36028 9103759 7749762 2444801 -3472335 -7101000 -7555722 -5207957 -1651403 307488
36020 307488 -1263851 -5375707 -9498787 -12668046 -15677890 -18298237 -18238280 -14000706 -7744361
36011 -7744361 -3709624 -3640145 -5107022 -5287716 -5160802 -7676009 -11833724 -11813158 -4313456
36002 -4313456 5269306 7480314 -519627 -11762942 -17294864 -14553007 -7376983 -725501
35994 -725501 2694274 2661137 858425 -491656 -886725 -1917429 -4557554 -7328543 -8579547
35985 -8579547 -9451114 -12460956 -17297420 -19971496 -17009409 -9631833 -2918146 -909100
$$ packed form
36044b7335467q73598Q702396R687270K857900k018396K92992M871671N671989
36036A856757L582923K253636J412029q27290k684881j137683K180855K467413
36028I103759j353997n304961n917136l628665m54722K347765L556554J958891
36020C07488j571339m111856m123080l169259l009844k620347N9957M237574O256345
36011g744361M034737O9479j466877j80694J26914k515207m157715K0566P499702
36002d313456R582762K211008p999941j1243315n531922K741857P176024O651482
35994g25501L419775l3137j802712j350081l95069j030704k640125k770989j251004
35985h579547q71567l009842m836464k674076K962087P377576O713687K009046
$$ plain form
35977 -909100 -3054314 -5732144 -6645715 -6485080 -6230448 -4992786 -2265048 -612650 -3134951
35968 -3134951 -8604876 -12089687 -10813760 -6813083 -3282888 -1022626 748894 2936149
35960 2936149 6946900 13370826 18825613 17701454 9605037 1881814 1467462 6827275
35952 6827275 11420655 12380016 11114773 7461850 -580685 -11085947 -17908222 -18103524
35944 -18103524 -15340288 -13752697 -12400445 -8936016 -5495172 -6601555 -12422935 -18012431
35936 -18012431 -19261484 -16377028 -10970572 -3199564 5969803 12186784 11259678 5171360
35928 5171360 918700 1770127 2724974 -2423796 -11863474 -17927664 -17550354 -15305256 -15104088
35919 -15104088 -14427378 -9962950 -4305684 -2237054 -3375237 -3836127 -3302231 -4603826
$$ packed form
35977i09100k145214k677830r13571J60635K54632J237662K727738J652398k522301
35968c134951n469925l484811J275927M000677L530195K260262J771520K187255
35960B936149M010751O423926N454787j124159q096417p723223m14352N359813
35952F827275M593380R59361j265243l652923q042535j0505262o822275j95302
35944a8103524K763236J587591J352252L464429L440844j106383n821380n589496
35936a8012431j249053K884456N406456P771008R169367O216981r27106o088318
35928E171360m252660Q51427R54847n148770r439678o064190L77310K245098K01168
35919a5104088O76710M464428N657266K068630j138183m60890N33896j301595
$$ plain form
35911 -4603826 -6846894 -5191310 1108783 5819229 3698707 -2415103 -5543359 -3012526
35903 -3012526 1861679 4663889 3772708 539137 -2025125 -1153025 3414997 9071865
35895 9071865 12776848 13347532 11465388 8898449 7788418 8564277 8051352 2390724 -6661099
35886 -6661099 -11151316 -5546527 5668758 12326049 10225749 5483313 6593807 14659229
35878 14659229 23122147 25683671 22134661 16239118 10150623 3119257 -4750915 -10370641
35870 -10370641 -11251674 -9807349 -11360117 -17595451 -23986603 -24574624 -18225735 -9687257
35862 -9687257 -5359643 -8138920 -15202626 -20413862 -19706439 -14358972 -8682698 -5471639
35854 -5471639 -5022008 -7305328 -12262191 -17988012 -21573573 -22682134 -23898954 -26365932
$$ packed form
35911d603826k243068J655584O300093M710446k120522o113810l128256K530833
35903c012526M874205K802210q91181l233571k564262Q72100M568022N656868
35895I071865L704983N70684j882144k566939j110031P75859n12925n660628r051823
35886f661099m490217N604789J1215285O657291k100300m742436J110494Q065422
35878A4659229Q462918K561524l549010n895543o088495p031366p870172n619726
35870a0370641q81033J444325j552768o235334o391152n88021O348889Q538478
35862i687257M327614k779277p063706n211236P07423N347467N676274L211059
35854e471639M49631k283320m956863n725821l585561j108561j216820k466978
$$ plain form
35846 -26365932 -27300503 -23506822 -15728048 -7799879 -2553804 -31047 1047765 1465092
35838 1465092 1009217 -868418 -3905349 -6910597 -9490440 -13074088 -18619413 -23968890
35830 -23968890 -25751601 -23683149 -20473664 -17491060 -13400444 -7519579 -1509225 3026661
35822 3026661 5625320 4978662 -436632 -8254445 -12508242 -10347221 -5345661 -2064647
35814 -2064647 -940316 -1061139 -3609924 -8293107 -10004650 -4498087 4714521 10377197
35806 10377197 10843882 10049102 9428120 6348333 1134978 -723120 3959028 10859622
35798 10859622 13346318 9928326 4352822 985635 2079738 6997980 11913932 12363143
35790 12363143 8061812 3331583 1289848 311908 -1465904 -1123230 5450095 16156359
$$ packed form
35846b6365932r34571L793681P778774P928169N246075K522757J078812M17327
35838A465092m55875j877635l036931l005248k579843l583648n545325n349477
35830b3968890j782711K068452L209485K982604M090616N880865O010354M535886
35822C026661K598659o46658n415294p817813m253797K161021N001560L281014
35814b064647J124331j20823k548785m683183j711543N506563R212608N662676
35806A0377197M66685p94780o20982l079787n213355j858098M682148O900594
35798A0859622K486696l417992n575504l367187J094103M918242M915952M49211
35790A2363143m301331m730229k041735r77940j777812L42674O573325J0706264
$$ plain form
35782 16156359 23317449 22399149 16704046 11957046 9120707 5049831 -1587669 -8357716
35774 -8357716 -12836733 -15195515 -15892884 -13554468 -7665596 -1797187 -962639 -5853236
35766 -5853236 -12295300 -16450264 -17647617 -15691041 -9202548 973063 9392838 10244007
35758 10244007 3215052 -6560136 -13291163 -14018466 -9319432 -2654395 2282669 4992577
35750 4992577 7188782 7630895 1868255 -10091319 -20074821 -20606269 -14544236 -10327485
35742 -10327485 -10043777 -9048098 -6181854 -6152577 -10313638 -12698426 -8630380 -1214894 4640947
35733 4640947 9335704 15078473 19753596 19682368 15583535 10623271 4647365 -4557926
35725 -4557926 -15611816 -24149321 -28620246 -30954998 -31465080 -27570570 -18644095 -8446864
$$ packed form
35782A6156359P161090r18300n695103m747000k836339m070876o637500o770047
35774h357716m479017k358782o97369K338416N888872N868409Q34548m890597
35766e853236o442064m154964j197353J956576O488493J0175611Q419775Q51169
35758A0244007p028955r775188o731027p27303M699034O665037M937064K709908
35750D992577K196205M42113n762640j1959574r983502n31448O062033M216751
35742a0327485K83708R95679K866244K9277m161061k384788M068046P415486N855841
35733D640947M694757N742769M675123p1228m098833m960264n975906r205291
35725d557926j1053890q537505m470925k334752n10082L894510Q926475J0197231
$$ plain form
35717 -8446864 -1076402 3068560 6024969 9140390 12535080 15881991 18156449 17688159
35709 17688159 13973215 9175567 6765052 8173533 10827645 10004468 3575687 -4937229
35701 -4937229 -9185286 -6453806 -181563 4556457 6325843 6668533 6074973 3566760
35693 3566760 -7647 -1186709 2273087 8078384 11154171 8662476 3069079 140694
35685 140694 3347900 10026743 13914450 11753728 5983619 347503 -4716548 -10082943
35677 -10082943 -13489258 -11233790 -4579564 -686737 -5091335 -15294351 -23822521 -26317555
35669 -26317555 -24557946 -22308683 -20633826 -17809278 -12142679 -3824145 4989389 10751581
35661 10751581 10092946 2954079 -5452984 -8031827 -2963522 3794559 5342328 2172186
$$ packed form
35717h446864P370462M144962K956409L115421L394690L346911K274458m68290
35709A7688159l714944m797648k410515J408481K654112q23177o428781q512916
35701d937229m248057K731480O272243M738020J769386L42690n93560k508213
35693C566760l574407j179062L459796N805297L075787k491695n593397k928385
35685A40694L207206O678843L887707k160722n770109n636116n064051n366395
35677a0082943l406315K255468O654226L892827m404598j0203016q528170k495034
35669b6317555J759609K249263J674857K824548N666599Q318534Q813534N762192
35661A0751581o58635p138867q407063k578843N068305O758081J547769l170142
$$ plain form
35653 2172186 636349 3444498 6092389 4648946 2754421 6321178 13490153 15495754
35645 15495754 7985117 -3356296 -10294654 -11059364 -8974003 -5603795 44107 6771046
35637 6771046 10609623 10008286 7967566 7410501 7471600 6441551 5356067 5331787 3688232
35628 3688232 -2569894 -10110460 -11381123 -4532840 3671056 7245856 8395920 11458652
35620 11458652 13976136 10496053 3201974 924236 6483329 11978698 9721195 2144373
35612 2144373 -3408185 -5138849 -6600418 -9091883 -10437759 -10400054 -11426667 -13313248
35604 -13313248 -12162016 -6416689 136105 3656091 5108759 7066609 8658512 7540455
35596 7540455 5121405 5368080 8585944 10737522 10023872 9920024 13149279 16424976 15353119
$$ packed form
35653B172186j535837K808149K647891j443443j894525L566757P168975K005601
35645A5495754p510637j1341413o938358p64710K085361L370208N647902O726939
35637F771046L838577o01337k040720n57065O1099j030049j085484k4280j643555
35628C688232o258126p540566j270663O848283Q203896L574800J150064L062732
35620A1458652K517484l480083p294079k277738N559093N495369k257503p576822
35612B144373n552558j730664j461569k491465j345876L7705j026613j886581
35604a3313248J151232N745327O552794L519986J452668J957850J591903j118057
35596G540455k419050K46675L217864K151578p13650j03848L229255L275697j071857
$$ plain form
35587 15353119 11933441 11640198 13929536 12036059 3540909 -5077865 -7611292 -6287499
35579 -6287499 -6333152 -7517489 -7294017 -8257733 -14544518 -22798478 -25152901 -21054480 -17838310
35570 -17838310 -18547325 -17791486 -12404369 -7774384 -8970285 -12727788 -13564672 -11429858
35562 -11429858 -7474413 1261478 15289112 25911126 23865954 11980165 1141293
35555 1141293 -4071121 -7467991 -10846526 -11055925 -7895949 -5889828 -6031186 -3662970
35547 -3662970 2570721 7013677 6106850 4743774 8617292 15159592 17361276 13272915
35539 13272915 6919086 2171802 34814 193620 1144524 -237092 -5679475 -12291793
35531 -12291793 -14909415 -11508080 -4557956 2358797 7350353 9865707 9351042 5224452
$$ packed form
35587A5353119l419678k93243K289338j893477q495150q618774k533427J323793
35579f287499m5653j184337K23472r63716o286785q253960k354423M098421L216170
35570a7838310p09015P55839N387117M629985j195901l757503q36884K134814
35562a1429858L955445Q735891J4027634J0622014k045172j1885789j0838872
35555A141293n212414l396870l378535k09399L159976K006121j41358K368216
35547c662970O233691M442956r06827j363076L873518O542300K201684m088361
35539A3272915o353829m747284k136988J58806R50904j381616n442383o612318
35531a2291793k617622L401335O950124O916753M991556K515354n14665m126590
$$ plain form
35523 5224452 -1696584 -8104856 -10088491 -7469206 -4835026 -5947668 -8472494 -7606767
35515 -7606767 -3901074 -2735204 -5593791 -7079334 -2879866 3683229 6366911 4040242
35507 4040242 412565 -2030218 -4112055 -7009361 -10299881 -12873610 -14047935 -14074099
35499 -14074099 -14327317 -15894431 -17393686 -16044247 -11758169 -7884523 -6547626 -5615868
35491 -5615868 -2081935 3764616 9555532 14102997 17102122 17472690 14767273 11055553
35483 11055553 8733948 7061968 3279512 -2894368 -7822522 -7562701 -2106849 4410542
35475 4410542 7848890 8320387 9231427 11546156 11468493 6388157 574747 192628 3913843
35466 3913843 4434959 -506367 -5273704 -6094899 -6538019 -9635807 -11299286 -7105146 -354969
$$ packed form
35523E224452o921036o408272j983635K619285K634180j112642k524826Q65727
35515g606767L705693J165870k858587j485543M199468O563095K683682k326669
35507D040242l627677k442783k081837k897306l290520k573729j174325k6164
35499a4074099k53218j567114j499255J349439M286078L873646J336897R31758
35491e615868L533933N846551N790916M547465K999125L70568k705417l711720
35483A1055553k321605j671980l782456o173880m928154K59821N455852O517391
35475D410542L438348M71497R11040K314729p7663n080336n813410l82119L721215
35466C913843N21116m941326m767337q21195m43120l097788j663479M194140O750177
$$ plain form
35457 -354969 2851441 2355450 1218797 -1887100 -9712409 -18049187 -18812386 -11629371 -4800135
35448 -4800135 -3321048 -2644334 3191311 12787366 19968660 21153781 17066863 10097055
35440 10097055 3079154 -1020098 -1001427 1081394 1486473 -1879075 -7239571 -9871860
35432 -9871860 -6674176 -602586 1620527 -2301728 -7108960 -7300258 -4177483 -2038652
35424 -2038652 -1021114 895054 1683853 -1961517 -6873725 -5934923 1027586 5989804
35416 5989804 4211986 349101 198893 2343296 2060926 -1134794 -4459179 -7181727
35408 -7181727 -10599287 -14433798 -16635066 -15730580 -11391300 -4295231 2917554 6653544
35400 6653544 6244718 4990490 5693448 7045206 5965577 1590910 -4530861 -10329970
$$ packed form
35457c54969L206410m95991j136653l105897p825309q336778p63199P183015O829236
35448d800135J479087O76714N835645R596055P181294J185121m086918o969808
35440A0097055p017901m099252J8671K082821M05079l365548n360496k632289
35432i871860L197684O071590K223113l922255m807232j91298L122775K138831
35424b038652J017538J916168P88799l645370m912208R38802O962509M962218
35416E989804j777818l862885j50208K144403k82370l195720l324385k722548
35408g181727l417560l834511k201268R04486M339280P096069P212785L735990
35400F653544m08826j254228P02958J351758j079629m374667o121771n799109
$$ plain form
35392 -10329970 -14005958 -14829033 -14264799 -14486815 -15265568 -14748970 -13576267 -14687236 -17911352
35383 -17911352 -18509192 -13223687 -4732442 2043524 5254329 5714448 4127770 1263827
35375 1263827 -1313262 -2920615 -4443933 -6144046 -7136373 -7894175 -10007287 -12352678
35367 -12352678 -11473730 -7453209 -5044712 -6660535 -8891951 -8983589 -9713072 -13541754 -16592105
35358 -16592105 -13985651 -7780682 -3976100 -4301821 -6506518 -10183013 -16011270 -20854067
35350 -20854067 -20162314 -14949506 -10678280 -9366704 -8245250 -6160884 -5523663 -7105511
35342 -7105511 -8334295 -8169252 -8823758 -10923977 -11375495 -8225665 -4060280 -2360156 -3270700
35333 -3270700 -4852904 -6220304 -7829272 -10300893 -13781782 -17140649 -18168144 -16582050
$$ packed form
35392a0329970l675988q23075N64234k22016p78753N16598J172703j110969l224116
35383a7911352n97840N285505Q491245O775966L210805M60119j586678k863943
35375A263827k577089j607353j523318j700113r92327p57802k113112k345391
35367a2352678Q78948M020521K408497j615823k231416r1638p29483l828682l050351
35358a6592105K606454O204969L804582l25721k204697l676495n828257m842797
35350b0854067O91753N212808M271226J311576J121454K084366O37221j581848
35342g105511j228784J65043o54506k100219m51518L149830M165385J700124r10544
35333c270700j582204j367400j608968k471621l480889l358867j027495J586094
$$ plain form
35325 -16582050 -15921488 -19603057 -25979057 -30626279 -32463578 -33480996 -33445857 -30230145
35317 -30230145 -25370464 -23444640 -24816033 -24771292 -21666209 -19961108 -22233518 -23894372
35309 -23894372 -20036832 -12856253 -7578346 -4881838 -2454498 -1005706 -3074660 -7375995
35301 -7375995 -9503940 -7928565 -5321793 -4129590 -3993807 -3205644 -247162 5015294
35293 5015294 9260829 6951462 -2709940 -11891574 -11827805 -3583174 3603700 4367917 2190151
35284 2190151 1458231 500020 -4007976 -9883834 -11513659 -7640947 -3101189 -2697347 -5997558
35275 -5997558 -8699731 -7395716 -2451234 2571600 3704318 -343400 -6920992 -11281906
35267 -11281906 -10437895 -5900609 -2631111 -4587158 -10861781 -16646105 -18296152 -16649256
$$ packed form
35325a6582050O60562l681569o376000m647222j837299j017418L5139L215712
35317c0230145M859681J925824j371393M4741L105083J705101k272410j660854
35309b3894372L857540P180579N277907K696508K427340J448792k068954m301335
35301g375995k127945J575375K606772J192203J35783P88163K958482N262456
35293E015294M245535k309367r661402r181634O3769Q244631P186874P64217k177766
35284B190151p31920r58211m507996n875858j629825L872712M539758M03842l300211
35275e997558k702173J304015M944482N022834J132718m047718o577592m360914
35267a1281906Q44011M537286L269498j956047o274623n784324j650047J646896
$$ plain form
35259 -16649256 -14741580 -13476733 -11220761 -7147481 -2916592 -654028 -919724 -3184341
35251 -3184341 -6559492 -9085699 -8075712 -2962792 3224617 7096739 8908910 11301781
35243 11301781 14566866 15899337 13850391 10759809 9315705 9065684 8373673 7732573
35235 7732573 8398348 9352258 8925913 8367796 9953427 12055844 10673723 6437033 5081672
35226 5081672 8946051 12788630 11306556 6585194 3893203 3674198 2766381 820702
35218 820702 -233735 -1385741 -5061893 -9036453 -7988341 -1742428 3620642 4008510
35210 4008510 1631206 23096 -17108 1826025 6042515 9482725 6524867 -2634032
35202 -2634032 -9660848 -7598748 1506769 11565849 20010252 26296916 27925487 23626064
$$ packed form
35259a6649256J907676J264847K255972M073280M230889K262564k65696k264617
35251c184341l375151k526207J009987N112920O187409L872122J812171K392871
35243A1301781L265085J332471k048946l090582j444104k50021o92011o41100
35235G732573O65775R53910m26345n58117J585631K102417j382121m236690j355361
35226E081672L864379L842579j482074m721362k691991k19005r07817j945679
35218H20702j054437j152006l676152l974560J048112O245913N363070L87868
35210D008510k377304j608110m0204J843133M216490L440210k957858r158899
35202b634032p026816K062100R105517J0059080Q444403O286664J628571m299423
$$ plain form
35194 23626064 16998971 11564557 5418712 -3648194 -11093829 -10412017 -2836247 4432894
35186 4432894 8076094 9861304 9470497 4306355 -3126929 -5837240 -2637208 -753521
35178 -753521 -4922503 -9944164 -8116383 558152 9533145 13488501 11543937 5988856
35170 5988856 1144491 869148 4375009 6763076 5461747 2989471 1679547 4563
35162 4563 -3072934 -4727006 -3383299 -3110901 -7723975 -13651202 -14584929 -11292812 -10559159
35153 -10559159 -14893307 -19313442 -19139691 -15728637 -12905700 -12175920 -13527325 -17098040
35145 -17098040 -21217215 -21497936 -15095825 -4985228 2092216 1741158 -4692158 -11880172
35137 -11880172 -14949203 -13147940 -9955959 -9217067 -11282125 -13716525 -14980273 -15377358
$$ packed form
35194B3626064o627093n434414o145845r066906p445635O81812P575770P269141
35186D432894L643200J785210l90807n164142p433284k710311L200032J883687
35178g53521m168982n021661J827781Q674535Q974993L955356j944564n555081
35170E988856m844365k75343L505861K388067j301329k472276j309924j674984
35162D563l077497j654072J343707K72398m613074n927227r33727L292117P33653
35153a0559159m334148m420135J73751L411054K822937P29780j351405l570715
35145a7098040m119175k80721O402111J0110597P077444l51058o433316p188014
35137a1880172l069031J801263L191981P38892k065058k434400j263748l97085
$$ plain form
35129 -15377358 -14646299 -11477319 -6493112 -3195153 -3915414 -6393106 -6590880 -4019826
35121 -4019826 -1941211 -2495017 -4071603 -4366688 -4029657 -5330646 -7980892 -8610515 -5171475
35112 -5171475 -253844 1474141 -1642294 -7230121 -12319307 -15647479 -16564797 -14399061
$$ packed form
35129a5377358P31059L168980M984207L297959p20261k477692j97774K571054
35121d019826K078615n53806j576586k95085L37031j300989k650246o29623L439040
35112e171475M917631J727985l116435n587827n089186l328172r17318K165736
$$ [...]
##END NTUPLES=NMR SPECTRUM
##END=
