##TITLE=31Pdec_DE-63_21_oil
 D2O, 64 sc
 8.8.2024
##JCAMPDX= 6.0         $$ Bruker NMR JCAMP-DX V2.0
##DATA TYPE= NMR SPECTRUM
##DATA CLASS= NTUPLES
##ORIGIN= UXNMR, Bruker Analytische Messtechnik GmbH
##OWNER= root
$$ XWIN-NMR		Version 3.5
$$ Thu Aug  8 14:27:55 2024 Russian Standard Time (UT+4h)  she@DPX200
##.OBSERVE FREQUENCY= 81.013821
##.OBSERVE NUCLEUS= ^31P
##.ACQUISITION MODE= SIMULTANEOUS
##.ACQUISITION SCHEME= undefined
##.AVERAGES= 64
##.DIGITISER RES= 17
##SPECTROMETER/DATA SYSTEM= spect
##.PULSE SEQUENCE= zgpg30
##.SOLVENT NAME= D2O
##.SHIFT REFERENCE= (INTERNAL, D2O, 0, 198.062)
##AUDIT TRAIL= $$ (NUMBER, WHEN, WHO, WHERE, WHAT)
$$ ##TITLE= Audit trail, XWIN-NMR		Version 3.5
$$ ##JCAMPDX= 5.01
$$ ##ORIGIN= Bruker BioSpin GmbH
$$ ##OWNER= she
$$ F:/spectra/data/she/nmr/P31/2/pdata/1/auditp.txt
$$ ##AUDIT TRAIL=  $$ (NUMBER, WHEN, WHO, WHERE, WHAT)
(   1,<2024-08-08 14:25:54.34 +0400>,<she>,<DPX200>,
      <created by zg, POWCHK disabled, PULCHK disabled
       configuration hash MD5:
       00 E9 B6 7A A2 85 ED C7 34 08 36 98 17 FE 4E 26
       data hash MD5: 32K
       BA 88 72 28 86 17 1F 6D E5 22 57 B4 5A 9D F8 F6>)
(   2,<2024-08-08 14:26:51.45 +0400>,<she>,<DPX200>,
      <Start of raw data processing
       efp BC_mod = 2 LB = 1.5 FT_mod = 6 PKNL = 1 PHC0 = 2667.749 PHC1 = 84.08804 SI = 64K 
       data hash MD5: 64K
       ED CF 90 6D 1F 12 68 DB 60 B2 8B 20 FF 15 8C 5E>)
(   3,<2024-08-08 14:27:15.71 +0400>,<she>,<DPX200>,
      <pk PHC0 = 4.15167 PHC1 = 0 
       data hash MD5: 64K
       4F 45 62 C8 5A 30 3A D1 76 C3 04 DC 74 FC 3C 0B>)
(   4,<2024-08-08 14:27:26.09 +0400>,<she>,<DPX200>,
      <abs ABSG = 5 
       data hash MD5: 64K
       15 81 B4 D5 D1 B3 A3 B5 A3 99 17 DF 4C A1 F5 00>)
$$ ##END=
$$ 
$$ hash MD5
$$ F7 78 01 DC 35 F9 28 3E 3D F5 DC B1 71 C9 1C B2
##$RELAX= 
##$RELAX= 
##$RELAX= 
##$RELAX= 
##$RELAX= 
##$RELAX= 
##$RELAX= 
##$RELAX= 
$$ Bruker specific parameters
$$ --------------------------
##$DU= <F:/spectra>
##$EXPNO= 2
##$NAME= <P31>
##$PROCNO= 1
##$TYPE= <nmr>
##$USER= <she>
##$AMP= (0..31)
100 100 100 100 100 100 100 100 100 100 100 100 100 100 100 100 100 100 
100 100 100 100 100 100 100 100 100 100 100 100 100 100 
##$AQSEQ= 0
##$AQ_mod= 1
##$AUNM= <au_zg>
##$AUTOPOS= <>
##$BF1= 81.014009
##$BF2= 200.13
##$BF3= 200.13
##$BF4= 200.13
##$BF5= 200.13
##$BF6= 200.13
##$BF7= 200.13
##$BF8= 200.13
##$BYTORDA= 1
##$CFDGTYP= 0
##$CFRGTYP= 5
##$CHEMSTR= <none>
##$CNST= (0..31)
1 1 145 1 1 1 1 1 1 1 1 1 1 1 1 1 1 1 1 1 1 1 1 1 1 1 1 1 1 1 1 1 
##$CPDPRG= <waltz16>
##$CPDPRG1= <>
##$CPDPRG2= <waltz16>
##$CPDPRG3= <>
##$CPDPRG4= <mlev>
##$CPDPRG5= <mlev>
##$CPDPRG6= <mlev>
##$CPDPRG7= <mlev>
##$CPDPRG8= <mlev>
##$CPDPRGB= <>
##$CPDPRGT= <>
##$D= (0..31)
0 1 0 0 0 0 0 0 0 0.06 0 0.03 2e-05 3e-06 0 0 0.0002 0 0 0 0 0 0 0 0 0 
0 0 0 0 0 0 
##$DATE= 1723112753
##$DBL= (0..7)
120 120 120 11 120 120 24 19 
##$DBP= (0..7)
150 150 150 150 150 150 150 150 
##$DBP07= 0
##$DBPNAM0= <>
##$DBPNAM1= <>
##$DBPNAM2= <>
$$ [...]
##$SUBNAM3= <"">
##$SUBNAM4= <"">
##$SUBNAM5= <"">
##$SUBNAM6= <"">
##$SUBNAM7= <"">
##$SUBNAM8= <"">
##$SUBNAM9= <"">
##$SW= 400.765351723535
##$SWIBOX= (0..15)
0 1 3 0 0 0 0 0 0 0 0 0 0 0 0 0 
##$SW_h= 32467.5324675325
##$TD= 32768
##$TD0= 1
##$TE= 0
##$TE2= 300
##$TE3= 300
##$TEG= 300
##$TL= (0..7)
0 120 53 12 22 120 120 120 
##$TP= (0..7)
150 150 150 150 150 150 150 150 
##$TP07= 0
##$TPNAME0= <>
##$TPNAME1= <>
##$TPNAME2= <>
##$TPNAME3= <>
##$TPNAME4= <>
##$TPNAME5= <>
##$TPNAME6= <>
##$TPNAME7= <>
##$TPOAL= (0..7)
0.5 0.5 0.5 0.5 0.5 0.5 0.5 0.5 
##$TPOFFS= (0..7)
0 0 0 0 0 0 0 0 
##$TUNHIN= 0
##$TUNHOUT= 0
##$TUNXOUT= 0
##$USERA1= <user>
##$USERA2= <user>
##$USERA3= <user>
##$USERA4= <user>
##$USERA5= <user>
##$V9= 5
##$VALIST= <valist>
##$VCLIST= <CCCCCCCCCCCCCCC>
##$VD= 0
##$VDLIST= <DDDDDDDDDDDDDDD>
##$VPLIST= <PPPPPPPPPPPPPPP>
##$VTLIST= <TTTTTTTTTTTTTTT>
##$WBST= 1024
##$WBSW= 4
##$XGAIN= (0..3)
0 0 0 0 
##$XL= 0
##$YL= 0
##$YMAX_a= 7881
##$YMIN_a= -6798
##$ZGOPTNS= <>
##$ZL1= 120
##$ZL2= 120
##$ZL3= 120
##$ZL4= 120
##$ABSF1= 198.0616
##$ABSF2= -202.7028
##$ABSG= 5
##$ABSL= 3
##$ALPHA= 0
##$AQORDER= 0
##$ASSFAC= 0
##$ASSFACI= 0
##$ASSFACX= 0
##$ASSWID= 0
##$AUNMP= <proc_1d>
##$AZFE= 0.1
##$AZFW= 0.5
##$BCFW= 0
##$BC_mod= 2
##$BYTORDP= 0
##$COROFFS= 0
##$CY= -3
##$DATMOD= 1
##$DC= 0
##$DFILT= <>
##$DTYPP= 0
##$F1P= 0
##$F2P= 0
##$FCOR= 1
##$FTSIZE= 65536
##$FT_mod= 6
##$GAMMA= 0
##$GB= 0
##$INTBC= 1
##$INTSCL= 9.790993e-09
##$ISEN= 30
##$LB= 1.5
##$LEV0= 0
##$LPBIN= 0
##$MAXI= 10000
##$MC2= 0
##$MEAN= 0
##$ME_mod= 0
##$MI= 50
##$NCOEF= 0
##$NC_proc= -8
##$NLEV= 6
##$NOISF1= 182.463
##$NOISF2= 159.3651
##$NSP= 0
##$NTH_PI= 0
##$NZP= 0
##$OFFSET= 198.0616
##$PC= 4
##$PHC0= 2671.901
##$PHC1= 84.08804
##$PH_mod= 1
##$PKNL= yes
##$PPARMOD= 0
##$PSCAL= 0
##$PSIGN= 0
##$REVERSE= no
##$SF= 81.0140089999434
##$SI= 65536
##$SIGF1= 159.3651
##$SIGF2= -187.1042
##$SINO= 113.3802
##$SIOLD= 16384
##$SREGLST= <1H.CDCl3>
##$SSB= 0
##$STSI= 65536
##$STSR= 0
##$SW_p= 32467.5324675325
##$SYMM= 0
##$S_DEV= 0
##$TDeff= 32768
##$TDoff= 0
##$TI= <>
##$TILT= no
##$TM1= 0
##$TM2= 0
##$TOPLEV= 0
##$USERP1= <user>
##$USERP2= <user>
##$USERP3= <user>
##$USERP4= <user>
##$USERP5= <user>
##$WDW= 1
##$XDIM= 65536
##$YMAX_p= 285654731
##$YMIN_p= -22059023
$$ End of Bruker specific parameters
$$ ---------------------------------
##NTUPLES= NMR SPECTRUM
##VAR_NAME=  FREQUENCY,     SPECTRUM/REAL,   SPECTRUM/IMAG
##SYMBOL=    X,             R,               I
##VAR_TYPE=  INDEPENDENT,   DEPENDENT,       DEPENDENT
##VAR_FORM=  AFFN,          ASDF,            ASDF
##VAR_DIM=   65536,         65536,           65536
##UNITS=     HZ,            ARBITRARY UNITS, ARBITRARY UNITS
##FACTOR=    0.49542278885378, 1,            1
##FIRST=     16045.7642231865, 0,            0
##LAST=      -16421.768244346, 0,            0
##MIN=       -16421.768244346, -22059023,    0
##MAX=       16045.7642231865, 285654731,    0
$$ Real data points
##PAGE= N=1
##DATA TABLE= (X++(R..R)), XYDATA
$$ [...]
$$ plain form
40039 2886915 3764853 5091957 5929574 5940389 5798604 6555889 7895114 7740307 4815128
40030 4815128 1119608 243780 3005968 6230590 6562994 4432885 3288355 5463695
40022 5463695 9678087 12449370 11385597 7119999 2420766 -395805 -1099935 -789755
40014 -789755 -293236 16984 -399880 -1533600 -1586204 1644068 7328778 11217111 10157155
40005 10157155 5903264 2691649 1819941 879509 -1644458 -3566165 -2144783 1652018
39997 1652018 4035869 3029044 399780 -1144450 -1040554 -383267 331229 1526611 3016389
39988 3016389 3583401 2433202 184955 -1982914 -3516967 -4488609 -5097143 -5600121 -6113672
39979 -6113672 -6094690 -4783776 -2609902 -1104940 -620268 632675 3825800 6833179 6371762
$$ packed form
40039B886915Q77938J327104Q37617J0815j41785P57285J339225j54807k925179
40030D815128l695520q75828K762188L224622L32404k130109j144530K175340
40022E463695M214392K771283j063773m265598m699233k816571p04130L10180
40014g89755M96519L10220m16864j133720n2604L230272N684710L888333j059956
40005A0157155m253891l211615q71708r40432k523967j921707J421382L796801
39997A652018K383851j006825k629264j544230J03896O57287P14496J195382J489778
39988C016389N67012j150199k248247k167869j534053r71642o08534n02978n13551
39979f113672J8982J310914K173874J504962M84672J252943L193125L007379m61417
$$ plain form
39970 6371762 2486103 -1234004 -2080619 -846558 403028 1025615 1232299 686222 -759762
39961 -759762 -1990510 -1656774 280247 2717029 4300882 3829344 1253589 -1064255 3119
39952 3119 4143955 6860611 4684571 -455831 -4090754 -4825685 -4470399 -3808178 -1632802
39943 -1632802 2048861 4999117 5693719 4912496 3725289 2165692 694705 676530 2204965
39934 2204965 3468155 3589239 4147341 6240373 7890289 6637215 3518507 1907167
39926 1907167 2745417 3391935 1635108 -1234514 -2473897 -1635859 -772028 -1348950 -2392864
39917 -2392864 -2108999 -420108 1029622 1184315 894207 1531265 3068554 4349992 4861299
39908 4861299 5204276 5716183 5526166 3547410 75003 -3089738 -4218923 -3254754 -1615956
$$ packed form
39970F371762l885659l720107q46615J234061J249586O22587K06684n46077j445984
39961g59762j230748L33736J937021K436782J583853m71538k575755k317844J067374
39952C119M140836K716656k176040n140402l634923p34931L55286O62221K175376
39943a632802L681663K950256O94602p81223j187207j559597j470987j8175J528435
39934B204965J263190J21084N58102K093032J649916j253074l118708j611340
39926A907167Q38250O46518j756827k869622j239383Q38038Q63831n76922j043914
39917b392864K83865J688891J449730J54693k90108O37058J537289J281438N11307
39908D861299L42977N11907j90017j978756l472407l164741j129185R64169J638798
$$ plain form
39899 -1615956 -312235 1234917 3820539 6475986 7334765 6392639 5404687 4522037 1577108
39890 1577108 -3688408 -7299407 -5853839 -1796821 -249640 -1610038 -1524498 1788487
39882 1788487 4769592 4446755 2965441 3676156 5904947 6649908 5248395 3318990 1622565
39873 1622565 -117507 -1340997 -1260767 -585171 -330709 196819 1881287 3260065 2340360
39864 2340360 370150 674595 3579423 5441257 3481271 -881673 -4421494 -5599184
39856 -5599184 -4604202 -2053708 712363 1509741 -717321 -4370162 -6769412 -6731475 -4830144
39847 -4830144 -1981322 1052793 3254693 3773946 2996998 2502342 3596262 6010039 8096659
39838 8096659 8334663 6733284 4638312 2998320 1219238 -1678426 -5054503 -6800270
$$ packed form
39899a615956J303721J547152K585622K655447Q58779r42126r87952q82650k944929
39890A577108n265516l610999J445568M057018J547181j360398Q5540L312985
39882A788487K981105l22837j481314P10715K228791P44961j401513j929405j696425
39873A622565j740072j223490Q0230O75596K54462N27528J684468J378778r19705
39864B340360j970210L04445K904828J861834j959986m362944l539821j177690
39856e599184R94982K550494K766071P97378k227062l652841k399250L7937J901331
39847d830144K848822L034115K201900N19253p76948m94656J093920K413777K086620
39838H096659K38004j601379k094972j639992j779082k897664l376077j745767
$$ plain form
39830 -6800270 -5816882 -3596360 -2686972 -3862234 -5431895 -5469742 -4237300 -3824752 -5417045
39821 -5417045 -7771039 -9059006 -9396166 -10092097 -10749078 -9222037 -5126423 -1329098 -445704
39812 -445704 -1398693 -1287143 519288 2251360 2825108 2661372 1789757 -342978 -2896134
39803 -2896134 -3738534 -2234647 -164260 743646 558766 -31668 -788110 -1115687 -184797
39794 -184797 1063601 -35828 -4291176 -8751796 -10190429 -9108273 -8139485 -7564546 -5203469
39785 -5203469 -721904 2787864 2704490 361181 -1064728 -881687 -974792 -1931331 -1534585
39776 -1534585 1770273 5673700 6264581 2760314 -2183625 -6637504 -11098295 -15227909
39768 -15227909 -16020843 -11802537 -6007157 -3661456 -5021477 -6036513 -4741201 -3450801
$$ packed form
39830f800270R83388K220522R09388j175262j569661l7847J232442M12548j592293
39821e417045k353994j287967l37160o95931o56981J527041M095614L797325Q83394
39812d45704r52989J11550J806431J732072N73748j63736q71615k132735k553156
39803b896134q42400J503887K070387R07906j84880n90434p56442l27577R30890
39794a84797J248398j099429m255348m460620j438633J082156R68788N74939K361077
39785e203469M481565L509768q3374k343309j425909J83041r3105r56539L96746
39776a534585L304858L903427N90881l504267m943939m453879m460791m129614
39768a5227909p92934M218306N795380K345701j360021j015036J295312J290400
$$ plain form
39760 -3450801 -4093353 -5237245 -5413528 -5946485 -7928264 -9092546 -6872764 -2886791 -1170915
39751 -1170915 -2790258 -5053543 -5590698 -4506876 -2635422 -219079 2383863 4721258
39743 4721258 7060403 9198494 8734073 3350577 -4628606 -8983580 -6591259 -1423170
39735 -1423170 513233 -1531835 -3347635 -2263843 -246700 -105551 -1244767 -834632
39727 -834632 2055062 5226137 6043917 4139653 1270502 -623097 -861854 -210902 -170396
39718 -170396 -1691565 -4073410 -5445584 -4889283 -3694402 -3684481 -4565089 -4152870 -1466254
39709 -1466254 1702111 3117087 3050521 3702524 6045817 8454646 8736787 6800877 4804932
39700 4804932 4750708 6178784 6537384 4053932 -74321 -2911340 -2979258 -1437684 -238331
$$ packed form
39760c450801o42552j143892j76283n32957j981779j164282K219782L985973J715876
39751a170915j619343k263285n37155J083822J871454K416343K602942K337395
39743D721258K339145K138091m64421n383496p979183m354974K392321N168089
39735a423170J936403k045068j815800J083792K017143J41149j139216M10135
39727h34632K889694L171075Q17780j904264k869151j893599k38757O50952M0506
39718a70396j521169k381845j372174N56301J194881R921q80608M12219K686616
39709a466254L168365J414976o6566O52003K343293K408829K82141j935910j995945
39700D804932n4224J428076L58600k483452m128253k837019o7918J541574J199353
$$ plain form
39691 -238331 -197906 -923837 -1303179 172697 3932539 7615148 7802885 4617689 2478114
39682 2478114 4372268 7420916 6980500 3584018 1948100 3485136 4171968 1068632
39674 1068632 -3010970 -3843578 -1822503 -412265 -497314 119983 2339397 4443254 5423741
39665 5423741 6419174 7752257 7325577 3897912 19865 -659753 1943343 4571149 4946309
39656 4946309 3542860 1160712 -2448462 -6412244 -7714169 -4691827 -240436 1068674
39648 1068674 -1317885 -3534397 -2628265 218681 2434088 3455984 3902509 3496608 2017702
39639 2017702 1019088 2265352 4965907 6473355 5439613 2727711 -268312 -2447497
39631 -2447497 -2675556 -765088 1263276 916259 -1557197 -3420822 -2958792 -873643 1693983
$$ packed form
39691b38331M0425p25931l79342J475876L759842L682609J87737l185196k139575
39682B478114J894154L048648m40416l396482j635918J537036O86832l103336
39674A068632m079602q32608K021075J410238q5049O17297K219414K103857R80487
39665E423741R95433J333083m26680l427665l878047o79618K603096K627806L75160
39656D946309j403449k382148l609174l963782j301925L022342M451391J309110
39648A068674k386559k216512R06132K846946K215407J021896M46525m05901j478906
39639B017702r98614J246264K700555J507448j033742k711902k996023k179185
39631b447497k28059J910468K028364l47017k473456j863625M62030K085149K567626
$$ plain form
39622 1693983 4100487 4851788 2179411 -2825106 -6185752 -5848835 -4371052 -4898930 -6496783
39613 -6496783 -5971459 -2925648 -239698 -157511 -2333768 -5393162 -8052079 -8778232 -6741367
39604 -6741367 -3583790 -2234449 -3198155 -3582091 -609786 5124907 10631328 13668769
39596 13668769 14150768 13287996 12268359 11489936 10525344 8856589 6679931 4801409 3891543
39587 3891543 4048517 4641496 4265307 1768403 -1766258 -3049234 -211103 4105206 5239948
39578 5239948 2225375 -938108 -372210 3042161 5295762 4315142 1920664 1092866 2492604
39569 2492604 4095390 3970974 2865167 3166538 5092928 5429843 1672449 -3674620 -5530610
39560 -5530610 -2856919 83091 -56430 -1196811 378509 3993435 5292053 2143928
$$ packed form
39622A693983K406504P51301k672377n004517l360646L36917J477783n27878j597853
39613f496783N25324L045811K685950Q2187k176257l059394k658917p26153K036865
39604f741367L157577J349341r63706l83936K972305N734693N506421L037441
39596A3668769M81999q62772j019637p78423r64592j668755k176658j878522r09866
39587C891543J56974N92979l76189k496904l534661j282976K838131M316309J134742
39578E239948l014573l163483N65898L414371K253601r80620k394478q27798J399738
39569B492604J602786j24416j105807L01371J926390L36915l757394n347069j855990
39560e530610K673691K940010j39521j140381J575320L614926J298618l148125
$$ plain form
39552 2143928 -2836271 -5765811 -5579533 -4292699 -4404923 -6247101 -7259082 -4350243
39544 -4350243 2250484 8363230 10220967 8440403 6095457 4117575 1245394 -1978774
39536 -1978774 -2495379 960104 5392696 7037831 5594048 3347767 1524928 -413792
39528 -413792 -2439010 -2975269 -744027 3465232 7420836 9497874 9854485 9711181 9742169
39519 9742169 9564555 8853294 8099737 7499031 5939540 2598068 -852087 -1553152 710874
39510 710874 2855560 2435001 566423 -175848 700227 1618223 1398604 125646 -1821805
39501 -1821805 -4125411 -6127065 -7128172 -6921276 -5452852 -2660923 549170 2073301
39493 2073301 630477 -2448081 -4537832 -4432118 -2898845 -1272777 -597492 -1406402 -2984552
$$ packed form
39552B143928m980199k929540J86278J286834j12224j842178j011981K908839
39544d350243O600727O112746J857737j780564k344946j977882k872181l224168
39536a978774n16605L455483M432592J645135j443783k246281j822839j938720
39528d13792k025218n36259K231242M209259L955604K077038L56611j43304L0988
39519I742169j77614p11261p53557o00706j559491l341472l450155p01065K264026
39510G10874K144686m20559j868578p42271Q76075R17996k19619j272958j947451
39501a821805k303606k001654j001107K06896J468424K791929L210093J524131
39493B073301j442824l078558k089751J05714J533273J626068O75285q08910j578150
$$ plain form
39484 -2984552 -3428493 -1909286 -449585 -1896097 -6275905 -10544223 -11862894 -9970167
39476 -9970167 -6634863 -4112240 -3874371 -5470396 -6772486 -6463153 -5733327 -6225771 -7284111
39467 -7284111 -7255192 -6653241 -7333260 -8823077 -8482758 -5638619 -2546925 -474673 2066252
39458 2066252 5737578 7980127 6446343 2730084 356396 478040 1514640 1748381
39450 1748381 493138 -1939679 -3606265 -1705554 3891443 9099989 9871484 7092312
39442 7092312 5076696 6029822 8325609 9600919 8990352 6487691 2628641 -826994
39434 -826994 -1981126 -1121549 -399041 -852880 -1221112 -31730 2412841 4420135 4294494
39425 4294494 1478201 -2568265 -4932597 -3998020 -1314886 534514 1270476 2419488
$$ packed form
39484b984552m43941J519207J459701j446512m379808m268318j318671J892727
39476i970167L335304K522623K37869j596025j302090L09333P29826m92444j058340
39467g284111K8919O01951o80019j489817L40319K844139L091694K072252K540925
39458B066252L671326K242549j533784l716259k373688J21644J036600K33741
39450A748381j255243k432817j666586J900711N596997N208546P71495k779172
39442G092312k015616R53126K295787J275310o10567k502661l859050l455635
39434h26994j154132Q59577P22508m53839l68232J189382K444571K007294j25641
39425D294494k816293m046466k364332R34577K683134J849400P35962J149012
$$ plain form
39417 2419488 4249491 5583951 6422322 8075422 10314980 10998487 9417202 7641000
39409 7641000 7277440 6992147 4869907 1632034 -267838 225572 2011021 3498056 3855614
39400 3855614 3159111 2197211 1697973 1388994 692852 501797 2576426 6321611 8008170
39391 8008170 5028932 -151212 -2356329 252735 4226706 5061049 1894820 -2567479
39383 -2567479 -5649172 -7017505 -7553963 -7112702 -4571989 -154473 3557672 3972186 1321524
39374 1321524 -1838309 -3484548 -3398018 -2214687 -852102 -646518 -2229595 -4092405 -4005157
39365 -4005157 -2167386 -1151848 -2238718 -3681396 -3403008 -1665875 -96442 368204
39357 368204 -397408 -2058480 -3258882 -2282593 556918 2652587 2363971 994647 288631
$$ packed form
39417B419488J830003J334460Q38371J653100K239558O83507j581285j776202
39409G641000l63560k85293k122240l237873j899872M93410J785449J487035L57558
39400C855614o96503r61900m99238l08979o96142j91055K074629L745185J686559
39391H008170k979238n180144k205117K609064L973971Q34343l166229m462299
39383b567479l081693j368333n36458M41261K540713M417516L712145M14514k650662
39374A321524l159833j646239Q6530J183331J362585K05584j583077j862810Q7248
39365d005157J837771J015538j086870j442678K78388J737133J569433M64646
39357C68204p65612j661072j200402R76289K839511K095669k88616j369324p06016
$$ plain form
39348 288631 -316526 -2243046 -4996991 -6704953 -6487987 -4804153 -2462286 -708184 -1067843
39339 -1067843 -3471174 -5581279 -5473311 -3797672 -1916517 345482 3077917 4216331
39331 4216331 1915930 -2056069 -4106259 -3364930 -1885927 -1022765 -479220 -570814 -2353478
39322 -2353478 -5271927 -7356901 -8069501 -8487541 -8514540 -6666883 -3208578 -841810 -1288440
39313 -1288440 -3254955 -4474834 -3750051 -610547 4518377 9049732 9717690 6510504
39305 6510504 2942137 1429556 780510 -641010 -1970502 -1758622 -382175 1361677
39297 1361677 3728321 6003523 5531953 1649425 -1495550 392332 5417366 7479869
39289 7479869 4271735 -238420 -1673576 -246662 1308492 1982008 2665374 3773601
$$ packed form
39348B88631o05157j926520k753945j707962K16966J683834K341867J754102l59659
39339a067843k403331k110105J07968J675639J881155K261999K732435J138414
39331D216331k300401l971999k050190P41329J479003Q63162N43545r1594j782664
39322b353478k918449k084974p12600m18040k6999J847657L458305K366768m46630
39313a288440j966515j219879P24783L139504N128924M531355O67958l207186
39305F510504l568367j512581o49046j421520j329492K11880J376447J743852
39297A361677K366644K275202m71570l882528l144975J887882N025034K062503
39289G479869l208134m510155j435156J426914J555154O73516O83366J108227
$$ plain form
39281 3773601 4764852 5431860 6198687 7310233 8656416 10250580 12131220 13750852 13975611
39272 13975611 11988991 8269164 4636191 2972220 3479878 4364606 3718560 1660202
39264 1660202 116823 478337 1991555 2677486 1519189 -419906 -872031 1606761 6145834
39255 6145834 10058302 11207865 10043231 8972846 9555483 10747428 10418658 8286112
39247 8286112 6427361 6630239 8188991 9185977 9230387 9503311 10297633 10315513 8965543
39238 8965543 7605125 7294494 6801645 4553395 1494125 -61872 128921 107442 -1102723
39229 -1102723 -2345281 -2625107 -2403055 -1898087 -82903 3448580 7080713 8877886 8655454
39220 8655454 7401620 5748973 4130256 3487380 4500171 6540867 8355705 9425685
$$ packed form
39281C773601R91251O67008P66827J111546J346183J594164J880640J619632K24759
39272A3975611j986620l719827l632973j663971N07658Q84728o46046k058358
39264A660202j543379L61514J513218O85931j158297j939095m52125K478792M539073
39255F145834L912468J149563j164634j070385N82637J191945l28770k132546
39247H286112j858751K02878J558752R96986M4410K72924P94322J7880j349970
39238H965543j360418l10631m92849k248250l059270j555997J90793k1479j210165
39229a102723j242558k79826K22052N04968J815184L531483L632133J797173k22432
39220H655454j253834j652647j618717o42876J012791K040696J814838J069980
$$ plain form
39212 9425685 9907768 9644144 8051700 4963609 1212860 -1637272 -2362869 -1330523 -366596
39203 -366596 -673376 -1317188 -753388 810412 2047921 2804527 3629798 3456988 536720
39194 536720 -4000790 -6427366 -5169064 -2518727 -560804 1454311 3978033 4849642
39186 4849642 2992972 1554750 3653703 6941826 6450142 1918519 -1614184 -397849
39178 -397849 4208244 8565722 10312404 8911590 5737677 4179957 6853091 11923731
39170 11923731 14669983 13355281 11054846 10937226 12484064 13619680 13921281 13861102 13024899
39161 13024899 11308103 10401980 11824067 14341180 15490162 15279164 16324350 20012201
39153 20012201 24197355 25692614 24203345 22537393 22838886 23819028 22743300 19387539
$$ packed form
39212I425685M82083k63624j592444l088091l750749k850132p25597J032346R63927
39203c66596l06780o43812N63800J563800J237509P56606Q25271j72810k920268
39194E36720m537510k426576J258302K650337J957923K015115K523722Q71609
39186D849642j856670j438222K098953L288123m91684m531623l532703J216335
39178c97849M606093M357478J746682j400814l173913j557720K673134N070640
39170A1923731K746252j314702k300435j17620J546838J135616L01601o0179q36203
39161A3024899j716796r06123J422087K517113J148982k10998J045186L687851
39153B0012201M185154J495259j489269j665952L01493R80142j075728l355761
$$ plain form
39145 19387539 16164859 14283596 12134727 8601863 5635137 5448885 7016873 7917415
39137 7917415 8090876 8687316 8484362 5312852 609595 -1556151 -367070 834639 316453
39128 316453 417011 2661152 4564322 3787668 1887903 1039263 258173 -1787367 -3107688
39119 -3107688 -1440380 1169582 875500 -2391758 -5719301 -8162317 -10624241 -11772911
39111 -11772911 -8877293 -2838611 2093975 4290192 6178061 8800062 9506380 7064022
39103 7064022 4795263 5577629 7121288 5860859 3012158 2621035 4972934 6205934
39095 6205934 4378115 2056049 1827185 2225303 -24627 -5299413 -10352979 -11813618
39087 -11813618 -9407907 -5796427 -3603467 -2704172 -783708 3229694 7180842 8103292
$$ packed form
39145A9387539l222680j881263k148869l532864k966726j86252J567988R00542
39137G917415J73461N96440k02954l171510m703257k165746J189081J201709n18186
39128C16453J00558K244141J903170p76654j899765q48640p81090k045540j320321
39119c107688J667308K609962k94082l267258l327543k443016k461924j148670
39111a1772911K895618O038682M932586K196217J887869K622001P06318k442358
39103G064022k268759P82366J543659j260429k848701l91123K351899J233000
39095F205934j827819k322066k28864L98118k249930n274786n053566j460639
39087a1813618K405711L611480K192960Q99295J920464M013402L951148R22450
$$ plain form
39079 8103292 5946119 3507876 2948332 3838810 4587269 4134482 1966780 -1818003 -5700979
39070 -5700979 -7457362 -6628507 -5117038 -4515986 -4210004 -3175470 -2123515 -2172518 -2556441
39061 -2556441 -1656464 377307 2026379 2919819 3837624 4510358 3754505 1877597 597409
39052 597409 317923 21792 231829 2822819 6594271 6622474 829581 -5619276 -6177273
39043 -6177273 -1399463 2449918 2263240 1049971 1849970 3370995 3538910 3574524 5521862
39034 5521862 8013465 7659297 3723113 -1063595 -3925535 -4358969 -3371059 -2191563 -1760762
39025 -1760762 -2159306 -2467382 -2069775 -1768373 -2566777 -3816213 -3977946 -3075706 -2842776
39016 -2842776 -4143686 -5678012 -5872117 -4797139 -3260609 -1105781 2057181 4907997
$$ packed form
39079H103292k157173k438243n59544Q90478P48459m52787k167702l784783l882976
39070e700979j756383Q28855J511469O01052L05982J034534J051955m9003l83923
39061b556441Q99977K033771J649072Q93440R17805O72734p55853j876908j280188
39052E97409k79486k96131K10037K590990L771452K8203n792893o448857n57997
39043f177273M777810L849381j86678j213269P99999J521025J67915L5614J947338
39034E521862K491603l54168l936184m786708k861940m33434R87910J179496M30801
39025a760762l98544l08076L97607L01402p98404j249436j61733R02240K32930
39016b842776j300910j534326j94105J074978J536530K154828L162962K850816
$$ plain form
39008 4907997 5061663 2166848 -1114686 -2269423 -1980396 -2582741 -4238132 -4627724 -2454800
38999 -2454800 820660 3394812 5292562 6962066 7571692 6529008 5296193 5544403
38991 5544403 6457462 6193001 5399976 6645460 10265452 13261467 12943415 9712862 5663911
38982 5663911 2299768 305202 -227225 -244913 -959955 -1899238 -1090419 2228280 6479344
38973 6479344 9782965 11583654 11810065 10212528 7347017 4752335 3500207 3781718
38965 3781718 5785843 8967935 10674436 8482318 4329607 2930304 5132672 6705137
38957 6705137 5368721 4520947 6739114 7896286 2838234 -5772543 -10019322 -7163913
38949 -7163913 -2173071 136327 286832 424103 142752 -1636548 -3874711 -5028099 -5513211
$$ packed form
39008D907997J53666k894815l281534j154737K89027o02345j655391l89592K172924
38999b454800L275460K574152J897750J669504O09626j042684j232815K48210
38991E544403R13059k64461p93025J245484L619992K996015l18052l230553m048951
38982E663911l364143j994566n32427j7688p15042r39283Q08819L318699M251064
38973F479344L303621J800689K26411j597537k865511k594682j252128K81511
38965C781718K004125L182092J706501k192118m152711j399303K202368J572465
38957F705137j336416q47774K218167J157172n058052q610777m246779K855409
38949g163913M990842K309398J50505J37271k81351j779300k238163j153388m85112
$$ plain form
38940 -5513211 -6563389 -7883680 -7908872 -5667570 -1769954 1683484 2268472 -347688 -3276614
38931 -3276614 -3231008 -294431 2722759 4104756 4195935 3123897 561721 -2085734 -2423921
38922 -2423921 -817902 -465941 -2602245 -4485581 -3687780 -1662096 -997376 -1344461 -393865
38913 -393865 2597370 6268620 8930803 9283699 6785912 2981939 1004619 1925499 2979998
38904 2979998 1374845 -1544975 -2296219 -332299 1623525 1914827 1875366 3084790 5067042
38895 5067042 6591535 7499110 8134704 8133151 6912411 4860692 3221904 2936070 3886974
38886 3886974 5029430 5085731 3509219 1108032 -452675 -58898 1932615 4262180 6059099
38877 6059099 7167205 7209013 5232825 1244892 -2409064 -2818613 -56762 2553348 2489169
$$ packed form
38940e513211j050178j320291k5192K241302L897616L453438N84988k616160k928926
38931c276614M5606K936577L017190J381997R1179j072038k562176k647455l38187
38922b423921J606019L51961k136304j883336P97801K025684O64720l47085R50596
38913c93865K991235L671250K662183L52896k497787l803973j977320R20880J054499
38904B979998j605153k919820p51244J963920J955824K91302l9461J209424J982252
38895E067042J524493R07575O35594j553j220740k051719j638788k85834R50904
38886C886974J142456N6301j576512k401187j560707L93777J991513K329565J796919
38877F059099J108106M1808j976188l987933l653956m09549K761851K610110o4179
$$ plain form
38868 2489169 830601 -52279 139636 343600 600513 1418052 1830766 778316 -482031
38859 -482031 -376068 -712694 -4609454 -10567835 -12698532 -8175104 -934052 3761306 5115390
38850 5115390 5014841 3743351 716394 -2613097 -3946841 -3303221 -2428471 -1861256 -870039
38841 -870039 320144 378857 -1207343 -3449378 -4839648 -4362401 -2428952 -1263938 -2785574
38832 -2785574 -5504953 -5638187 -2174993 1711775 3499854 4423214 5859178 6196779 4405190
38823 4405190 3406997 5769067 8644365 7744033 4471330 3939998 6990949 9626710 10102206
38814 10102206 10880450 12712613 12340195 8193533 3766782 2676137 3997185 5079550
38806 5079550 5692338 6508544 6245451 3546521 24519 -1286885 603339 4564366 9127786
$$ packed form
38868B489169j658568q82880J91915K03964K56913Q17539M12714j052450j260347
38859d82031J05963l36626l896760n958381k130697M523428P241052M695358J354084
38850E115390j00549j271490l026957l329491j333744O43620Q74750N67215R91217
38841h70039J190183N8713j586200k242035j390270M77247J933449J165014j521636
38832b785574k719379j33234L463194L886768J788079R23360J435964L37601j791589
38823D405190r98193K362070K875298r00332l272703n31332L050951K635761M75496
38814A0102206P78244J832163l72418m146662m426751j090645J321048J082365
38806E079550O12788Q16206k63093k698930l522002j311404J890224L961027M563420
$$ plain form
38797 9127786 12387192 11837948 6872824 607268 -2878722 -2644856 -861185 387357
38789 387357 741624 883411 1773359 3992099 6686310 7948464 7243258 6337247 6624474
38780 6624474 6826560 4953246 1438601 -1549481 -3185439 -4456637 -5940776 -6956951
38772 -6956951 -6983478 -6460430 -5979023 -5712670 -5708845 -5863822 -5636731 -4573733 -3060004 -1902207
38762 -1902207 -1288188 -689383 424879 2194228 4287745 5771485 5531393 3313986 -53313
38753 -53313 -3683854 -7109182 -9462612 -9343989 -6366290 -2099546 1271717 2625741 1882295
38744 1882295 -521066 -3343723 -4897094 -4762253 -4237635 -4173657 -3617231 -1887226 -611151
38735 -611151 -1690966 -4054785 -4673141 -2628961 -87906 951250 841041 614998 10669
$$ packed form
38797I127786L259406n49244m965124o265556l485990K33866J783671J248542
38789C87357L54267J41787Q89948K218740K694211J262154p05206r06011K87227
38780F624474K02086j873314l514645k988082j635958j271198j484139j016175
38772f956951k6527N23048M81407K66353L825j54977K27091J062998J513729J157797
38762a902207O14019N98805J114262J769349K093517J483740k40092k217407l367299
38753e3313l630541l425328k353430J18623K977699M266744L371263J354024p43446
38744A882295k403361k822657j553371J34841N24618O3978N56426J730005J276075
38735f11151j079815k363819o18356K044180K541055J039156j10209k26043o04329
$$ plain form
38726 10669 -1592664 -3439086 -4034776 -3160207 -2200288 -2502637 -4128083 -6300707 -8417319
38717 -8417319 -10130678 -10774013 -9566054 -6820087 -4351824 -3815511 -4780134 -5342860 -4665840
38708 -4665840 -3898167 -4358420 -5928338 -7800944 -9708656 -11424605 -11816218 -9675673 -5522473
38699 -5522473 -1884303 -1542504 -5330096 -11102990 -14858816 -13786410 -8727884 -3140224
38691 -3140224 471257 2306928 3580127 4559843 4883249 4505006 3491747 1891120 448580
38682 448580 250850 955446 788658 -748141 -1656651 -147458 2823888 5052588 5700658
38673 5700658 4990161 2950558 459645 35981 3065903 7106276 8389116 6402257
38665 6402257 3682889 1834114 499383 -167740 821448 2844201 3820681 3510381 3978591
$$ packed form
38726A0669j603333j846422n95690Q74569R59919l02349j625446k172624k116612
38717h417319j713359o43335J207959K745967K468263N36313r64623n62726O77020
38708d665840P67673m60253j569918j872606j907712j715949l91613K140545M153200
38699e522473L638170L41799l787592n772894l755826J072406N058526N587660
38691c140224L611481J835671J273199R79716L23406l78243j013259j600627j442540
38682D48580j97730P04596j66788j536799r08510J509193K971346K228700O48070
38673E700658p10497k039603k490913m23664L029922M040373J282840j986859
38665F402257k719368j848775j334731o67123R89188K022753R76480l10300M68210
$$ plain form
38656 3978591 5890987 7020401 5798785 3913333 3514480 3749896 2239585 -1133039
38648 -1133039 -3931040 -4195363 -2243571 348639 2425080 3886520 5267573 6762393
38640 6762393 7749123 7635696 6777955 5732161 4150946 1763639 -131566 -154946 427510
38631 427510 -1040645 -4341529 -6168735 -5103939 -3905389 -5160856 -7381755 -7765382
38623 -7765382 -6500866 -5447266 -4412781 -2186438 -126817 -874925 -3511787 -3671631
38615 -3671631 455767 5127972 5662667 2099009 -1376460 -1455151 1212075 3282748 2165379
38606 2165379 -1367054 -3667000 -1955706 2395687 5335336 4828993 2594022 948282
38598 948282 -17014 -1008110 -1200010 550347 3049836 3546573 1199137 -1956777 -3819075
$$ packed form
38656C978591J912396J129414j221616j885452l98853K35416j510311l372624
38648a133039k798001k64323J951792K592210K076441J461440J381053J494820
38640F762393R86730j13427q57741j045794j581215k387307j895205k3380N82456
38631D27510j468155l300884j827206J064796J198550j255467k220899l83627
38623g765382J264516J053600J034485K226343K059621p48108k636862j59844
38615c671631M127398M672205N34695l563658l475469p8691K667226K070673j117369
38606B165379l532433k299946J711294M351393K939649n06343k234971j645740
38598I48282r65296r91096j91900J750357K499489M96737k347436l155914j862298
$$ plain form
38589 -3819075 -4462792 -4943031 -5254779 -4709240 -3557682 -2740302 -2023745 230534 4723488
38580 4723488 9499978 11633539 10370500 7554304 4886182 2031861 -1823568 -5620180
38572 -5620180 -7099753 -5668967 -3273683 -2161118 -2878490 -4869917 -7719429 -10677280
38564 -10677280 -11891345 -9865941 -5799410 -3028806 -3480731 -5637740 -6805520 -6519879
38556 -6519879 -6463722 -7461206 -8236374 -7604376 -6383590 -5905656 -5586963 -3710612 -452246
38547 -452246 1713238 1266891 -220002 -358979 840865 1646894 1740700 2572384 4466606
38538 4466606 5509151 4340259 2440026 2151694 3484917 4505343 4216684 3290644 2283337
38529 2283337 1092824 316046 1090946 2897244 3436269 1830997 148138 119884 9656
$$ packed form
38589c819075o43717m80239l11748N45539J151558Q17380P16557K254279M492954
38580D723488M776490K133561j263039k816196k668122k854321l855429l796612
38572e620180j479573J430786K395284J112565p17372j991427k849512k957851
38564a0677280j214065K025404M066531K770604m51925k157009j167780K85641
38556f519879N6157r97484p75168O31998J220786M77934L18693J876351L258366
38547d52246K165484m46347j486893j38977J199844Q06029R3806Q31684J894222
38538D466606J042545j168892j900233k88332J333223J020426k88659r26040j007307
38529B283337j190513p76778P74900J806298N39025j605272j682859k8254j10228
$$ plain form
38520 9656 -2859400 -7381273 -9288623 -6607560 -1981652 1098185 2094787 2308771 1990560
38511 1990560 406013 -2296643 -4978664 -6795708 -7446474 -6713417 -4854730 -2967839
38503 -2967839 -2004523 -1908185 -2425417 -3801201 -5576550 -5797209 -3111114 995120 3809724
38494 3809724 4767585 5277397 5498296 3742227 -312361 -4026010 -4770474 -3108930 -1651752
38485 -1651752 -1609580 -1726446 -219480 3116346 6516440 7538978 5241699 1439778 -828459
38476 -828459 -459611 818601 1074789 674030 1322831 3419180 5438599 5620537 3435071
38467 3435071 -258480 -3606272 -4584326 -2554280 698834 2171986 334141 -3538945
38459 -3538945 -6726573 -7461386 -6006117 -3868156 -2359862 -1823060 -1825135 -1770717 -1368319
$$ packed form
38520I656k869056m521873j907350K681063M625908L079837R96602K13984l18211
38511A990560j584547k702656k682021j817044o50766P33057J858687J886891
38503b967839R63316R6338n17232j375784j775349k20659K686095M106234K814604
38494C809724R57861N09812K20899j756069m054588l713649p44464J661544J457178
38485a651752M2172j16866J506966L335826L400094J022538k297279l801921k268237
38476h28459L68848J278212K56188m00759O48801K096349K019419J81938k185466
38467C435071l693551l347792r78054K030046L253114J473152j837845l873086
38459c538945l187628p34813J455269K137961J508294N36802k075N4418M02398
$$ plain form
38450 -1368319 -820982 -683175 -1303736 -2329847 -3041619 -3187878 -3014707 -2486782 -1394592
38441 -1394592 -571857 -1789096 -5379926 -8882227 -9456295 -7164099 -4445577 -2778730
38433 -2778730 -1553098 -119920 985755 1351974 1559596 2003672 2203467 2068199 2582434
38424 2582434 4234478 5736914 5411264 3336416 1293679 855022 1975843 3192107
38416 3192107 3026635 1495451 40060 -443468 -769998 -1670819 -1892025 -63559 2218627
38407 2218627 1891071 -924458 -2707261 -1670505 -37282 122073 110390 1425530 2299190
38398 2299190 618726 -1732130 -1109392 2264969 4354385 2762032 -848730 -3815303
38390 -3815303 -5135609 -4682145 -2422300 558770 2147674 1397431 -435885 -1501272
$$ packed form
38450a368319N47337J37807o20561j026111p11772j46259J73171N27925J092190
38441a394592Q22735j217239l590830l502301n74068K292196K718522J666847
38433b778730J225632J433178J105675L66219K07622M44076J99795j35268N14235
38424B582434J652044J502436l25650k074848k042737m38657J120821J216264
38416C192107j65472j531184j455391m83528l26530r00821k21206J828466K282186
38407B218627l27556k815529j782803J036756J633223J59355j1683J315140Q73660
38398B299190j680464k350856O22738L374361K089416j592353l610762k966573
38390c815303j320306M53464K259845K981070J588904p50243j833316j065387
$$ plain form
38382 -1501272 -1011033 734590 2761233 3833276 3645347 3502317 4599861 5972016 5711297
38373 5711297 3967611 2842906 3184561 3447617 2379408 1176679 1908751 4661349 7114867
38364 7114867 6833159 3923213 1413629 2163939 5069917 5905989 2962447 -254129 -34473
38355 -34473 2001763 1767888 -482876 -747099 1602247 2261701 -1162358 -5330464 -6507530
38346 -6507530 -5799102 -6055195 -6892478 -6530414 -6130439 -8077131 -11186001 -11749677 -9148412
38337 -9148412 -6816528 -7212634 -8857718 -9104382 -7293061 -4276241 -1064682 989293
38329 989293 667930 -1127284 -1497034 888745 3659291 3781171 1684020 476795 1680762
38320 1680762 3950251 6056431 8592558 11475286 11952767 7606293 470491 -4495631
$$ packed form
38382a501272M90239J745623K026643J072043j87929j43030J097544J372155k60719
38373E711297j743686j124705L41655K63056j068209j202729P32072K752598K453518
38364G114867k81708k909946k509584P50310K905978Q36072k943542l216576K19656
38355c4473K036236k33875k250764k64223K349346O59454l424059m168106j177066
38346f507530P08428k56093q37283L62064L99975j946692l108870n63676K601265
38337i148412K331884l96106j645084k46664J811321L016820L211559K053975
38329I89293l21363j795214l69750K385779K770546J21880k097151j207225J203967
38320A680762K269489K106180K536127K882728M77481m346474p135802m966122
$$ plain form
38312 -4495631 -5141401 -3892169 -3307045 -2625253 -264714 2693155 3993069 3659593 3371265
38303 3371265 3347492 2450419 812283 -178456 -188711 169647 1346009 4022638 6453925
38294 6453925 5636586 1508841 -2775412 -5140688 -6304962 -6831029 -5802316 -3448879
38286 -3448879 -1853736 -1689065 -1328952 -526685 -1411214 -3878992 -3806054 1101496 6885858
38277 6885858 8390278 6250131 4995649 6072895 6831590 5422294 2867220 604413
38269 604413 -892548 -1341719 -1095415 -1689788 -3490718 -3973799 -1293404 1702742 638332
38260 638332 -3941174 -7059832 -6012465 -2885546 -421898 755728 317614 -2505413
38252 -2505413 -6603929 -9068835 -8802050 -7474924 -6258016 -4555970 -2695133 -2529994
$$ packed form
38312d495631o45770J249232N85124O81792K360539K957869J299914l33476k88328
38303C371265k3773q97073j638136r90739j0255L58358J176362K676629K431287
38294F453925q17339m127745m284253k365276j164274n26067J028713K353437
38286c448879J595143J64671L60113Q02267q84529k467778P2938M907550N784362
38277F885858J504420k140147j254482J077246P58695j409296k555074k262807
38269F04413j496961m49171K46304n94373j800930m83081K680395K996146j064410
38260F38332m579506l118658J047367L126919K463648J177626m38114k823027
38252b505413m098516k464906K66785J327126J216908J702046J860837J65139
$$ plain form
38244 -2529994 -4105593 -4856937 -3666096 -2775648 -3977010 -5721715 -5926257 -5013869 -4128357
38235 -4128357 -2828759 -798002 475264 177470 326989 2910822 6551386 8541224
38227 8541224 8721146 8818387 9244249 9159128 8683694 8428545 7564537 4897095 1396491
38218 1396491 -691787 -935381 -744086 -673238 8113 1166317 1569032 1174344 1627860
38209 1627860 3775497 6162249 6684750 4737238 1388135 -1636271 -2964225 -2490924
38201 -2490924 -1445287 -887159 -389871 893652 2313339 2312176 930995 161420 1159230
38192 1159230 2258303 815092 -3337660 -7189759 -7613274 -4781983 -1985432 -1892326 -3726701
38183 -3726701 -4885960 -4564101 -4146653 -4238370 -3504408 -1240755 939183 1465155 1336775
$$ packed form
38244b529994j575599p51344J190841Q90448j201362j744705k04542R12388Q85512
38235d128357J299598K030757J273266k97794J49519K583833L640564J989838
38227H541224J79922R7241M25862q5121m75434k55149q64008k667442l500604
38218A396491k088278k43594J91295P0848O81351J158204M02715l94688M53516
38209A627860K147637K386752N22501j947512l349103l024406j327954M73301
38201b490924J045637N58128M97288J283523J419687j163j381181p69575R97810
38192A159230J099073j443211m152752l852099m23515K831291K796551R3106j834375
38183c726701j159259L21859M17448r1717P33962K263653K179938N25972j28380
$$ plain form
38174 1336775 2547112 5010567 6790637 6711634 5230036 3356040 2154591 2592869 4276860
38165 4276860 4961240 3063508 293772 71848 3449752 7997815 10438551 9077981
38157 9077981 4371718 -957430 -2804599 880464 7075551 10024245 7295839 2135369
38149 2135369 -625452 448624 2938060 3625034 1338315 -2119296 -3324913 -452819
38141 -452819 4550767 7926940 8205530 7085778 6379069 6029689 5676948 6070265 7541232
38132 7541232 8550669 7441991 4870854 3008886 2769567 3177921 3325500 3600547 4567095
38123 4567095 5547679 5183803 3323265 1641846 1836019 3433675 4167524 2620620 -354901
38114 -354901 -3051629 -4497873 -4077780 -1260821 2803323 4938117 3487997 1341867
$$ packed form
38174A336775J210337K463455J780070p9003j481598j873996j201449M38278J683991
38165D276860O84380j897732k769736k21924L377904M548063K440736j360570
38157I077981m706263n329148j847169L685063O195087K948694k728406n160470
38149B135369k760821J074076K489436O86974k286719l457611j205617K872094
38141d52819N003586L376173K78590j119752p06709l49380l52741L93317J470967
38132G541232J009437j108678k571137j861968k39319M08354J47579K75047R66548
38123D567095R80584l63876j860538j681419J94173J597656P33849j546904k975521
38114c54901k696728j446244M20093K816959M064144K134794j450120k146130
$$ plain form
38106 1341867 2767680 7479104 10634368 9088082 4924792 1972433 1484038 2637484
38098 2637484 4823989 7379418 8766852 8172757 6902331 6546290 6852945 7010143 7732411
38089 7732411 9908382 11949870 10882546 6208924 909196 -1812667 -1644616 -823896
38081 -823896 -1570474 -4014104 -6146711 -5936522 -3715271 -1826199 -1623071 -2004900 -1605762
38072 -1605762 -882448 -676353 -257418 1129971 1939307 150731 -3064542 -4311242 -2810886
38063 -2810886 -1540206 -2696252 -4569165 -4451093 -2620907 -1418270 -1657923 -2173535 -2432079
38054 -2432079 -3506793 -6087943 -8944269 -10066101 -8698562 -5806509 -2953621 -1124434
38046 -1124434 -484396 -929162 -2595060 -5671339 -9791106 -13862634 -16570196 -16979025 -14928632
$$ packed form
38106A341867J425813M711424L155264j546286m163290k952359m88395J153446
38098B637484K186505K555429J387434n94095j270426l56041L06655J57198P22268
38089G732411K175971K041488j067324m673622n299728k721863J68051Q20720
38081h23896p46578k443630k132607K10189K221251J889072K03128l81829L99138
38072a605762P23314K06095M18935J387389Q09336j788576l215273j246700J500356
38063b810886J270680j156046j872913J18072J830186J202637k39653n15612k58544
38054b432079j074714k581150k856326j121832J367539K892053K852888J829187
38046a124434O40038m44766j665898l076279m119767m071528k707562m08829K050393
$$ plain form
38037 -14928632 -11289778 -7700624 -5402112 -4182808 -2945643 -1294000 219354 1559401
38029 1559401 3759553 7090199 9492604 8341917 3873270 -417019 -1425140 331869
38021 331869 1909958 1664510 550692 -132799 -699995 -1862188 -2641182 -1130234 2697154
38012 2697154 6418482 8022918 8252882 9139137 10952034 11882882 10575476 7715094 4785515
38003 4785515 2295163 -42480 -2026381 -2853350 -2269580 -1118905 -445962 -374204 -69223
37994 -69223 1445656 4570694 8761700 12400162 13407142 10915295 6544555 3239266
37986 3239266 2393282 2777868 2760793 2609369 3543642 5335090 6521252 6813109 7448087
37977 7448087 8716935 8868309 6465365 2556746 -611964 -2087761 -2401595 -2279758 -2341201
$$ packed form
38037a4928632L638854L589154K298512J219304J237165J651643J513354J340047
38029A559401K200152L330646K402405j150687m468647m290289j008121J757009
38021C31869J578089k45448j113818o83491n67196j162193p78994J510948L827388
38012B697154L721328J604436K29964Q86255J812897R30848j307406k860382k929579
38003D785515k490352k337643j983901q26969N83770J150675O72943P1758L04981
37994f9223J514879L125038M191006L638462J006980k491847m370740l305289
37986C239266q45984L84586j7075j51424R34273J791448J186162K91857O34978
37977G448087J268848J51374k402944l908619l168710j475797l13834J21837o1443
$$ plain form
37968 -2341201 -3127723 -4073491 -3353702 -426146 2033642 800334 -3617507 -7595121 -9329253
37959 -9329253 -10565187 -12581813 -13216959 -10087708 -5023628 -2468456 -3857354 -6080146
37951 -6080146 -5915726 -3863661 -2552808 -2977257 -3908219 -4293657 -4597268 -5657075 -7344941
37942 -7344941 -8711824 -8771102 -6944739 -3488906 197864 2446681 3005654 3191366 3817039
37933 3817039 3843818 2115886 -266917 -797313 1353676 4536185 7035943 8802211 10296403
37924 10296403 11112188 10768308 9902308 9585228 9908112 9904230 8394018 4624471 -954254
37915 -954254 -6027592 -7716565 -5500760 -1996704 -59385 -133170 -1208463 -2821382 -4577621
37906 -4577621 -5035375 -3182077 -445093 687919 -207978 -1367599 -1506276 -1005112 -686920
$$ packed form
37968b341201p86522r45768P19789K927556K459788j233308m417841l977614j734132
37959i329253j235934k016626o35146L129251N064080K555172j388898k222792
37951f080146J64420K052065J310853m24449r30962l85438l03611j059807j687866
37942g344941j366883n9278J826363L455833L686770K248817N58973J85712O25673
37933C817039K6779j727932k382803n30396K150989L182509K499758J766268J494192
37924A0296403Q15785l43880q66000l17080L22884l882j510212l769547n578725
37915i54254n073338j688973K215805L504056J937319p3785j075293j612919j756239
37906d577621m57754J853298K736984J133012q95897j159621j38677N01164L18192
$$ plain form
37897 -686920 -952677 -1891544 -2846284 -2366394 -141709 1731411 1332884 31556 617819
37888 617819 2778584 3206224 323344 -3816450 -6745139 -8031499 -7880253 -5930690 -2510170
37879 -2510170 1052136 4182285 7161942 9216572 9081526 7781041 7720413 8455340 7060162
37870 7060162 3719004 2545490 4739952 5557334 1542146 -3341828 -3296193 856900 3876325
37861 3876325 4324996 4983871 6380459 5733242 2426912 -614234 -1798772 -2721063 -4205241
37852 -4205241 -4489959 -2578445 -53288 1459520 1673887 87574 -3530990 -6638036
37844 -6638036 -5724215 -1551964 1156494 248981 -1615952 -2412747 -3856796 -6933808 -8814687
37835 -8814687 -7406018 -5312076 -5797528 -7842675 -8711205 -8733233 -9853934 -11616067 -12179509
$$ packed form
37897f86920k65757r38867r54740M79890K224685J873120l98527j301328N86263
37888F17819K160765M27640k882880m139794k928689j286360J51246J949563L420520
37879b510170L562306L130149K979657K054630j35046j300485o0628P34927j395178
37870G060162l341158j173514K194462Q17382m015188m883974M5635M153093L019425
37861C876325M48671O58875J396588o47217l306330l041146j184538r22291j484178
37852d205241k84718J911514K525157J512808K14367j586313l618564l107046
37844f638036R13821M172251K708458r07513j864933p96795j444049l077012j880879
37835h814687J408669K093942m85452k045147q68530k2028j120701j762133n63442
$$ plain form
37826 -12179509 -11517157 -10310395 -7611589 -3027618 699252 954145 -632146 -980206
37818 -980206 -547581 -1373389 -2125262 -274110 1960771 -295547 -6351322 -9539292 -6374438
37809 -6374438 -1051200 1170490 492247 -116468 -216197 -1197311 -2875849 -3893438 -4030105
37800 -4030105 -3915265 -3677281 -3369306 -3311383 -2899778 -801661 2677002 5395297 6496355
37791 6496355 7455935 8960699 9321509 7442736 4808540 2902215 1349884 505030 2849846
37782 2849846 9017686 14882863 15841881 12371044 8523970 6598115 6259676 7341886
37774 7341886 10044519 13104375 14719190 14722058 13533136 10287026 4862060 381364 164176
37765 164176 2916405 4359734 3083137 1389946 938385 1281150 2381334 4532361 5744186
$$ packed form
37826a2179509O62352J206762K698806M583971L726870K54893j586291l48060
37818i80206M32625q25808p51873J851152K234881k256318o055775l187970L164854
37809f374438N323238K221690o78243o08715r9729r81114j678538j017589j36667
37800d030105J14840K37984L07975N7923M11605K098117L478663K718295J101058
37791F496355R59580J504764L60810j878773k634196j906325j552331q44854K344816
37782B849846O167840N865177R59018l470837l847074j925855l38439J082210
37774G341886K702633L059856J614815K868j188922l246110n424966m480696k17188
37765A64176K752229J443329j276597j693191m51561L42765J100184K151027J211825
$$ plain form
37756 5744186 3487220 -463676 -1352141 1423683 3105696 1126638 -906279 553532
37748 553532 3194027 2975188 549600 -659108 -257980 -377822 -1011496 -250851 1504716
37739 1504716 1591231 -594597 -2613173 -2637079 -1338813 163835 1708086 2961987 3111358
37730 3111358 2283417 1591071 1413847 1166717 886300 1415197 2826343 4169897 4898088
37721 4898088 5081836 4234553 1630843 -1862106 -3735045 -2176965 2288223 7347615
37713 7347615 10186811 8934851 4488103 628378 635781 3812382 6766780 7696641 7556982
37704 7556982 7400406 6927949 5827929 4223332 1335504 -3991036 -10628189 -15141545
37696 -15141545 -15514161 -13237867 -10860114 -9220107 -8063214 -7540134 -7702251 -7806528 -7285133
$$ packed form
37756E744186k256966l950896q88465K775824J682013j979058k032917J459811
37748E53532K640495k18839k425588j208708M01128j19842o33674P60645J755567
37739A504716Q6515k185828k018576k3906J298266J502648J544251J253901J49371
37730C111358q27941o92346j77224k47130k80417N28897J411146J343554P28191
37721D898088J83748q47283k603710l492949j872939J558080M465188N059392
37713G347615K839196j251960m446748l859725P403L176601K954398R29861j39659
37704G556982j56576m72457j100020j604597k887828n326540o637153m513356
37696a5141545l72616K276294K377753J640007J156893N23080j62117j04277N21395
$$ plain form
37687 -7285133 -6349876 -4944142 -2510585 462234 2282645 2373685 2167594 2773545 3468290
37678 3468290 3499774 3473178 3680479 3011386 1025584 -834744 -1740649 -3110419 -5793120
37669 -5793120 -7764616 -7086122 -5220570 -4607316 -4666626 -3313552 -873363 1020811 3087072
37660 3087072 6854931 10233582 9212979 4261424 602683 1168133 3437715 4596452
37652 4596452 5477563 7129899 7537390 5086139 2308376 2546229 4870718 5698391 3948970
37643 3948970 1351536 -1115210 -3638042 -5087516 -3549162 484719 4140279 5629598
37635 5629598 5534412 4818887 4057289 4639899 7954124 12655726 15103527 13413569 9200199
37626 9200199 4770590 890846 -1789887 -1696555 1387594 4753360 5545821 4114791 2959386
$$ packed form
37687g285133R35257J405734K433557K972819J820411R1040k06091O05951O94745
37678C468290L1484k6596K07301o69093j985802j860328r05905j369770k682701
37669e793120j971496O78494J865552O13254n9310J353074K440189J894174K066261
37660C087072L767859L378651j020603m951555l658741N65450K269582J158737
37652D596452Q81111J652336M07491k451251k777763K37853K324489Q27673j749421
37643C948970k597434k466746k522832j449474J538354M033881L655560J489319
37635E629598r5186p15525p61598N82610L314225M701602K447801j689958m213370
37626I200199m429609l879744k680733R3332L084149L365766P92461j431030j155405
$$ plain form
37617 2959386 3318386 4501464 5775487 7018816 7827450 7667491 6940511 6650465 7077342
37608 7077342 7774656 8457761 8670181 7159200 3382250 -509242 -1201235 1810713 5533388
37599 5533388 7386399 8025247 9288994 11130471 12239272 12477787 12818966 13581635 14557937
37590 14557937 16373645 19655975 22906651 23389009 20759696 17987295 17731119 19366524
37582 19366524 20675079 20881566 20356543 18594347 14879909 10744376 9374124 11711166
37574 11711166 14764798 15067565 12882254 11584147 13176527 15858382 16543745 14758506
37566 14758506 12862096 12607883 12897232 11780145 9690977 9114232 11170339 14225674
37558 14225674 16419543 17949762 19724606 21116115 20752240 18845473 17075081 16499289
$$ packed form
37617B959386L59000J183078J274023J243329Q08634j59959p26980k90046M26877
37608G077342O97314O83105K12420j510981l776950l891492o91993L011948L722675
37599E533388J853011O38848J263747J841477J108801K38515L41179P62669R76302
37590A4557937J815708L282330L250676M82358k629313k772401k56176J635405
37582A9366524J308555K06487n25023j762196l714438m135533j370252K337042
37574A1711166L053632L02767k185311j298107J592380K681855O85363j785239
37566A4758506j896410k54213K89349j117087k089168n76745K056107L055335
37558A4225674K193869J530219J774844J391509l63875j906767j770392n75792
$$ plain form
37550 16499289 17045177 18609660 20888139 22346169 21425689 19023702 17764467 18279034
37542 18279034 18239752 15980652 13102275 12189166 13675204 16460800 19945000 23480103
37534 23480103 25168979 23653997 20595537 19203871 20443560 22527849 23980640 25169346
37526 25169346 26588917 27556361 27285003 25890050 23818568 21480565 19762606 19573417
37518 19573417 20480385 21157458 21602288 23301270 26419587 28554437 27787849 25834408 26363850
37509 26363850 30582803 36009897 39629813 40980643 41825110 43791476 46988323 50461925
37501 50461925 53266603 54899151 55150236 54312694 53833711 55933354 61474693 68424393
37493 68424393 73667807 76578580 79621052 84979242 91821664 97753404 101992748 106073929
$$ packed form
37550A6499289N45888J564483K278479J458030r20480k401987j259235N14567
37542A8279034l9282k259100k878377r13109J486038K785596L484200L535103
37534B3480103J688876j514982l058460j391666J239689K084289J452791J188706
37526B5169346J419571R67444k71358j394953k071482k338003j717959j89189
37518A9573417R06968O77073M44830J698982L118317K134850p66588j953441N29442
37509B6363850M218953N427094L619916J350830Q44467J966366L196847L473602
37501E0461925K804678J632548K51085q37542m78983K099643N541339O949700
37493F8424393N243414K910773L042472N358190O842422N931740M239344M081181
$$ plain form
37485 106073929 112101622 121284156 133470062 146902793 158887023 168036579 175819289
37478 175819289 184852539 195820792 207181395 217760357 228175370 239278492 250475591
37471 250475591 260454901 268815952 276038055 282072536 285654731 285183582 280311195 272896095
37463 272896095 266152785 261966098 258607117 251764716 238606220 220749394 202895341
37456 202895341 188759622 178616955 170270473 161470092 151269527 139943883 128495388
37449 128495388 118293527 110589297 105805945 103140804 100983358 97851858 93023187 86512264
37441 86512264 78822312 70820883 63523924 57667711 53525914 51186563 50634897 51207484
37433 51207484 51317074 49479783 45810274 41988503 39455183 38075468 36989910 36280144
$$ packed form
37485A06073929O027693R182534J2185906J3432731J1984230R149556P782710
37478A75819289R033250J0968253J1360603J0578962J0415013J1103122J1197099
37471B50475591R979310Q361051P222103O034481L582195m71149m872387p415100
37463B72896095o743310m186687l358981o842401j3158496j7856826j7854053
37456B02895341j4135719j0142667q346482q800381j0200565j1325644j1448495
37449A28495388j0201861p704230m783352k665141k157446l131500m828671o510923
37441H6512264p689952q001429p296959n856213m141797k339351n51666N72587
37433E1207484J09590j837291l669509l821771k533320j379715j085558p09766
$$ plain form
37425 36280144 36815831 38329913 38757418 36512380 32959460 31247405 32403685 33889955
37417 33889955 32857266 29659640 26764979 25133911 23786406 22747467 23854368 27609704
37409 27609704 31273392 31729518 28918999 24821880 20287106 14903009 9219943 4853520
37401 4853520 2534328 1950876 3318991 7002416 11551552 14462008 15441405 16736754
37393 16736754 19413177 21512338 21110680 19108198 17366909 15964262 14276876 13130627
37385 13130627 13335390 13091092 9696771 3846470 -181117 756079 5320934 9504716
37377 9504716 10476239 8340644 5413871 4417095 6621436 11146515 15996502 19387655
37369 19387655 20074773 17777514 14213712 12249600 12539405 12425606 9959662 7209138
$$ packed form
37425C6280144N35687J514082M27505k245038l552920j712055J156280J486270
37417C3889955j032689l197626k894661j631068j347505j038939J106901L755336
37409B7609704L663688M56126k810519m097119m534774n384097n683066m366423
37401D853520k319192n83452J368115L683425M549136K910456R79397J295349
37393A6736754K676423K099161m01658k002482j741289j402647j687386j146249
37385A3130627K04763k44298l394321n850301m027587R37196M564855M183782
37377I504716R71523k135595k926773r96776K204341M525079M849987L391153
37369A9387655O87118k297259l563802j964112K89805j13799k465944k750524
$$ plain form
37361 7209138 6847953 7260094 5069650 1593889 1776661 6240235 9653932 8841412 7428790
37352 7428790 9319005 12099993 11224456 7205680 3785450 1606538 -958313 -2467190
37344 -2467190 263960 5907250 9166533 8004741 5386353 3217176 -186921 -5067391
37336 -5067391 -7852319 -6547664 -4295036 -4471914 -5760865 -5314783 -3667363 -2859305 -2236326
37327 -2236326 -72842 2328021 2062738 -741252 -3144845 -3726380 -3685407 -3959727 -3947509
37318 -3947509 -3011345 -1150368 1449645 3759491 3787481 1188672 -1263070 -1267317 -631728
37309 -631728 -2252339 -4814128 -4427635 -996303 1296518 228553 -1745627 -1943819 -870017
37300 -870017 189786 1539005 3293178 4242798 4342174 5593880 8550076 10593816 9835638
$$ packed form
37361G209138l61185M12141k190444l475761J82772M463574L413697q12520j412622
37352G428790J890215K780988q75537m018776l420230k178912k564851j508877
37344b467190K731150N643290L259283j161792k618388k169177l404097m880470
37336e067391k784928J304655K252628j76878j288951M46082J647420Q08058O22979
37327b236326K163484K400863k65283k803990k403593n81535M0973k74320J2218
37318c947509R36164J860977K600013K309846K7990k598809k451742m247O35589
37309f31728j620611k561789L86493L431332K292821j067965j974180j98192J073802
37300h70017J059803J349219J754173R49620R9376J251706K956196K043740p58178
$$ plain form
37291 9835638 8191950 8135925 8691857 7550174 5373579 4745893 5723180 5553126 2887051
37282 2887051 -107325 -415482 2340339 5468741 5823482 3107678 568149 1386693 4545124
37273 4545124 6221516 5427094 5355848 7985828 10529820 9570689 6034024 3159293 1724956
37264 1724956 506722 -314544 233679 1067415 306691 -1359597 -1769363 -909404 -106364
37255 -106364 1491476 5740437 11243262 14362378 14541622 14512889 14998586 13896029 11746611
37246 11746611 12946088 19015059 24984419 25802248 22971289 21210503 21276146 20253276
37238 20253276 17327960 14979990 14655359 14663549 12843494 9036900 4673212 1704280 1903542
37229 1903542 5404747 9779993 12030484 11605175 10320377 9537765 8764541 6942163 3788169
$$ packed form
37291I835638j643688n6025N55932j141683k176595o27686R77287j70054k666075
37282B887051k994376l08157K755821L128402L54741k715804k539529Q18544L158431
37273D545124J676392p94422p1246K629980K543992r59131l536665k874731j434337
37264A724956j218234q21266N48223Q33736p60724j666288m09766Q59959Q03040
37255a06364J597840M248961N502825L119116J79244k8733M85697j102557k149418
37246A1746611J199477O068971N969360Q17829k830959j760786O5643j022870
37238B0253276k925316k347970l24631Q190j820055l806594m363688k968932J99262
37229A903542L501205M375246K250491m25309j284798p82612p73224j822378l153994
$$ plain form
37220 3788169 -264942 -4383117 -7395310 -8365060 -7338177 -5220395 -3160209 -2309928
37212 -2309928 -3457358 -6159614 -8781722 -10111035 -10426068 -10365793 -9536547 -7229559 -3954727
37203 -3954727 -1114666 722121 2330431 4455016 6332082 5825891 1486006 -5019846
37195 -5019846 -9219362 -8074638 -3802266 -1682009 -3738005 -6545896 -6020463 -2255414
37187 -2255414 1676293 3702890 3632905 1592829 -2102341 -6007545 -8130395 -7356316 -3789611
37178 -3789611 1261491 5106766 5298050 2614929 649204 1110447 1620776 -190099 -2852440
37169 -2852440 -3703598 -3003321 -2374895 -1252943 1422406 3548515 2078009 -1861887 -4151531
37160 -4151531 -3627203 -2798742 -2805080 -2090444 -583604 -629229 -2471240 -3117305 -1580079
$$ packed form
37220C788169m053111m118175l012193r69750J026883K117782K060186Q50281
37212b309928j147430k702256k622108j329313l15033O0275Q29246K306988L274832
37203c954727K840061J836787J608310K124585J877066n06191m339885o505852
37195e019846m199516J144724M272372K120257k055996k807891N25433L765049
37187b255414L931707K026597o9985k040076l695170l905204k122850P74079L566705
37178c789611N051102L845275J91284k683121j965725M61243N10329j810875k662341
37169b852440q51158P00277O28426J121952K675349K126109j470506l939896k289644
37160d151531N24328Q28461o338P14636J506840m5625j842011o46065J537226
$$ plain form
37151 -1580079 -1233990 -4467023 -8514414 -9625617 -8572024 -8733139 -10669206 -11812311
37143 -11812311 -10452339 -7369925 -4155899 -1863933 -704694 270592 2256041 4558077
37135 4558077 4999571 3530895 3275794 6237790 10030914 11059580 9178716 6815832
37127 6815832 4968970 2651221 -672042 -4349364 -7379553 -8188049 -5027675 1155092
37119 1155092 5758333 5174298 1319849 -1189097 -1222084 -1275465 -2253487 -1940911 946494
37110 946494 4559623 6811772 7914030 8936422 9863132 10057882 9114155 6667425 2821945
37101 2821945 -974854 -3005262 -3241485 -2609716 -739384 3147324 7266955 8265526 5912017
37092 5912017 3855169 4390011 5240398 3438986 -38695 -2079570 -2261375 -3057348 -5728439
$$ packed form
37151a580079L46089l233033m047391j111203J053593j61115j936067j143105
37143a1812311J359972L082414L214026K291966J159239R75286J985449K302036
37135D558077M41494j468676k55101K961996L793124J028666j880864k362884
37127F815832j846862k317749l323263l677322l030189q08496L160374O182767
37119A155092M603241n84035l854449k508946l2987n3381r78022L12576K887405
37110I46494L613129K252149J102258J022392R26710J94750r43727k446730l845480
37101B821945l796799k030408k36223O31769J870332L886708M119631R98571k353509
37092E912017k056848N34842Q50387j801412l477681k040875j81805p95973k671091
$$ plain form
37083 -5728439 -8386692 -8415008 -5331047 -930119 2528551 4048828 4201818 3772123 2453930
37074 2453930 -192802 -2734114 -2658226 101951 2302044 1522200 -319952 419679 3942547
37065 3942547 6775040 6494597 4364319 2720564 1831081 708043 -314870 332627 3010106
37056 3010106 5940711 7072634 5970797 3597828 1300670 730477 3576889 9630339
37048 9630339 15395434 16709438 13503993 10308777 10854153 13627771 14407886 12027565
37040 12027565 9464949 9647239 12264641 14780042 14772007 11189721 5211058 274802 -556163
37031 -556163 2018320 4217445 3748904 2091761 1581200 2064060 1779549 246699 -1281436
37022 -1281436 -1669558 -1069913 -477152 -658382 -1252591 -995995 393886 926214 -1505847
$$ packed form
37083e728439k658253k8316L083961M400928L458670J520277J52990m29695j318193
37074B453930k646732k541312P5888K760177K200093p79844j842152P39631L522868
37065C942547K832493k80443k130278j643755q89483j123038j022913O47497K677479
37056C010106K930605J131923j101837k372969k297158n70193K846412O053450
37048I630339N765095J314004l205445l195216N45376K773618P80115k380321
37040A2027565k562616J82290K617402K515401q035l582286n978663m936256q30965
37031e56163K574483K199125m68541j657143n10561M82860k84511j532850j528135
37022a281436l88122N99645N92761j81230n94209K56596J389881N32328k432061
$$ plain form
37013 -1505847 -5668192 -7660932 -5598027 -1660035 1272134 2845364 3873768 4016371
37005 4016371 2779089 1155271 204841 -660435 -2019018 -2543530 -1117703 437726 -418025
36996 -418025 -2726732 -3039348 -577686 1523800 692855 -1880215 -3416430 -2832185 -810031
36987 -810031 1636630 3455096 3732594 2753765 1992527 2247192 2676512 2322638 1518642
36978 1518642 1004636 778218 919985 2553831 6373417 10515651 11592731 8457876 3896306
36969 3896306 1629949 2164125 2766527 1508773 -279375 -632297 -616036 -3069470 -7878795
36960 -7878795 -11197442 -10524176 -8336708 -8718541 -11907636 -14521496 -14286607 -12032233 -9268260
36951 -9268260 -6320588 -3302732 -754685 1575997 4888506 9141128 11891330 10555841
$$ packed form
37013a505847m162345j992740K062905L937992K932169J573230J028404J42603
37005D016371j237282j623818r50430q65276j358583n24512J425827J555429q55751
36996d18025k308707l12616K461662K101486q30945k573070j536215N84245K022154
36987h10031K446661J818466K77498r78829p61238K54665M29320l53874q03996
36978A518642n14006k26418J41767J633846L819586M142234J077080l134855m561570
36969C896306k266357N34176O02402j257754j788148l52922J6261k453434m809325
36960g878795l318647O73266K187468l81833l189095k613860K34889K254374K763973
36951i268260K947672L017856K548047K330682L312509M252622K750202j335489
$$ plain form
36943 10555841 5378865 -625088 -4475027 -5563252 -5333672 -4912576 -3502600 135474
36935 135474 4777343 6981992 5168757 1865683 362880 633158 680927 467226 1393688
36926 1393688 2541479 1033562 -3348557 -7176610 -8103114 -7683671 -8060189 -8573308 -7654505
36917 -7654505 -5833888 -4539886 -3495153 -1598195 679395 1877248 1850585 1769333 2347711
36908 2347711 3394767 4430007 4574351 2742599 -802368 -4027251 -5460229 -5823872
36900 -5823872 -6094135 -5460651 -3114113 -714517 -637945 -2498196 -3842513 -3884492 -4044645
36891 -4044645 -4871849 -5098778 -4362776 -4472923 -6750028 -9790349 -11190571 -10401629 -8760533
36882 -8760533 -7597131 -7512323 -8968830 -12140550 -15736123 -16827099 -13026270 -5346627
$$ packed form
36943A0555841n176976o003953l849939j088225K29580M21096J409976L638074
36935A35474M641869K204649j813235l303074j502803K70278M7769k13701R26462
36926A393688J147791j507917m382119l828053r26504M19443l76518n13119R18803
36917g654505J820617J294002J044733J896958K277590J197853k6663q1252N78378
36908B347711J047056J035240J44344j831752l544967l224883j432978l63643
36900e823872k70263O33484K346538K399596P6572j860251j344317m1979j60153
36891d044645q27204k26929P36002j10147k277105l040321j400222P88942J641096
36882h760533J163402Q4808j456507l171720l595573j090976L800829P679643
$$ plain form
36874 -5346627 1774130 4383444 2872104 864283 464277 436289 -535484 -1277460 -478476
36865 -478476 475005 -520985 -2836036 -4340512 -5161630 -7130275 -9725832 -9818278 -6149926
36856 -6149926 -1346027 1604699 2568935 2775861 2261883 504288 -1793631 -3165193 -2915723
36847 -2915723 -1269814 1185833 3515099 4823622 5220338 5433863 5173407 3233941 -339078
36838 -339078 -3792075 -6009989 -7589692 -8729307 -8016215 -4753008 -826379 1421356
36830 1421356 1896565 1831544 1589544 1075485 811667 533041 -1787365 -6838776 -11030095
36821 -11030095 -9923657 -4371816 68796 288970 -1055206 -480410 1305115 1555332
36813 1555332 210247 -515088 -17846 263923 72499 1119445 3911930 6069859 5277986
$$ packed form
36874e346627P120757K609314j511340k007821m00006k7988r71773p41976P98984
36865d78476R53481r95990k315051j504476q21118j968645k595557r2446L668352
36856f149926M803899K950726R64236K06926n13978j757595k297919j371562K49470
36847b915723J645909K455647K329266J308523L96716K13525k60456j939466l573019
36838c39078l452997k217914j579703j139615P13092L263207L926629K247735
36830A421356M75209o5021k42000n14059k63818k78626k320406n051411m191319
36821a1030095J106438N551841M440612K20174j344176N74796J785525K50217
36813A555332j345085p25335M97242K81769j91424J046946K792485K157929p91873
$$ plain form
36804 5277986 2536413 810289 1080594 1402106 -39711 -2358023 -3125499 -1283070 1876847
36795 1876847 4184906 4302158 2179381 -1366798 -5287628 -8844672 -11614929 -12896187
36787 -12896187 -11625940 -7630178 -2755224 221712 140039 -1651697 -3039073 -2973539 -1364884
36778 -1364884 1637731 5168632 7080518 5365750 607467 -3840500 -4920593 -2931447
36770 -2931447 -843277 -494112 -410189 1722953 5160677 6516440 4417064 1698803 1520151
36761 1520151 2953096 2643544 -255855 -3493079 -5431389 -6167132 -4889457 111341
36753 111341 7428754 12012998 11062215 7768036 6543974 6996989 5950813 3479381 2839875
36744 2839875 5160338 8102050 9764977 10314303 9465062 6102949 1468782 -644257
$$ packed form
36804E277986k741573j726124K70305L21512j441817k318312p67476J842429L159917
36795A876847K308059J17252k122777l546179l920830l557044k770257j281258
36787a2896187J270247L995762M874954K976936q1673j791736j387376O5534J608655
36778a364884L002615L530901J911886j714768m758283m447967j080093J989146
36770b931447K088170L49165Q3923K133142L437724J355763k099376k718261j78652
36761A520151J432945l09552k899399l237224j938310p35743J277675N000798
36753A11341P317413M584244r50783l294179j224062M53015j046176k471432o39506
36744B839875K320463K941712J662927N49326q49241l362113m634167k113039
$$ plain form
36736 -644257 1498935 5379323 8029005 9374555 10209257 9691454 7313252 5205501 5724152
36727 5724152 8022529 9350062 8633286 6637823 3799505 273550 -2805876 -4495512
36719 -4495512 -5686636 -7283040 -7734506 -5219660 -1569423 -620994 -2595506 -3568664 -1289699
36710 -1289699 1819042 2802690 2095106 1305268 16319 -2461647 -4438037 -4173880 -3293637
36701 -3293637 -4351855 -5908125 -3932910 1736364 6193846 5924042 3183319 2129933
36693 2129933 3405503 4897201 5449601 4764434 1332862 -5788733 -13543805 -16799991
36685 -16799991 -14338986 -10013611 -7140653 -4793910 -1225193 2035493 2339315 364218
36677 364218 -769620 -123997 289510 -656439 -1471568 -984702 -660437 -2429240 -5493650
$$ packed form
36736f44257K143192L880388K649682J345550Q34702n17803k378202k107751N18651
36727E724152K298377J327533p16776j995463k838318l525955l079426j689636
36719d495512j191124j596404m51466K514846L650237R48429j974512r73158K278965
36710a289699L108741R83648p07584p89838j288949k477966j976390K64157Q80243
36701c293637j058218j556270J975215N669274M457482k69804k740723j053386
36693B129933J275570J491698N52400o85167l431572p121595p755072l256186
36685a6799991K461005M325375K872958K346743L568717L260686L03822j975097
36677C64218j133838O45623M13507r45949q15129M86866L24265j768803l064410
$$ plain form
36668 -5493650 -6751668 -3974353 2077092 8090384 10373215 7601203 2258879 -1241162
36660 -1241162 -617575 2375789 4323502 3709787 1709868 294871 375582 1411620 2153595
36651 2153595 1852312 923573 134929 -667546 -2060163 -3178809 -1805094 2700139 7526077
36642 7526077 8808170 5671455 997660 -1686934 -1415943 -36450 145991 -1094880
36634 -1094880 -1690050 113864 3212874 4712660 3540574 1584698 806410 900504 860877
36625 860877 1174944 2668038 4297985 4181918 2350399 649106 197346 674389 1860426
36616 1860426 3961721 6286084 7378321 6863922 5758597 4788821 3909511 3593830 4758299
36607 4758299 6845176 7685674 6131950 3475526 1488633 400903 -312590 -403472 836133
$$ packed form
36668e493650j258018K777315O051445O013292K282831k772012n342324l500041
36660a241162O23587K993364J947713o13715j999919j414997Q0711J036038P41975
36651B153595l01283r28739p88644q02475j392617j118646J373715M505233M825938
36642G526077J282093l136715m673795k684594K70991J379493J82441j240871
36634a094880n95170J803914L099010J499786j172086j955876p78288R4094l9627
36625H60877L14067J493094J629947j16067j831519j701293m51760M77043J186037
36616A860426K101295K324363J092237n14399j105325r69776q79310l15681J164469
36607D758299K086877Q40498j553724k656424j986893j087730p13493r0882J239605
$$ plain form
36598 836133 3611724 7688663 12416036 16127066 16906560 14935765 12833411 12591836 13397946
36589 13397946 13653082 13702351 14768441 16233867 16147039 14059007 11354145 8787750 5637063
36580 5637063 1719020 -1478193 -2614572 -2375336 -2541828 -3637703 -4188990 -2270032 2364358
36571 2364358 7533466 10149885 8925343 5589035 3115417 2811346 3369701 2527692 -641424
36562 -641424 -4721289 -6868200 -5181381 -624158 3781115 5894581 5901012 4696189 2344655
36553 2344655 -855351 -3274897 -3683666 -3060679 -2733486 -1697060 1572209 5087462 4449323
36544 4449323 -1247444 -7627372 -10658223 -11320563 -12488571 -13664441 -12158579 -8228272
36536 -8228272 -5271159 -4710768 -4016205 -999088 2566672 3496373 1626195 -422316 -1006889
$$ packed form
36598H36133K775591M076939M727373L711030P79494j970795k102354k41575Q06110
36589A3397946K55136M9269J066090J465426q6828k088032k704862k566395l150687
36580E637063l918043l197213j136379K39236j66492j095875n51287J918958M634390
36571B364358N169108K616419j224542l336308k473618l04071N58355q42009l169116
36562f41424m079865k146911J686819M557223M405273K113466O431j204823k351534
36553B344655l200006k419546m08769O22987L27193J036426L269269L515253o38139
36544D449323n696767o379928l030851o62340j168008j175870J505862L930307
36536h228272K957113N60391O94563L017117L565760R29701j870178k048511n84573
$$ plain form
36527 -1006889 -934579 -1405596 -2369085 -3302078 -4171857 -4946976 -5203475 -4954891 -4971887 -5370137
36517 -5370137 -4708768 -1861331 1574825 2402327 -231111 -3447977 -4120930 -2631892 -1880245
36508 -1880245 -3318791 -5687512 -7546359 -9098148 -10630123 -10717963 -7770163 -3023427
36500 -3023427 -327186 -2243752 -7101070 -10627944 -10245197 -7154255 -4286385 -2970091
36492 -2970091 -2167280 -599522 1325556 2066190 785377 -1967096 -4970190 -6906941
36484 -6906941 -6508534 -3428240 488210 1876579 -974603 -5842896 -8503190 -7069703
36476 -7069703 -3569980 -1079705 -551885 -1346671 -3643555 -8203347 -13648348 -16241363
36468 -16241363 -13899176 -9186446 -6503960 -6942965 -7918429 -7661296 -7587979 -9385941 -11956104
$$ packed form
36527a006889P2310m71017r63489r32993q69779p75119k56499K48584j6996l98250
36517e370137O61369K847437L436156Q27502k633438l216866o72953J489038P51647
36508a880245j438546k368721j858847j551789j531975q7840K947800M746736
36500c023427K696241j916566m857318l526874L82747L090942K867870J316294
36492b970091Q02811J567758J925078P40634j280813k752473l003094j936751
36484f906941L98407L080294L916450J388369k851182m868293k660294J433487
36476g069703L499723K490275N27820p94786k296884m559792n445001k593015
36468a6241363K342187M712730K682486m39005r75464K57133P3317j797962k570163
$$ plain form
36459 -11956104 -12907738 -11665481 -9372908 -6839760 -4494809 -3494242 -4558531 -5897978
36451 -5897978 -4553009 -192164 4266527 6264520 6042057 4925935 3192953 842499
36443 842499 -1166055 -2093960 -2795453 -4266328 -5467581 -4267235 -462343 3439135 4588173
36434 4588173 2113226 -2740056 -7683836 -10497718 -10195867 -7773776 -5356649 -4125948
36426 -4125948 -3311602 -1596463 669123 1282560 -1308707 -5563096 -7802296 -6126870
36418 -6126870 -2670634 -994814 -1689659 -1940084 470846 4252934 6434036 5939074 4292604
36409 4292604 3408793 3730989 4361757 4280505 3372443 2465540 2207297 2080736 1203627 -40312
36399 -40312 -293587 722321 1851353 2660765 4276167 6995595 8711088 7462255 4437516
$$ packed form
36459a1956104r51634J242257K292573K533148K344951J000567j064289j339447
36451e897978J344969M360845M458691J997993k22463j116122j732982k350454
36443H42499k008554r27905p01493j470875j201253J200346L804892L901478J149038
36434D588173k474947m853282m943780k813882L01851K422091K417127J230701
36426d125948Q14346J715139K265586O13437k591267m254389k239200J675426
36418f126870L456236J675820o94845k50425K410930L782088K181102m94962j646470
36409D292604q83811L22196O30768q1252r08062r06903k58243j26561q77109j243939
36399d0312k53275J015908J129032Q09412J615402K719428J715493j248833l024739
$$ plain form
36390 4437516 2416043 1904779 1020810 -1003048 -2580860 -2581735 -2252241 -3121621 -4504834
36381 -4504834 -4675855 -3737904 -3628603 -5219215 -6821525 -6357328 -4239414 -2904091 -3442671
36372 -3442671 -3929224 -1947591 2076311 5411585 6494402 6259109 6000922 5770650 5460517
36363 5460517 5626087 6154268 5748774 4057675 2806097 3304649 4328330 4317489 4266089
36354 4266089 6057452 8865339 9785509 7714621 4329476 1500512 9025 548503
36346 548503 3373250 6671900 7674805 5878595 3148939 497142 -2735823 -6060736
36338 -6060736 -7107343 -5035347 -2301303 -1378062 -1579687 -855188 751528 1251455 -460547
36329 -460547 -3217873 -4581208 -2793754 1366394 4584494 4240639 1621217 -2074
$$ packed form
36390D437516k021473n11264q83969k023858j577812q75L29494q69380j383213
36381d504834j71021R37951J09301j590612j602310M64197K117914J335323n38580
36372c442671m86553J981633M023902L335274J082817k35293k58187k30272l10133
36363E460517J65570N28181m05494j691099j251578M98552J023681j0841n1400
36354D266089J791363K807887R20170k070888l385145k828964j491487N39478
36346E48503K824747L298650J002905j796210k729656k651797l232965l324913
36338f060736j046607K071996K734044R23241k01625P24499J606716M99927j712002
36329d60547k757326j363335J787454M160148L218100l43855k619422j623291
$$ plain form
36321 -2074 -396054 -2577404 -7301812 -10708683 -9443703 -5371795 -2714698 -2677340 -3508514
36312 -3508514 -4033688 -4340232 -4323501 -4108654 -4612962 -5331443 -3361628 2322026 7335982
36303 7335982 6576653 1627266 -779860 2071837 5353408 3565584 -2461127 -7366942
36295 -7366942 -7762906 -5018885 -2859932 -3516262 -5579254 -5363005 -1284976 3574897 4986269
36286 4986269 3091148 1964874 3860090 6898694 8903776 10129064 10819617 9356363
36278 9356363 5211460 1251123 291767 1038475 297660 -1807109 -1721120 2565857 8704990
36269 8704990 12493240 11811407 8052103 4744957 4556746 6670237 7565350 5296049 2057411
36260 2057411 1077490 1983330 1510789 -1496837 -4361773 -4442253 -2467324 -775039 -62900
$$ packed form
36321b074l93980k181350m724408l406871J264980M071908K657097L7358q31174
36312c508514n25174l06544J6731K14847n04308p18481J969815N683654N013956
36303G335982p59329m949387k407126K851697L281571j787824o026711m905815
36295g366942l95964K744021K158953o56330k062992K16249M078029M859873J411372
36286D986269j895121j126274J895216L038604K005082J225288O90553j463254
36278I356363m144903l960337r59356P46708p40815k104769Q5989M286977O139133
36269H704990L788250o81833l759304l307146j88211K113491Q95113k269301l238638
36260B057411r79921R05840m72541l007626k864936q0480J974929J692285P12139
$$ plain form
36251 -62900 349904 285443 -1089925 -3229945 -4491622 -4665642 -5203174 -6180635 -5155989
36242 -5155989 -833899 3685493 4001995 400876 -2046991 -52375 3704749 4398416
36234 4398416 1124419 -2731436 -3833972 -1621691 2343244 5661353 6234584 4042111
36226 4042111 1594205 1161046 2065111 2181358 1130745 -101527 -1759204 -4740712 -7846383
36217 -7846383 -8663376 -7373670 -6639257 -7190428 -6710491 -4112925 -1719410 -1552152 -2346566
36208 -2346566 -2223019 -1706429 -1831355 -1616368 27670 1899900 2681009 3652569 6321439
36199 6321439 8918109 8581977 6035372 4628866 5099304 4678286 1739664 -1714888 -3112055
36190 -3112055 -2515952 -1760557 -1993288 -2800184 -2612348 104611 4739838 7904048 6713465
$$ packed form
36251f2900M12804o4461j375368k140020j261677j74020n37532r77461J024646
36242e155989M322090M519392L16502l601119k447867J994616L757124O93667
36234D398416l273997l855855j102536K212281L964935L318109N73231k192473
36226D042111k447906m33159R04065J16247j050613j232272j657677k981508l105671
36217g846383q16993J289706P34413n51171M79937K597566K393515J67258p94414
36208b346566J23547N16590j24926K14987J644038J872230P81109R71560K668870
36199F321439K596670l36132k546605j406506M70438m21018k938622l454552j397167
36190c112055N96103P55395k32731q06896J87836K716959M635227L164210j190583
$$ plain form
36181 6713465 2553830 -434654 -512512 401131 759817 1718587 4231851 6464154 6175147
36172 6175147 4031791 2448195 2189311 2198023 2257338 3719215 7213702 11014272 12410896
36163 12410896 10237193 5746678 1363763 -1145933 -1505393 -491835 840605 1600226
36155 1600226 1460629 1048157 1356722 2260245 2269031 530211 -1599399 -2039293 -552135
36146 -552135 1332143 2493479 2916159 2521838 1048353 -695647 -1104161 80631 1192891
36137 1192891 877107 -241049 -837274 -770216 -714879 -656711 157650 1942006 3784881
36128 3784881 4423661 3334513 1126381 -935971 -1774165 -971587 1221416 3845882 5422328
36119 5422328 5209997 4489343 5377779 7868509 9484751 8693668 6870300 5405968 2856681
$$ packed form
36181F713465m159635k988484p7858R13643L58686R58770K513264K232303k89007
36172F175147k143356j583596k58884Q712N9315J461877L494487L800570J396624
36163A2410896k173703m490515m382915k509696l59460J013558J332440P59621
36155A600226j39597m12472L08565R03523Q786j738820k129610m39894J487158
36146e52135J884278J161336M22680l94321j473485j744000m08514J184792J112260
36137A192891l15784j118156n96225O7058N5337N8168Q14361J784356J842875
36128C784881O38780j089148k208132k062352q38194Q02578K193003K624466J576446
36119E422328k12331p20654Q88436K490730J616242p91083j823368j464332k549287
$$ plain form
36110 2856681 -2493116 -8602229 -11349669 -9812144 -6921571 -4980325 -3559097 -2126388
36102 -2126388 -1581963 -2163179 -2518414 -2067895 -2012997 -2940473 -3635277 -3290267 -2708889 -2421582
36092 -2421582 -1984290 -1989208 -3957585 -7074332 -8149858 -6454162 -5280971 -6539249 -7275324
36083 -7275324 -4588445 -739414 448265 -452339 -417901 420237 76195 38743 3722241
36074 3722241 9937162 13411928 12396766 10443880 9453286 6572108 609369 -3702107
36066 -3702107 -2085589 2325787 3244802 237046 -1467301 707592 3408344 3018690
36058 3018690 477176 -1348210 -2101397 -3297045 -4942959 -5435492 -4447918 -3754923 -4698889
36049 -4698889 -6335214 -6953457 -6405305 -5733479 -5041684 -3223766 -18911 2888684 3395889
$$ packed form
36110B856681n349797o109113k747440J537525K890573J941246J421228J432709
36102b126388N44425n81216l55235M50519N4898r27476o94804L45010N81378K87307
36092b421582M37292m918j968377l116747j075526J695696J173191j258278p36075
36083g275324K686879L849031J187679r00604L4438Q38138l44042l7452L683498
36074C722241O214921L474766j015162j952886r90594k881178n962739m311476
36066c702107J616518M411376R19015l007756j704347K174893K700752l89654
36058C018690k541514j825386p53187j195648j645914m92533R87574O92995r43966
36049d698889j636325o18243N48152O71826O91795J817918L204855K907595N07205
$$ plain form
36040 3395889 824282 -4016056 -9455593 -13182143 -13314477 -10432211 -7479106 -6528603
36032 -6528603 -6778247 -6871158 -7432002 -9140214 -9817670 -6623666 -766124 3155074 2907329
36023 2907329 943430 393342 1571311 3453856 5792013 8142301 9205256 8963673
36015 8963673 9375446 11029378 11224208 7739143 2689095 -167173 -635393 -1552629 -3801587
36006 -3801587 -5089107 -3769686 -946414 1833119 4371553 6347826 6365680 3940824
35998 3940824 812577 -1196026 -2451234 -4280072 -6439236 -7321887 -6243953 -4184055
35990 -4184055 -2266712 -498681 1720214 4273721 5764144 4516517 666006 -2922126
35982 -2922126 -3002253 275016 3160234 2867608 1061547 1022800 2300912 1002743 -4188148
$$ packed form
36040C395889k571607m840338n439537l726550j32334K882266K953105R50503
36032f528603k49644r2911n60844j708212o77456L194004N857542L921198k47745
36023B907329j963899n50088J177969J882545K338157K350288J062955k41583
36015H963673M11773J653932J94830l485065n050048k856268m68220r17236k248958
36006c801587j287520J319421K823272K779533K538434J976273J7854k424856
35998C940824l128247k008603j255208j828838k159164q82651J077934K059898
35990d184055J917343J768031K218895K553507J490423j247627l850511l588132
35982b922126q0127L277269K885218k92626j806061l8747J278112j298169n190891
$$ plain form
35973 -4188148 -9182609 -9493143 -5961642 -2942239 -2179065 -1807785 -1133833 -2497212 -6855881
35964 -6855881 -10734184 -10367468 -6978558 -4860709 -5231145 -5247065 -3022667 -380675 312248
35955 312248 -593636 -1375642 -1519930 -1307456 -363719 1562240 3358666 3805547 3457281
35946 3457281 3742713 4614269 4574784 2905109 584469 -1037468 -1452177 -845728 333749
35937 333749 1553746 2665204 4220881 6641411 9023641 9475110 6952053 2539432
35929 2539432 -1228526 -2471450 -1804917 -2047878 -5360126 -10550219 -14184741 -14544048 -13029025
35920 -13029025 -11108601 -7973710 -2975273 1424525 2004592 -555675 -2302696 -1431281
35912 -1431281 -266932 -1114210 -2849381 -3096837 -1558146 665071 3255582 5996568
$$ packed form
35973d188148m994461l10534L531501L019403P63174L71280O73952j363379m358669
35964f855881l878303L66716L388910K117849l70436j5920K224398K641992O92923
35955C12248r05884p82006j44288K12474R43737J925959J796426M46881l48266
35946C457281K85432Q71556l9485j669675k320640j621937m14709O06449J179477
35937C33749J219997J111458J555677K420530K382230M51469k523057m412621
35929B539432l767958j242924O66533k42961l312248n190093l634522l59307J515023
35920a3029025J920424L134891M998437M399798N80067k560267j747021Q71415
35912a431281J164349q47278j735171k47456J538691K223217K590511K740986
$$ plain form
35904 5996568 7149916 4947041 340831 -3644362 -5162357 -4659664 -3199295 -1464846
35896 -1464846 -225750 126614 683020 2880550 5902003 6888634 4303004 -353339 -4549909
35887 -4549909 -6827957 -6551724 -3751654 -295363 845446 -930732 -2823622 -2638596
35879 -2638596 -1850679 -2565551 -3561118 -2525394 -685885 -1235949 -3716774 -4268427 -1870893
35870 -1870893 38706 -586852 -1396386 -746312 -1461532 -5826273 -10238684 -9451186 -4072387
35861 -4072387 783490 3029085 4988774 7707541 8762804 6499513 2363724 -1962697
35853 -1962697 -6065783 -8541654 -7256419 -3481895 -2007134 -4952489 -8716709 -9281105
35845 -9281105 -7291327 -5320114 -3435915 -897155 586162 -639475 -2289599 -888544
$$ packed form
35904E996568J153348k202875m606210l985193j517995N02693J460369J734449
35896a464846J239096L52364N56406K197530L021453R86631k585630m656343m196570
35887d549909k278048K76233K800070L456291J140809j776178j892890J85026
35879b638596P87917p14872r95567J035724J839509n50064k480825n51653K397534
35870a870893J909599o25558q09534O50074p15220m364741m412411P87498N378799
35861d072387M855877K245595J959689K718767J055263k263291m135789m326421
35853a962697m103086k475871J285235L774524J474761k945355l764220n64396
35845i281105J989778J971213J884199K538760J483317j225637j650124J401055
$$ plain form
35837 -888544 2752319 4711913 3825732 2472233 1891803 746872 -1277318 -2099316 -417310
35828 -417310 2576229 5317272 7091081 6878785 4105023 1110624 1479583 4731574 6014097
35819 6014097 2759227 -1549294 -2472905 -526623 897674 1150674 2359861 5087449
35811 5087449 7413539 8186674 8429222 9251216 10467195 11528534 12048794 11220425 8439384
35802 8439384 4860139 2721067 2521492 2213191 -10314 -3145339 -4539796 -3042927
35794 -3042927 -72415 2268061 3200857 3027003 1643447 -1382742 -4887918 -5647876 -1543498
35785 -1543498 5091211 9170409 8481859 6053597 5998330 8467480 10182382 8934143 5739519
35776 5739519 2865585 1449713 1380395 2246604 3701711 5384644 6892081 7739264 7453362
$$ packed form
35837h88544L640863J959594q86181j353499n80430j144931k024190q21998J682006
35828d17310K993539K741043J773809k12296k773762k994399L68959L251991J282523
35819F014097l254870m308521r23611J946282J424297K53000J209187K727588
35811E087449K326090P73135K42548Q21994J215979J061339N20260q28369k781041
35802H439384l579245k139072j99575l08301k223505l135025j394457J496869
35794c042927K970512K340476R32796j73854j383556l026189l505176p59958M104378
35785a543498O634709M079198o88550k428262n5267K469150J714902j248239l194624
35776E739519k873934j415872o9318Q66209J455107J682933J507437Q47183k85902
$$ plain form
35767 7453362 5903346 3273619 -455694 -5399075 -10684972 -14233813 -14597459 -12734946
35759 -12734946 -10998769 -10362607 -9503123 -6849091 -2850662 308499 1063000 62571
35751 62571 -809850 -724740 -517213 -883287 -1080881 -406420 41289 -1180237 -3159899 -3617429
35741 -3617429 -2617626 -2733248 -4794502 -6253092 -5339394 -4159074 -5165424 -6719001 -5383822
35732 -5383822 -1379083 1708500 2231185 2151515 3168365 4313120 4323672 3814315 3816359
35723 3816359 4094942 4082975 3944061 3750670 2959152 1458187 -64469 -1169891 -1719322
35714 -1719322 -896609 1833529 4675909 4962109 3247573 3091903 5598459 7254537 5134085
35705 5134085 1240282 -1050711 -2192411 -4649167 -7934945 -9507540 -9427632 -9876772 -10436901
$$ packed form
35767G453362j550016k629727l729313m943381n285897l548841l63646J862513
35759a2734946J736177O36162Q59484K654032L998429L159161P54501j000429
35751F2571q72421Q5110K07527l66074j97594O74461M47709j221526j979662m57530
35741c617429R99803j15622k061254j458590R13698J180320j006350j553577J335179
35732e383822M004739L087583N22685p9670J016850J144755J0552n09357K044
35723C816359K78583j1967j38914j93391p91518j500965j522656j105422n49431
35714a719322Q22713K730138K842380K86200j714536j55670K506556J656078k120452
35705E134085l893803k290993j141700k456756l285778j572595P9908m49140n60129
$$ plain form
35696 -10436901 -8227893 -3236474 702928 1502464 1507476 2737931 3125996 305714 -3707262
35687 -3707262 -4988800 -3109252 -897335 -20953 93756 -233784 -1200779 -1350162 1686219
35678 1686219 7473473 12227066 12977756 10482959 7287835 4802855 3247805 2614305
35670 2614305 2270561 1003744 -1089720 -1865611 219671 3584289 5219766 4386451 3098935
35661 3098935 3220206 4569855 5922402 6471752 5937104 4281291 1846847 -801117 -3373090
35652 -3373090 -5715852 -7313534 -7722742 -7454455 -7477979 -7745542 -7229950 -5715932 -4509347
35643 -4509347 -4816990 -6261067 -7525777 -7623068 -6006701 -2626935 1034436 2050809 -1039400
35634 -1039400 -5642439 -7202070 -4348839 -617160 -326988 -3858664 -7954010 -9753791
$$ packed form
35696a0436901K209008M991419L939402P99536N012J230455L88065k820282m012976
35687c707262j281538J879548K211917Q76382J14709l27540r66995j49383L036381
35678A686219N787254M753593P50690k494797l195124k484980j555050o33500
35670B614305l43744j266817k093464p75891K085282L364618J635477q33315j287516
35661C098935J21271J349649J352547N49350n34648j655813k434444k647964k571973
35652c373090k342762j597682m09208K68287k3524k67563N15592J514018J206585
35643d509347l07643j444077j264710r7291J616367L379766L661371J016373l090209
35634a039400m603039j559631K853231L731679K90172l531676m095346j799781
$$ plain form
35626 -9753791 -9064464 -6906327 -3571129 951051 5516847 8124607 7822037 5584394
35618 5584394 3003494 655923 -1795204 -4338547 -6216141 -6810751 -6318403 -5277514
35610 -5277514 -3844069 -1910622 213180 1562695 1084185 -1434871 -4808920 -6960024
35602 -6960024 -6446139 -3678439 -381144 2185036 4065393 5602410 6189976 4593716
35594 4593716 466794 -4655551 -7891914 -6890835 -1943314 3586546 5756250 3626516
35586 3626516 -13195 -1901803 -1724693 -1665629 -3115424 -4822435 -4311486 -531786 4835089
35577 4835089 8301034 7256903 2513685 -2139936 -3723021 -3015934 -2742662 -3441295 -3048482
35568 -3048482 -732454 1141233 209252 -2401686 -3714715 -3055539 -2351168 -2571106 -2307188
$$ packed form
35626i753791O89327K158137L335198M522180M565796K607760l02570k237643
35618E584394k580900k347571k451127k543343j877594n94610M92348J040889
35610e277514J433445J933447K123802J349515m78510k519056l374049k151104
35602f960024N13885K767700L297295K566180J880357J537017N87566j596260
35594D593716m126922n122345l236363J001079M947521N529860K169704k129734
35586C626516l639711j888608J77110N9064j449795j707011N10949L779700N366875
35577D835089L465945j044131m743218m653621j583085P07087K73272o98633L92813
35568c048482K316028J873687r31981k610938j313029O59176P04371k19938K63918
$$ plain form
35559 -2307188 -605816 890909 159353 -2168798 -3737908 -3712207 -3234741 -2878244 -1665139
35550 -1665139 794263 2882089 2853822 1159926 -173293 193675 2097279 4476358 5796344
35541 5796344 4748715 1793446 -767754 -1636441 -2496195 -5292124 -8529896 -9063704 -7201631
35532 -7201631 -6554987 -8125660 -8312484 -4778843 -812607 -631398 -3008617 -3636085 -2234962
35523 -2234962 -2689673 -6287312 -9326663 -8569370 -5358784 -2637581 -993207 190643
35515 190643 176579 -1905880 -4743159 -6104969 -5726877 -5247341 -5867581 -7307300 -8402014
35506 -8402014 -7837243 -5256929 -2375978 -1549703 -2346466 -1499992 2233890 5373328 4308766
35497 4308766 842612 -26119 3073892 6652934 7791168 7389679 7291939 7275613 6481393
$$ packed form
35559b307188J701372J496725p31556k328151j569110K5701M77466L56497J213105
35550a665139K459402K087826k8267j693896j333219L66968J903604K379079J319986
35541E796344j047629k955269k561200q68687q59754k795929l237772n33808J862073
35532g201631O46644j570673j86824L533641L966236J81209k377219o27468J401123
35523b234962m54711l597639l039351P57293L210586K721203J644374J183850
35515A90643j4064k082459k837279j361810L78092M79536o20240j439719j094714
35506h402014N64771K580314K880951Q26275p96763Q46474L733882L139438j064562
35497D308766l466154q68731L100011L579042J138234m01489r7740j6326p94220
$$ plain form
35488 6481393 5581882 5658344 6210838 5822833 4098997 2028150 1052243 2123826 4687229
35479 4687229 6433595 5523776 3342343 3201682 5669854 7275023 5051172 402312
35471 402312 -3079738 -3730159 -1914895 1905938 6512450 8856282 6984317 3461687
35463 3461687 2664129 4795002 5873594 3837661 866925 -1429195 -5010510 -10963140
35455 -10963140 -15497721 -14348031 -9294360 -6100646 -6569881 -6750484 -3494387 1023945
35447 1023945 2885785 1569732 -529144 -1607812 -1341209 168431 2033322 2097701 -956437
35438 -956437 -5301283 -7511242 -6281326 -3235077 -464069 1097078 1181617 98177 -601841
35429 -601841 786843 3680860 5290170 3808125 216030 -3643467 -7114837 -9758377
$$ packed form
35488F481393q99511P6462N52494l88005j723836k070847r75907J071583K563403
35479D687229J746366r09819k181433j40661K468172J605169k223851m648860
35471D02312l482050o50421J815264L820833M606512K343832j871965l522630
35463C461687p97558K130873J078592k035933k970736k296120l581315n952630
35455a0963140m534581J149690N053671L193714m69235j80603L256097M518332
35447A023945J861840j316053k098876j078668K66603J509640J864891O4379l054138
35438i56437m344846k209959J229916L046249K771008J561147Q4539j083440p00018
35429f01841J388684K894017J609310j482045l592095l859497l471370k643540
$$ plain form
35421 -9758377 -10059201 -7197960 -3383166 -2144137 -3931181 -5106673 -2233977 3595082
35413 3595082 7771399 7233644 3651661 1284408 2170862 4171663 3992142 1403473 -594184
35404 -594184 220304 2404001 2810887 638132 -1735350 -1860324 -44168 1332510 558399
35395 558399 -1990378 -4785161 -6723694 -7676199 -8105686 -8658259 -9802034 -11163520 -11312306
35386 -11312306 -9201431 -6193520 -5490331 -8420406 -12050424 -12010403 -7465347 -1719723
35378 -1719723 2139324 4370015 6748945 9429424 11021261 10775982 9294265 7522369
35370 7522369 6038087 4917689 3569384 1249808 -1601335 -3308082 -3000482 -1825810
35362 -1825810 -1216051 -968101 -251887 499776 281159 -733724 -1906817 -3882687 -7422033
$$ packed form
35421i758377l00824K861241L814794J239029j787044j175492K872696N829059
35413C595082M176317n37755l581983k367253Q86454K000801j79521k588669j997657
35404e94184Q14488K183697M06886k172755k373482j24974J816156J376678p74111
35395E58399k548777k794783j938533r52505m29487n52573j143775j361486j48786
35386a1312306K110875L007911P03189k930075l630018M0021M545056N745624
35378a719723L859047K230691K378930K680479J591837k45279j481717j771896
35370G522369j484282j120398j348305k319576k851143j706747L07600J174672
35362a825810O09759K47950P16214P51663k18617j014883j173093j975870l539346
$$ plain form
35353 -7422033 -10809792 -11003659 -7855840 -4765871 -4036389 -3796888 -1396977 1761019 1395778
35344 1395778 -3802125 -9727366 -11217107 -7644906 -2971853 -764671 -705305 -519449 178745
35335 178745 -171589 -1753519 -2421477 -953835 886255 1263772 1506645 3973235 7719929
35326 7719929 9186173 7113694 4089021 2741266 2844583 2941778 2547195 1669163 203322
35317 203322 -940849 26759 3105270 5623483 5524161 4003779 3319428 3509486 3192659
35308 3192659 2305789 1815245 1532167 471181 -1008830 -1518120 -946282 -531647 -672947
35299 -672947 -645648 -693723 -2303156 -5541107 -7812136 -6581440 -2455644 1565677 3412535
35290 3412535 3560410 3534809 3713249 3011237 495866 -3072749 -5480893 -4747601 -561190
$$ packed form
35353g422033l387759j93867L147819L089969P29482K39501K399911L157996l65241
35344A395778n197903n925241j489741L572201M673053K207182N9366J85856O98194
35335A78745l50334j581930o67958J467642J840090L77517K42873K466590L746694
35326G719929J466244k072479l024673j347755J03317R7195l94583q78032j465841
35317B03322j144171R67608L078511K518213r9322j520382o84351J90058l16827
35308C192659q86870m90544k83078j060986j480011n09290N71838M14635j41300
35299f72947K7299m8075j609433l237951k271029J230696M125796M021321J846858
35290C412535J47875k5601J78440p02012k515371l568615k408144P33292M186411
$$ plain form
35281 -561190 5471915 10535072 12154541 10208369 7310283 6016358 5710937 3809737
35273 3809737 124252 -2234098 -1278557 842247 1132534 148086 595901 2777997 4261693
35264 4261693 3636873 1927542 270528 -1293039 -2365698 -1883671 -13768 1482190
35256 1482190 1504408 741610 102054 -442031 -1078471 -1769414 -2834242 -4183046 -3948204
35247 -3948204 -214424 5439320 8740134 8092561 6630137 7542156 9925488 11166813
35239 11166813 10945618 10295716 8745255 5520283 2321860 1677858 3066562 3581031 2148455
35230 2148455 315639 -909701 -1935912 -2149267 67212 3865032 5541736 3339438
35222 3339438 191292 -285339 1526369 2808781 2823030 3084954 3967081 4084272 3113033
$$ packed form
35281e61190O033105N063157J619469j946172k898086j293925l05421j901200
35273C809737l685485k358350R55541K120804K90287r84448M47815K182096J483696
35264D261693o24820j709331j657014j563567j072659M82027J869903J495958
35256A482190K2218p62798o39556n44085o36440o90943j064828j348804K34842
35247c948204L733780N653744L300814o47573j462424R12019K383332J241325
35239A1166813k21195o49902j550461l224972l198423o44002J388704N14469j432576
35230B148455j832816j225340j026211k13355K216479L797820J676704k202298
35222C339438l148146m76631J811708J282412J4249K61924Q82127J17191r71239
$$ plain form
35213 3113033 2596580 3207566 3348477 1681371 -550997 -1274057 -692039 -964072 -2996303
35204 -2996303 -5060199 -5010128 -2871348 -578527 324614 121392 347600 2316558 6037112
35195 6037112 10005123 12019357 10766011 6988032 3005825 940216 1300985 2924652
35187 2924652 3918868 3084881 1233299 889165 3504803 6827279 6631582 1977777 -2841289
35178 -2841289 -3332354 -594559 416244 -1987091 -3931015 -1752978 2865150 5742037
35170 5742037 6034326 6151942 6882468 6221934 3587606 1945042 3948283 8126308 11002027
35161 11002027 11505816 10999902 9998968 7692005 4631676 3025807 3371221 3126446 333996
35152 333996 -3195268 -4345936 -3194819 -2672385 -4086577 -5424762 -4639302 -2521427 -1099305
$$ packed form
35213C113033n16453O10986J40911j667106k232368p23060N82018k72033k032231
35204b996303k063896N0071K138780K292821R03141k03222K26208J968958L720554
35195F037112L968011K014234j253346l777979l982207k065609L60769J623667
35187B924652R94216q33987j851582l44134K615638L322476j95697m653805m819066
35178b841289m91065K737795J010803k403335j943924K178037M618128K876887
35170E742037K92289J17616P30526o60534k634328j642564K003241M178025K875719
35161A1002027N03789n05914j000934k306963l060329j605869L45414k44775k792450
35152C33996l529264j150668J151117N22434j414192j338185P85460K117875J422122
$$ plain form
35143 -1099305 -656781 106932 1719520 3254328 3836010 3673066 3522081 3935354 5090692
35134 5090692 6710581 8113968 8840052 9069589 8902413 7601656 4466678 258912 -3316716
35125 -3316716 -5520661 -6757243 -6810895 -4679768 -1043267 837567 -1471320 -6143534
35117 -6143534 -9053883 -8806183 -7646264 -7225176 -5982496 -2067820 3168415 6783154
35109 6783154 8259084 9482115 10930717 10401413 6371175 708284 -3383132 -4975335
35101 -4975335 -5545711 -6258185 -6736728 -6460216 -5971654 -6218883 -7412950 -8858581 -9475038
35092 -9475038 -8480501 -6176223 -4094094 -3638053 -4359205 -4289087 -2410638 -243061 -366189
35083 -366189 -3515455 -7504298 -9040766 -6654685 -2139323 870296 136784 -3240538
$$ packed form
35143a099305M42524P63713J612588J534808N81682j62944j50985M13273J155338
35134E090692J619889J403387P26084K29537j67176j300757l134978m207766l575628
35125c316716k203945j236582n3652K131127L636501J880834k308887m672214
35117f143534k910349K47700J159919M21088J242680L914676N236235L614739
35109F783154J475930J223031J448602n29304m030238n662891m091416j592203
35101d975335n70376p12474m78543K76512M88562k47229j194067j445631o16457
35092i475038R94537K304278K082129M56041p21152P0118J878449K167577j23128
35083c66189l149266l988843j536468K386081M515362L009619p33512l377322
$$ plain form
35075 -3240538 -6372353 -7823887 -8588677 -9935983 -11489045 -11965581 -10744636 -7839439
35067 -7839439 -3331077 1850531 5299332 5069623 2294345 299986 718900 1926441
35059 1926441 1993566 1684552 3164957 6639343 9877940 10873154 9585728 6961611 3556732
35050 3556732 -227617 -3418015 -4875225 -4312955 -2557896 -912036 -322636 -824174 -1639655
35041 -1639655 -2154679 -2821463 -4539203 -7016405 -8613313 -8413824 -7662732 -8072486 -9143543
35032 -9143543 -8600528 -5702318 -2710091 -2197621 -3925867 -5670309 -6567755 -7908987 -10317531
35023 -10317531 -11892324 -10538492 -7167400 -4643308 -3586270 -1382756 3516630 8205761
35015 8205761 8592372 5323139 3536958 6053932 9536631 9238898 5395157 2104469
$$ packed form
35075c240538l131815j451534p64790j347306j553062m76536J220945K905197
35067g839439M508362N181608L448801k29709k775278j994359M18914J207541
35059A926441O7125l09014J480405L474386L238597R95214j287426k624117l404879
35050C556732l784349l190398j457210N62270J755059J645860N89400n01538q15481
35041a639655n15024o66784j717740k477202j596908J99489P51092m09754j071057
35032i143543N43015K898210K992227N12470j728246j744442q97446j341232k408544
35023a0317531j574793J353832L371092K524092J057038K203514M899386M689131
35015H205761L86611l269233j786181K516974L482699k97733l843741l290688
$$ plain form
35007 2104469 1109359 158620 -2303543 -4245366 -3326273 -550156 1329664 1353977 384418
34998 384418 -988014 -2461445 -3044618 -2312323 -1876242 -3229723 -4627396 -2808083 2070472
34989 2070472 5982081 6321896 5163914 5884337 8562760 10468903 9730865 6858068 3655280
34980 3655280 2136734 3543249 6779247 8524818 6594047 2826078 1172670 3254323
34972 3254323 7225110 10552273 12063851 11352567 8366343 4460104 2206555 2830424
34964 2830424 4622993 4946879 3308370 1586475 1598917 3263445 5013656 5343693 3924319
34955 3924319 1729522 262091 427555 1995818 4107689 6168224 8111546 9821797
34947 9821797 10490648 8945496 5078485 880799 -790695 838798 3184669 2854282
$$ packed form
35007B104469r95110r50739k462163j941823R19093K776117J879820K4313r69559
34998C84418j372432j473431n83173P32295M36081j353481j397673J819313M878555
34989B070472L911609L39815j157982P20423K678423J906143p38038k872797l202788
34980C655280j518546J406515L235998J745571j930771l767969j653408K081653
34972C254323L970787L327163J511578p11284k986224l906239k253549O23869
34964B830424J792569L23886j638509j721895J2442J664528J750211L30037j419374
34955C924319k194797j467431J65464J568263K111871K060535J943322J710251
34947I821797O68851j545152l867011m197686j671494J629493K345871l30387
$$ plain form
34939 2854282 -573902 -4072838 -4462373 -1352834 3305754 7529455 10439857 11803897
34931 11803897 11495460 9556230 6397670 2884005 239070 -563031 272270 1290234
34923 1290234 1105656 -267671 -1662763 -2140228 -1817907 -1565725 -2288991 -4317114 -7005067
34914 -7005067 -9041416 -9658667 -9487795 -9713100 -10493511 -10898714 -10348211 -9181636 -7668448
34905 -7668448 -5728857 -4331876 -5748859 -10734610 -16127904 -17296183 -13194798 -7335993
34897 -7335993 -3406368 -1789598 -1164059 -1316341 -2489609 -3553369 -3338896 -3033653 -4621531
34888 -4621531 -7147482 -7385752 -4810372 -3078285 -5078925 -8855826 -10560713 -9688044
34880 -9688044 -8723337 -8535175 -7103253 -3134675 1509473 4109909 4342582 4149934 5245593
$$ packed form
34939B854282l428184l498936l89535L109539M658588M223701K910402J364040
34931A1803897l08437j939230l158560l513665k644935q02101Q35301J017964
34923A290234j84578j373327j395092m77465L22321K52182p23266k028123k687953
34914g005067k036349o17251J70872k25305p80411m05203N50503J166575J513188
34905g668448J939591J396981j416983m985751n393294j168279M101385N858805
34897g335993L929625J616770O25539j52282j173268j063760K14473L05243j587878
34888d621531k525951k38270K575380J732087k000640l776901j704887Q72669
34880i688044R64707J88162J431922L968578M644148K600436K32673j92648J095659
$$ [...]
##END NTUPLES=NMR SPECTRUM
##END=
