##TITLE=31Pdec_DE-635p_NaOH
 , 64 sc
 26.12.2024
##JCAMPDX= 6.0         $$ Bruker NMR JCAMP-DX V2.0
##DATA TYPE= NMR SPECTRUM
##DATA CLASS= NTUPLES
##ORIGIN= UXNMR, Bruker Analytische Messtechnik GmbH
##OWNER= root
$$ XWIN-NMR		Version 3.5
$$ Thu Dec 26 13:50:44 2024 Russian Standard Time (UT+4h)  she@DPX200
##.OBSERVE FREQUENCY= 81.013821
##.OBSERVE NUCLEUS= ^31P
##.ACQUISITION MODE= SIMULTANEOUS
##.ACQUISITION SCHEME= undefined
##.AVERAGES= 64
##.DIGITISER RES= 17
##SPECTROMETER/DATA SYSTEM= spect
##.PULSE SEQUENCE= zgpg30
##.SOLVENT NAME= CDCl3
##.SHIFT REFERENCE= (INTERNAL, CDCl3, 0, 198.062)
##AUDIT TRAIL= $$ (NUMBER, WHEN, WHO, WHERE, WHAT)
$$ ##TITLE= Audit trail, XWIN-NMR		Version 3.5
$$ ##JCAMPDX= 5.01
$$ ##ORIGIN= Bruker BioSpin GmbH
$$ ##OWNER= she
$$ F:/spectra/data/she/nmr/P31/2/pdata/1/auditp.txt
$$ ##AUDIT TRAIL=  $$ (NUMBER, WHEN, WHO, WHERE, WHAT)
(   1,<2024-12-26 13:49:12.12 +0400>,<she>,<DPX200>,
      <created by zg, POWCHK disabled, PULCHK disabled
       configuration hash MD5:
       00 E9 B6 7A A2 85 ED C7 34 08 36 98 17 FE 4E 26
       data hash MD5: 32K
       1F DE 63 6D F7 69 87 A9 07 7D A7 D3 61 AB 1D E0>)
(   2,<2024-12-26 13:49:14.35 +0400>,<she>,<DPX200>,
      <Start of raw data processing
       efp BC_mod = 2 LB = 1.5 FT_mod = 6 PKNL = 1 PHC0 = 2083.072 PHC1 = 175.4863 SI = 64K 
       data hash MD5: 64K
       71 53 03 E8 42 E4 46 6D C5 86 12 CC 2C 23 AE 5C>)
(   3,<2024-12-26 13:49:26.35 +0400>,<she>,<DPX200>,
      <pk PHC0 = -26.01965 PHC1 = 0 
       data hash MD5: 64K
       2D 87 BA A1 EA D8 CF B9 0A 0D 82 81 EB CB 00 91>)
(   4,<2024-12-26 13:49:29.89 +0400>,<she>,<DPX200>,
      <abs ABSG = 5 
       data hash MD5: 64K
       5B 6E 7A A0 8A E2 59 0E 93 F7 23 CF FF 6F 4F 18>)
(   5,<2024-12-26 13:49:42.43 +0400>,<she>,<DPX200>,
      <abs ABSG = 5 
       data hash MD5: 64K
       EC 43 C5 8E 0F B3 6E 90 0E 5C A5 91 63 78 45 EF>)
(   6,<2024-12-26 13:49:57.01 +0400>,<she>,<DPX200>,
      <pk PHC0 = -0.6229492 PHC1 = 5.6 
       data hash MD5: 64K
       E0 93 B4 FA CB 4E 9C 2B 5C 72 80 05 41 BA 9D 24>)
(   7,<2024-12-26 13:50:01.65 +0400>,<she>,<DPX200>,
      <abs ABSG = 5 
       data hash MD5: 64K
       B4 C8 E3 9B A0 E2 57 E8 37 3A 1D 7C 66 37 ED 21>)
$$ ##END=
$$ 
$$ hash MD5
$$ 8E 4B 31 1A 52 BD B3 5C FC D6 2A 2E E8 1A BF B0
##$RELAX= 
##$RELAX= 
##$RELAX= 
##$RELAX= 
##$RELAX= 
##$RELAX= 
##$RELAX= 
##$RELAX= 
$$ Bruker specific parameters
$$ --------------------------
##$DU= <F:/spectra>
##$EXPNO= 2
##$NAME= <P31>
##$PROCNO= 1
##$TYPE= <nmr>
##$USER= <she>
##$AMP= (0..31)
100 100 100 100 100 100 100 100 100 100 100 100 100 100 100 100 100 100 
100 100 100 100 100 100 100 100 100 100 100 100 100 100 
##$AQSEQ= 0
##$AQ_mod= 1
##$AUNM= <au_zg>
##$AUTOPOS= <>
##$BF1= 81.014009
##$BF2= 200.13
##$BF3= 200.13
##$BF4= 200.13
##$BF5= 200.13
##$BF6= 200.13
##$BF7= 200.13
##$BF8= 200.13
##$BYTORDA= 1
##$CFDGTYP= 0
##$CFRGTYP= 5
##$CHEMSTR= <none>
##$CNST= (0..31)
$$ [...]
##$SUBNAM3= <"">
##$SUBNAM4= <"">
##$SUBNAM5= <"">
##$SUBNAM6= <"">
##$SUBNAM7= <"">
##$SUBNAM8= <"">
##$SUBNAM9= <"">
##$SW= 400.765351723535
##$SWIBOX= (0..15)
0 1 3 0 0 0 0 0 0 0 0 0 0 0 0 0 
##$SW_h= 32467.5324675325
##$TD= 32768
##$TD0= 1
##$TE= 0
##$TE2= 300
##$TE3= 300
##$TEG= 300
##$TL= (0..7)
0 120 53 12 22 120 120 120 
##$TP= (0..7)
150 150 150 150 150 150 150 150 
##$TP07= 0
##$TPNAME0= <>
##$TPNAME1= <>
##$TPNAME2= <>
##$TPNAME3= <>
##$TPNAME4= <>
##$TPNAME5= <>
##$TPNAME6= <>
##$TPNAME7= <>
##$TPOAL= (0..7)
0.5 0.5 0.5 0.5 0.5 0.5 0.5 0.5 
##$TPOFFS= (0..7)
0 0 0 0 0 0 0 0 
##$TUNHIN= 0
##$TUNHOUT= 0
##$TUNXOUT= 0
##$USERA1= <user>
##$USERA2= <user>
##$USERA3= <user>
##$USERA4= <user>
##$USERA5= <user>
##$V9= 5
##$VALIST= <valist>
##$VCLIST= <CCCCCCCCCCCCCCC>
##$VD= 0
##$VDLIST= <DDDDDDDDDDDDDDD>
##$VPLIST= <PPPPPPPPPPPPPPP>
##$VTLIST= <TTTTTTTTTTTTTTT>
##$WBST= 1024
##$WBSW= 4
##$XGAIN= (0..3)
0 0 0 0 
##$XL= 0
##$YL= 0
##$YMAX_a= 225971
##$YMIN_a= -224223
##$ZGOPTNS= <>
##$ZL1= 120
##$ZL2= 120
##$ZL3= 120
##$ZL4= 120
##$ABSF1= 198.0616
##$ABSF2= -202.7028
##$ABSG= 5
##$ABSL= 3
##$ALPHA= 0
##$AQORDER= 0
##$ASSFAC= 0
##$ASSFACI= 0
##$ASSFACX= 0
##$ASSWID= 0
##$AUNMP= <proc_1d>
##$AZFE= 0.1
##$AZFW= 0.5
##$BCFW= 0
##$BC_mod= 2
##$BYTORDP= 0
##$COROFFS= 0
##$CY= -3
##$DATMOD= 1
##$DC= 0
##$DFILT= <>
##$DTYPP= 0
##$F1P= 0
##$F2P= 0
##$FCOR= 1
##$FTSIZE= 65536
##$FT_mod= 6
##$GAMMA= 0
##$GB= 0
##$INTBC= 1
##$INTSCL= 9.790993e-09
##$ISEN= 30
##$LB= 1.5
##$LEV0= 0
##$LPBIN= 0
##$MAXI= 10000
##$MC2= 0
##$MEAN= 0
##$ME_mod= 0
##$MI= 50
##$NCOEF= 0
##$NC_proc= -3
##$NLEV= 6
##$NOISF1= 182.463
##$NOISF2= 159.3651
##$NSP= 0
##$NTH_PI= 0
##$NZP= 0
##$OFFSET= 198.0616
##$PC= 4
##$PHC0= 2056.429
##$PHC1= 181.0863
##$PH_mod= 1
##$PKNL= yes
##$PPARMOD= 0
##$PSCAL= 0
##$PSIGN= 0
##$REVERSE= no
##$SF= 81.0140089999434
##$SI= 65536
##$SIGF1= 159.3651
##$SIGF2= -187.1042
##$SINO= 113.3802
##$SIOLD= 16384
##$SREGLST= <1H.CDCl3>
##$SSB= 0
##$STSI= 65536
##$STSR= 0
##$SW_p= 32467.5324675325
##$SYMM= 0
##$S_DEV= 0
##$TDeff= 32768
##$TDoff= 0
##$TI= <>
##$TILT= no
##$TM1= 0
##$TM2= 0
##$TOPLEV= 0
##$USERP1= <user>
##$USERP2= <user>
##$USERP3= <user>
##$USERP4= <user>
##$USERP5= <user>
##$WDW= 1
##$XDIM= 65536
##$YMAX_p= 287248307
##$YMIN_p= -2617801
$$ End of Bruker specific parameters
$$ ---------------------------------
##NTUPLES= NMR SPECTRUM
##VAR_NAME=  FREQUENCY,     SPECTRUM/REAL,   SPECTRUM/IMAG
##SYMBOL=    X,             R,               I
##VAR_TYPE=  INDEPENDENT,   DEPENDENT,       DEPENDENT
##VAR_FORM=  AFFN,          ASDF,            ASDF
##VAR_DIM=   65536,         65536,           65536
##UNITS=     HZ,            ARBITRARY UNITS, ARBITRARY UNITS
##FACTOR=    0.49542278885378, 1,            1
##FIRST=     16045.7642231865, 0,            0
##LAST=      -16421.768244346, 0,            0
##MIN=       -16421.768244346, -2617801,     0
##MAX=       16045.7642231865, 287248307,    0
$$ Real data points
##PAGE= N=1
##DATA TABLE= (X++(R..R)), XYDATA
$$ [...]
40293A08192P948r3815j44728j14720j69J26974J44372J9939j18341j26324k4895
40282b15567M2041Q447m6786l5944K6646P9148J00295R6006N5516k1286q3415
40271E101o9321J8035J07463J25604N2154p1624j66743j66126p1083M2565R2056
40260a01919O1156j631m6085o2705o5502n5063j6369M6752R2257P7208J6512k3220
40248g8609p501J5010j6908p3072n7487N0493J40754J03057k4289r6771m5624
40237i0947M4154N4377k1045r1116r1442l7376L0637Q7466R8666K8568q1994j08226
40225a78278J1721J58135J51514j4663j63091j69329r7342n0141n145R6058J83952
40214g6609J36570j1954r0271l3713K9096j5882r6203p5352L9320J14718P6000
$$ y = [108192, 116140, 22325, -122403, -237123, -237292, -110318, 34054, 53993, -64348, -190672, -215567, -173526, -165079, -211865, -247809, -221163, -142015, -41720, 54286, 109802, 88516, 5101, -64220, -46185, 61278, 186882, 239036, 167412, 669, -165457, -236540, -193975, -101919, -40763, -42394, -88479, -151184, -216686, -271749, -288118, -241366, -149109, -71901, -55389, -78609, -86110, -71100, -88008, -161080, -218567, -168074, -27320, 75737, 51448, -45323, -90947, -46793, 7584, -13461, -104577, -196019, -233395, -202758, -115292, -16626, 11942, -70052, -178278, -166557, -8422, 143092, 128429, -34662, -203991, -301333, -351474, -356619, -260561, -76609, 59961, 48007, -42264, -75977, -46881, -62763, -158966, -234318, -194998, -80280, -4280]
40203d280j9098p3868m8996K6922Q7120P5183R341j9164M0974J16435R9843L162
40191B93574n8049k9185J9332R036m6206q9758j00573p9497k2898L8599L6304
40180b9321l8227q6461l0871N8072N5840l0533q3175o5976o3940j06067q9950
40169e10609L9691J55710J10003m4429j22914o1882K9121N6485M8463M8562K8866
40158b22933l1228p6122n6078r429P385J4784N9803J13142R8420Q264p8122r1923
40146b64037l8639L1022O9908N6525P888k7322j3720L5968Q4270J06766R1310
40135A39939L4941l0853n1068k0788q068n9400j25260j33411r1043m7603k051
40124c94665O6736J13614P5153j1746m7133k2109k3122p0374p5268J478O9888
$$ y = [-4280, -23378, -97246, -146242, -119320, -32200, 42983, 52324, 33160, 74134, 190569, 290412, 293574, 235525, 206340, 225672, 234708, 188502, 98744, -1829, -81326, -104224, -65625, -29321, -67548, -154009, -184880, -126808, -70968, -101501, -184676, -250652, -314592, -420659, -510609, -470918, -315208, -205205, -249634, -372548, -434430, -405309, -348824, -300361, -251799, -222933, -254161, -330283, -386361, -395790, -388405, -373621, -313818, -200676, -102256, -93992, -172114, -264037, -302676, -271654, -201746, -145221, -137333, -164655, -178375, -142407, -58137, 48629, 139939, 174880, 144027, 92959, 72171, 64103, 4703, -120557, -253968, -345011, -392614, -394665, -327929, -214315, -139162, -150908, -198041, -220150, -243272, -313646, -388914, -387436, -317548]
40113c17548N6951K7874P1505J46297J44111N5759k8060n1091l3723J709N7136
40102A30920J07794J03143L7850l1909n9233n3367m5435m3579l6291j7298L668
40091I6263O948j4924l5226j3638M5869Q1737M3507m3630j04583r0496j7631M8758
40079B954M3626l1598q7717m0168O9203J06884K5405p0777p7298k4229N657J1056
40067f7002L5244O0977M6138J7020K0485K3321k8039q1299l7631P9286J41702
40056B10202J01402K9688k1757o0829n4341M8605J63390J18759p4083j80010p1801
40045B09225O9157L0518j05761j09067L6016J31636Q4821N472j4878j9215l9804
40034B78120j8498N3826O7225m3286j74754j92798j08358k9067r09J3264M3045
$$ y = [-317548, -260597, -232723, -161218, -14921, 129190, 184949, 156889, 105798, 72075, 73784, 130920, 238714, 341857, 379707, 347798, 288565, 235198, 189763, 146184, 109893, 92595, 96263, 103211, 88287, 53061, 39423, 85292, 167029, 210536, 166906, 62323, -28173, -45804, 2954, 46580, 14982, -72735, -112903, -43700, 63184, 88589, 17812, -59486, -83715, -78058, -67002, -31758, 29219, 75357, 92377, 112862, 136183, 108144, 26845, -10786, 68500, 210202, 311604, 341292, 319535, 258706, 204365, 252970, 416360, 535119, 461036, 281026, 209225, 278382, 308900, 203139, 94072, 130088, 261724, 346545, 352017, 337139, 317924, 278120, 259622, 313448, 380673, 337387, 162633, -30165, -138523, -167590, -168499, -155235, -112190]
40023a12190P7879R7874Q2035J9218m4859k3016R2736J78498J21320k6363j18589
40012C44543j10906q7016j02309j09490o6451k1171k9007m9667r08J11948J87072
40001F6638J48308L0105o9216q6060l1315L7956O2413J5784o8005j04801l6388
39990c4581Q5975J30858L6216r8138j22621k8932M3654N238o5304m9637L2514
39979f4758O2555M161n3036l2345L5737Q2061Q8054O9765L2898j1612l1179j2752
39967A69549J5776L7798P4289J17347R8024r534j03701p4264K0311J2735j25242
39956B33088k20111j37645K3445P3951q897q7006q2373n6235o1340m7469L0820
39945c39772J13265J20031P1716L9698K5139j9422p2996n3507M7682J27169R9136
$$ y = [-112190, -34311, 63563, 145598, 164816, 119957, 96941, 189677, 368175, 489495, 463132, 344543, 233637, 146621, 44312, -65178, -131629, -152800, -181807, -231474, -232382, -120434, 66638, 214946, 245051, 175835, 89775, 58460, 96416, 158829, 174613, 106608, 1807, -34581, 51394, 182252, 218468, 120330, -2291, -31223, 12431, 17669, -47635, -97272, -64758, -2203, 1958, -51078, -83423, -47686, 34375, 122429, 192194, 225092, 213480, 182301, 169549, 185325, 223123, 297412, 414759, 512783, 503249, 399548, 325284, 345595, 358330, 233088, 12977, -124668, -101223, -27272, -36169, -123175, -205548, -261783, -323123, -370592, -339772, -226507, -106476, -34760, 4938, 30077, 10655, -62341, -115848, -68166, 59003, 158139]
39934A58139j839q2815j00066o4166Q019Q9611J26877Q4803m978q2510j22918
39923H157j22229o0501N0488J09863J6136j71440k51683j11172J27605K45238
39913a59538J68902J8044o1990m4339l064p072m8963n8431J3431J14365J24944
39902E6289N091j26461j18658J9058J20280O9719n9123j09265l1147Q2463J23961
39891C2207P8736Q874k6652j7715J1904M3902Q0186J17456J24636P2226j6465
39880E09295p4446o4027j7034R888m704m3542p5885o6906K571R4326J23474N3503
39868D46513m4530p5276l9225j0686j2568P377O3324P7625j1638j47029k14882
39857C9005j76972q3587J4673J00382J47064J19315L4524l3011m1665l4751o7140
$$ y = [158139, 156300, 73485, -26581, -90747, -82728, 6883, 133760, 218563, 213585, 131075, 8157, -114072, -174573, -124085, -14222, 1914, -169526, -421209, -532381, -404776, -159538, 9364, 27408, -34582, -78921, -81985, -89057, -138020, -196451, -183020, -68655, 56289, 61380, -65081, -183739, -164681, -44401, 25318, -33805, -143070, -174217, -91754, 32207, 110943, 119817, 93165, 75450, 87354, 131256, 211442, 328898, 453534, 525760, 509295, 434849, 370822, 353788, 363676, 358972, 315430, 239545, 172639, 175210, 269536, 393010, 446513, 401983, 326707, 287482, 276796, 264228, 271605, 334929, 412554, 400916, 253887, 39005, -137967, -221554, -206881, -106499, 40565, 159880, 194404, 161393, 119728, 84977, 17837]
39846A7837j11402q5846L0182J51373J72142P7855m3684r3785n4298J0954L2329
39835A03657k303n6340q9340p6069q247Q2007J15341M1629o7410p1592N1256J40601
39823A63190N3062j20138j49656J7975J69394J07474p8831j37378P398J67558
39813B00048J52593J641j01874p0085J6093M2808o763o7246q0506m1833J5283
39802F0159N0667M2230L633j9430J0851P6245J06012M7624o8324j53080j50643
39791E944q1346O085Q6983J44039J41531O6618k5752o6562o3692p9589j19057
39780A5202j13411l8919K6660J8666p162M1049J38187J62569O4083o9960j33084
39769A03880j13252n9046L236O6633R8978O5719q146m8911j9058L9743O3716M3198
$$ y = [17837, -93565, -179411, -149229, 2144, 174286, 252141, 208457, 114672, 60374, 71328, 103657, 101354, 45014, -44326, -120395, -128642, -46635, 68706, 110335, 42925, -28667, 22589, 163190, 216252, 96114, -53542, -35567, 133827, 241301, 162470, 25092, 32490, 200048, 352641, 354282, 252408, 182323, 198416, 241224, 234461, 167215, 86709, 44876, 60159, 110826, 153056, 156689, 137259, 148110, 224355, 330367, 377991, 309667, 156587, 5944, -75402, -69317, 17666, 161705, 303236, 369854, 344102, 277540, 213848, 134259, 15202, -98209, -137128, -110468, -91802, -98964, -57915, 80272, 242841, 306924, 236964, 103880, -9372, -68418, -65182, 1451, 100429, 166148, 158002, 109091, 90033, 129776, 193492, 236690]
39757B36690J7855Q232j1026n4382p4056j0918J07063J70280J16687J2486l6605
39746D82306j8345j866j8269l0309k3667m5389j13020j50810p8884O5986J59527
39735B27260J33040M1096j7900j4952q625n8853j34224j28707J921J43842J35759
39724C19657j3841j10293k9781R6947O6382r2418j48057m240J57565J43520J5457
39713D00898l1904L1618N9309j4598p2647j3424Q1788P2894k9953q7006k7539
39702C69436O8494R2669L6634k8356m9494l3720j6744k3091m9248o7799n3044
39691B45737j3372J0163r666m7534m9062N911P6898J07201Q5713M9143K2573j7908
39679D65797r7974j72608j48814o941J35852J35390r960j47475j40898j1511J13535
$$ y = [236690, 254545, 262777, 251751, 197369, 123313, 112395, 219458, 389738, 506425, 518911, 482306, 463961, 462095, 443826, 413517, 389850, 344461, 231441, 80631, 1747, 67733, 227260, 360300, 401396, 383496, 368544, 359919, 301066, 166842, 38135, 40056, 183898, 319657, 305816, 195523, 165742, 262689, 329071, 236653, 88596, 84356, 241921, 385441, 400898, 368994, 400612, 459921, 445323, 372676, 359252, 441040, 513934, 483981, 396975, 369436, 437930, 530599, 567233, 538877, 489383, 455663, 438919, 415828, 366580, 298781, 245737, 232365, 242528, 232862, 185328, 136266, 142177, 219075, 326276, 411989, 461132, 483705, 465797, 367823, 195215, 46401, 39460, 175312, 310702, 300742, 153267, 12369, 858, 114393]
39668A14393J51490J19353O6992J7499j7548j4953L2378Q4163Q1861J2561p0265
39657E77924r5718m3314L7926P7929N2718o16l5115m5232n5441p2863p6820n3900
39645B67478j7769J2942L5368N0792N1157L1416K411k1171l4922l6627j7846K2557
39633C45786O6691R1135Q1314K6190p5192j79534j99816q6624R3861K05842J78621
39622E48274O4477m1919r8927j15352j00664o2102k5746j2783l478L4861Q8647
39611B75288J05631O1759j4386q0282j02446m8129Q5183K19030K38221J21304
39601H61173k7242j11668j47510j74381j44567o933J43206J40927q429j02761
39591D21815j3409J36321J52948L9776l8037k371N6375M0994k7964p6382p3769
$$ y = [114393, 265883, 385236, 452228, 469727, 452179, 437226, 469604, 553767, 635628, 648189, 577924, 482206, 438892, 476818, 554747, 607465, 606849, 571734, 526502, 471061, 398198, 321378, 267478, 249709, 262651, 298019, 348811, 399968, 431384, 433795, 412624, 377702, 341075, 323229, 345786, 412477, 503612, 584926, 611116, 535924, 356390, 156574, 69950, 163811, 369653, 548274, 612751, 570832, 471905, 356553, 255889, 193787, 168041, 155258, 151780, 186641, 275288, 380919, 442678, 428292, 348010, 245564, 197435, 282618, 501648, 739869, 861173, 833931, 722263, 574753, 400372, 255805, 248872, 392078, 533005, 524576, 421815, 408406, 544727, 697675, 737451, 699414, 697043, 753418, 794412, 766448, 690066, 616297]
39580F16297k8414M2355R5302P3899j6395q8729p1848Q265P5919R5329P7096L6969
39568I16045m230j1300K4132N4518L5141q797k2035n630o416l2684m4078k6472
39556H68194j3449k0032j4531K1279N7288O6803O2778N3458J6362m4223p0317
39545I83610l5298k470k7183m9513J9265J34528J62135Q3894K6705N0971M9981
39534A396625n5329j50090r1670M5102O0062o6090j36554l3022J18318J41765
39524A229117L8676p0207j20840j20365o8218K2628P7282L9900k7852k1281O2891
39513A041731J39874J57820J17616J8492j06452j42488j7940J42610J40423j6918
39503A474768j17234n4759L5940K6327n607N1893J23811P6240l4603l7385P3892
$$ y = [616297, 587883, 630238, 725540, 799439, 783044, 694315, 622467, 630732, 706651, 801980, 879076, 916045, 911815, 900515, 924647, 979165, 1014306, 1005509, 983474, 977844, 971428, 938744, 894666, 868194, 854745, 834713, 820182, 841461, 898749, 965552, 1028330, 1081788, 1098150, 1053927, 983610, 948312, 945842, 918659, 869146, 888411, 1022939, 1185074, 1268968, 1295673, 1346644, 1396625, 1341296, 1191206, 1099536, 1144638, 1204700, 1138610, 1002056, 969034, 1087352, 1229117, 1267793, 1197586, 1076746, 956381, 888163, 910791, 988073, 1027973, 1000121, 978840, 1041731, 1181605, 1339425, 1457041, 1475533, 1369081, 1226593, 1208653, 1351263, 1491686, 1474768, 1357534, 1302775, 1338715, 1365042, 1359435, 1411328, 1535139, 1611379, 1576776, 1539391, 1613283]
39492A613283J29820O0834k378M3421J05574N2865o9633j03962o677R8833R5232
39481B017212J2556l2964O045O1265N4797R214Q945O3161P5448j3769j15877r9249
39469B046784K5889J15907Q4946N36l2698m220L0193M2533M1393K7197m236l3414
39457B340810l7350k3397p526K1088P1068J00036N0552n6996j18115o2764M9713
39446B327119R6153M2412j5074K1430J19199J57249Q4216k1763o0757k4951K3137
39435B748370L7730J1193n0874j15592j09323R664J65014K15599J14078l8121
39425B987738j14354r5100m9626k6674q146L8758R8570J13869N5769k4034m2022
39414B934748N385K2293n4062j43145j15799J8989J10872O7657k6021l5118M2354
$$ y = [1613283, 1743103, 1803937, 1801559, 1844980, 1950554, 2003419, 1933786, 1829824, 1823147, 1921980, 2017212, 2029768, 1996804, 2002849, 2064114, 2118911, 2128125, 2137070, 2200231, 2275679, 2261910, 2146033, 2046784, 2072673, 2188580, 2273526, 2274062, 2241364, 2237144, 2267337, 2309870, 2351263, 2378460, 2374224, 2340810, 2303460, 2280063, 2272537, 2293625, 2364693, 2464729, 2515281, 2458285, 2340170, 2277406, 2327119, 2423272, 2465684, 2450610, 2472040, 2591239, 2748488, 2832704, 2810941, 2750184, 2725233, 2748370, 2786100, 2797293, 2746419, 2630827, 2521504, 2531168, 2696182, 2911781, 3025859, 2987738, 2873384, 2778284, 2728658, 2701984, 2693838, 2732596, 2831166, 2945035, 3000804, 2976770, 2934748, 2940133, 2962426, 2908364, 2765219, 2649420, 2668409, 2779281, 2846938, 2820917, 2785799, 2828153]
39403B828153Q1682l314j53345k24688j37812L7002J48343J27336N4985L3214
39393B791556L6000k7329j28329j26916R441J23064Q0345l5594n4544L0721P1529
39382B769944r437j20695j38582m3453R7959K03993K08915R6801n8374j38352
39372B868719j01016j9827J7279P567N118K9741M5239J8297l2271n4897k6428
39361B757521J8491L1942J8078K2142N1836N9883K9787J9978O8134J05141M8354
39350C231287n2925p1011M223M1210k2839o2114N7207K53192L08464J60732m070
39339C843356R804J61332K44328J70402Q2878J57725L65053N08798M81273L83944
39329F408893L68282M42578N08412N31918N76357O71368P47713P35896O60083
$$ y = [2828153, 2909835, 2906521, 2753176, 2528488, 2390676, 2427678, 2576021, 2703357, 2758342, 2791556, 2827556, 2800227, 2671898, 2544982, 2554423, 2677487, 2757832, 2722238, 2667694, 2698415, 2769944, 2760507, 2639812, 2501230, 2457777, 2555736, 2759729, 2968644, 3065445, 3007071, 2868719, 2767703, 2747876, 2765155, 2772722, 2777840, 2807581, 2852820, 2871117, 2838846, 2783949, 2757521, 2776012, 2807954, 2826032, 2848174, 2900010, 2959893, 2989680, 3009658, 3077792, 3182933, 3231287, 3178362, 3107351, 3111574, 3152784, 3129945, 3067831, 3125038, 3378230, 3686694, 3847426, 3843356, 3853160, 4014492, 4258820, 4429222, 4512100, 4669825, 5034878, 5543676, 6024949, 6408893, 6777175, 7219753, 7728165, 8260083, 8836440, 9507808, 10255521, 10991417, 11651500]
39320A1651500N85340N15338L94544J91787o2271l15174n34100p00607p90138
39311A0936219p81221o89874n78243n04598m64060m07090l22308k58115k39530
39302F691180k16889j46958p6057o8118q6488m4454M1717O5555J4024J6536J50749
39291F340797L04169L22346K23922J63559K21046L32408M16369M67818N13183
39282I305617N59319O17694P12340Q22624Q64945P77571N99867M27626K98086
39273A4985689J51316q7380m04838o96220q65893r17272r23781r22054q76422
39264I443145p64022o46008o02554o17948n90740m67773l21122k65924l27642
39255D839412m17232m27478l33282j97984r8614o0614o6014j01138j63169k21166
$$ y = [11651500, 12236840, 12752178, 13146722, 13338509, 13276238, 12961064, 12426964, 11726357, 10936219, 10154998, 9465124, 8886881, 8382283, 7918223, 7511133, 7188825, 6930710, 6691180, 6474291, 6327333, 6251276, 6183158, 6096670, 6052216, 6093933, 6159488, 6173512, 6190048, 6340797, 6644966, 6967312, 7191234, 7354793, 7575839, 7908247, 8324616, 8792434, 9305617, 9864936, 10482630, 11194970, 12017594, 12882539, 13660110, 14259977, 14687603, 14985689, 15137005, 15049625, 14644787, 13948567, 13082674, 12165402, 11241621, 10319567, 9443145, 8679123, 8033115, 7430561, 6812613, 6221873, 5754100, 5432978, 5167054, 4839412, 4422180, 3994702, 3661420, 3463436, 3364822, 3304208, 3238194, 3137056, 2973887, 2752721]
39245B752721k15305j25718j8372J2887n7858j74196k62871k82724k23982j06168
39235A298414J5565Q0528P9310O0171O4772P7154N5432J114l0583J049O1023P2502
39223A836451J6398l5675j7318L3983L1445k1439k8644M1941R3598N1718o130
39212A996328L0954J18305J11480r914j06967q6299j5408J0026q81k372j4198
39201B031054o3487r4841l9317O6898J24107J02735N2130J02o5587j22930j14035
39190A876829l4690M3606O1525L1527J701Q848O6981J47125J71384R2073k2078
39179B444831n2511Q547M8339N708m2609j7151L4094K0495m3189o8062l2982k205
39167B303305j6325m9992p7199j01227j07603n6003N2359J44861J44502M6966
$$ y = [2752721, 2537416, 2411698, 2393326, 2406213, 2348355, 2174159, 1911288, 1628564, 1404582, 1298414, 1313979, 1394507, 1473817, 1533988, 1598760, 1675914, 1731346, 1732460, 1701877, 1702926, 1763949, 1836451, 1852849, 1817174, 1799856, 1833839, 1865284, 1843845, 1815201, 1857142, 1950740, 2002458, 1996328, 2027282, 2145587, 2257067, 2247153, 2140186, 2053887, 2038479, 2048505, 2047624, 2045252, 2031054, 1967567, 1872726, 1833409, 1900307, 2024414, 2127149, 2179279, 2179381, 2113794, 1990864, 1876829, 1842139, 1885745, 1947270, 1978797, 1980498, 1989346, 2056327, 2203452, 2374836, 2466909, 2444831, 2392320, 2400867, 2449206, 2454914, 2412305, 2395154, 2429248, 2449743, 2406554, 2338492, 2305510, 2303305, 2286980, 2236988, 2159789, 2058562, 1950959, 1894956, 1947315, 2092176, 2236678, 2283644]
39157B283644p6406j34131q2817K9348R7037O8293M889n649L0389M4051L0662
39146B289310N3072J10581J07397M62j07109r6206J296N1599M771n8142o1561
39135B295470l1733k5625l1380R19O0184P4476J9260l2049o687N5514N3992j8310
39123B414031n5936m107M7202L784p1547m8109O2480J16109N2789l2545o2693
39112B421458q0715j16205q6199O0371K02411J85264L8602p3662q0143m7284k1341
39101B402557L2833J18833J59184J04116L586o8221r1108p3107j5467O2338J17752
39090B753296J34002J30222J13082P2408L0342K8575N5118N5222L1179N1569J33135
39079C588150J97230J89913J69011K11352K96288L49831L57663L63799L87994
$$ y = [2283644, 2207238, 2073107, 1990290, 2019638, 2116675, 2184968, 2189857, 2184208, 2214597, 2258648, 2289310, 2342382, 2452963, 2560360, 2560822, 2453713, 2357507, 2358803, 2410402, 2415173, 2357031, 2295470, 2263737, 2238112, 2206732, 2207651, 2267835, 2342311, 2361571, 2329522, 2322835, 2378349, 2432341, 2414031, 2358095, 2353988, 2401190, 2404974, 2333427, 2285318, 2347798, 2463907, 2516696, 2484151, 2421458, 2340743, 2224538, 2138339, 2198710, 2401121, 2586385, 2624987, 2551325, 2471182, 2423898, 2402557, 2435390, 2554223, 2713407, 2817523, 2821109, 2752888, 2661780, 2588673, 2573206, 2635544, 2753296, 2887298, 3017520, 3130602, 3203010, 3233352, 3261927, 3317045, 3372267, 3403446, 3455015, 3588150, 3785380, 3975293, 4144304, 4355656, 4651944, 5001775, 5359438, 5723237, 6111231]
39070F111231M12837M39648M99402O05009P26844Q17647Q47358Q21929P72138
39061A2054043P07062N87096L76788J08989j58011m29618p37146j014366j124557
39052A0370280j045587r16727q42844p64109o04524m37688l77965l87486l40572
39043D652778k38146k04257k73727l28352k73956j61394q5102n5221k4381K4113
39033C032355O3060N6417j2810j08367j34794k9257J33278J99091J20244J0575
39023C329792q981N0058R9121J05088J12869J71985K85216M09043M81617M76924
39013E512732M43270M50973M94881N04470M69254M87785O47432R03894J127411
39004A1042102J232354J221527J141681J038939R21928P27780L70103j24695n76977
$$ y = [6111231, 6524068, 6963716, 7463118, 8068127, 8794971, 9612618, 10459976, 11281905, 12054043, 12761105, 13348201, 13724989, 13833978, 13675967, 13246349, 12509203, 11494837, 10370280, 9324693, 8407966, 7565122, 6801013, 6196489, 5758801, 5380836, 4993350, 4652778, 4414632, 4210375, 3936648, 3608296, 3334340, 3172946, 3087844, 3032623, 3008242, 3032355, 3095415, 3151832, 3139022, 3030655, 2895861, 2866604, 2999882, 3198973, 3319217, 3329792, 3320811, 3370869, 3469990, 3575078, 3687947, 3859932, 4145148, 4554191, 5035808, 5512732, 5956002, 6406975, 6901856, 7406326, 7875580, 8363365, 9010797, 9914691, 11042102, 12274456, 13495983, 14637664, 15676603, 16598531, 17326311, 17696414, 17571719, 16994742]
38995A6994742q28622r29204j056872j262772j399345j331141j116807r13803
38987H156176p76481o45871n04541m26579m50806m95764m58453l43076k30944
38978C823661j61603j14704q8242j11648j71117j95191j44565o4016j9279l0881
38968B722415q9103j71855k20298j72956p1680n1127j50087k18438j21604L3277
38958A488544K6973j44209k45084j37580K7402M3083o2462j02190j9602M9293
38948I24168l614j05649j19298l3175L4035J551o4803m4301O5684J29149M6173
38937H29920j07597j74699j13283k2357J4503J7615L1711N1139O0138O8986O8087
38926G24163K0144n6057p2046N78O3292K9507m0109l5732K5277L4495k4994n4734
$$ y = [16994742, 16166120, 15236916, 14180044, 12917272, 11517927, 10186786, 9069979, 8156176, 7379695, 6733824, 6229283, 5802704, 5351898, 4856134, 4397681, 4054605, 3823661, 3662058, 3547354, 3459112, 3347464, 3176347, 2981156, 2836591, 2772575, 2753296, 2722415, 2633312, 2461457, 2241159, 2068203, 1996523, 1945396, 1795309, 1576871, 1455267, 1488544, 1515517, 1371308, 1126224, 988644, 1016046, 1059129, 996667, 894477, 874875, 924168, 920554, 814905, 695607, 662432, 696467, 698018, 633215, 588914, 654598, 783747, 829920, 722323, 547624, 434341, 411984, 426487, 444102, 475813, 526952, 587090, 656076, 724163, 744307, 688250, 616204, 616782, 680074, 709581, 669472, 633740, 659017, 693512, 668518, 613784]
38914F13784l448N9112O0295K3449O360J5525L0071N1545P7750P2810J7792m0303
38902I84742m2734j885J9672N93k0322j5868q475j8717k2621K317J9983k1428
38890H75257r5471j06281j5765Q6692Q7463p456q7093q1786l3084r073j1533j662
38878F00208K4961L6070J8692k033j63J8257K3771m136n2551q0735n6597J0233
38866E35977P5063R3130M7288l8672j03869r8226n0613n2246j32543j93294j30136
38855d8141J3119R3598N5622k2821o4534p1385n5065M07O7964P1719P291k3573
38843B4201L7603J07015Q2783p681o5139n7977k1134K6047P4532Q7578N2361K4336
38831C64525L9067L1157o6807j91788k21145j42790m9086J3897P8345J44327J51499
$$ y = [613784, 610336, 669448, 729743, 753192, 759552, 775077, 805148, 856693, 934443, 1007253, 1025045, 984742, 942008, 940123, 959795, 960388, 940066, 924198, 915723, 897006, 874385, 876702, 896685, 875257, 779786, 673505, 657740, 744432, 831895, 824439, 737346, 655560, 622476, 613403, 601870, 600208, 625169, 661239, 679931, 677898, 677735, 695992, 719763, 715627, 663076, 582341, 525744, 535977, 611040, 704170, 751458, 712786, 608917, 510691, 460078, 407832, 275289, 81995, -48141, -35022, 58576, 114198, 91377, 26843, -44542, -99607, -99200, -31236, 40483, 47774, 24201, 61804, 168819, 251602, 243921, 178782, 120805, 99671, 125718, 200250, 287828, 340189, 364525, 403592, 434749, 367942, 176154, -44991, -187781, -236867, -222970, -144625, -298, 151201]
38820A51201Q1530J769j7836K8132J01935J55836J49575Q8056K7502j798l9964
38809G25938j07800j34804o6117K0700K2458j8333J2127R1896R3157P155l4876
38798F11501J6303N9079L6407K6871P1730P8086n979o6435N142J33325J80163
38787A146193J49299J38490J64348J68849J50501J62615K08750K47180K78264
38778B814489L34669M04407M45000M51839M39522L87342K79490J63393Q4367l423
38768E801095j67954l66797m82242m79752m39296m28878m31886m05169l31802
38759B267319k10134o3628L3617J5955p8884j44586j45582j47582j94390k34660
38749A097445k04865j16315j9569N7522R3864N8384l1261q0586k1909P7886Q8785
$$ y = [151201, 232731, 234500, 216664, 244796, 346731, 502567, 652142, 740198, 767700, 765902, 725938, 618138, 483334, 417217, 437917, 460375, 442042, 454169, 546065, 639222, 646377, 611501, 627804, 686883, 723290, 750161, 821891, 899977, 893998, 827563, 832705, 966030, 1146193, 1295492, 1433982, 1598330, 1767179, 1917680, 2080295, 2289045, 2536225, 2814489, 3149158, 3553565, 3998565, 4450404, 4889926, 5277268, 5556758, 5720151, 5804518, 5801095, 5633141, 5266344, 4784102, 4304350, 3865054, 3436176, 3004290, 2599121, 2267319, 2057185, 1993557, 2027174, 2043129, 1964245, 1819659, 1674077, 1526495, 1332105, 1097445, 892580, 776265, 756696, 814218, 908082, 966466, 935205, 854619, 832710, 910596, 999381]
38738I99381n283p6758k6209Q3762J20555O3299J6024M6986R7834Q7617M1945
38727A449153N2935J41125K27770K45126K18119K20736K87119L81025M36370M28622
38717D088100M15337M80350O17526P14139O89548N93112M96965L56693R0563k45287
38707H297046n00100o34577p33506q05140p43582n45325l86829l83194m20319
38698C144474l55327k51356k54364l36012l38953k27042j20000r5092j03112q4332
38688I78884m3987m744J6114j1802q1959j08281l6073L9088j1291j40722j83457
38677D11770j06975m4750n9202m6401O1297J57387J25139J6948l9984k5962p211
38666D42056l086J2397K2939o146l9723j1099N4429M9426n9587j63415j43548
$$ y = [999381, 994098, 917340, 891131, 974893, 1095448, 1158747, 1174771, 1221757, 1319591, 1407208, 1449153, 1502088, 1643213, 1870983, 2116109, 2334228, 2554964, 2842083, 3223108, 3659478, 4088100, 4503437, 4983787, 5601313, 6315452, 7005000, 7598112, 8095077, 8451770, 8542333, 8297046, 7796946, 7162369, 6428863, 5623723, 4880141, 4334816, 3947987, 3564793, 3144474, 2789147, 2537791, 2283427, 1947415, 1608462, 1381420, 1261420, 1166328, 1063216, 978884, 934897, 930153, 946267, 934465, 852506, 744225, 708152, 747240, 735949, 595227, 411770, 304795, 260045, 200843, 154442, 215739, 373126, 498265, 515213, 475229, 449267, 442056, 438970, 451367, 474306, 468160, 428437, 417338, 471767, 521193, 461606, 298191, 154643]
38655A54643k6776M9872J1999p2125r7651n6267j7750j3280o672K5264O0136Q8758
38643A00151J24603J32288M4610j01212j51398l9464R8902J17032O3321O3884
38633D52717R2511L1840r3551j40794q8914o0288q9888o8144M3189J23867R2287
38622B94832K3591o021l4338q6454q9742j8447K5923m775O929J32716K15181Q0894
38610E40289j60922k37458q7835P4580P5827j6457m4081K5647J01697J05609M4530
38599D21426j9177m0077l6824n7994r9473j01960m7590Q227L4474P1027J25066
38588B57125J19211K7613l3110L2930J26428Q4034o9567j57001j11641m4403l9429
38577A92190m0515J4705Q0880R0583N2946L645n7995j17775j09965r995Q9583
$$ y = [154643, 127867, 177739, 189738, 117613, 19962, -36305, -54055, -67335, -74007, -48743, 11393, 100151, 224754, 357042, 401652, 300440, 149042, 109578, 208480, 325512, 388833, 452717, 545228, 577068, 483517, 342723, 253809, 193521, 103633, 35489, 78678, 202545, 294832, 318423, 312402, 278064, 191610, 101868, 83421, 109344, 104569, 111498, 244214, 459395, 540289, 379367, 141909, 54074, 128654, 204481, 188024, 143943, 169590, 271287, 376896, 421426, 402249, 362172, 325348, 267354, 167881, 65921, 18331, 26558, 61032, 132059, 257125, 376336, 403949, 370839, 403769, 530197, 614231, 544664, 387663, 276022, 231619, 192190, 151675, 166380, 247260, 337843, 390789, 394434, 336439, 218664, 108699, 98704, 188287]
38566A88287P8709j8814o9685p980P8064O6540l3151r1856l5510N3715N2400l6284
38554B24435j02967r3907n6477k3646L4953J13755J33876O4563j4600l7523m1306
38543B01156o3878o2662k3879l3491j20446j47391r444J61376J69366N0849k037
38532A19519M7527O6462J8239Q334N3876M2671l5139m3222M2580N6272p3467j71734
38520A31918r1967M0932L1884q2930j19931l5349N1754O6807M9678M3947M5768
38509A32511N0261N4325L4081r185k1025K1841N4628K1405l5241n4595n4849o8702
38497A25455o2631j4948Q466l3756n1810M1498J61798J63847O8998K6112P4705
38486E07734J05273N0957l0963q2241j12527j22557q1266p882L1034L0149M8464
$$ y = [188287, 266996, 248182, 178497, 170517, 248581, 315121, 281970, 190114, 154604, 208319, 260719, 224435, 121468, 27561, -28916, -52562, -17609, 96146, 230022, 294585, 279985, 242462, 201156, 137278, 74616, 50737, 17246, -103200, -250591, -260035, -98659, 70707, 121556, 119519, 167046, 233508, 251747, 260081, 313957, 356628, 321489, 278267, 320847, 377119, 303652, 131918, 39951, 80883, 112767, 29837, -90094, -125443, -73689, -6882, 42796, 86743, 132511, 182772, 237097, 271178, 261993, 240968, 262809, 317437, 338842, 303601, 249006, 194157, 125455, 62824, 47876, 56342, 22586, -29224, 12274, 174072, 337919, 406917, 433029, 507734, 613007, 663964, 633001, 550760, 438233, 315676, 234410, 226528, 257562, 287711, 336175]
38475C36175Q7170P4369l514o4780o0246l3933k0898J0217O7918R3238O0804L4777
38463E81297O5363J09548J11418Q4374N5959P120o8290j10737p0247J7222Q4012
38452H67039J08497R3664L6326k7572k1236O1026J12247O2025n958J6215P9571
38441A381844N1887o5385j31312p6408J0177L3602J9202L0760N2058K3491n3401
38430A276515j14601j14992o5526l980L7650M6112L1172J3402P20j1833k1525
38419A073114k1693k5943n4508q7979p2539O390Q5527Q7213N241r4688j46195
38408G53940j35028r4291o7396p0095p8215n9330j6828J6152K6330L1172L1735
38397C38146j161o5200r3942l5346O3738J07540P1987J7741r680k5209m0417k7165
$$ y = [336175, 423345, 497714, 494200, 429420, 369174, 335241, 314343, 324560, 392478, 485716, 546520, 581297, 646660, 756208, 867626, 952000, 1007959, 1015079, 946789, 836052, 765805, 783027, 867039, 975536, 1069200, 1105526, 1077954, 1056718, 1117744, 1229991, 1292016, 1286058, 1302273, 1381844, 1433731, 1368346, 1237034, 1160626, 1170803, 1204405, 1223607, 1254367, 1306425, 1329916, 1276515, 1161914, 1046922, 981396, 977416, 1015066, 1061178, 1092350, 1105752, 1106472, 1094639, 1073114, 1051421, 1025478, 970970, 882991, 810452, 816842, 902369, 989582, 994823, 900135, 753940, 618912, 524621, 457225, 387130, 308915, 249585, 232757, 248909, 275239, 306411, 338146, 336985, 271785, 177843, 142497, 206235, 313775, 385762, 403503, 393823, 368614, 328197, 301032]
38385C01032J9015L7711k2023j20950j72001j41067o5118Q332N8041Q1501Q8361
38374G2834Q9639P0304L576p8045p8192L5977J48920J27148N686o0527k2177J1026
38362C26169l3688p5145k9517L3902q52j04337j39625o3884K4997M6920M1271
38351B6211P7137J37920J46276O8564m4309j09453q9113k1943K0010Q177k1361
38340A98116k7999j8177j8200k9651m1434n2879n0953m582P2067R4005R978r9332
38328C0959j07769j3297O3269M9900P557K0689P9974J14198Q6925K1689l7256
38317C16838o1481n4983m2592k5544L1482J29367J80747R9299o8647j83598j84994
38306A35894j35798q8149j3882Q9978J34326N6749o3921r5226j2833Q8738J11549
$$ y = [301032, 320047, 357758, 335735, 214785, 42784, -98283, -163401, -155069, -97028, -15527, 72834, 162473, 232777, 236353, 158308, 80116, 116093, 265013, 392161, 397847, 337320, 315143, 326169, 292481, 217336, 187819, 221721, 220869, 116532, -23093, -86977, -61980, -15060, 26211, 103348, 241268, 387544, 456108, 411799, 302346, 213233, 191290, 211300, 219477, 198116, 170117, 151940, 133740, 104089, 62655, 9776, -41177, -45759, 26308, 120313, 130291, 30959, -76810, -90107, -26838, 23062, 30619, 51308, 131282, 245480, 332405, 354094, 316838, 255357, 200374, 157782, 132238, 163720, 293087, 473834, 573133, 504486, 320888, 135894, 96, -88053, -101935, -11957, 122369, 179118, 115197, 19971, 7138, 95876, 207425]
38295B07425L1723r5072j60006q5023P0496J44600O7207m8180p0601k7539k0288
38284A4742m1210o832P1391R4729M7728K2922N8982Q1915M0661j5689m1847p0119
38272B57373j22469j44058r2181j2858L7023O9600J00278Q0627j3997r3055n2280
38261A4003O7993J26913O9962k0472n4652k5380L6847J09478J55069J29495M9513
38250F58769n605M838K8684R10o7115j16104j18817r1447n4636k3324j3530k2114
38238A80509j8094J1318K6615j0136o1935m7400N1826J56411J75158R5910j9256
38227E40926j00387j15437p4319j2446L3200M3961K2225j4072l3205p858M2963
38216C25551M9990k7689j30679j57083r2437k2919o404j65M5999R2724P2756M317
$$ y = [207425, 239148, 144076, -15930, -100953, -30457, 114143, 181350, 133170, 62569, 35030, 14742, -26468, -33300, 38091, 132820, 180548, 203470, 262452, 344367, 385028, 369339, 327492, 257373, 134904, -9154, -101335, -114193, -77170, -7570, 92708, 173335, 159338, 66283, 14003, 81996, 208909, 278871, 258399, 203747, 178367, 215214, 324692, 479761, 609256, 658769, 653164, 658002, 686686, 687596, 620481, 504377, 385560, 294113, 239477, 216153, 202623, 180509, 162415, 173733, 200348, 190212, 128277, 80877, 132703, 289114, 464272, 560182, 540926, 440539, 325102, 250783, 238337, 271537, 315498, 337723, 323651, 290446, 282588, 325551, 375541, 347852, 217173, 60090, -32347, -55266, -61670, -61835, -15836, 76888, 149644, 153961]
38204A53961l1637l577N0576R7282J28146J16822L5526p6480j32682j03597l9758
38193A94582J5722O2654Q0878K7043o6176q2649J8031J15130Q6534j3349m0728
38182C97672J8308L9495l7730j24144j25938p0675l3373j6954K2391P9642J03575
38171B52269P4771K1670l2192q3135j08078o4111M7787J54072J78545J24690N5053
38160F21341J107n7206j15316j12529k6628M9422Q774j06710j41042l8415P5922
38149A58720P9105K1736K8973R9977J20956N0378k7252m2849l3793n7155r4593
38138C04203r7295p0116n2609m4725m371Q2945J64885J66946P4118m0366q4270
38127C99345m4675J1208L6295N0852O5012K7512q1918j71777j45185m5863Q066
$$ y = [153961, 122324, 118747, 169323, 266605, 394751, 511573, 547099, 470619, 337937, 234340, 194582, 210304, 272958, 353836, 380879, 314703, 232054, 250085, 365215, 451749, 438400, 397672, 415980, 455475, 417745, 293601, 167663, 96988, 63615, 46661, 69052, 148694, 252269, 327040, 348710, 316518, 233383, 125305, 61194, 108981, 263053, 441598, 566288, 621341, 622448, 565242, 449926, 337397, 310769, 360191, 368965, 262255, 121213, 82798, 158720, 237825, 259561, 288534, 388511, 509467, 559845, 532593, 489744, 455951, 398796, 304203, 206908, 136792, 84183, 39458, 35087, 118032, 282917, 449863, 523981, 483615, 399345, 354670, 365878, 402173, 453025, 518037, 545549, 463631, 291854, 146669, 100806, 108872]
38116A08872N828L5422J05372J17893M2874k1932j3246O982j1575q182O3512J25404
38104E57224R5332K1307j3350k8554p2031r1537k3303N8792L6755n2690p2077
38093D15868j0117J3393l2170l8331L8475Q9052L4330m5534m9003l184J5673J3662
38081D42114L3239N3558L7111J8118M8558R9348J05415P4597O3479P0677M3925
38070A090139j6697m7425j8141L0395N7963O9420O8814K7002o8025j62258j77076
38059H54111r4670J9500Q3012P4780L9091J8661J0025n52O824M6292O7572J0076
38047A134722q3232r1797J2227J04310P5021j8245m7373k115J8843k4870o6306
38036A011185n3117k0193j3090j8638j2171j3624m8356q9348q3272j9629N2940
$$ y = [108872, 114700, 150122, 255494, 373387, 416261, 394329, 381083, 388065, 376490, 368308, 431820, 557224, 652556, 673863, 660513, 631959, 559928, 468391, 445088, 503880, 540635, 487945, 415868, 405751, 419144, 386974, 348643, 387118, 476170, 510500, 464966, 415963, 412779, 428452, 442114, 475353, 528911, 566022, 584140, 632698, 732046, 837461, 912058, 975537, 1046214, 1090139, 1073442, 1026017, 1007876, 1038271, 1096234, 1165654, 1234468, 1261470, 1193445, 1031187, 854111, 759441, 778941, 861953, 936733, 975824, 994485, 1004510, 1003958, 1010782, 1057074, 1124646, 1134722, 1051490, 959693, 971920, 1076230, 1151251, 1133006, 1085633, 1083518, 1102361, 1077491, 1011185, 958068, 937875, 924785, 906147, 893976, 880352, 831996, 742648, 659376, 639747, 692687]
38025F92687P2864K2081n0136o4834J2O8570M9441m5616j10398p5687J5814P6981
38013F51779P0029J4729m8523p6321m4055J9589N2162L3156L161r709k8935o4572
38001E72490p1258k3843K1606J1755p992L2384R5007Q1782p11m3805j7592k1706
37989F28117j06336j66457j04204N466L1395m907J9472J06232J25696M0425j8910
37978E55989M0995J30373J25483N3946J9007J9671k4185j12307j60693j42540
37968E05739j11591q5529k6789M4136L9492m8657j03524m6813N0975R4929J06601
37957D18969J45953J70078R0440o6156j70096j54375p0313J6561Q6500J12816
37947E80377N3754o1249j18488n0742O8399J11756M7406m2495o9159k5134K7601
$$ y = [692687, 765551, 787632, 737496, 672662, 672674, 741244, 790685, 745069, 634671, 558984, 574798, 651779, 721808, 736537, 688014, 611693, 567638, 587227, 639389, 672545, 675706, 665997, 637062, 572490, 501232, 477389, 498995, 510750, 502758, 535142, 630149, 711931, 711220, 667415, 649823, 628117, 521781, 355324, 251120, 256586, 287981, 283074, 302546, 408778, 534474, 574899, 555989, 596984, 727357, 852840, 906786, 925793, 945464, 921279, 808972, 648279, 505739, 394148, 308619, 281830, 325966, 365458, 316801, 213277, 166464, 217439, 312368, 418969, 564922, 735000, 825440, 759284, 589188, 434813, 364500, 381061, 467561, 580377, 634131, 572882, 454394, 403652, 472051, 583807, 631213, 588718, 519559, 494425, 522026]
37936E22026L2533k660k3805q496J133k5864l5814L8652J46217J46446k30j56328
37924F33810j78707j00401o2397j04392j18429j2613J61863K79628K80293J94696
37914I73351P0832o2664j60428j55035l7882Q3636P8568m5732j36337q4962L3380
37903E56727P3850K3416o859K9048M8445p888p1363o0504j3774j6847n4987m3829
37891D55435J6559K8396m7539j17573q4582J4047O3004L1293O592O1356J45036
37880E72024J51307O2638k9959n2810l4001l1081l1796R654P3083Q9883N0565
37869H29507J3790M712j0548l3770j2330N4935Q2363K4724m4426m8544j9066q679
37857H32668K1033J13062J84223J20661k7384r0785k1081N4325L8732r488j1455
$$ y = [522026, 554559, 551899, 528094, 519598, 520731, 494867, 459053, 497705, 643922, 790368, 790138, 633810, 455103, 354702, 292305, 187913, 69484, 56871, 218734, 498362, 778655, 973351, 1044183, 981519, 821091, 666056, 628174, 711810, 790378, 744646, 608309, 523347, 556727, 630577, 653993, 647134, 676182, 724627, 716739, 645376, 584872, 571098, 554251, 499264, 455435, 471994, 500390, 452851, 335278, 250696, 264743, 327747, 359040, 365632, 426988, 572024, 723331, 785969, 756010, 703200, 669199, 638118, 606322, 615976, 689059, 778942, 829507, 843297, 848009, 837461, 803691, 791361, 846296, 928659, 953383, 908957, 860413, 841347, 832668, 853701, 966763, 1150986, 1271647, 1244263, 1153478, 1132397, 1186722, 1225454, 1215966, 1204511]
37846A204511j388m0200q7921o4230J5790O0624L1666k6326p0651j00632j07230
37835H14013n4205N4617J33909R9029j3173o0033L4320J59260J40533k2543j35706
37824A150021o6101P4137Q8035l5928j37592j31312r2447q8242o7313K3276J23108
37813H39642J41130P9986N803m9566q9685j01683o7064J84O6927J07926J01509
37802A035109M2817k0889k5753J5395K0425l4879p2064k9398N0522R5742Q9087
37791A166114L4534o8035j58779j32626L627R2230L7430m8063k6721M1459J5733
37780I56903p3382p7579J0465N2210J1106P105R1726J52587J05362K3200k427
37769A257276N177m246p939J3003J287p7943j49669j28500l8039M0961P2323N2239
$$ y = [1204511, 1203123, 1162923, 1075002, 1010772, 1026562, 1087186, 1118852, 1092526, 1021875, 921243, 814013, 759808, 814425, 948334, 1047363, 1034190, 974157, 1008477, 1167737, 1308270, 1285727, 1150021, 1083920, 1158057, 1246092, 1210164, 1072572, 941260, 848813, 760571, 693258, 716534, 839642, 980772, 1060758, 1066561, 1016995, 927310, 825627, 758563, 758747, 825674, 933600, 1035109, 1077926, 1057037, 1031284, 1046679, 1067104, 1032225, 960161, 930763, 981285, 1077027, 1166114, 1200648, 1132613, 973834, 841208, 844835, 937065, 974495, 926432, 899711, 941170, 956903, 883521, 805942, 816407, 868617, 879723, 886828, 978554, 1131141, 1236503, 1259703, 1257276, 1262453, 1258207, 1250268, 1263271, 1264558, 1186615, 1036946, 908446, 870407, 911368, 983691, 1035930]
37757A035930k2145j01794r0497J7787R1370M0382m2904k8377N1748P4396K8068
37746A053964j716m008m3555j07119j03929k9670J6019L345K2000J07808J54722
37735A067861Q0317k9846m4168K2840M6557j8090q3265o2798J5771N7642K1963
37724A074784l2120k4905K8718K1810r4654k08633j74056k2310O2720Q68p3474
37713E58748k0334R8783J30172O2595J7319M1873N5219L090n9632p5093o5161
37702G47579o1743m3933K56K5086J324k3055J134M2384M7184K8406K3055J1199
37690G98876l5668o4424l196J00797J17013J6365q3513q5529k7519J2471K9511
37679G75184M8496N1085K2765N032J8748j995j03679j94633j48569J378R5175
$$ y = [1035930, 1013785, 911991, 821494, 839281, 930651, 971033, 928129, 899752, 951500, 1025896, 1053964, 1052248, 1048240, 1004685, 897566, 793637, 763967, 779986, 783331, 805331, 913139, 1067861, 1148178, 1118332, 1074164, 1097004, 1143561, 1125471, 1042206, 979408, 995179, 1052821, 1074784, 1042664, 1017759, 1046477, 1068287, 973633, 765000, 590944, 568634, 631354, 632222, 558748, 538414, 637197, 767369, 829964, 847283, 889156, 944375, 947465, 887833, 812740, 747579, 685836, 641903, 642159, 667245, 668569, 645514, 646648, 689032, 736216, 764622, 787677, 798876, 763208, 698784, 695588, 796385, 913398, 929763, 846250, 760721, 733202, 745673, 775184, 823680, 874765, 897530, 902562, 921310, 919315, 815636, 621003, 472434, 473812, 568987]
37668E68987O7689J3361J2488K1969j0024l5552P385Q4091J21559J15942J03273
37657A071168P7731K0978l3145m7898n7284j01385j27499o4732K6579J0294j09602
37646F65205j63927o1783O4266N0019n6341o8397O2759J81295J48641J9661n5881
37635G85517k9753K1558L1918K2415L6759O2468N4035P298k9831j9778K2711O2630
37623A027947R3641J28092J48352J06258r533j27706j49207n2019Q0694J45958
37613A392477J16939M3012k1124n4151m6804J0320R4934J40947R6248j3082j02274
37602A657442j09782m2649M7667J06292R9281L4495l3962n2239k7644j6283m2297
37591A620321o3721l8243Q966J5134l7638r7462r5393r691J10790J77022J34594
$$ y = [568987, 636676, 650037, 662525, 684494, 674470, 638918, 646303, 730394, 851953, 967895, 1071168, 1148899, 1169877, 1136732, 1088834, 1031550, 930165, 802666, 737934, 764513, 774807, 665205, 501278, 439495, 503761, 553780, 497439, 429042, 491801, 673096, 821737, 841398, 785517, 755764, 777322, 809240, 831655, 868414, 930882, 984917, 992215, 962384, 942606, 965317, 1027947, 1121588, 1249680, 1398032, 1504290, 1494757, 1367051, 1217844, 1165825, 1246519, 1392477, 1509416, 1552428, 1531304, 1477153, 1430349, 1440669, 1535603, 1676550, 1772798, 1759716, 1657442, 1547660, 1505011, 1552678, 1658970, 1758251, 1792746, 1758784, 1706545, 1678901, 1662618, 1620321, 1556600, 1518357, 1527323, 1542457, 1504819, 1407357, 1311964, 1302273, 1413063, 1590085, 1724679]
37580A724679K6453l8771l007P4036Q7203Q277r1178j25577p4489J5309P6985
37569A679920P4884L2780J1476M2702R0749R2681K5138p9809j62572j63511n9384
37558A585054Q9309J59381Q8657l7786q2604k5441L0647J9989l711K3798O7527
37547A914820N5976J238k1071Q374K6673j1391o6731p3723k7097J8279J7686j8212
37535A824821m5864l9908j3665P065J7520L0544M9187O4472P8235R7367R7988
37524B167762L5981p7863j50804j08400l448L7994j7399o5062j2064Q9953J18412
37513B015062M8041k7655l4845n362l734l0934m4346l2488j6020O605N8473J25406
37501B058203J45273P9732k7411q7891n9322J5020N6238L3016j1052j6471J7165
$$ y = [1724679, 1751132, 1712361, 1709354, 1783390, 1870593, 1878870, 1787692, 1662115, 1587626, 1602935, 1679920, 1754804, 1787584, 1799060, 1841762, 1932511, 2025192, 2050330, 1970521, 1807949, 1644438, 1585054, 1674363, 1833744, 1922401, 1884615, 1802011, 1776570, 1807217, 1827206, 1823495, 1847293, 1914820, 1970796, 1972034, 1950963, 1959337, 1986010, 1974619, 1907888, 1834165, 1807068, 1825347, 1843033, 1824821, 1778957, 1739049, 1725384, 1732449, 1749969, 1780513, 1829700, 1894172, 1972407, 2069774, 2167762, 2203743, 2125880, 1975076, 1866676, 1863228, 1901222, 1883823, 1818761, 1806697, 1896650, 2015062, 2063103, 2035448, 2000603, 1995241, 1991507, 1960573, 1916227, 1883739, 1867719, 1874324, 1932797, 2058203, 2203476, 2283208, 2255797, 2167906, 2108584, 2123604, 2179842, 2212858, 2201806, 2185335, 2202500]
37490B202500L7529J7397j1597j7109j3793j8309J231P3950J50735J48142O1385
37479B632061k9433o3775m7167L090P7515J26494Q2899k8303q5348k9320M5232
37468B683945K6763n1932p3256r076N7637O2701K3900k0668n7753p2520m1319
37457B528422K9824R9272J30755J13595N3469k2240o2743l3696N0326J51379K33833
37446C272196K47207J49587l356o7605J2198J05130P3955j7539j3001P5733R2886
37435C927391J3261m236J13872K16571J56632R013o1310l5837j1761j5869Q545
37424D316272O8327J01258Q1572M9394L8929M8682P0677Q8490O9523J8694O361
37413D958179P3567J43422J08482j5166j03719q4092J436Q0319J18104J00073
$$ y = [2202500, 2240029, 2257426, 2245829, 2228720, 2214927, 2196618, 2197849, 2271799, 2422534, 2570676, 2632061, 2602628, 2538853, 2491686, 2494776, 2572291, 2698785, 2781684, 2753381, 2668033, 2638713, 2683945, 2710708, 2658776, 2585520, 2576444, 2634081, 2696782, 2720682, 2700014, 2642261, 2569741, 2528422, 2558246, 2657518, 2788273, 2901868, 2955337, 2933097, 2870354, 2836658, 2886984, 3038363, 3272196, 3519403, 3668990, 3665634, 3598029, 3610227, 3715357, 3789312, 3771773, 3758772, 3834505, 3927391, 3940652, 3936416, 4050288, 4266859, 4423491, 4432504, 4371194, 4335357, 4323596, 4307727, 4316272, 4384599, 4485857, 4567429, 4616823, 4655752, 4704434, 4775111, 4863601, 4933124, 4951818, 4958179, 5031746, 5175168, 5283650, 5268484, 5164765, 5080673, 5082109, 5162428, 5280532, 5380605]
37403E380605K5591n9890r1510o5451m4336o9533j14638j34539j12930n1599L7640
37392D699410J13238J19852M8660m2738q3951n0149K6687P9958N5039l0613q4778
37381D850615l8082O5686J20825R0480L3261N640K416N414K6572P1934J12183
37370E346944J24349J25163J28632J06276L3884m5786o0357o911L5327J0701l4818
37359E763404k1850L9753N9182N146l2973K4904J16979J22638M6021Q471N6312
37348F187987R5892N8801J5839N2978J30721J59389J36698J09807O8150j2480
37338G003782p2601m0446L4597M6427N532J4681Q4683J19877R6368J02280J62864
37327G558044J74517Q1557j1924M945R1951J46209J54523J54430J24312L2847
$$ y = [5380605, 5406196, 5346306, 5254796, 5189345, 5145009, 5075476, 4960838, 4826299, 4713369, 4661770, 4699410, 4812648, 4932500, 4981160, 4938422, 4854471, 4804322, 4831009, 4910967, 4966006, 4935393, 4850615, 4812533, 4878219, 4999044, 5089524, 5122785, 5128425, 5130841, 5136255, 5162827, 5234761, 5346944, 5471293, 5596456, 5725088, 5831364, 5865248, 5819462, 5759105, 5752194, 5787521, 5798222, 5763404, 5741554, 5781307, 5840489, 5845635, 5812662, 5837566, 5954545, 6077183, 6123204, 6131675, 6187987, 6283879, 6342680, 6358519, 6411497, 6542218, 6701607, 6838305, 6948112, 7016262, 7003782, 6931181, 6890735, 6925332, 6971759, 6977291, 6991972, 7076655, 7196532, 7292900, 7395180, 7558044, 7732561, 7814118, 7802194, 7807139, 7899090, 8045299, 8199822, 8354252, 8478564, 8511411]
37317H511411n3717l7233O0549J23007J11398J07562J66040K18388J74226N8030
37307I439661j4656K1203J09391J51417J26078R9168J17793J42902J23782R9567
37297A0416306J51918K65003L21465K65322J86447J90047K50585K67596K18785
37288A2533474J73855J77230J98522K02208J96700J95308J83731J57912J56859
37279A4175799K16253L00845L23701K50435J60759J69499K84368L83639L59313
37270A6624611K43854J52723J35618J48395J54613J76263K30716K84262K98303
37261A8449358K80251K67650K89814L45399L86977L48234K35282J59043K03776
37252B0965784K98945L22732K99167L50823M63868M77362L49785K55197L24638
$$ y = [8511411, 8457694, 8420461, 8481010, 8604017, 8715415, 8822977, 8989017, 9207405, 9381631, 9439661, 9425005, 9446208, 9555599, 9707016, 9833094, 9932262, 10050055, 10192957, 10316739, 10416306, 10568224, 10833227, 11154692, 11420014, 11606461, 11796508, 12047093, 12314689, 12533474, 12707329, 12884559, 13083081, 13285289, 13481989, 13677297, 13861028, 14018940, 14175799, 14392052, 14692897, 15016598, 15267033, 15427792, 15597291, 15881659, 16265298, 16624611, 16868465, 17021188, 17156806, 17305201, 17459814, 17636077, 17866793, 18151055, 18449358, 18729609, 18997259, 19287073, 19632472, 20019449, 20367683, 20602965, 20762008, 20965784, 21264729, 21587461, 21886628, 22237451, 22701319, 23178681, 23528466, 23783663, 24108301]
37243B4108301M60080N26753N70768O82793P80058P26728N88173N56137O60497
37234B9660288P53270P61090P56793P75371P58668P23569P96940J007215J198099
37225C7191303J241799J212763J256907J393485J539933J645663J709546J736223
37217D8927622J761628J862232K059900K270372K418765K551829K758795L031132
37209F7642275L287702L505114L733869L998901M267523M523740M808911N166194
37201A00934229N582351O002893O387790O746505P127039P567047Q051618Q528542
37193A56928014Q962432R354455R714765J0044654J0338877J0564185J0638053
37186B26545435J0478169J0076921R474501Q656795P551801O147720M538312K811424
$$ y = [24108301, 24568381, 25095134, 25665902, 26348695, 27128753, 27855481, 28443654, 28999791, 29660288, 30413558, 31174648, 31931441, 32706812, 33465480, 34189049, 34985989, 35993204, 37191303, 38433102, 39645865, 40902772, 42296257, 43836190, 45481853, 47191399, 48927622, 50689250, 52551482, 54611382, 56881754, 59300519, 61852348, 64611143, 67642275, 70929977, 74435091, 78168960, 82167861, 86435384, 90959124, 95768035, 100934229, 106516580, 112519473, 118907263, 125653768, 132780807, 140347854, 148399472, 156928014, 165890446, 175244901, 184959666, 195004320, 205343197, 215907382, 226545435, 237023604, 247100525, 256575026, 265231821, 272783622, 278931342, 283469654, 286281078]
37178B86281078R67229r90681k944606m727391o272319p624985q813562r773200
37170B46101563j0415011j0733024j0824427j0810144j0731737j0528941j0140302
37163A71917977r618759r099247q644428q187932p664498p129628o685900o336142
37155A08551443n988131n588165n177161m810351m481360m145667l784437l429518
37147G1146653l141328k959892k859395k759564k602669k408344k232596k093017
37139E0089848j967558j851321j767122j712309j635111j492851j320888j213272
37131C7129416j218466j266403j230646j073739q96144q10275q01089p66012o69179
37122B8397463n80519n61027n86460o04054n93493n46005m54562l58965l28864
$$ y = [286281078, 287248307, 286257626, 283313020, 278585629, 272313310, 264688325, 255874763, 246101563, 235686552, 224953528, 214129101, 203318957, 192587220, 182058279, 171917977, 162299218, 153199971, 144555543, 136367611, 128703113, 121573485, 114887585, 108551443, 102563312, 96975147, 91797986, 86987635, 82506275, 78360608, 74576171, 71146653, 68005325, 65045433, 62186038, 59426474, 56823805, 54415461, 52182865, 50089848, 48122290, 46270969, 44503847, 42791538, 41156427, 39663576, 38342688, 37129416, 35910950, 34644547, 33413901, 32340162, 31444018, 30633743, 29832654, 29066642, 28397463, 27816944, 27255917, 26669457, 26065403, 25471910, 24925905, 24471343, 24112378, 23783514]
37113B3783514l60161l61261k92168k37349k68124l07584k32787o6647L8647j626
37103B1694454j11988j63373j06378M933P4001N0480j0162n46R7591J78332J59755
37092B1867099R4462O1928L2995m9892j29705j18184q0710j68803l65955m72288
37082B0670947l87100k52212k40496l34692m11458m35703m55260m73047m44194
37073A7236785l73870l24035l25974l46484l38662k90419k32374k14624k51960
37064A4538383k87926k56952j82191j44404j47862j09652j0679M9486P868n5998
37054A3400073n4416l5951q4151j49919j22724k8012j0768j25035k66220l30348
37044A2192529l30507l23455l14302k80027k25096j78662j78636k62805m15223
$$ y = [23783514, 23423353, 23062092, 22769924, 22532575, 22264451, 21956867, 21724080, 21657433, 21696080, 21694454, 21582466, 21419093, 21312715, 21317648, 21391649, 21442129, 21431967, 21431421, 21529012, 21707344, 21867099, 21961561, 22023489, 22056484, 22006592, 21876887, 21758703, 21677993, 21509190, 21143235, 20670947, 20283847, 20031635, 19791139, 19456447, 19044989, 18609286, 18154026, 17680979, 17236785, 16862915, 16538880, 16212906, 15866422, 15527760, 15237341, 15004967, 14790343, 14538383, 14250457, 13993505, 13811314, 13666910, 13519048, 13409396, 13398717, 13448203, 13456071, 13400073, 13345657, 13309706, 13225555, 13075636, 12952912, 12924900, 12914132, 12789097, 12522877, 12192529, 11862022, 11538567, 11224265, 10944238, 10719142, 10540480, 10361844, 10099039, 9683816]
37035I683816n20660m55541k50828q9410j00513k16255k74188k10020j00514n1981
37025G413906r3461j64563j81814j27019p1392q6362j42699j51471j00673p5206
37015F219246j20637j67667j39099o4474k6687m4906p5496r0718q9314n6573J6065
37004E359740Q3366Q1626J2775n4754o9778m4754k3478l8530r3346j52140j58551
36993D902176r8020k6152j06o366k418l83m1717j04338j14330n6199L231J7704
36981D473082J5623K4885J7004k9188p0888o3991l3243k0760q468L6620P1290
36970D411966J7908j02978j65859r6277K9067Q1853L8380j5855j3504K2694L8404
36959D245799K3253o58k7100n7437o3238j2984N9073O8599n850p5167n1374L0770
$$ y = [9683816, 9163156, 8707615, 8456787, 8367377, 8266864, 8050609, 7776421, 7566401, 7465887, 7413906, 7320445, 7155882, 6974068, 6847049, 6775657, 6689295, 6546596, 6395125, 6294452, 6219246, 6098609, 5930942, 5791843, 5727369, 5700682, 5655776, 5580280, 5489562, 5400248, 5343675, 5359740, 5443106, 5524732, 5537507, 5482753, 5412975, 5368221, 5344743, 5306213, 5212867, 5060727, 4902176, 4804156, 4778004, 4777898, 4771532, 4769114, 4768731, 4727014, 4622676, 4508346, 4452147, 4455378, 4473082, 4488705, 4513590, 4530594, 4501406, 4430518, 4366527, 4333284, 4312524, 4304056, 4340676, 4411966, 4429874, 4326896, 4161037, 4064760, 4093827, 4175680, 4214060, 4198205, 4184701, 4207395, 4245799, 4269052, 4268394, 4241294, 4183857, 4120619, 4107635, 4166708, 4235307, 4229457, 4154290, 4102916, 4133686]
36947D133686O2570P702o6615r3335o9649j7549M3910P4842M1645q413J7251J08201
36935D234246J28511Q048j27178j10137M0407J54649J37571M8065l3195r7086
36925D383901j49086j61199j20629n5803J4368R2111J45569J23437N4599M5753
36915D373021J29516J96478J45651L0365k9706k3226l1290p0348o6463P370P2546
36904D733914O1046J1974K140L7357O9363Q1673R5472J07992Q9272M6361L5515
36893E372079Q5856J50661J67480J38298J11037J02724R1832Q0110J00789J47683
36883F548549J54140Q2870n170k0132M6119J26616J72244J82944J62288J05802
36873G556270L9653J4596M4093Q8535J13554J26991J45086J56754J40714R9653
$$ y = [4133686, 4196256, 4203958, 4137343, 4044008, 3974359, 3956810, 4000720, 4075562, 4117207, 4108794, 4126045, 4234246, 4362757, 4370805, 4243627, 4133490, 4173897, 4328546, 4466117, 4514182, 4480987, 4383901, 4234815, 4073616, 3952987, 3897184, 3911552, 4003663, 4149232, 4272669, 4327268, 4373021, 4502537, 4699015, 4844666, 4875031, 4845325, 4822099, 4790809, 4720461, 4653998, 4661368, 4733914, 4794960, 4806934, 4809074, 4846431, 4915794, 4997467, 5092939, 5200931, 5290203, 5336564, 5372079, 5457935, 5608596, 5776076, 5914374, 6025411, 6128135, 6219967, 6300077, 6400866, 6548549, 6702689, 6785559, 6780389, 6760257, 6806376, 6932992, 7105236, 7288180, 7450468, 7556270, 7595923, 7610519, 7654612, 7743147, 7856701, 7983692, 8128778, 8285532, 8426246, 8525899]
36863H525899O7302Q6741J67130K50631K56534J86198J39390J80523K42616K35128
36853A0338092J92062K10852K85291L26181L29248L78304M73608N10030M61487
36844A3505155M33937M76526M93883M29328L84246M45154N33250N59477N97207
36835A7858163P38573Q92260R16013Q70139R29786J089394J175425J150994J184005
36826B6804752J362657J547400J601638J605496J716658J934248K133478K268997
36818D0975324K419987K651948K927792L170237L363761L573940L872361M248278
36810F7203628M613046M903157N144986N391390N644365N888935O144031O401579
36802A11335117O566397O551670O391304O153410N786780N180604M343777L379538
$$ y = [8525899, 8593201, 8679942, 8847072, 9097703, 9354237, 9540435, 9679825, 9860348, 10102964, 10338092, 10530154, 10741006, 11026297, 11352478, 11681726, 12060030, 12533638, 13043668, 13505155, 13939092, 14415618, 14909501, 15338829, 15723075, 16168229, 16701479, 17260956, 17858163, 18596736, 19488996, 20405009, 21275148, 22204934, 23294328, 24469753, 25620747, 26804752, 28167409, 29714809, 31316447, 32921943, 34638601, 36572849, 38706327, 40975324, 43395311, 46047259, 48975051, 52145288, 55509049, 59082989, 62955350, 67203628, 71816674, 76719831, 81864817, 87256207, 92900572, 98789507, 104933538, 111335117, 117901514, 124453184, 130844488, 136997898, 142784678, 147965282, 152309059, 155688597]
36794A55688597K300167J032643l79282j746011k941984l988937m891890n567362
36786A39505941o008210o349533o661220o817141o693723o380944o066086n800053
36778H8729031n505240n143708m758791m398435m088229l833723l589825l300134
36770E4110946l013512k850006k788774k636557k312309k008036j913061j919035
36762C4669656j794395j542980j362722j312496j260693j150153j077043j072721
36754B4096453j023136q79015p67087p94409q77287q65892p41657n98660m99254
36745A7050056m32700l78341l45423l57999m19826m86830m94816m42119m03561
36736A3288441m16521m13553l40172k66164k72253k96713k37526j52985j87453
$$ y = [155688597, 157988764, 159021407, 158642125, 156896114, 153954130, 149965193, 145073303, 139505941, 133497731, 127148198, 120486978, 113669837, 106976114, 100595170, 94529084, 88729031, 83223791, 78080083, 73321292, 68922857, 64834628, 61000905, 57411080, 54110946, 51097434, 48247428, 45458654, 42822097, 40509788, 38501752, 36588691, 34669656, 32875261, 31332281, 29969559, 28657063, 27396370, 26246217, 25169174, 24096453, 23073317, 22194302, 21427215, 20632806, 19755519, 18889627, 18147970, 17549310, 17050056, 16617356, 16239015, 15893592, 15535593, 15115767, 14628937, 14134121, 13692002, 13288441, 12871920, 12458367, 12118195, 11852031, 11579778, 11283065, 11045539, 10892554, 10705101]
36727A0705101l20925l80535l09568k33780k26881k07192j33798j10945j91902
36718H589575k50068j75917o0879m4740r9273j13093r3952j26137j92146j94891
36708G238479j24464o5547n7886o7471p8598j04118j20282r8749q9128j58451
36698F273785k53742k43368j13597j1055m5223j42817j64086r7113n4353j00068
36688E048363j60771j30807j9644N6257K2624o4881j10126j05780j13674j46680
36678D274881j53330j17951q7919q2562o1485j5048J827k8471m0652n808o047
36667C677435j00661j93936j52894j5207M4290m6909j61114j40842J0215J48107
36657C068484J56699N4369n4195j00202j00333q6333m0338M1638O8929m5716k10236
$$ y = [10705101, 10384176, 10003641, 9694073, 9460293, 9233412, 9026220, 8892422, 8781477, 8589575, 8339507, 8163590, 8102711, 8057971, 7958698, 7845605, 7751653, 7625516, 7433370, 7238479, 7114015, 7048468, 6990582, 6923111, 6844513, 6740395, 6620113, 6521364, 6432236, 6273785, 6020043, 5776675, 5663078, 5652023, 5606800, 5463983, 5299897, 5202784, 5148431, 5048363, 4887592, 4756785, 4737141, 4793398, 4816022, 4751141, 4641015, 4535235, 4421561, 4274881, 4121551, 4003600, 3915681, 3833119, 3771634, 3756586, 3758413, 3729942, 3689290, 3683482, 3677435, 3576774, 3382838, 3229944, 3214737, 3259027, 3212118, 3051004, 2910162, 2920377, 3068484, 3225183, 3279552, 3225357, 3125155, 3024822, 2938489, 2898151, 2939789, 3008718, 2963002, 2752766]
36646B752766k17905l6383J12628N5733q7596j01373P46K9913o1762j25068p1276
36635B250423O311J2417j1705k196O506l4690p9673n5640J6836N5427L4853P139
36623B206008J6672M1541K2123o5121j60197j62098m5370Q8394J20287N4500o085
36612B110654k601L1420M8921L5720j7698j06944j72058j47244n8093J1988M7242
36601A781307R0131J11275K6656j23434j63433k9614J05386O5133q2840j41768
36591A638799o3347L4852P3245P4332M5627m1065j35868j22265Q396J13893R5551
36580A722150L1380L5785P7453M5186o0229j22802q9550l6547l1510l2524J6273
36569A555065O6026K9635p1152j21735p5376p892Q219l966m497k3188q8483j32216
$$ y = [2752766, 2534861, 2498478, 2611106, 2666839, 2579243, 2477870, 2478616, 2508529, 2446767, 2321699, 2250423, 2256734, 2269151, 2257446, 2255250, 2261756, 2227066, 2147393, 2091753, 2108589, 2164016, 2198869, 2206008, 2222680, 2264221, 2286344, 2221223, 2061026, 1898928, 1853558, 1941952, 2062239, 2116739, 2110654, 2108053, 2139473, 2188394, 2224114, 2206416, 2099472, 1927414, 1780170, 1722077, 1734065, 1781307, 1871438, 1982713, 2009369, 1885935, 1722502, 1692888, 1798274, 1863407, 1780567, 1638799, 1575452, 1610304, 1683549, 1757881, 1803508, 1762443, 1626575, 1504310, 1512706, 1626599, 1722150, 1753530, 1789315, 1866768, 1911954, 1851725, 1728923, 1639373, 1602826, 1571316, 1538792, 1555065, 1621091, 1650726, 1579574, 1457839, 1382463, 1374571, 1382790, 1378824, 1374327, 1351139, 1262656, 1130440]
36557A130440p0850M4025O9249k6244j08011o6501L1496N0538j8962o1102n752
36546I68326Q3355J06682N8390K0696M9287J03576J06315M9389L1k027j697m6719
36534A495604r4480o4829L5980J14468J08721M2459l7439j05457j34075j03582
36524A257370n2855m4634o0852j7547Q7261J39174P4439j6845l3678j9278o5086
36513A247469j29642q9701N2974J51920J18280K7763j2257p115k7675q4751j19856
36502A127409r5824m3674j9300l7578n3071p182R5231J65753J16431l4176j65595
36491A048424j75363p7372K4727M6483l250m9848m5121j6997j3343j8629K3055
36480G42766J01636J26950N5815l0952l7800J0796K1012k1074m2361j3639P321
$$ y = [1130440, 1059590, 1103615, 1172864, 1146620, 1038609, 972108, 1003604, 1054142, 1035180, 974078, 968326, 1051681, 1158363, 1216753, 1237449, 1286736, 1390312, 1496627, 1546016, 1546047, 1544020, 1542323, 1495604, 1401124, 1336295, 1372275, 1486743, 1595464, 1637923, 1600484, 1495027, 1360952, 1257370, 1204515, 1159881, 1099029, 1081482, 1168743, 1307917, 1382356, 1365511, 1331833, 1312555, 1247469, 1117827, 1028126, 1081100, 1233020, 1351300, 1379063, 1366806, 1359691, 1332016, 1247265, 1127409, 1031585, 987911, 968611, 931033, 877962, 870780, 966011, 1131764, 1248195, 1214019, 1048424, 873061, 795689, 820416, 866899, 863649, 813801, 768680, 751683, 738340, 719711, 742766, 844402, 971352, 1027167, 996215, 958415, 969211, 990223, 969149, 926788, 913149, 920470]
36469I20470j9820n2521l8020J1408N2292O8929O3148K8585k6904o6295o6405
36458H74867n0504m8290m8365k2979J7697K9272j1636p4818j00204n2086M2533
36447E55487J14555J25611J06575R7675P3578j6969j44201k03239j49095n7210
36437E02767r588J3968O9293J27418J09409K1856l3772k176M9336K9913n1513
36426H26911j04055o6795L3151J17697J26516O3556l920r205L2409L1682n6089
36415I91858j51320j41563l6635L8431J6775k0939K3629J14211J36355O8996M070
36404A043868j875L571k2084l2047J9141O9941K7148q4814j42236q9527n313K1787
36392H07560J2123M2287J18410J62880J20536L0833k2081o476L2052L5105l070
$$ y = [920470, 900650, 848129, 810109, 821517, 873809, 942738, 1005886, 1034471, 1007567, 941272, 874867, 824363, 776073, 727708, 704729, 722426, 751698, 740062, 665244, 565040, 512954, 555487, 670042, 795653, 902228, 999903, 1073481, 1056512, 912311, 709072, 559977, 502767, 493179, 507147, 576440, 703858, 813267, 835123, 801351, 799175, 848511, 878424, 826911, 722856, 656061, 689212, 806909, 933425, 996981, 993061, 983856, 1016265, 1047947, 991858, 840538, 698975, 662340, 700771, 717546, 696607, 720236, 834447, 970802, 1039798, 1043868, 1041993, 1045564, 1023480, 991433, 1010574, 1080515, 1107663, 1022849, 880613, 791086, 785773, 807560, 819683, 861970, 980380, 1143260, 1263796, 1294629, 1272548, 1266072, 1298124, 1333229, 1330159]
36381A330159m1855m4832o380N2179Q4463L8469p7262j58534j05087L4672R6851
36370A202843J3570r2012q4168o721L447o1780p6649J1053R6224P3550k3207q9945
36358I66205q5566m4233j0540j1048m8632q6336p2603r405M3568N0666L4893J2083
36346G39052m1543j17573j39374n8759N8683J05950N9290j9414o8815o6284j7891
36335D33322L5012L3615k0609m4201J4826Q7662Q2738K8896K4746P2552P5089
36324H23648m21o8972o8104m8366p0542r7195n7592L4627R8909R1091L3278l2740
36312F37621p1158n4664Q441O5093P7623P3202Q8542R1210K1917r2581j44946
36301G00300q7212P4J8507k0587l3856N611M6401N2546M5411L8964L716o6206
$$ y = [1330159, 1288304, 1243472, 1237092, 1289271, 1373734, 1412203, 1334941, 1176407, 1071320, 1105992, 1202843, 1216413, 1124401, 1040233, 1033512, 1036959, 975179, 898530, 909583, 1005807, 1079357, 1056150, 966205, 880639, 836406, 825866, 814818, 766186, 679850, 607247, 597842, 641410, 692076, 726969, 739052, 697509, 579936, 440562, 381803, 440486, 546436, 605726, 586312, 517497, 451213, 433322, 468334, 501949, 481340, 437139, 451965, 539627, 622365, 651261, 676007, 748559, 823648, 823227, 754255, 686151, 637785, 567243, 470048, 412456, 447083, 545992, 637083, 670361, 637621, 566463, 511799, 520240, 585333, 662956, 736158, 824700, 915910, 937827, 845246, 700300, 613088, 613162, 631669, 611082, 577226, 582837, 629238, 681784, 727195, 766159, 769875, 703669]
36289G03669j06959o3882J9064N3376L0301K2102O2168R5690O7500l183o3244
36278H16602q8392p6792l1876J4511J2193l4683n5966k1875m596o9647j57231
36267C02248j57547p3372j2819k8834n9692l8689K5165R8094J68585K06795J56831
36256E86765K8319o3006j8151J09134J63593P1457p5644j28808m5308P2082R3699
36245G94132O440q1910q4026l7524l3278q0415j10136r2629o5401m2665J1520
36234A84108R2016J22907P0273J2137L3076J03444J27409P0064k2257r3065j12608
36223E87504p6041j4260K3479L3680N9001R1160N0504p3875j50622p6932M7663
36212E01261N1323n1464q7151J5O7656J2992o5130k8981Q9538J49428R6728r5
$$ y = [703669, 596710, 532828, 551892, 605268, 635569, 657671, 719839, 815529, 883029, 879846, 816602, 728210, 651418, 619542, 634053, 646246, 611563, 555597, 533722, 529126, 459479, 302248, 144701, 71329, 58510, 29676, -30016, -68705, -43540, 54554, 223139, 429934, 586765, 615084, 552078, 533927, 643061, 806654, 878111, 802467, 673659, 628351, 700433, 794132, 800572, 718662, 634636, 597112, 563834, 483419, 373283, 280654, 215253, 172588, 184108, 276124, 399031, 469304, 481441, 514517, 617961, 745370, 815434, 793177, 700112, 587504, 511463, 497203, 520682, 554362, 613363, 704523, 755027, 681152, 530530, 453598, 501261, 552584, 501120, 413969, 413984, 481640, 494632, 429502, 400521, 490059, 639487, 736215, 736120]
36200G36120o5336p7296m1690J7540N1423L0377j0217j3059K3044M7913L2883
36189G31702J866p649J1291L1077K1252j0609j9031J5818M3979J1690m6107n0379
36177G34900r313j1353o9463q0293R491R9014P5746k1815p6862o0446k4627R913
36165E74892M5995L4617o7761j86218j92541q3237J5163K2076j9263m5432m5865
36154E2426j4145O6739J56524J68796Q8429j814m1240n4198o6227n2229r053J3550
36142C07558N554L0432J07726J50870R4350K430k9800j2241q141j0314K8944Q6013
36130G53381Q5939J5803o5315j12397j16787o8071K3539Q5372N1302l1848n0281
36119E70637K1494R2465R2544N5780L7986K5312k4661r5721j21969p3084N186
$$ y = [736120, 670784, 593488, 551798, 569338, 620761, 651138, 640921, 627862, 650906, 698819, 731702, 733568, 725919, 737210, 768287, 789539, 778930, 759899, 775717, 819696, 831386, 785279, 734900, 725587, 714234, 644771, 564478, 573969, 672983, 748729, 726914, 650052, 589606, 564979, 574892, 620887, 655504, 587743, 401525, 208984, 125747, 140910, 162986, 143723, 98291, 52426, 38281, 105020, 261544, 430340, 518769, 516955, 475715, 421517, 355290, 303061, 294008, 307558, 313112, 343544, 451270, 602140, 696490, 698920, 669120, 656879, 648738, 638424, 667368, 753381, 839320, 855123, 789808, 677411, 560624, 492553, 516092, 601464, 652766, 620918, 570637, 592131, 684596, 777140, 832920, 870906, 896218, 871557, 775836, 653867, 580783, 585969]
36108E85969M1883J8327j7685j9065k473j4360m6473m0977R954L5837p251o6485
36096D77201p5024m5811k4158l389M1281Q4019R0339Q3160Q7193N7540l8839j16830
36084F16682o8204O2033J21711O7667M946o3o903o1070r6063m6338L8703O9427
36072G02528L6937k699r793K1494P4344R9994N1867m0523r0050o8517l9096n2016
36060F84470q4765j07426j17033p8978N8564K41708L11507K01402M1835q649M9128
36049A191763J11568J24556R1809J9991m6260j7371J08855J88929J20141L470
36039A897451p378O1362P5385L0872M1037J14203J33000O3994J2349L1832L9948
36028B494055k1167p8586n5183Q458L0606K349l1821l5719J1446R2534J17265
$$ y = [585969, 627852, 646179, 628494, 609429, 606956, 592596, 546123, 505146, 515100, 550937, 543686, 477201, 402177, 356366, 332208, 328819, 370100, 454119, 544458, 627618, 714811, 772351, 733512, 616682, 548478, 610511, 732222, 799889, 804835, 804772, 797869, 736799, 640736, 594398, 633101, 702528, 739465, 736766, 726973, 748467, 822811, 922805, 974672, 934149, 844099, 775582, 736486, 684470, 599705, 492279, 375246, 296268, 354832, 596540, 908047, 1109449, 1151284, 1142635, 1191763, 1303331, 1427887, 1519696, 1539687, 1493427, 1476056, 1584911, 1773840, 1893981, 1897451, 1890073, 1951435, 2026820, 2057692, 2098729, 2212932, 2345932, 2409926, 2422275, 2454107, 2494055, 2472888, 2394302, 2339119, 2347577, 2378183, 2380532, 2348711, 2312992, 2324438, 2416972, 2534237]
36017B534237P480j59413k08042j04194j0499m7154j31890j42847j07330j08377
36007A521971j15607n5538K7362L3494j6426j9634K2656J0334o7572j00891m0305
35996A199844K6423K8014J6515N2215Q6625M9910j9481l1103J3581K7098l0331
35985A419310j04303j33615j15176p1811j6390L0694L8630R651j2322l564O545
35974A047649l451M043O1947J17046Q8591J030k8238M3267J10918O9587l8230
35963A474159r4211p2471m6832n7488o7000m9311l1945k8606p600L9924O4857
35952A123476L1826k3552m3900j4688M6549J16992J54360J09199l921r0102p7392
35941A328847m034M1247L1799N175j5292l5184l7410J4704J07056J60121J16921
$$ y = [2534237, 2541717, 2382304, 2174262, 2070068, 2059569, 2012415, 1880525, 1737678, 1630348, 1521971, 1406364, 1350826, 1378188, 1411682, 1395256, 1375622, 1398278, 1408612, 1341040, 1240149, 1199844, 1226267, 1254281, 1270796, 1323011, 1409636, 1459546, 1440065, 1408962, 1422543, 1449641, 1419310, 1315007, 1181392, 1066216, 994405, 978015, 1008709, 1047339, 1056990, 1044668, 1041104, 1047649, 1044198, 1048241, 1110188, 1227234, 1315825, 1316855, 1288617, 1331884, 1442802, 1512389, 1474159, 1379948, 1307477, 1260645, 1203157, 1136157, 1086846, 1054901, 1026295, 1018695, 1058619, 1123476, 1155302, 1131750, 1087850, 1073162, 1119711, 1236703, 1391063, 1500262, 1496341, 1406239, 1328847, 1324813, 1366060, 1397859, 1403034, 1387742, 1352558, 1315148, 1329852, 1436908, 1597029, 1713950]
35930A713950J8947l6236l938O6620J01365Q4501N1046J5814m2766j17540j44483
35919A707280q3132Q958L7093j1937o3930n7756j068O1304Q1356K5538q2213j51296
35907A470197j22677n4920l8555n7940l9326l710l3547r6372o7154M7038Q3812
35896A086846r537p1972M924Q4772J0722j32278j63030r0106m9736n1617p815
35885F11173M6025m466j07314q3836O7792J42101N3051l4371R393P1617J3692
35874G84857q1328n2209O6176R6534p283j05914q8756j3940n656q8399j60269
35863C43813j12149L6055J33886P0104p5881j26231m2480L2116q648q9147q5959
35852G5479k824P1150R5300P9601K0973o8614j19884q0726K700N2134O4761Q4378
$$ y = [1713950, 1732897, 1696661, 1692723, 1759343, 1860708, 1945209, 1996255, 2012069, 1969303, 1851763, 1707280, 1624148, 1633106, 1670199, 1658262, 1594332, 1536576, 1535508, 1596812, 1678168, 1703706, 1621493, 1470197, 1347520, 1292600, 1254045, 1196105, 1156779, 1153069, 1119522, 1023150, 955996, 1003034, 1086846, 1077309, 1005337, 1010261, 1095033, 1105755, 973477, 810447, 720341, 670605, 618988, 611173, 657198, 652732, 545418, 461582, 529374, 671475, 724526, 690155, 699548, 771165, 784857, 703529, 651320, 717496, 814030, 806747, 700833, 612077, 598137, 592481, 504082, 343813, 231664, 267719, 401605, 471709, 395828, 269597, 227117, 259233, 250585, 161438, 75479, 72655, 143805, 239105, 318706, 339679, 271065, 151181, 70455, 73155, 125289, 190050, 274428]
35840B74428J08338R8219M9719j2700p3627j04729o1303L4661P4216M955p3116
35829C19061n0180K5341L9306Q236L4787J03433Q8030k9644j08707n8180L9812
35818D11295P4715N9138O3639R2155J01357Q2303N4904K2727j9964p2590j43301
35807G26378k27441k55598j42570P2015K12920J65166K0647m2504J9051R1730
35797F39794P7180M892l2290N704P7932J21156J15711R4777R1782R1997N9742
35786A348377O923o065M9263J24644J52797J22663P4551M2724K8296J8814J3491
35775A976478K2585M1342L4787k2670q6979p2647K6828J00664N9256m0477q5017
35764A954150p0069p3227r9007q3438m2740o8047j47951j48333k4926Q6736P1778
$$ y = [274428, 382766, 480985, 530704, 518004, 444377, 339648, 278345, 313006, 387222, 392177, 319061, 268881, 294222, 333528, 341764, 376551, 479984, 568014, 538370, 429663, 371483, 411295, 486010, 545148, 608787, 700942, 802299, 884602, 939506, 962233, 942269, 869679, 726378, 498937, 243339, 100769, 172784, 385704, 550870, 571517, 529013, 548064, 639794, 716974, 721866, 689576, 695280, 773212, 894368, 1010079, 1104856, 1196638, 1288635, 1348377, 1355300, 1349235, 1398498, 1523142, 1675939, 1798602, 1873153, 1915877, 1944173, 1962987, 1976478, 1999063, 2040405, 2075192, 2052522, 1965543, 1892896, 1919724, 2020388, 2079644, 2039167, 1954150, 1884081, 1810854, 1711847, 1628409, 1585669, 1517622, 1369671, 1221338, 1196412, 1283148, 1354926]
35753A354926n980l9101m0975o1892o2235q565Q123q9601j91630j41255O401N6454
35741G84670k2120o3877J1494Q2765M7404j7400m085M9580L7340n3291j43585
35730G08895j64726r6570K9788J22936R8566k039m2079K1559P5120K7036n6395
35719G22091p2283l7365k3063j9690J6676M3066j8557j37549j95735j42051l5760
35708I9780N0514Q6181N8794j7249p6982o9280l2508l0034l6336J5669R2329Q2854
35696B23732k2506r3031l5776Q0557J27181O4819n0841j42043j44493m1325Q7008
35685E3282J11664J1846p4430j9222J24283J89994J04129m9965j53052j64128
35675A34401j13284m3511J6675N2999N7649K1856n0094j12786r8783L708J15782
$$ y = [1354926, 1348946, 1309845, 1268870, 1206978, 1144743, 1136178, 1144301, 1054700, 863070, 721815, 728216, 784670, 762550, 698673, 710167, 792932, 840336, 822936, 818851, 868431, 905771, 852480, 708895, 544169, 447599, 477387, 600323, 698889, 696850, 654771, 676330, 751450, 778486, 722091, 649808, 612443, 589380, 569690, 586366, 629432, 610875, 473326, 277591, 135540, 99780, 150294, 236475, 295269, 278020, 201038, 131758, 99250, 69216, 32880, 48549, 140878, 223732, 201226, 108195, 72419, 152976, 280157, 344976, 294135, 152092, 7599, -33726, 53282, 164946, 176792, 102362, 83140, 207423, 397417, 501546, 451581, 298529, 134401, 21117, -22394, -5719, 47280, 104929, 126785, 76691, -36095, -134878, -131170, -15388]
35664a5388J45749Q5609k257p1903j21035j44442j17677m0850M2909R3531J11108
35653c4646J10594Q8383M2050L993J5581O3596P8083J7362o9920j06200r4331
35642A14545j06514j53399j39398l855J55054J88025R4487R347j892j1083o3661
35631H1656q1987j1955M8944q954j16137j10936J8677J22516J14501P2011P8548
35620B06884R4873N0911l1769q7396j06954j14918r7158l2316L6823M1303j3905
35609e3622n0422j7154N6942J09738J04894M5581l1532p3153n2486N71L5513M2522
35597A17392M9942O8661P6303N9739L7130K5607J6619j311j9871l0010m5648q5128
35585B69425j34267j46823q9213J7029J01125J01720K9185l8143l5376J6839M1653
$$ y = [-15388, 130361, 215970, 213713, 141810, 20775, -123667, -241344, -282194, -239285, -145754, -34646, 75948, 164331, 206381, 210374, 225955, 289551, 367634, 384996, 315076, 208876, 114545, 8031, -145368, -284766, -288621, -133567, 54458, 148945, 158292, 156400, 145317, 81656, -331, -12286, 36658, 27704, -88433, -199369, -180692, -58176, 56325, 128336, 206884, 301757, 352668, 320899, 233503, 126549, 11631, -85527, -117843, -81020, -39717, -53622, -104044, -121198, -64256, 45482, 150376, 195957, 164425, 91272, 38786, 39357, 74870, 117392, 167334, 235995, 312298, 372037, 409167, 434774, 451393, 450082, 430211, 400201, 354553, 269425, 135158, -11665, -100878, -83849, 17276, 118996, 148181, 110038, 74662, 91501, 133154]
35574A33154L547n2142o3462k3458L1036P2190R0912P6057K7710j5479q999L0194
35562C01260L5375j1990m3776j554P0667Q7248M8095L2019O4880P5397J4058n5073
35550F16606m1728L6326P8332M1822j2014j7794J3659L6141L7153L1234J8344
35539H38081j1759m8277o3580m4191k41M6077O5738L2915m3777j07865j02305
35528E60816l2950L8346O6494O1818M8437K0316l1985p8540q1471o0029o9551
35517D41701j07079r9910k1915L9801j005r0874r7634L275R5026Q4821J5219k2962
35505B38464r310K2511N0308N5570J1027o1861p8825m372P5089O4490l796l2219
35493C27076r896l861l3732o0279p4066q8104o6317K1799R6735N7282l7402l4529
$$ y = [133154, 136701, 84559, 21097, -2361, 28675, 100865, 191777, 267834, 295544, 280065, 271066, 301260, 336635, 324645, 280869, 279315, 349982, 437230, 485325, 517344, 582224, 657621, 671679, 616606, 574878, 611204, 689536, 731358, 719344, 701550, 715209, 751350, 788503, 819737, 838081, 826322, 778045, 714465, 670274, 670033, 716110, 781848, 814763, 770986, 663121, 560816, 527866, 566212, 632706, 694524, 742961, 763277, 731292, 652752, 571281, 511252, 441701, 334622, 234712, 212797, 252598, 251593, 160719, 63085, 66360, 161386, 246207, 261426, 238464, 229154, 251665, 301973, 357543, 368570, 306709, 227884, 223512, 298601, 363091, 359295, 327076, 317180, 313319, 279587, 219308, 145242, 57138, -9179, 12620, 109355, 166637, 129235, 94706]
35481I4706N4964N3118q1586j50043j9893J48093J38781R86n9356m0M2842J914
35469B24486n3492p1595o7608l2094M9427R8811L1240p1527n0397O8553R6343
35458B22147j1546q5575m0614j6010j01484j43147j586J76104J64735J5350m2965
35447A35409K1130K6806p4255j10212m317P0591k0807j35278p4845Q3506R0175
35436G903r7652k41658j52849O3700J71234J05180J2503K5449R6811R1886j1698
35425G0809q6529l0350Q2664R4707j0685p3493J6071J48803J44532R724p6162
35414B90091k2384N5573K2142q4896j25626m9445P0928J49920J50099O6689o1907
35403D61184j44272j18448l8433o170l0038l3277Q057L7146L3414M5425P5867
$$ y = [94706, 149670, 202788, 121202, -28841, -48734, 99359, 238140, 239126, 179770, 179730, 222572, 224486, 170994, 99399, 31791, -303, 49124, 147935, 179175, 107648, 57251, 125804, 222147, 210601, 125026, 84412, 68402, -33082, -176229, -177815, -1711, 163024, 178374, 135409, 156539, 183345, 109090, -1122, -5439, 65152, 44345, -90933, -165778, -82272, 7903, -89749, -331407, -484256, -420556, -249322, -144142, -131639, -106190, -9379, 82507, 70809, -15720, -46070, 36594, 131301, 120616, 47123, 63194, 211997, 356529, 366253, 290091, 267707, 323280, 345422, 260526, 134900, 85455, 156383, 306303, 456402, 523091, 461184, 316912, 198464, 160031, 153861, 123823, 90546, 98603, 135749, 169163, 214588, 290455]
35392B90455M7580n8052j33856r6269j1598J6819N322K8226O9897O2599K5121
35381B46244L1509O6355M4759k9928o2604l0944j8517n4307n5907J2625N6968
35370B06253R761m1768O580R6855R2394j0681q3532n9831j1155j2948l9438l3774
35358A18716n965l223k7543m1038l3762l2182l9418j8446L9855P3499K6738m7698
35346I533l4627Q1794J79162J63275R6094P9838Q2973J956j39145j96908j28897
35335A95048o0982q2553j07531k7810J00577J36069N0204n8134j03729p5636P802
35324b6675J11191J68616J37481N2319l1225j06623j65689j40347k003J25722
35314A22767Q7640p7561j66774q5786L7706N8363N658n673M0431O7562M0845p16
$$ y = [290455, 338035, 279983, 146127, 49858, 38260, 55079, 60401, 88627, 158524, 221123, 246244, 277753, 344108, 388867, 358939, 296335, 265391, 246874, 192567, 136660, 149285, 206253, 216014, 174246, 180826, 277681, 370075, 359394, 275862, 216031, 204876, 191928, 152490, 118716, 112751, 109528, 81985, 40947, 7185, -24997, -64415, -82861, -43006, 30493, 57231, 9533, -25094, 56700, 235862, 399137, 495231, 575069, 658042, 659998, 520853, 323945, 195048, 134066, 51513, -56018, -83828, 16749, 152818, 203022, 144888, 41159, -34477, -26675, 84516, 253132, 390613, 442932, 411707, 305084, 139395, -952, -2955, 122767, 210407, 132846, -33928, -119714, -82008, -23645, -17987, -23660, 16771, 84333, 125178, 124462]
35302A24462k0916j8647L509L9523N6863K8605j4840j6914K1120L6374m965n7937
35290A76237o2072k0990J2016P903j3173k5732l1893l9034l4578q052J9765K0499
35278H96K472N8K2025M2811M3537K5584j4758p7978j21945q7404J5466R8986J02766
35265E2516N3377n358p0145j22539r7485J6020J11392R6669L4130L7763P9101
35254A85441L5090q5814j23664q876J18798J06348q691q0267n8279j3975j1679
35243E4432m5794q0679q1779k5272O5651J14227P3732j998k3424J9212O1267O8158
35231A97733O9500Q6645Q8620M5398j5639l8334n997M2045N7026K9668q617k5337
35219E22711j9966j6386l1484n9165p8756p1847m1210k0071m1540q3872p6500
$$ y = [124462, 103546, 84899, 88408, 127931, 184794, 213399, 198559, 181645, 202765, 239139, 234174, 176237, 114165, 93175, 105191, 113094, 99921, 74189, 42296, 3262, -31316, -39368, -19603, 896, 3368, 3426, 25451, 68262, 111799, 137383, 122625, 44647, -77298, -164702, -149236, -50250, 52516, 105893, 100535, 30390, -92149, -189634, -173614, -62222, 34447, 68577, 106340, 185441, 220531, 134717, 11053, 2177, 120975, 227323, 218632, 138365, 80086, 66111, 54432, 8638, -72041, -153820, -179092, -113441, 786, 74518, 72520, 49096, 68308, 129575, 197733, 267233, 353878, 442498, 487896, 472257, 433923, 427926, 469971, 526997, 556665, 548048, 522711, 502745, 486359, 454875, 395710, 316954, 245107, 203897, 183826, 142286, 58414, -18086]
35208a8086P825R6875J00872K6592m4873p2254p6274o1811o629O0961O3578j0256
35196F6520o9550m4096K2355N0472L3167R471j0687k9512j7651L9139Q3007M8040
35184A80675l6865p6375l2642L6678N9528J8570n6446j17711j20835o1180M590
35173b02013O407n9680j19027r2615J9475J26037J26913K8260m4802K947R7734
35162a10364Q8435k8169q8495l068J10254J13025M7559L3321N9637L1828l9666
35151B14297o2251m2154p0511j31215j00225L0221R9304J7450r4210r3904j3187
35140b46385M6059Q5539J46922J70933P8335o0131r2884j1691L8249j9517r8041
35129C7388j06338p3574n1378m344J04554J91554J31194n8006k03201j71498j1284
$$ y = [-18086, -10261, 86614, 187486, 214078, 169205, 96951, 20677, -41134, -47763, 13198, 76776, 66520, -3030, -47126, -24771, 25701, 58868, 68339, 57652, 28140, 10489, 49628, 132635, 180675, 143810, 67435, 34793, 71471, 130999, 149569, 93123, -24588, -145423, -206603, -202013, -195606, -255286, -374313, -466928, -447453, -321416, -194503, -166243, -211045, -208098, -110364, -21929, -50098, -138593, -141661, -31407, 81618, 129177, 162498, 222135, 253963, 214297, 152046, 109892, 39381, -91834, -192059, -161838, -62534, -45084, -139294, -233198, -246385, -200326, -114787, 32135, 203068, 281403, 221272, 128388, 116697, 154946, 135429, 37388, -68950, -142524, -193902, -198246, -93692, 97862, 229056, 171050, -32151, -203649, -214933]
35118b14933J24932J50491J03276O5920P2266R3258Q6005M1319j0026k7767K241
35107D86982N6353Q8948O0985k9686j29051j49382m5509J19823K16105J74603
35097H50171N7732k4682m3351n4025r3262j27261j11610n0594K2670Q4442J16930
35086F27160J04361N8101J5281q919l5369o8693p2434k6660K7591L6572m914o9035
35074E83042j31110j56161r8980K9716J37364J47861R3137N0548K8420j5168p2191
35063E96478q8088n2677j0007J5228K8253J3091m5767r4167n0654O9130J52939
35052E33759J34289N7533j4104p0131j05778q9582k2485L7488N0000L4186R462
35041E54637l4451p5770m8220N8342J51446J44268N5981l8886r8697j08108n6040
$$ y = [-214933, -90001, 60490, 163766, 229686, 301952, 395210, 481215, 522534, 512508, 484741, 486982, 543335, 632283, 693268, 663582, 534531, 385149, 339640, 459463, 675568, 850171, 907903, 883221, 839870, 785845, 692583, 565322, 453712, 403118, 425788, 510230, 627160, 731521, 789622, 804903, 795984, 760615, 691922, 619488, 592828, 620419, 656991, 652077, 583042, 451932, 295771, 196791, 226507, 363871, 511732, 604869, 655417, 683837, 668669, 596478, 508390, 455713, 445706, 460934, 489187, 502278, 456511, 362344, 311690, 380820, 533759, 668048, 725581, 711477, 641346, 535568, 445986, 423501, 460989, 510989, 545175, 554637, 520186, 444416, 396196, 454538, 605984, 750252, 806233, 767347, 668650, 560542, 504502]
35030E04502J9140K9492m7715j13271p6366J2680L8038j9815q0109q3354l7322
35019A45900K8785Q0149P3367R799l5893j0865K7875P99n5712l7893N6748J14818
35007C97877O6932l0390q9336q9407o1876l9643l9364m6477k0801L5690M4244
34996A27449m6266j50199j36879j4678Q5522J03585R9547R9143M0133p2180j04311
34985C0866P229J14653M9684j19929j71511l5943J16612J14076j2641j09181r7488
34974a13573k8230K5611N5943R0891J22972J08540M1373j4336j437M4970M5037
34963C77761l427k1445K0646M8538r57q0982j07844p6476l8811j6639q162l7837
34951E4365j13069j59481r5211L8063J13347R3953P3001J13334J49445J05336
$$ y = [504502, 523642, 553134, 505419, 392148, 315782, 328462, 366500, 346685, 266576, 183222, 145900, 174685, 254834, 328201, 338000, 302107, 291242, 319117, 319916, 264204, 226311, 283059, 397877, 464809, 434419, 345083, 255676, 193800, 154157, 114793, 68316, 47515, 83205, 127449, 81183, -69016, -205895, -220573, -135051, -31466, 68081, 167224, 207357, 135177, 30866, 38095, 152748, 202432, 82503, -89008, -124951, -8339, 105737, 93096, -16085, -113573, -141803, -116192, -60249, 30642, 153614, 262154, 303527, 289191, 287754, 332724, 377761, 374334, 352889, 373535, 422073, 421116, 340134, 232290, 155814, 117003, 100364, 92202, 54365, -58704, -218185, -313396, -275333, -161986, -68033, 4968, 118302, 267747, 373083]
34941C73083K2552j3832j6891o3203j41192j43147k8846R3896J03456J8678m5320
34930A59234m0631l2442q2943j54913j58647n8729R0457J92194J77060N7670o4921
34919H3389q2225O241Q7014O8428j6384p8686r5812r7352p1654J7272J28065J58422
34907A06718Q3853p809m7204n9324p2215n0214J5158M0220l0191j06583o9814
34896a97405M2345Q3193J4822m2584N548J00489J26236N7047l4315o5714j2667
34885G6995P3062R5440Q625j10798j36846m9309M2527M6939n133l2970k0753r853
34873b2074j9178k5821o326L6411P3541O3991m422p7415p7723k572O4978O0249
34861F3639O011m1343n8333m0281J4799O6277L9748o7415j48269j20378m0196
$$ y = [373083, 395635, 381803, 364912, 301709, 160517, 17370, -11476, 82420, 185876, 204554, 159234, 118603, 86161, 3218, -151695, -310342, -369071, -278614, -86420, 90640, 148310, 83389, 1164, 7405, 94419, 162847, 146463, 67777, -28035, -125387, -197041, -179769, -51704, 106718, 190571, 182762, 135558, 76234, 4019, -46195, -31037, 9183, -21008, -127591, -197405, -155060, -71867, -57045, -99629, -94081, 6408, 132644, 189691, 155376, 89662, 76995, 150057, 245497, 254122, 143324, 6478, -42831, -304, 46635, 41502, 8532, -12221, -22074, -41252, -67073, -73399, -36988, 36553, 100544, 96122, 18707, -59016, -61588, 3390, 63639, 69650, 28307, -30026, -70307, -55508, 10769, 50517, -16898, -165167, -285545, -325741]
34850c25741m023P220P4441J67218J60575L7726n4945j2447P2647M4252r2939
34839G3984j82324j27196k956N9072L2519k484J4909N4256N4850J5980j0100K088
34827a7402K2624J9732j003k3371m3605m7332r653N2903P7774M1622K199R710
34815H4198K8257M418l8339m8806m3932o5923q3030l7579L4339M6464J1597K2099
34803h6237Q1369R1122K7596j2337J4480K0119m6726r1121k5342Q4425J30682
34792A88030J20201J03349M8137p8172j80310j41410j3816M2624j0891o2198l5682
34781b0138K1262M5248L5353J0934j5727j9645L486j178o7671j22579q2694k770
34769b16119K899m2447j1862J01393J59428J00331K0127n629k1020n3750l9736
$$ y = [-325741, -329764, -322544, -248103, -80885, 79690, 117416, 62471, 50024, 122671, 166923, 73984, -108340, -235536, -238492, -179420, -146901, -149385, -134476, -80220, -25370, -9390, -19490, -17402, 5222, 24954, 23951, 580, -43025, -90357, -100010, -47107, 30667, 72289, 74488, 84198, 112455, 116873, 78534, 29728, -14204, -80127, -163157, -200736, -166397, -119933, -108336, -86237, -4868, 86254, 113850, 101513, 115993, 136112, 89386, -1735, -27077, 57348, 188030, 308231, 411580, 459717, 381545, 201235, 59825, 46009, 88633, 77742, 15544, -20138, 1124, 46372, 81725, 92659, 76932, 57287, 60773, 59595, -8076, -130655, -213349, -216119, -213220, -255667, -267529, -166136, -6708, 93623, 113750, 108121, 87101, 33351, -6385]
34758f385L5780O7561m226q6265q6299n2227n4703n1794J1086P3362N8257J0668
34746h5185J3561M7750N2898M5504N6651L9024l4716o9888R365J02223P3575k4957
34734B25805n3067k7397o3586j24682o3290R0683J28318p243j14949m2713J00885
34723D8764J45830R2949K4567n8864j66206k02516q7998Q4272J50449Q7303N220
34712A23770k2969j2058K0649P6488J22061J08490M5194j2992m4309o6578p9796
34701B57950o5408l8630m5384r7527j45298j24575k3928R0284J25173O5891J2540
34690A1088N8822J48593J36181n465j37636j48091q6293n0441l9276R41N9952
34679e1625Q7103P9276O4201L9970N35k4986k1256k1239l4457j3397M0469K8538
$$ y = [-6385, 29395, 96956, 92730, 6465, -79834, -132061, -186764, -238558, -227472, -154110, -95853, -85185, -71624, -23874, 29024, 74528, 131179, 170203, 135487, 65599, 74964, 177187, 250762, 225805, 172738, 145341, 81755, -42927, -106217, -15534, 112784, 105541, -9408, -52121, 48764, 194594, 287543, 312110, 253246, 87040, -115476, -203474, -119202, 31247, 118550, 123770, 100801, 88743, 109392, 185880, 307941, 416431, 461625, 448633, 404324, 337746, 257950, 192542, 153912, 108528, 11001, -134297, -258872, -282800, -192516, -67343, -1452, 11088, 69910, 218503, 354684, 349219, 211583, 63492, -22801, -73242, -112518, -111577, -51625, 35478, 114754, 178955, 218925, 219460, 194474, 173218, 151979, 117522, 104125, 144594, 173132]
34667A73132q8394j76377j03083M5161P6083k1211o9348K3337J44181J57217O3800
34656B24498n3914j28329j08661J5851J50131J56591L2012p4361o1489N746K7146
34645A85221P574k714j1419m1476n9318l4165j2370m6552r4564p4119J0210P3609
34633a00083O9397L1107J049k1144m7169o0434l1796L3146P5307L0803q4887j67258
34621b71962j36435l5840L8756P8669J41985K08912J78153L5941q8237r2488k9579
34610B7875K551J719J3561K9269K3627K4030N0023M9604j2240o9576n8613l2483
34598D9347n9023p6921N560J25187J37497M4235k0140j5875l3331q9452p7794
34587a0710K6044Q5928J5358q4714r1522k8441L0429Q9763J50931J26751j9030
$$ y = [173132, 84738, -91639, -194722, -149561, -73478, -94689, -164037, -140700, 3481, 160698, 224498, 170584, 42255, -66406, -50555, 99576, 256167, 288179, 213818, 152329, 158075, 185221, 192795, 190081, 178662, 137186, 77868, 43703, 31333, -15219, -109783, -183902, -173692, -100083, -30686, 421, 1470, -19674, -66843, -127277, -159073, -125927, -50620, -19817, -104704, -271962, -408397, -444237, -405481, -326812, -184827, 24085, 202238, 238179, 149942, 57454, 27875, 30426, 32145, 45706, 74975, 98602, 122632, 172655, 222259, 210019, 140443, 81830, 49347, -9676, -86597, -81037, 44150, 181647, 225882, 205742, 189867, 156536, 67084, -10710, 15334, 101262, 116620, 31906, -59616, -88057, -57628, 32135, 183066, 309817, 290787]
34576B90787j47289j12235K0417P6860L2224j02J1485r941o6714n7478M0222J14084
34564A92320Q8385J9156k5690n5592p7623m9752K4851O5499L8225J0039K0523
34553B50341J0301n1186q1230k0210N1815M1043j0619j7974p305m5589q7948m7041
34541a5602L2761K8879n3428q4493j9695M5048M5067L0803M5867N5403M3041N5900
34529B09551R6399Q3686j1082r4964r1833n7508p5987j19779r9063O350J34682
34518a9548K12454J86390N0874j02477j36442l1826P3875P1267J3307r307k1048
34507B87519p6536j14976m5855P4884J04836K6077m3651l8381p017R486K9609
34496B05995M7002K2516j7168N407P7614R3523K8499r573L9363P9658J7938p3456
$$ y = [290787, 143498, 31263, 51680, 128540, 160764, 160662, 172147, 162206, 95492, 38014, 78236, 192320, 280705, 299861, 274171, 218579, 140956, 91204, 116055, 181554, 219779, 229818, 250341, 260642, 209456, 128226, 108016, 159831, 200874, 190255, 172281, 164976, 119387, 31439, -15602, 17159, 46038, -7390, -91883, -111578, -66530, -21463, 9340, 55207, 110610, 153651, 209551, 305950, 389636, 378554, 283590, 191757, 134249, 58262, -61517, -160580, -154230, -19548, 192906, 379296, 430170, 327693, 191251, 159425, 233300, 304567, 317874, 308567, 287519, 210983, 96007, 50152, 125036, 229872, 255949, 212298, 173917, 166900, 176386, 205995, 252997, 275513, 258345, 263752, 341366, 434889, 463388, 453815, 493178, 572836, 590774, 517318]
34484E17318o0015N0972J19522O3700m6396q9802l5132L6306L3492k6639l2087
34473E31239O5181J52290R9544l5322p5417L125K6981q9839j81719p6736J18462
34462E37789J48310l5577k16033k01315k9544J39421K11812J91789J21359N5118
34452I23129M3298Q4309J17119R1212K3173l4916n7652n2751k5375K9506R3262
34441A234314J10526M6022m3521m2403Q0588K02741J88424P2234Q696M7170P7319
34430A982110K9769l063O8928J63192J43056L1897k9322J551L3589J4228o94L2576
34418B467817P3758Q4387Q8581J04952J01675O7916N9466J18501J99924K29103
34408C596080J94727J40058R3567N2522J7319L375J8364M4696M9978K0929j0785
$$ y = [517318, 457303, 508275, 627797, 691497, 645101, 555299, 520167, 556473, 589965, 563326, 531239, 596420, 748710, 848254, 812932, 737515, 740640, 767621, 677782, 496063, 419327, 537789, 686099, 650522, 434489, 233174, 203630, 343051, 554863, 746652, 868011, 923129, 966427, 1050736, 1167855, 1259067, 1282240, 1247324, 1189672, 1136921, 1111546, 1141052, 1234314, 1344840, 1390862, 1347341, 1304938, 1385526, 1588267, 1776691, 1848925, 1857621, 1904791, 1982110, 2011879, 2008816, 2077744, 2240936, 2383992, 2415889, 2386567, 2388118, 2421707, 2435935, 2435241, 2467817, 2541575, 2625962, 2714543, 2819495, 2921170, 2989086, 3048552, 3167053, 3366977, 3596080, 3790807, 3930865, 4024432, 4076954, 4094273, 4097648, 4116012, 4160708, 4210686, 4231615, 4220830]
34397D220830K94M3386N0884j053m1313j0617L1963j296o8390m9625M6791O8771
34385D290625m8947j68510j47389n1010n3497j83941k92273k57083j26848l5246
34375B925881m4823j03229j15881m1330O5993J03509K7932r0992j46949j19264
34365B460847q8335j27137k07705k32840j47135J942J13087J25546N5931m1488
34355A912713j19724j45593j06438l6865l420k6820n0662k8067j243l3415r3800
34344A266666r4740l4244q614o5331j28105j05266o633Q6184J12237O2537k7442
34333A057249q7220o6869r432r133p4706j09975o6514k7648p6277j58308j63148
34322B08019q1977L964M9069O5734N5189J2174j8604J7002R0929J25147J10496
$$ y = [4220830, 4221124, 4264510, 4315394, 4314341, 4273028, 4262411, 4294374, 4293078, 4224688, 4175063, 4221854, 4290625, 4241678, 4073168, 3925779, 3874769, 3821272, 3637331, 3345058, 3087975, 2961127, 2925881, 2881058, 2777829, 2661948, 2620618, 2686611, 2790120, 2818052, 2727060, 2580111, 2460847, 2372512, 2245375, 2037670, 1804830, 1657695, 1659637, 1772724, 1898270, 1954201, 1912713, 1792989, 1647396, 1540958, 1504093, 1500673, 1473853, 1423191, 1395124, 1393881, 1360466, 1266666, 1171926, 1137682, 1129068, 1063737, 935632, 830366, 823733, 909917, 1022154, 1084691, 1057249, 970029, 903160, 893728, 884595, 809889, 699914, 633400, 605752, 529475, 371167, 208019, 126042, 130006, 179075, 244809, 299998, 312172, 293568, 310570, 401499, 526646, 637142]
34311F37142J05308J12457N7319p7501j81247j41213O495J11628P9246l6571j06747
34300E66316o7938K3323P1013N0954J4518n581l5370q6785j07791n4937K9612
34289C97334O9561M9364O580l1913n1345l1007J1925R891n1039p4736K280P7640
34277C84535K3470r4459j05386j4987J740r2521j17769J5211J31011O7033n6286
34266A41592l4101Q6067Q9611n3558j52739j01741p415K2995L5237R4095J44525
34255B64568J04784J052p8869j00524q4870n3890l0798m1321o5837m2999L4522
34244i4182Q5420N0271j9328l8642o262K0281K4344L6927O6160Q1312N9377P823
34232B73501m5861o0449o928Q0065J13887N8373j8986l7651m926K2070K6123J8631
$$ y = [637142, 742450, 854907, 912226, 834725, 653478, 512265, 518760, 630388, 709634, 673063, 566316, 498378, 521701, 592714, 643668, 658186, 652605, 617235, 530450, 422659, 367722, 397334, 466895, 516259, 522839, 490926, 439581, 408574, 420499, 430390, 379351, 304615, 306895, 384535, 408005, 313546, 208160, 193173, 194913, 102392, -15377, -166, 130845, 197878, 141592, 107491, 193558, 283169, 229611, 76872, -24869, -32284, -9289, 25948, 120043, 264568, 369352, 370404, 291535, 191011, 106141, 52251, 21453, -19868, -85705, -128704, -94182, -8762, 41509, 22181, -16461, -22723, -2442, 21902, 58829, 124989, 206301, 265678, 273501, 227640, 167191, 160263, 240328, 354215, 412588, 393602, 355951, 351025, 373095, 399218, 417849]
34220D17849j4096p3939r6955k7343P4258Q9468M967p0106n2173L2034J11192
34209C95156J39618R9016J1855m5314k5592q86o5548j61710j37671N221Q4726
34198B98871J0903p7573m3928L7587L4310k3180l6072l8894j12277j75247q2697
34187b08197J01798J52486J6885j00942m2899J00109J60237J07466N934j03486
34177A89391j78526j51241l0603O4208O0347K8745M5029O0429J1580m5373l1906
34166B2080Q953l801l6820j4624J8559l3480j27276j22787j3110N1153p823q6989
34154c45965p1467J3760Q0241R8669P9773K0086o2618j02942n9426L1435J10441
34143b08013J53389J46845P7395j4639m4835j264K1103l4501q2982k7302P1845
$$ y = [417849, 403753, 329814, 232859, 205516, 279774, 369242, 374209, 304103, 251930, 283964, 395156, 534774, 633790, 645645, 600331, 574739, 573853, 508305, 346595, 208924, 214145, 298871, 309774, 232201, 188273, 225860, 260170, 236990, 200918, 162024, 49747, -125500, -208197, -106399, 46087, 62972, -37970, -80869, 19240, 179477, 286943, 292877, 189391, 10865, -140376, -170979, -106771, -46424, -17679, 27350, 87779, 99359, 53986, 22080, 31033, 27232, -9588, -24212, -5653, -39133, -166409, -289196, -302306, -251153, -258976, -345965, -417432, -403672, -323431, -224762, -144989, -124903, -187521, -290463, -349889, -318454, -208013, -54624, 92221, 169616, 154977, 110142, 108878, 129981, 95480, 12498, -14804, 57041]
34132E7041P2340l2221r6622l5979O0289O9283j888n6106m4460N525N4602P0472
34120A22276J3321j10795j92388j13888P0999J50453J3425j82380j99680l0651
34110d59308J07571P8820j1350r448O2002P9884L3323K4317Q4405J23935Q2384
34099A96535J8954P307K3223n21o0106q7971n2674L278K5531J2446P194L8884
34087A32080Q1692Q0254K0728l8675l0576L5822Q1775N4536j3090n1438m1007
34076C12101l0219o8448j35266j53064q1263J8736M6499j3191p5595p4204l4940
34065b88854n175K4039P0221R3707N6355M599R582N2082N4759J0384j6115o246
34053E9338j0170m3302n8094l8440k8910m2437k9675K3930N9042M4152K9808M7926
$$ y = [57041, 129381, 97160, 538, -35441, 24848, 94131, 92243, 36137, -8323, -2798, 51804, 122276, 135597, 24802, -167586, -281474, -210475, -60022, -46597, -228977, -428657, -459308, -351737, -272917, -284267, -293715, -231713, -151829, -118506, -94189, -9784, 114151, 196535, 215489, 222796, 246019, 245498, 185392, 97421, 44747, 48025, 73556, 86002, 93196, 132080, 213772, 294026, 314754, 276079, 245503, 281325, 363100, 417636, 404546, 353108, 312101, 281882, 213434, 78168, -74896, -156159, -137423, -90924, -104115, -179710, -253914, -288854, -294029, -269990, -199769, -106062, -49707, -45108, -35526, 16556, 71315, 81699, 65584, 59338, 49168, 5866, -52228, -90668, -119578, -162015, -191690, -167760, -108718, -64566, -34758, 13168]
34041A3168M2730k7114r2232o6657J2449L1775l4926r5034o8278J6232O9805N1204
$$ y = [13168, 55898, 28784, -63448, -130105, -117656, -85881, -120807, -215841, -284119, -267887, -198082, -146878]
$$ [...]
##END NTUPLES=NMR SPECTRUM
##END=
