##TITLE=31Pdec_DE_63-k
 D2O, 64 sc
 31.7.2024
##JCAMPDX= 6.0         $$ Bruker NMR JCAMP-DX V2.0
##DATA TYPE= NMR SPECTRUM
##DATA CLASS= NTUPLES
##ORIGIN= UXNMR, Bruker Analytische Messtechnik GmbH
##OWNER= root
$$ XWIN-NMR		Version 3.5
$$ Wed Jul 31 16:38:03 2024 Russian Standard Time (UT+4h)  she@DPX200
##.OBSERVE FREQUENCY= 81.013821
##.OBSERVE NUCLEUS= ^31P
##.ACQUISITION MODE= SIMULTANEOUS
##.ACQUISITION SCHEME= undefined
##.AVERAGES= 64
##.DIGITISER RES= 17
##SPECTROMETER/DATA SYSTEM= spect
##.PULSE SEQUENCE= zgpg30
##.SOLVENT NAME= D2O
##.SHIFT REFERENCE= (INTERNAL, D2O, 0, 198.062)
##AUDIT TRAIL= $$ (NUMBER, WHEN, WHO, WHERE, WHAT)
$$ ##TITLE= Audit trail, XWIN-NMR		Version 3.5
$$ ##JCAMPDX= 5.01
$$ ##ORIGIN= Bruker BioSpin GmbH
$$ ##OWNER= she
$$ F:/spectra/data/she/nmr/P31/2/pdata/1/auditp.txt
$$ ##AUDIT TRAIL=  $$ (NUMBER, WHEN, WHO, WHERE, WHAT)
(   1,<2024-07-31 16:37:00.01 +0400>,<she>,<DPX200>,
      <created by zg, POWCHK disabled, PULCHK disabled
       configuration hash MD5:
       00 E9 B6 7A A2 85 ED C7 34 08 36 98 17 FE 4E 26
       data hash MD5: 32K
       BC D6 ED DB 4D 25 06 BF 91 E5 E8 4C 1A F0 77 B4>)
(   2,<2024-07-31 16:37:06.42 +0400>,<she>,<DPX200>,
      <Start of raw data processing
       efp BC_mod = 2 LB = 1.5 FT_mod = 6 PKNL = 1 PHC0 = 2760.779 PHC1 = -107.5131 SI = 64K 
       data hash MD5: 64K
       A2 F4 62 8A 66 D5 06 3A 62 74 D0 D6 4B F5 A4 B1>)
(   3,<2024-07-31 16:37:28.14 +0400>,<she>,<DPX200>,
      <pk PHC0 = -39.55989 PHC1 = 77.99998 
       data hash MD5: 64K
       8B 00 D5 02 F7 8E 9E EE CA DE 32 A4 16 53 08 1B>)
$$ ##END=
$$ 
$$ hash MD5
$$ 0D 48 03 13 A9 B9 01 2A 53 03 50 38 6E 18 11 6D
##$RELAX= 
##$RELAX= 
##$RELAX= 
##$RELAX= 
##$RELAX= 
##$RELAX= 
##$RELAX= 
##$RELAX= 
$$ Bruker specific parameters
$$ --------------------------
##$DU= <F:/spectra>
##$EXPNO= 2
##$NAME= <P31>
##$PROCNO= 1
##$TYPE= <nmr>
##$USER= <she>
##$AMP= (0..31)
100 100 100 100 100 100 100 100 100 100 100 100 100 100 100 100 100 100 
100 100 100 100 100 100 100 100 100 100 100 100 100 100 
##$AQSEQ= 0
##$AQ_mod= 1
##$AUNM= <au_zg>
##$AUTOPOS= <>
##$BF1= 81.014009
##$BF2= 200.13
##$BF3= 200.13
##$BF4= 200.13
##$BF5= 200.13
##$BF6= 200.13
##$BF7= 200.13
##$BF8= 200.13
##$BYTORDA= 1
##$CFDGTYP= 0
##$CFRGTYP= 5
##$CHEMSTR= <none>
##$CNST= (0..31)
1 1 145 1 1 1 1 1 1 1 1 1 1 1 1 1 1 1 1 1 1 1 1 1 1 1 1 1 1 1 1 1 
##$CPDPRG= <waltz16>
##$CPDPRG1= <>
##$CPDPRG2= <waltz16>
##$CPDPRG3= <>
##$CPDPRG4= <mlev>
##$CPDPRG5= <mlev>
##$CPDPRG6= <mlev>
##$CPDPRG7= <mlev>
##$CPDPRG8= <mlev>
##$CPDPRGB= <>
##$CPDPRGT= <>
##$D= (0..31)
0 1 0 0 0 0 0 0 0 0.06 0 0.03 2e-05 3e-06 0 0 0.0002 0 0 0 0 0 0 0 0 0 
0 0 0 0 0 0 
##$DATE= 1722429419
##$DBL= (0..7)
120 120 120 11 120 120 24 19 
##$DBP= (0..7)
150 150 150 150 150 150 150 150 
##$DBP07= 0
##$DBPNAM0= <>
##$DBPNAM1= <>
##$DBPNAM2= <>
##$DBPNAM3= <>
##$DBPNAM4= <>
##$DBPNAM5= <>
##$DBPNAM6= <>
##$DBPNAM7= <>
##$DBPOAL= (0..7)
0.5 0.5 0.5 0.5 0.5 0.5 0.5 0.5 
##$DBPOFFS= (0..7)
$$ [...]
##$SUBNAM3= <"">
##$SUBNAM4= <"">
##$SUBNAM5= <"">
##$SUBNAM6= <"">
##$SUBNAM7= <"">
##$SUBNAM8= <"">
##$SUBNAM9= <"">
##$SW= 400.765351723535
##$SWIBOX= (0..15)
0 1 3 0 0 0 0 0 0 0 0 0 0 0 0 0 
##$SW_h= 32467.5324675325
##$TD= 32768
##$TD0= 1
##$TE= 0
##$TE2= 300
##$TE3= 300
##$TEG= 300
##$TL= (0..7)
0 120 53 12 22 120 120 120 
##$TP= (0..7)
150 150 150 150 150 150 150 150 
##$TP07= 0
##$TPNAME0= <>
##$TPNAME1= <>
##$TPNAME2= <>
##$TPNAME3= <>
##$TPNAME4= <>
##$TPNAME5= <>
##$TPNAME6= <>
##$TPNAME7= <>
##$TPOAL= (0..7)
0.5 0.5 0.5 0.5 0.5 0.5 0.5 0.5 
##$TPOFFS= (0..7)
0 0 0 0 0 0 0 0 
##$TUNHIN= 0
##$TUNHOUT= 0
##$TUNXOUT= 0
##$USERA1= <user>
##$USERA2= <user>
##$USERA3= <user>
##$USERA4= <user>
##$USERA5= <user>
##$V9= 5
##$VALIST= <valist>
##$VCLIST= <CCCCCCCCCCCCCCC>
##$VD= 0
##$VDLIST= <DDDDDDDDDDDDDDD>
##$VPLIST= <PPPPPPPPPPPPPPP>
##$VTLIST= <TTTTTTTTTTTTTTT>
##$WBST= 1024
##$WBSW= 4
##$XGAIN= (0..3)
0 0 0 0 
##$XL= 0
##$YL= 0
##$YMAX_a= 10960
##$YMIN_a= -9899
##$ZGOPTNS= <>
##$ZL1= 120
##$ZL2= 120
##$ZL3= 120
##$ZL4= 120
##$ABSF1= 0
##$ABSF2= 0
##$ABSG= 0
##$ABSL= 0
##$ALPHA= 0
##$AQORDER= 0
##$ASSFAC= 0
##$ASSFACI= 0
##$ASSFACX= 0
##$ASSWID= 0
##$AUNMP= <proc_1d>
##$AZFE= 0.1
##$AZFW= 0.5
##$BCFW= 0
##$BC_mod= 2
##$BYTORDP= 0
##$COROFFS= 0
##$CY= -3
##$DATMOD= 1
##$DC= 0
##$DFILT= <>
##$DTYPP= 0
##$F1P= 0
##$F2P= 0
##$FCOR= 1
##$FTSIZE= 65536
##$FT_mod= 6
##$GAMMA= 0
##$GB= 0
##$INTBC= 1
##$INTSCL= 9.790993e-09
##$ISEN= 30
##$LB= 1.5
##$LEV0= 0
##$LPBIN= 0
##$MAXI= 10000
##$MC2= 0
##$MEAN= 0
##$ME_mod= 0
##$MI= 50
##$NCOEF= 0
##$NC_proc= -7
##$NLEV= 6
##$NOISF1= 182.463
##$NOISF2= 159.3651
##$NSP= 0
##$NTH_PI= 0
##$NZP= 0
##$OFFSET= 198.0616
##$PC= 4
##$PHC0= 2721.219
##$PHC1= -29.51312
##$PH_mod= 1
##$PKNL= yes
##$PPARMOD= 0
##$PSCAL= 0
##$PSIGN= 0
##$REVERSE= no
##$SF= 81.0140089999434
##$SI= 65536
##$SIGF1= 159.3651
##$SIGF2= -187.1042
##$SINO= 113.3802
##$SIOLD= 16384
##$SREGLST= <1H.CDCl3>
##$SSB= 0
##$STSI= 65536
##$STSR= 0
##$SW_p= 32467.5324675325
##$SYMM= 0
##$S_DEV= 0
##$TDeff= 32768
##$TDoff= 0
##$TI= <>
##$TILT= no
##$TM1= 0
##$TM2= 0
##$TOPLEV= 0
##$USERP1= <user>
##$USERP2= <user>
##$USERP3= <user>
##$USERP4= <user>
##$USERP5= <user>
##$WDW= 1
##$XDIM= 65536
##$YMAX_p= 512904910
##$YMIN_p= -20091539
$$ End of Bruker specific parameters
$$ ---------------------------------
##NTUPLES= NMR SPECTRUM
##VAR_NAME=  FREQUENCY,     SPECTRUM/REAL,   SPECTRUM/IMAG
##SYMBOL=    X,             R,               I
##VAR_TYPE=  INDEPENDENT,   DEPENDENT,       DEPENDENT
##VAR_FORM=  AFFN,          ASDF,            ASDF
##VAR_DIM=   65536,         65536,           65536
##UNITS=     HZ,            ARBITRARY UNITS, ARBITRARY UNITS
##FACTOR=    0.49542278885378, 1,            1
##FIRST=     16045.7642231865, 0,            0
##LAST=      -16421.768244346, 0,            0
##MIN=       -16421.768244346, -20091539,    0
##MAX=       16045.7642231865, 512904910,    0
$$ Real data points
##PAGE= N=1
##DATA TABLE= (X++(R..R)), XYDATA
$$ [...]
39653I634490N37287m75390j984958k531186j563158j49984M43927J34851l59470
$$ 9634490 10171777 9696387 7711429 5180243 3617085 3467101 3911028 4045879 3686409
39644C686409m86060m5268Q19394J362266P12010q55355j818953j210164J22505
$$ 3686409 3200349 3155081 3974475 5336741 6048751 5193396 3374443 2164279 2286784
39635B286784P40499N12987L92773O87456O53681q9205p07625k69274P88372J011764
$$ 2286784 3027283 3540270 3933043 4620499 5274180 5184975 4477350 4208076 4996448 6008212
39625F008212k01072j621130j524943J49172J583975J249591k90453j307131j202981
$$ 6008212 5807140 4186010 2661067 2810239 4394214 5643805 5353352 4046221 2843240
39616B843240r70948j390918j767981r62828R33277K558723K698440J391640j86085
$$ 2843240 1872292 481374 -1286607 -2249435 -1316158 1242565 3941005 5332645 5146560
39607E146560p39637j0058R17979P71007l46917j041802n10862L30579J66254
$$ 5146560 4406923 4396865 5314844 6085851 5738934 4697132 4186270 4516849 4683103
39598D683103q67335j527995j337464r94687q68094l00915R84863J846853J164987
$$ 4683103 3815768 2287773 950309 -44378 -912472 -1213387 -228524 1618329 2783316
39589B783316l01220q11630j88882O140r10330j510425m88519J222007J901126
$$ 2783316 2482096 1670466 1481584 1487724 577394 -933031 -1421550 -199543 1701583
39580A701583J597592J554748J745450J015208m20559q16727K23243P59631n42060
$$ 1701583 3299175 4853923 6599373 7614581 7194022 6377295 6600538 7360169 6818109
39571F818109k251229k366902j242420o59367j015896j181350n14657N65545J548539
$$ 6818109 4566880 2199978 957558 298191 -717705 -1899055 -2413712 -1848167 -299628
39562b99628J962579J144477o14020j383414J15098K092783J701047p91247k204303
$$ -299628 1662951 2807428 2193408 809994 925092 3017875 4718922 3927675 1723372
39553A723372j032162O65407P24665j40758j94636M12474L69038l89239p33848
$$ 1723372 691210 1356617 2081282 1940524 1745888 2158362 2527400 2138161 1404313
39544A404313j62339P95426J547774J781250J258745J39560q66092j250420j156226
$$ 1404313 1241974 2037400 3585174 5366424 6625169 6764729 5898637 4648217 3491991
39535C491991p66124o2334M79099P8113r50243j254675n61713k58201r48052j115354
$$ 3491991 2725867 2663533 3142632 3220745 2270502 1015827 454114 195913 -752139 -1867493
39525a867493L42203J848180J340865n11808j438368r51793k97403K42024J340773
$$ -1867493 -1525290 322890 1663755 1151947 -286421 -1238214 -1535617 -1293593 47180
39516D7180K216704J119499j331920k061583J35376K537197K256088J27013r68694
$$ 47180 2263884 3383383 2051463 -10120 125256 2662453 4918541 5045554 4076860
39507D076860k40584O16996M47004j1486J24841L60055l00700j737754k681582
$$ 4076860 3836276 4453272 4900276 4888790 5013631 5373686 5072986 3335232 653650
39498F53650k206787q86193j35582m02931n85506K73197J358606J194012j8074
$$ 653650 -1553137 -2439330 -2574912 -2977843 -3563349 -3290152 -1931546 -737534 -755608
39489g55608n81660J26484Q20655M75152k27854m60814p93754j871598k665444
$$ -755608 -1337268 -1210784 -390129 85023 -142831 -603645 -1397399 -3268997 -5934441
39480e934441j680687N98676K015858J434463p3949p87335r0588J399422K571033
$$ -5934441 -7615128 -7016452 -5000594 -3566131 -3640080 -4427415 -4518003 -3118581 -547548
39471e47548K509205J193284k64193o09999J54655P78017K24266j210005k249819
$$ -547548 1961657 3154941 2890748 2280749 2435404 3213421 3437687 2227682 -22137
39462b2137j862339k73736J007472N53734j225397k207614j061015R16300J403197
$$ -22137 -1884476 -2158212 -1150740 -597006 -1822403 -4030017 -5091032 -4174732 -2771535
39453b771535J33238q63223j24067J412949J917997R64887m16458j245848j305988
$$ -2771535 -2638297 -3501520 -3625587 -2212638 -294641 670246 253788 -992060 -2298048
39444b298048p80669l0108L89599J65972k73607k05220M15068Q82081P31813L14357
$$ -2298048 -3078717 -3108825 -2719226 -2553254 -2826861 -3032081 -2617013 -1734932 -1003119 -688762
39434f88762J40959J11856j45381m56402k74472L21107N21529P811m01895M8826
$$ -688762 -547803 -435947 -581328 -1037730 -1312202 -991095 -469566 -461755 -863650 -814824
39424h14824P63106O25695j92510m39773J92462N70748O3164l48874K49005J077145
$$ -814824 -51718 573977 381467 -58306 134156 704904 768068 419194 668199 1745344
39414A745344R05725L1923l77860k75200m91127q76452m02926Q40185J426891
$$ 1745344 2651069 2682992 2305132 2029932 1538805 662353 259427 1099612 2526503
39405B526503P37948j70520l28224m7981K26883P73438J422549J007636p97142
$$ 2526503 3264451 3093931 2765707 2717726 2944609 3718047 5140596 6148232 5351090
39396E351090k313898j977506o60725l35585j170859j681402j281769q01609n31043
$$ 5351090 3037192 1059686 398961 63376 -1107483 -2788885 -4070654 -4872263 -5403306
39387e403306L14753J729347K209213Q02909j298325k150082j300606Q2855P53518
$$ -5403306 -5088553 -3359206 -1149993 -347084 -1645409 -3795491 -5096097 -5013242 -4259724
39378d259724M40009j88783j58583Q37535J885147J769172N51371m69422m91882
$$ -4259724 -3819715 -4008498 -4167081 -3329546 -1444399 324773 876144 406722 -85160
39369h5160l1087K02612J92311j3027o57213j364172j034699M55173J553793J098906
$$ -85160 -116247 86365 278676 265649 -391564 -1755736 -2790435 -2335262 -781469 317437
39359C17437Q467l70624n01950j534961k797794k512188o53728J053464J930403
$$ 317437 325904 -44720 -546670 -2081631 -4879425 -7391613 -8045341 -6991877 -5061474
39350e061474K819748L492601K209205j009079l088586j780040R23953J435412
$$ -5061474 -2241726 1250875 3460080 2451001 -637585 -2417625 -1493672 -58260
39342e8260n43271k107266j469023K11641J259903J492281J331961Q38582L77981
$$ -58260 -601531 -2708797 -4177820 -3966179 -2706276 -1213995 117966 956548 1334529
39333A334529O96835J492662J301209k52785j429559q05324M43918K39149j241666
$$ 1334529 2031364 3524026 4825235 4572450 3142891 2337567 2781485 3020634 1778968
39324A778968j929730j089387k23002m23414o69730K32908J426796J196604l52511
$$ 1778968 -150762 -1240149 -1463151 -1886565 -2556295 -2323387 -896591 300013 -52498
39315e2498j385624r32914O7925N29697O36886R04725J022566O23500L20423P41959
$$ -52498 -1438122 -2371036 -2303111 -1773414 -1136528 -231803 790763 1414263 1734686 2476645
39305B476645J084735L9936j969436k912049j788694J00773J013261P63886K39899
$$ 2476645 3561380 3601316 1631880 -1280169 -3068863 -2968090 -1954829 -1190943 -951044
39296i51044m2213n5278K15553M73169M7600r90799j409526m94507O33765O05030
$$ -951044 -993257 -1048535 -832982 -359813 -312213 -1303012 -2712538 -3207045 -2573280 -1968250
39286a968250l0989K60158J404353J827326J005650P9017k52901o11040j252148
$$ -1968250 -1999239 -1739081 -334728 1492598 2498248 2577265 2324364 1713324 461176
39277D61176j302452m59047J75249p4887l04181J78850M03483m88886j353731
$$ 461176 -841276 -1300323 -1125074 -1199961 -1504142 -1325292 -921809 -1410695 -2764426
39268b764426o82004Q41521J319053N60754O2536L36014K56990p25052j513627
$$ -2764426 -3446430 -2604909 -1285856 -725102 -662566 -326552 -69562 -794614 -2308241
39259b308241j078452P3652P30384L44294p44318j567639r31161J338247L420000
$$ -2308241 -3386693 -3313041 -2582657 -2238363 -2982681 -4550320 -5481481 -4143234 -723234
39250g23234L065269M75567j666315j500233O832R66965J007231P49571J81720
$$ -723234 2342035 2817602 1151287 -348946 -342114 624851 1632082 2381653 2563373
39241B563373r27512j770622j273655J26384Q62322L93875k20522q3442K97926
$$ 2563373 1635861 -134761 -1408416 -1282032 -419710 -25835 -246357 -329799 -31873
39232c1873j0103r03577j357974p20307N07290J121107L68371j238558k269173
$$ -31873 -41976 -945553 -2303527 -3023834 -2516544 -1395437 -1027066 -2265624 -4534797
39223d534797j705411M5085J538614J657484N61808n88189q05505k45199Q9319
$$ -4534797 -6240208 -6195123 -4656509 -2999025 -2437217 -3025406 -3830911 -4076110 -3986791
39214c986791k84343o16996m4809R80459J250271O37402K60678O27182Q16046
$$ -3986791 -4271134 -4888130 -4932939 -3952480 -2702209 -2064807 -1804129 -1176947 -360901
39205c60901Q8974p68864n79402N40185J484135J562330Q81829n2395m76583J48956
$$ -360901 -271927 -1040791 -1620193 -1080008 404127 1966457 2848286 2795891 2319308 2468264
39195B468264J172783J216664K79053M6346J071071J305067p70448l132358k890991
$$ 2468264 3641047 4857711 5136764 5183110 6254181 7559248 6788800 3656442 765451
39186G65451q79901m51752k117554k889139j386786J7042m81941j023294M72263
$$ 765451 -114450 -566202 -2683756 -5572895 -6959681 -6942639 -7424580 -8447874 -7975611
39177g975611K516286K484141Q34463k7748L17479M67574K68578O54361R86399
$$ -7975611 -5459325 -2975184 -2140721 -2168469 -1850990 -1383416 -1114838 -460477 525922
39168E25922k78411k275999k204869L46264K413706J954094M87842J30261M02204
$$ 525922 247511 -2028488 -4233357 -3887093 -1473387 480707 968549 1098810 1501014
39159A501014j74203j209296j304194n34835k9214J47046P75558J635379J664217
$$ 1501014 1326811 117515 -1186679 -1721514 -1750728 -1603682 -828124 807255 2471472
39150B471472Q03545Q2089j80055p83339j978998k658983j818581m5151J057731
$$ 2471472 3275017 3357106 3177051 2393712 414714 -2244269 -4062850 -4108001 -3050270
39141c050270O20046o25348j104145k7969J667237K269674J275597j03622o32699
$$ -3050270 -2430224 -3055572 -4159717 -4187686 -2520449 -250775 1024822 921200 288501
39132B88501m30374j36281K84800Q79207P53224p11407k210732j825087J04837
$$ 288501 -141873 -278154 6646 885853 1639077 927670 -1283062 -3108149 -3003312
39123c003312J176137K78902j001671r70746r1247M24196P91776J857124L049606
$$ -3003312 -1827175 -1548273 -2549944 -3520690 -3611937 -3187741 -2395965 -538841 2510765
39114B510765K865772J142504n64770r42524k52503L48962N3695r83818j631526
$$ 2510765 5376537 6519041 5954271 5011747 4759244 5108206 5161901 4178083 2546557
39105B546557o52011J652814L070766J804640j079523k720367j894636j08902
$$ 2546557 1894546 3547360 6618126 8422766 7343243 4622876 2728240 2619338
39097B619338P71266M93973l37074j400913k185103j742021q2947J231250J112104
$$ 2619338 3390604 3884577 3547503 2146590 -38513 -1780534 -1863481 -632231 479873
39088D79873O00267J096056J837051J027664r32721j531898J78183J944362J319128
$$ 479873 1080140 2176196 4013247 5040911 4108190 2576292 2754475 4698837 6017965
39079F017965j145151k915504k693801j314382k4262P77966J143691J025975N13617
$$ 6017965 4872814 1957310 -736491 -2050873 -2075135 -1297169 -153478 872497 1386114
39070A386114Q4116K46019R52202J408842O66585j205569k672205k201325k91709
$$ 1386114 1470230 1716249 2668451 4077293 4743878 3538309 866104 -1335221 -1626930
39061a626930R02344L41922n98254l49602N04381M18669m70171o66992O9727L89877
$$ -1626930 -724586 -382664 -980918 -1330520 -826139 -407470 -877641 -1544633 -1474906 -1085029
39051a085029j59985k48634Q37955J616589N89589j174589j305056N40528K208641
$$ -1085029 -1245014 -1493648 -655693 960896 1550485 375896 -929160 -388632 1820009
39042A820009J938877L71710p31888p51421m90953p25447j173934r28730L94520
$$ 1820009 3758886 4130596 3398708 2647287 2156334 1430887 256953 -671777 -277257
39033b77257K018138K549713J347367o27063j594397q23700M64032M24368j170425
$$ -277257 1740881 4290594 5637961 5010898 3416501 2592801 3056833 3481201 2310776
39024B310776k512411j941105j01601Q72358K00777o54398l69260K19694l65092
$$ 2310776 -201635 -2142740 -2244341 -1371983 -1171206 -1825604 -2194864 -1975170 -2340262
39015b340262j600394j563122L8235J272353Q54007o2096J39236J115868J369770
$$ -2340262 -3940656 -5503778 -5465543 -4193190 -3339183 -3401279 -3262043 -2146175 -776405
39006g76405N49207l97888q85348j234023j669752j778135j076304L97802J980931
$$ -776405 -227198 -625086 -1510434 -2744457 -4414209 -6192344 -7268648 -6870846 -4889915
38997d889915K593208J549689l98546j485311r71366j0434K12483J98045Q76745
$$ -4889915 -2296707 -747018 -1145564 -2630875 -3602241 -3612675 -3400192 -3202147 -2325402
38988b325402J644974J273134J25748l62159j08890l15988r74857n73419J184214
$$ -2325402 -680428 592706 718454 356295 247405 -68583 -1043440 -1616859 -432645
38979d32645K382118J601819m9973q15320p62946r84034j412939j061934J11503
$$ -432645 1949473 3551292 3501319 2685999 1923053 939019 -473920 -1535854 -1424351
38970a424351J006808R05952J66889n17709p89691o57261m00243k94299j84675
$$ -1424351 -417543 488409 655298 137589 -652102 -1309363 -1709606 -2003905 -2188580
38961b188580K28205N68885J18668p70957q09207R9743K99560r71862j882019
$$ -2188580 -1960375 -1391490 -1272822 -2043779 -2852986 -2753243 -2453683 -3425545 -5307564
38952e307564o17582J552319J992660O92228M6618Q80614J364778L94499n07370
$$ -5307564 -5925146 -4372827 -2380167 -1687939 -1641321 -760707 604071 998570 491200
38943D91200J54032J376505J396246L22127n91674j049277j371974j075203K91941
$$ 491200 645232 2021737 3417983 3740110 3148436 2099159 727185 -348018 -56077
38934e6077J516581R54217p97086j429662k95087P25501L00510l41565L12430
$$ -56077 1460504 2414721 1617635 187973 -107114 618387 918897 577332 889762
38925H89762J367181Q96564q57927j672630o31779O22799M39330o01817r62006
$$ 889762 2256943 3153507 2295580 622950 -8829 613970 1053300 451483 -510523
38916e10523n03345k67114n42639n89611j27950K80866N36216J325583K557312
$$ -510523 -1013868 -1280982 -1823621 -2413232 -2541182 -2260316 -1724100 -398517 2158795
38907B158795K726607R44782j255970j538888J45153J470621P98148j010970k221933
$$ 2158795 4885402 5830184 4574214 3035326 3180479 4651100 5449248 4438278 2216345
38898B216345k375074j997883j251492j09563P16094M52496k44420J04072J416395
$$ 2216345 -158729 -2156612 -3408104 -3517667 -2801573 -2349077 -2593497 -2489425 -1073030
38889a073030J713004l612j790784j131655J459725K985754K032821L63663j44212
$$ -1073030 639974 636362 -1154422 -2286077 -826352 2159402 4192223 4555886 4411674
38880D411674k01883j276494k551554j943119L92375J897646J213362j64251n53569
$$ 4411674 4209791 2933297 381743 -1561376 -1169001 728645 1942007 1777756 1224187
38871A224187m66218j045181j729987j230978J36053Q96679P12001N47370P81341
$$ 1224187 757969 -287212 -2017199 -3248177 -3112124 -2215445 -1503444 -956074 -174733
38862a74733P76987L60568J70181K81507o1167r17924j231175n55139N2798k86092
$$ -174733 602254 962822 1133003 1414510 1353343 435419 -795756 -1350895 -1298097 -1584189
38852a584189p76212j97706J103150J623678P43537o32749j317439r30093J44504
$$ -1584189 -2360401 -2558107 -1454957 168721 912258 279509 -1037930 -1968023 -1823519
38843a823519J150112J301289L83935q25143j178252l62999P84798J261112R32207
$$ -1823519 -673407 627882 1011817 186674 -991578 -1354577 -569779 691333 1623540
38834A623540M54508L32543L26916o5551p10809q37936r9593Q20820J078910P46560
$$ 1623540 2078048 2410591 2737507 2671956 1961147 1123211 1023618 1844438 2923348 3669908
38824C669908M27488J80175l27547q35763p26354k12908j28750l88914j2069R10519
$$ 3669908 4097396 4277571 3950024 3114261 2387907 2174999 2046249 1657335 1645266 2555785
38814B555785Q04421r10122k374359j728217J37075R69178M91505L49501J068823
$$ 2555785 3360206 2450084 75725 -1652492 -1515417 -546239 -54734 294767 1363590
38805A363590J284127L32942m68305n6825N83377J44785p91924q08208o6000K185
$$ 1363590 2647717 2980659 2512354 2455529 3038906 3183691 2391767 1583559 1517559 1519744
38795A519744r06788j522603j120019o13410r31077j427401q46034P56522J989283
$$ 1519744 612956 -909647 -2029666 -2643076 -3574153 -5001554 -5847588 -5091066 -3101783
38786c101783J802954M40087j165786k193972k108853q24877R32095J979330J837775
$$ -3101783 -1298829 -858742 -2024528 -4218500 -6327353 -7152230 -6220135 -4240805 -2403030
38777b403030J172110P31929L73662k87344p74677k77183Q65641J283810M35404
$$ -2403030 -1230920 -498991 -125329 -412673 -1187350 -1464533 -598892 684918 1120322
38768A120322o17415p82550m27874n40688j044993r52381L3705J008876J092309
$$ 1120322 502907 -279643 -707517 -1248205 -2293198 -3245579 -3211874 -2202998 -1110689
38759a110689M92184J04823M59181J268842J799297J556149P23887p0264m56708
$$ -1110689 -618505 -513682 -54501 1214341 3013638 4569787 5293674 5223410 4766702
38750D766702o17576q43517j149799j483690j837212j848514q68627R95915K400636
$$ 4766702 4149126 3305609 2155810 672120 -1165092 -3013606 -3882233 -2886318 -485682
38741d85682K120888O33292m56757m07544O1538O9211m55369j184185j832957
$$ -485682 1635206 2268498 1811741 1404197 1465735 1534946 1079577 -104608 -1937565
38732a937565j907670q90966Q29579J920613J568025M86844o4133J50457L42945
$$ -1937565 -3845235 -4736201 -3906622 -1986009 -417984 68860 4727 155184 498129
38723D98129m502m64015l26309L91346P76167j7384j529509k074674o44145J476378
$$ 498129 493627 29612 -296697 94649 870816 853432 -676077 -2750751 -3394896 -1918518
38713a918518J920887K29584j417756r98156Q01592J756423J103194J28777L535
$$ -1918518 2369 231953 -1185803 -2183959 -1382367 374056 1477250 1606027 1609562
38704A609562L20347J26465n26165p18589L402R64656J091594J69827p77283n82299
$$ 1609562 1929909 2056374 1530209 811620 815022 1779678 2871272 3041099 2263816 1681517
38694A681517O19039J453518R55275l99980j565086k084311j854347o35987J136406
$$ 1681517 2300556 3754074 4709349 4309369 2744283 659972 -1194375 -1830362 -693956
38685f93956J809838L23658j724537j571652R73720L065732K651659R30714o0426
$$ -693956 1115882 1439540 -284997 -1856649 -882929 2182803 4834462 5765176 5704750
38676E704750m80611j518692k577454j991202n1603J029348L34605o36663n34891
$$ 5704750 5224139 3705447 1127993 -863209 -914812 114536 449141 -187522 -722413
38667g22413L5580M9383k79415l88122n04948p86812n70752L31327P83439R7633
$$ -722413 -686833 -637450 -916865 -1304987 -1809935 -2596747 -3167499 -2836172 -2052733 -1955100
38657a955100m95250K98407J572897J665383R58126J034347J625712R74230q10760
$$ -1955100 -2450350 -2151943 -579046 1086337 2044463 3078810 4704522 5678752 4867992
38648D867992j518716n46094r8928j460491k610071j458055O45273J033233j02050
$$ 4867992 3349276 2803182 2704254 1243763 -1366308 -2824363 -2179090 -1145857 -1247907
38639a247907l06736J095294K153989J395036m64010k094805k904675k485475
$$ -1247907 -1554643 -459349 1694640 3089676 2625666 530861 -2373814 -4859289
38631d859289n67313J876640L006238K257580R12454J28122k69846o05006m82898
$$ -4859289 -5426602 -3549962 -543724 1713856 2626310 2754432 2484586 1879580 1396682
38622A396682J31914L40345k47329o51424q7679O46595L91068o53015j412333
$$ 1396682 1528596 1868941 1621612 970188 882509 1529104 1920172 1267157 -145176
38613a45176j340753m30522J185540K561722J968088q88323l484539l072757k26509
$$ -145176 -1485929 -1916451 -730911 1830811 3798899 2910576 -573963 -3646720 -3873229
38604c873229J913072J666895K63490p11054j242880j681867j480593k94011R35948
$$ -3873229 -1960157 -293262 -29772 -740826 -1983706 -3665573 -5146166 -5440177 -4504229
38595d504229J197988Q60790Q55143J130050R79669L55769j94941n19635p89502
$$ -4504229 -3306241 -2445451 -1590308 -460258 519411 875180 680239 160604 -628898
38586f28898p28223O4481J105139J303095L62764q26002j295112q58485J45804
$$ -628898 -1357121 -1292640 -187501 1115594 1478358 652356 -642756 -1501241 -1355437
38577a355437J238928J797726J389782L87265l06917l50760k38263l53729m48878
$$ -1355437 -116509 1681217 3070999 3458264 3151347 2800587 2562324 2208595 1759717
38568A759717l21582k55831l56584j93970L15496M19551k95574r10993l66233
$$ 1759717 1438135 1182304 825720 631750 947246 1366797 1071223 160230 -206003
38559b06003Q36437J281615P18916J98252J58058j93317j205960j845650j198174
$$ -206003 630434 1912049 2630965 2829217 2987275 2793958 1587998 -257652 -1455826
38550a455826R1254P54340N21466k1442n08310q23595o36555J18453O97928M16930
$$ -1455826 -1364572 -610232 -88766 -110208 -618518 -1442113 -2078668 -1960215 -1262287 -845357
38540h45357k59124l68179J41797N78696P14369P63958M65928n53163j579652
$$ -845357 -1104481 -1472660 -1330863 -752167 -37798 726160 1192088 638925 -940727
38531i40727j331747J24461J252594J198135Q32825J117455J603356J357039M40197
$$ -940727 -2272474 -2148013 -895419 302716 1135541 2252996 3856352 5213391 5653588
38522E653588m15518r24479j209949j193086p89661l16884q9372M609Q4399L126
$$ 5653588 5238070 4313591 3103642 1910556 1120895 804011 714639 719248 803647 806773
38512H06773o2739M70228J436569J548003J29713j517936j672171n51958J78608
$$ 806773 744034 1214262 2650831 4198834 4328547 2810611 1138440 586482 765090
38503G65090j06463m98160m66757o58688j364571j637225p54777N01011R70840
$$ 765090 658627 160467 -306290 -964978 -2329549 -3966774 -4721551 -4220540 -3249700
38494c249700P51733P04909Q76902N55413k43302m67690M56514J606390J641660
$$ -3249700 -2497967 -1793058 -916156 -360743 -604045 -1071735 -615221 991169 2632829
38485B632829N08919n47726n93011l4038J59837j99305m51897j76667K89335N43260
$$ 2632829 3141748 2594022 2001011 1966973 2126810 1927505 1475608 1298941 1588276 2131536
38475B131536P04855Q84841N86856n94174j859664j740233p2312J352061Q63045
$$ 2131536 2836391 3721232 4308088 3713914 1854250 114017 41705 1393766 2256811
38466B256811p89301j222398M28605K218520J908577n1623j219557n09616N86851
$$ 2256811 1467510 245112 673717 2892237 4800814 4749191 3529634 3020018 3606869
38457C606869M32916n25928q93994n76550n33656r08262r25567m96466m30655
$$ 3606869 4039785 3513857 2619863 2043313 1509657 601395 -324172 -820638 -1251293
38448a251293q69260q83947p9842O30072M92594J27628N03575J468924K070636
$$ -1251293 -2120553 -3004500 -3084342 -2454270 -1961676 -1834048 -1330473 138451 2209087
38439B209087J812704R96072K25831j5490K74643M98563K20796l4384L52993O17845
$$ 2209087 4021791 5017863 5243694 5228204 5502847 6001410 6222206 6187822 6540815 7158660
38429G158660n19959k347564k433256k04967J692754J017981q23235j029259M57727
$$ 7158660 6638701 4291137 1857881 1652914 3345668 4363649 3540414 2511155 2968882
38420B968882J306613M91003o97030j090834r84957q74406o26114k26747N433
$$ 2968882 4275495 4766498 4069468 2978634 1993677 1119271 493157 266410 271843
38411B71843J47216M77391O28791Q4950p09791r55177q09551p33462j31389J558640
$$ 271843 419059 896450 1525241 1610191 900400 -54777 -864328 -1597790 -1729179 -170539
38401a70539K959734K176818m9697j026733j04792N45269l46375j301766r60815
$$ -170539 2789195 4966013 4916316 3889583 3784791 4330060 3983685 2681919 1721104
38392A721104k44356k33409k10969M41176M95006q97809k007331r21298J168506
$$ 1721104 1476748 1243339 1032370 1473546 1968552 1070743 -936588 -1857886 -689380
38383f89380J576494J98183n45907M53258J583370J168901m07402j745801k131994
$$ -689380 887114 1085297 539390 992648 2576018 3744919 3337517 1591716 -540278
38374e40278j677459q43179k57640k41623l21965J27831Q32466R82823N47589
$$ -540278 -2217737 -3060916 -3318556 -3560179 -3882144 -3754313 -2921847 -1939024 -1391435
38365a391435L03855N34649O06175M8725o89059q65786l30191M54336R46775R53320
$$ -1391435 -1087580 -552931 53244 101969 -587090 -1452876 -1783067 -1328731 -381956 571364
38355E71364O85204M11765P9456m50725q26218m49054N29474J119565P06332k88376
$$ 571364 1256568 1668333 1747789 1297064 470846 21792 551266 1670831 2377163 2088787
38345B088787j223913j896300k006810j023608O91536J587425P63804o07900p62136
$$ 2088787 864874 -1031426 -3038236 -4061844 -3370308 -1782883 -1019079 -1626979 -2389115
38336b389115L09773J073728O55981k52877o20510l27380m6414k81860o28364
$$ -2389115 -2079342 -1005614 -349633 -602510 -1223020 -1550400 -1596814 -1878674 -2507038
38327b507038j19705J312320K148175J124367n36788m63965J191006J643560k14246
$$ -2507038 -2626743 -1314423 833752 1958119 1421331 957366 2148372 3791932 3577686
38318C577686j898741j294378r0455q49242k596317k365478J0627J783804J476526
$$ 3577686 1678945 384567 294112 -555130 -3151447 -5516925 -5506298 -3722494 -2245968
38309b245968K87976n14862q85870o57229M86973J531963J092411l3939J74470
$$ -2245968 -1957992 -2472854 -3358724 -4015953 -3528980 -1997017 -904606 -938545 -764075
38300g64075J362684J080275r06090j774977j86527J452115R08258m64040l24867
$$ -764075 598609 1678884 772794 -1002183 -1188710 263405 1171663 707623 382756
38291C82756R15426J275469M17834n21338r92013r72632j26992J132042J073232
$$ 382756 1298182 2573651 2991485 2470147 1478134 505502 378510 1510552 2583784
38282B583784q91480k498109j568049N57346R93949k41383o00244O14747J276283
$$ 2583784 1692304 -805805 -2373854 -1816508 -822559 -1063942 -1664186 -1049439 226844
38273B26844K10033q63805k48985J088602J262608K85191m05224k41889J38514
$$ 226844 436877 -426928 -675913 412689 1675297 1960488 1555264 1313375 1451889
38264A451889L44230O29283Q97173M41596r38045k232810k159883n95234J280736
$$ 1451889 1796119 2425402 3322575 3764171 2826126 593316 -1566567 -2161801 -881065
38255h81065K176873J739857N42935m78418n58353K65420Q02377k07977k175061
$$ -881065 1295808 3035665 3578600 3100182 2541829 2807249 3609626 3401649 1226588
38246A226588k807486j093016R47605R50248l29396l51544J010183J353018L2105
$$ 1226588 -1580898 -2673914 -1726309 -776061 -1105457 -1457001 -446818 906200 938305
38237I38305m43504J483564L600826L163958R04298m49909j78123K40088o1060
$$ 938305 494801 1978365 5579191 8743149 9647447 9197538 9019415 9259503 9198443
38228I198443o21324j190792j880876k054393r03311R61843J984325J556883K57644
$$ 9198443 8577119 7386327 5505451 3451058 2547747 3509590 5493915 7050798 7308442
38219G308442j282260k449937k320430q29685L83936j6673r14301m36600R38083
$$ 7308442 6026182 3576245 1255815 426130 810066 793393 -120908 -557508 380575
38210C80575J219610L28365Q2516Q21356P67608p39036j941926j522159m89427
$$ 380575 1600185 1928550 2011066 2832422 3600030 2860994 919068 -603091 -1092518
38201a092518p9161K19781J181675K100304K023865J413567J140915R03543N606
$$ -1092518 -1171679 -951898 229777 2330081 4353946 5767513 6908428 7811971 7817577
38192G817577j156301j695778j663322j676964j626182q57372N92298J817639
$$ 7817577 6661276 4965498 3302176 1625212 -970 -858342 -266044 1551595
38184A551595K035802J274063K15580l93295l88507k56212l12059k22077P1314
$$ 1551595 3587397 4861460 5077040 4683745 4295238 4039026 3726967 3504890 3576204
38175C576204l17610j751133k648612j361481R15676J363536k81625j318203m03280
$$ 3576204 3258594 1507461 -1141151 -2502632 -1586956 -223420 -505045 -1823248 -2226528
38166b226528M99212k53290j158032l88896Q99053O47993m69075l21414R30595
$$ -2226528 -1727316 -1980606 -3138638 -3527534 -2628481 -1980488 -2449563 -2770977 -1840382
38157a840382J269683L98690L0875P18423J076971M76463N8856M44728N99462
$$ -1840382 -570699 -172009 -141134 577289 1654260 2130723 2189579 2634307 3233769
38148C233769j22459o78578j93249M26573L4201p02920k21471J473655K550194
$$ 3233769 3111310 2432732 2239483 2666056 2700257 1997337 1775866 3249521 5799715
38139E799715J638340m38874j630973j068621L5831J60584m27068l22048N13411
$$ 5799715 7438055 6999181 5368208 4299587 4335418 4496002 4068934 3746886 4260297
38130D260297N19678p00483j278407o3104J050151j40815k397537k655691o74376
$$ 4260297 4779975 4079492 2801085 2737981 3788132 3647317 1249780 -1405911 -2080287
38121b080287Q30333N99492L23594J112672J452358O9840j612522j666538m68583
$$ -2080287 -1249954 -650462 -326868 785804 2238162 2308002 695480 -971058 -1439641
38112a439641M19115O53221O95976L74141l72203m84850O42272J609393R13833
$$ -1439641 -1020526 -367305 328671 702812 330609 -154241 488031 2097424 3011257
38103C011257m82914n28663O30026R13214l97704j763843j882564j140889k86441
$$ 3011257 2528343 1999680 2629706 3542920 3145216 1381373 -501191 -1642080 -1928521
38094a928521N79410J232611J147506O17462O14168J012163M19637j549591l258504
$$ -1928521 -1349111 -116500 1031006 1648468 2262636 3274799 3694436 2144845 -1113659
38085a113659l180746j815977n20978M13663J373430K063894J874130J059799
$$ -1113659 -4294405 -6110382 -6631360 -6217697 -4844267 -2780373 -906243 153556
38077A53556M05521P2067k45437m22553j99357l7064n90113j474217j601431p16983
$$ 153556 559077 631144 385707 -36846 -236203 -273267 -863380 -2337597 -3939028 -4656011
38067d656011L56505J006008J362884J459115R41137J5689k99349M68341J319217
$$ -4656011 -4299506 -3293498 -1930614 -471499 469638 485327 185978 654319 1973536
38058A973536R41841o02583k007508k272346j523303m51354M21907Q43609P44619
$$ 1973536 2915377 2312794 305286 -1967060 -3490363 -3941717 -3519810 -2676201 -1931582
38049a931582L76733K91247Q45569J714618K092593J503562L36195n59197p53412
$$ -1931582 -1554849 -1263602 -418033 1296585 3389178 4892740 5228935 4669738 3916326
38040C916326n30725l46532l28640m06945n34577n39411j68988L71849M04176
$$ 3916326 3385601 3039069 2710429 2303484 1768907 1229496 1060508 1432357 1836533
38031A836533j80235l82230N68752J760500J615410K06776p92806o56742n73311
$$ 1836533 1656298 1274068 1842820 3603320 5218730 5425506 4632700 3975958 3402647
38022C402647j399029j960120q84022R76096J558986M53095q62754j340433j296802
$$ 3402647 2003618 43498 -840524 135572 1694558 2147653 1284899 -55534 -1352336
38013a352336j064174m08814L57802K98571m75758n44290N25114J057273k41468
$$ -1352336 -2416510 -2825324 -2467522 -2168951 -2644709 -3188999 -2663885 -1606612 -1848080
38004a848080j855309j255558J462444L532716L055699R69966p54418j364986
$$ -1848080 -3703389 -4958947 -3496503 36213 3091912 4061878 3307460 1942474
37996A942474j151737l56295P03070J221352O96410k35987n79476k85963l5243
$$ 1942474 790737 434442 1137512 2358864 3055274 2819287 2239811 1953848 1918605
37987A918605k8073J05283L42452J95545l12927n68237n32222r86353k027638
$$ 1918605 1890532 1995815 2338267 2533812 2220885 1652648 1120426 134073 -1893565
37978a893565k293460p15883J565518K319709J108563k09704q0822Q42715R91149
$$ -1893565 -4187025 -4902908 -3337390 -1017681 90882 -118822 -199644 643071 1634220
37969A634220P2376r28401j321169j287844j137382q62884m41047M0435N27572
$$ 1634220 1706596 778195 -542974 -1830818 -2968200 -3831084 -4272131 -4231696 -3704124
37960c704124Q15291M47545n94146j349003q22341N91060J435202R86753o9519
$$ -3704124 -2888833 -2441288 -3035434 -4384437 -5206778 -4615718 -3180516 -2193763 -2263282
37951b263282q20169j065761q55904o8542J011545J506777J019375K94557J66812
$$ -2263282 -3083451 -4149212 -5005116 -5073658 -4062113 -2555336 -1535961 -1241404 -1074592
37942a074592L99144K90182n5261O3490P06250J113225P49896j20057r01614j139072
$$ -1074592 -675448 -385266 -440527 -377037 329213 1442438 2192334 2072277 1170663 31591
37932C1591n54975P53297K038765K355029J501217K03724p38139j166695j348549
$$ 31591 -523384 229913 2268678 4623707 6124924 6328648 5590509 4423814 3075265
37923C075265j401709j173561n56448K38815P68362P66212M31595J09639k87705
$$ 3075265 1673556 499995 -56453 182362 950724 1716936 2148531 2258170 1970465
37914A970465j147883k323897k943909k411541j167855l6701P31381J221543J192708
$$ 1970465 822582 -1501315 -4445224 -6856765 -8024620 -8061321 -7329940 -6108397 -4915689
37905d915689N27930L0872O72847J968157K170079N09546j623351k338200j437383
$$ -4915689 -4387759 -4356887 -3684040 -1715883 454196 963742 -659609 -2997809 -4435192
37896d435192k43767K92394M23036O22449O68747J39497o34232p27356J98297
$$ -4435192 -4678959 -4386565 -3963529 -3341080 -2672333 -2532836 -3167068 -3894424 -3696127
37887c696127J282993J371540L86558o02981p26637k49699J07667K94077P40883
$$ -3696127 -2413134 -1041594 -655036 -1258017 -1984654 -2234353 -2126686 -1832609 -1091726
37878a091726J273480J021809l41097j859933k240376j258480J35113R31175Q99576
$$ -1091726 181754 1203563 862466 -997467 -3237843 -4496323 -4361210 -3430035 -2530459
37869b530459L91334k29881p21978q15651l80121K11183K93491k42554o63101
$$ -2530459 -2139125 -2369006 -3090984 -3906635 -4286756 -4075573 -3782082 -4024636 -4687737
37860d687737l79697R7790j11814p59705o67482L99554J144268O12542l26673
$$ -4687737 -5067434 -4969644 -5081458 -5841163 -6508645 -6109091 -4964823 -4352281 -4678954
37851d678954k97008N68093J078085R12685P44587O60307o2165j368288j964691
$$ -4678954 -4975962 -4407869 -3329784 -2417099 -1672512 -1012205 -1074370 -2442658 -4407349
37842d407349j042397N21189J339083J141443N99974J99868K8108K32167Q93812
$$ -4407349 -5449746 -4928557 -3589474 -2448031 -1848057 -1648189 -1620081 -1387914 -494102
37833d94102J555344J476732M91427o55236r64973k48525M71028o9094j733138
$$ -494102 1061242 2537974 3029401 2374165 1409192 1160667 1631695 1562601 -170537
37824a70537k755260j726524N68761K110051K108918J461128R36979L14882m69021
$$ -170537 -2925797 -4652321 -4083560 -1973509 135409 1596537 2533516 2848398 2379377
37815B379377p47200l04137Q0873m4915r4866K41002K39653l78859n80731J19980
$$ 2379377 1632177 1328040 1408913 1363998 1269132 1510134 1749787 1370928 790197 910177
37805I10177K84846j242011k874111k208888K03615J420797L96864p03211m169
$$ 910177 1195023 -46988 -2921099 -5129987 -4926372 -3505575 -3108711 -3811922 -3816091
37796c816091J516077J993317J295056L10428q16206k105918k532478j209130
$$ -3816091 -2300014 -306697 988359 1298787 482581 -1623337 -4155815 -5364945
37788e364945P72234J364320K50580q84774o82327N84306J973749K793580K420823
$$ -5364945 -4592711 -3228391 -2977811 -3862585 -4544912 -3960606 -1986857 806723 3227546
37779C227546O33973j404341j808358l50553R53154N32631n64539m38933O50795
$$ 3227546 3861519 2457178 648820 298267 1251421 1784052 1219513 780580 1431375
37770A431375P81319m97507j464720r78516r1816o3836l52442R2856P89012O54408
$$ 1431375 2212694 1715187 250467 -728049 -819865 -883701 -1236143 -1143287 -354275 300133
37760C00133J60442O19125J676190J596108K06532n67871J77437P10042n37885
$$ 300133 460575 1079700 2755890 4351998 4558530 3990659 4168096 4878138 4340253
37751D340253k257570k145865l38473J035959J075378Q07786Q68499N58008m09313
$$ 4340253 2082683 -63182 -401655 634304 1709682 2517468 3385967 3943975 3534662
37742C534662j019602n65858K27332M46984K07075j16322p34065j625187j874119
$$ 3534662 2515060 1949202 2176534 2623518 2830593 2714271 1980206 355019 -1519100
37733a519100r15780L04632N51494J30164L18432J295481J854604J179580j45721
$$ -1519100 -2434880 -2130248 -1578754 -1448590 -1130158 165323 2019927 3199507 3053786
37724C053786j098174j351545j185865r18948p39961o70878m71637J07187R06957
$$ 3053786 1955612 604067 -581798 -1500746 -2240707 -2911585 -3383222 -3276035 -2369078
37715b369078J497111J675175J473236Q34328j73642r53471r03977l71484k91504
$$ -2369078 -871967 803208 2276444 3110772 2937130 1983659 1079682 708198 416694
37706D16694p18753n98085N61935J631301J235817l51467j533518j323485j90365
$$ 416694 -302059 -900144 -338209 1293092 2528909 2177442 643924 -679561 -869926
37697h69926Q44650J164375O31702n06381j579683j916697j510484q70332k06563
$$ -869926 -25276 1139099 1770801 1264420 -315263 -2231960 -3742444 -4612776 -4819339
37688d819339O69629J578988J828557J135526R5564o11393r11631q99795m20212
$$ -4819339 -4149710 -2570722 -742165 393361 488925 -122468 -1034099 -1933894 -2354106
37679b354106L51440N93806p6440p04204j22973J302672K026506J291786j73677
$$ -2354106 -2002666 -1408860 -1485300 -2189504 -2312477 -1009805 1016701 2308487 2134810
37670B134810j357659j851126j490834k32282J276019J945708J507549P36576
$$ 2134810 777151 -1073975 -2564809 -2797091 -1521072 424636 1932185 2668761
37662B668761J72830l77726p56493k15339R68474J026766q68337k850633k683807
$$ 2668761 2841591 2463865 1707372 1492033 2460507 3487273 2618936 -231697 -2915504
37653b915504r99495k32317p53818m13832J728100L534953K819720M66233j044922
$$ -2915504 -3914999 -4147316 -4901134 -5314966 -3586866 -51913 2767807 3234040 2189118
37644B189118j018295p08321q15609o84886N4568O70133N36047j0803m50992p51216
$$ 2189118 1170823 462502 -353107 -1037993 -983425 -313292 222755 211952 -239040 -990256
37634i90256q42273l90369L53763M00567n12211j113152k68559J162269J391421
$$ -990256 -1832529 -2222898 -1869135 -1468568 -1980779 -3093931 -3362490 -2200221 -808800
37625h08800K89281n31248k62301L2973n42379j113926n64179M99641P57883M04761
$$ -808800 -519519 -1050767 -1313068 -1280095 -1822474 -2936400 -3500579 -3000938 -2243055 -1838294
37615a838294P01539J607558J603465J07559j460793j587922m67073O51363R10360
$$ -1838294 -1136755 470803 2074268 2181827 721034 -866888 -1333961 -682598 227762
37606B27762J98807r29496j281492q1709J600149J798945N05537j03466Q92225
$$ 227762 426569 -502927 -1784419 -1866128 -265979 1532966 2038503 1935037 2827262
37597B827262J493015J05512j436982n74897J669735K030278K3171j474228q44744
$$ 2827262 4320277 4425789 2988807 2413910 4083645 6113923 6137094 4662866 3818122
37588C818122Q5568n83099j875922j870736o61699K55861K92463j087j13285J74611
$$ 3818122 3903690 3320591 1444669 -426067 -1087766 -831905 -539442 -540529 -653814 -479203
37578d79203R53053J687401J349316j35136j367786j164196J8112R57940J113668
$$ -479203 473850 2161251 3510567 3375431 2007645 843449 861561 1819501 2933169
37569B933169O42095m0702j99876O11725J442758Q10824q48875j382988l32699
$$ 2933169 3575264 3534562 3334686 3946411 5389169 6199993 5351118 3968130 3635431
37560C635431P448j687224l225616k167223K85204J256693O10755M80648J326296
$$ 3635431 3642879 1955655 -1269961 -3437184 -3151980 -1895287 -1284532 -803884 522412
37551E22412J525439N53233l58669p50291j377321j968020j262558L37078Q69963
$$ 522412 2047851 2601084 2242415 1492124 114803 -1853217 -3115775 -2778697 -1908734
37542a908734J42250K01181J645426K296514Q83757o23810j65554J235945J511640
$$ -1908734 -1766484 -1565303 80123 2376637 3260394 2636584 2471030 3706975 5218615
37533E218615Q23841N41321M54365n78892k158268k757872k096926j251383q43659
$$ 5218615 6042456 6583777 7038142 6459250 4300982 1543110 -553816 -1805199 -2648858
37524b648858o99020p88393j019763o51337O28523J649781J262143K08717o3595
$$ -2648858 -3347878 -4136271 -5156034 -5807371 -5178848 -3529067 -2266924 -2058207 -2121802
37515b121802K76504J01271l78122l2738Q71377R69316K92674K46792R37736P78593
$$ -2121802 -1845298 -1744027 -2122149 -2154887 -1283510 -314194 -21520 225272 1163008 1941601
37505A941601p14720j873568j458724l88681J23718M23300J160471J666365J038297
$$ 1941601 1226881 -646687 -2105411 -2494092 -2370374 -1947074 -786603 879762 1918059
37496A918059j66612o94329l70171J4456M152l08295q14842j246051j028331j14102
$$ 1918059 1751447 1057118 686947 701403 705555 397260 -417582 -1663633 -2691964 -2806066
37486b806066N85937L87283j39656j44593J51436Q3438m5199N83737J646452J708102
$$ -2806066 -2220129 -1832846 -1972502 -2117095 -1965659 -1882221 -1927420 -1343683 302769 2010871
37476B010871J28044j947343k839788k054030m76146P71000J363194J696011J942015
$$ 2010871 2138915 191572 -2648216 -4702246 -5178392 -4407392 -3044198 -1348187 593828
37467E93828J578406K58075j189422j507876p67788l23037p40629r50695r2442
$$ 593828 2172234 2430309 1240887 -266989 -1034777 -1357814 -2098443 -3049138 -3141580
37458c141580R40759P79881m88148j707410k194553j839623n06159J370281K298294
$$ -3141580 -2200821 -1420940 -1909088 -3616498 -5811051 -7650674 -8156833 -6786552 -4488258
37449d488258J343583k41800n00132N13464J077698N41015q3143j54092j17371
$$ -4488258 -3144675 -3386475 -3886607 -3373143 -2295445 -1754430 -1837573 -1991665 -2109036
37440b109036j6923P28049J628658J220959m18241j241789l36757N12483k43153
$$ -2109036 -2125959 -1397910 230748 1451707 1033466 -208323 -545080 -32597 -275750
37431b75750j291618o38587J074083J609981N37381o02473r35239r34581q12431
$$ -275750 -1567368 -2205955 -1131872 478109 1015490 413017 -522222 -1456803 -2269234
37422b269234l34601j13101r75752j975306j195714J101089K335132J319036m1432
$$ -2269234 -2603835 -2716936 -3692688 -5667994 -6863708 -5762619 -3427487 -2108451 -2149883
37413b149883J74812J182308J343832R16218R88265J058618n6365j664984j827012
$$ -2149883 -1975071 -792763 551069 1467287 2455552 3514170 3457805 1792821 -34191
37404c4191l01617J164411J458675J073510L96760q42938j970693j390916P84197
$$ -34191 -335808 828603 2287278 3360788 3757548 2914610 943917 -446999 337198
37395C37198K090204J058691n37613m93889L80936p1116j382271j040528J140190
$$ 337198 2427402 3486093 2948480 2454591 2835527 2764411 1382140 341612 1481802
37386A481802K221495N32029j734667j834450l45186K74811m09562o81635J59870
$$ 1481802 3703297 4235326 2500659 666209 321023 595834 186272 -495363 -335493
37377c35493Q23710L85527k93618j40025N37602P99473M76036J17463J78500P39210
$$ -335493 488217 873744 580126 440101 977703 1777176 2253212 2370675 2549175 3288385
37367C288385J469056J542724K73374j770189k942795k287871n60163Q93011J561362
$$ 3288385 4757441 6300165 6573539 4803350 1860555 -427316 -987479 -94468 1466894
37358A466894J534497O21407j269251l133686l299596j212827J631586K918493
$$ 1466894 3001391 3622798 2353547 -780139 -4079735 -5292562 -3660976 -742483
37350g42483J732977m96349j446029l99587J037662J057960o4061o44893j28656
$$ -742483 990494 494145 -951884 -1351471 -313809 744151 680090 35197 -93459
37341i3459L52309l3572p12560j005137j126873j210528o90265M22908R65897
$$ -93459 258850 225278 -487282 -1492419 -2619292 -3829820 -4520085 -4097177 -3131280
37332c131280M60468K37529J292474K221731J153815j094530j885024m55241J256090
$$ -3131280 -2670812 -2433283 -1140809 1080922 2234737 1140207 -744817 -1200058 56032
37323E6032J484893M98306o07886j240793j094670j61344O53383L43427m72098
$$ 56032 1540925 2039231 1431345 190552 -904118 -1065462 -412079 -68652 -540750
37314e40750j43091J370890K139722J120004l24784o19618j14817N5635j44514
$$ -540750 -683841 687049 2826771 3946775 3621991 3002373 2887556 2943191 2798677
37305B798677j89905k96955q37877j226771o35146O82223J718839J871047J068240
$$ 2798677 2608772 2311817 1473940 247169 -387977 294246 2013085 3884132 4952372
37296D952372n01822k009126k134616n67261J262607J775824R82996j3509m45735
$$ 4952372 4450550 2441424 306808 -260453 1002154 2777978 3760974 3747465 3301730
37287C301730j06056Q71318J567193O50977j701319l240205k266719K7270J186385
$$ 3301730 3195674 4066992 5634185 6285162 4583843 1343638 -923081 -895811 290574
37278B90574O59624j45694k84982n9631K59404Q24668J352466J233502N27882
$$ 290574 950198 804504 519522 459891 719295 1543963 2896429 4129931 4657813
37269D657813k12947q92574j556966j556274l47527J168373J497238N44003n43582
$$ 4657813 4444866 3552292 1995326 439052 91525 1259898 2757136 3301139 2757557
37260B757557j183660j521560j140272N19354K401352K425680L54066j550862
$$ 2757557 1573897 52337 -1087935 -568581 1832771 4258451 4612517 3061655
37252C061655j409777N4149Q75091L17062p32879j065529l00638P76441R11621
$$ 3061655 1651878 1706027 2581118 2898180 2165301 1099772 799134 1575575 2487196
37243B487196j19570j056373r04497m27342p09967j114414m51689N46772K61846
$$ 2487196 2367626 1311253 406756 -20586 -730553 -1844967 -2296656 -1749884 -1488038
37234a488038o86503j00388J846739K321872L25000j487501r06819O37910R21159
$$ -1488038 -2174541 -2274929 -428190 1893682 2218682 731181 -175638 462272 1383431
37225A383431M98758J003297J801212J159184m46651r65619j56662J61010q81939
$$ 1383431 1882189 2885486 4686698 5845882 5399231 4433612 4276950 4437960 3556021
37216C556021k058122k039762q94790N19424J339504R36118m23785j305740o02155
$$ 3556021 1497899 -541863 -1436653 -917229 422275 1358393 934608 -371132 -973287
37207i73287R62923J840416J679155J191539O02348l39993j231917j393239j125120
$$ -973287 -10364 1830052 3509207 4700746 5303094 4963101 3731184 2337945 1212825
37198A212825j175749j214690l46786R96065J248816q1784j767815k555260k282301
$$ 1212825 37076 -1177614 -1524400 -528335 720481 638697 -1129118 -3684378 -5966679
37189e966679j251989K15662J422745J679158J297624J216119J544752J490805
$$ -5966679 -7218668 -7003006 -5580261 -3901103 -2603479 -1387360 157392 1648197
37181A648197P24723k54015j087793j751112j789095o32068J168084K188020J841923
$$ 1648197 2372920 2118905 1031112 -720000 -2509095 -3141163 -1973079 214941 2056864
37172B056864Q47699l3727o13999o74195o1758M87150n1967j338200j875722j097358
$$ 2056864 2904563 2870836 2256837 1582642 1520884 2008034 1956067 617867 -1257855 -2355213
37162b355213M0366P18109J076752J123062M18462o21187p14944K58247P49228
$$ -2355213 -2314847 -1596738 -519986 603076 1021538 400351 -314593 -56346 692882
37153F92882o2118q67365l73609N39478K66487r45073j452648o64466M62251J093917
$$ 692882 630764 -236601 -610210 -70732 195755 -749318 -2201966 -2866432 -2404181 -1310264
37143a310264J349749J451984J181367M83810j07502n7859M32743N49121k20139
$$ -1310264 39485 1491469 2672836 3156646 3049144 2991285 3424028 3973149 3753010
37134C753010j339070j696315r97672k05316j60629m42884l70216l02020o72990
$$ 3753010 2413940 717625 -280047 -485363 -645992 -1088876 -1459092 -1761112 -2434102
37125b434102n64949Q83867K216006J227759j248537j913361P9667J726837R38671
$$ -2434102 -2999051 -2115184 100822 1328581 80044 -1833317 -1753650 -26813 911858
37116I11858l05827L74534J692328J143106n79086r52033n1286p8081j115747
$$ 911858 606031 980565 2672893 3815999 3236913 2284880 2233594 2155513 1039766
37107A039766r32961Q73757J881853P03604j006700j360972n66999N41578J880018
$$ 1039766 106805 980562 2862415 3566019 2559319 1198347 631348 1172926 3052944
37098C052944K791186J721081j113640k777475j326836J162587J464022j84066
$$ 3052944 5844130 7565211 6451571 3674096 2347260 3509847 4973869 4789803
37090D789803q20299N72692J831264J208306k49765q62302r18636j583040k355386
$$ 4789803 3969504 4542196 6373460 7581766 7332001 6469699 5551063 3968023 1612637
37081A612637j521216R79697K807647K058675k37045j552244j193243p38798j152655
$$ 1612637 91421 1071118 3878765 5937440 5700395 4148151 2954908 2216110 1063455
37072A063455j195790L16773K082058J847819k32217j643262r48005N23106Q79678
$$ 1063455 -132335 184438 2266496 4114315 3882098 2238836 1290831 1813937 2693615
37063B693615R7369n31069k57484O36552J423643J359082K71076q01751m76846
$$ 2693615 2790984 2259915 2002431 2638983 4062626 5421708 5692784 4891033 4414187
37054D414187R63971J552161L48977j040028p48647O91989J393614Q97047K50884
$$ 4414187 5378158 6930319 7279296 6239268 5490621 6182610 7576224 8473271 8724155
37045H724155r7061o39290j205462q48538M00370J214842Q31591q4880p99674
$$ 8724155 8627094 7987804 6782342 5933804 6334174 7549016 8380607 8295727 7496053
37036G496053j380009j729543j142160M04194J667068J689509R55782K83339l24238
$$ 7496053 6116044 4386501 3244341 3648535 5315603 7005112 7960894 8244233 7919995
37027G919995q48326m99787R45449K038424J356277l56040j193322o87385J24533
$$ 7919995 7071669 6571882 7517331 9555755 10912032 10555992 9362670 8675285 8799818
37018H799818P60216J668521K676688K840749K055817J243147P11479n7763p39530
$$ 8799818 9560034 11228555 13905243 16745992 18801809 20044956 20756435 20698672 19959142
37009A9959142j56363J435903J984834O31445p02559j04919J524417K147620J743946
$$ 19959142 19802779 21238682 23223516 23854961 23152402 23047483 24571900 26719520 28463466
37000B8463466J802758K566588K911038K581756K554792L196671L768256L841162
$$ 28463466 30266224 32832812 35743850 38325606 40880398 44077069 47845325 51686487
36992E1686487L759842L713520L745075M542728O680493R167299J0423809J0718386
$$ 51686487 55446329 59159849 62904924 67447652 74128145 83295444 93719253 104437639
36984A04437639J1870546J4412925J6948899J8653346K0433756K3053809K6083805
$$ 104437639 116308185 130721110 147670009 166323355 186757111 209810920 235894725
36977B35894725K9413497L3683991L8157343M0250643L8611287L4733956K9880177
$$ 235894725 265308222 298992213 337149556 377400199 416011486 450745442 480625619
36970D80625619K2326432R952859n712925k0369663l1138719l7948590m1563839
$$ 480625619 502952051 512904910 507191985 486822322 455683603 417735013 376171174
36963C76171174m2445919m1234065l8425814l3778116k7587431k1948400j8809455
$$ 376171174 333725255 292491190 254065376 220287260 192699829 170751429 151941974
36956A51941974j7276592j4983691j1788312r723385r366873q954285p626823
$$ 151941974 134665382 119681691 107893379 98169994 88803121 79848836 72222013
36949G2222013o904764p765795q555766p432111n144974l609841k991660k079951
$$ 72222013 65317249 57551454 48995688 41563577 36418603 32808762 29817102 27737151
36941B7737151p87011l92748j413035k671527k740979j441747K64133J274726
$$ 27737151 26950140 26557392 25144357 22472830 19731851 18290104 18554237 19828963
36933A9828963J120511J50150q90068j540828j854042j998084j923251j482912
$$ 19828963 20949474 21099624 20209556 18668728 16814686 14816602 12893351 11410439
36925A1410439o93996J09968L33152l16371j132845r48099J64285N84984n70427
$$ 11410439 10716443 10826411 11159563 10843192 9710347 8762248 8926533 9511517 8941090
36916H941090j804625j272570K81081M77096j093431k261329j486167K70271J384790
$$ 8941090 7136465 5863895 6144976 6622072 5528641 3267312 1781145 2051416 3436206
36907C436206J475782P77212o34827k037164k027744m06682J144011J228701M05208
$$ 3436206 4911988 5689200 5054373 3017209 989465 582783 1726794 2955495 3360703
36898C360703j60927l54586m11144P0532J177022J917240J638603J093373R17306
$$ 3360703 3199776 2845190 2434046 2504578 3681600 5598840 7237443 8330816 9248122
36889I248122L36875j148755k071441q64832J397357K091429N20485j393674j753699
$$ 9248122 9584997 8436242 6364801 5499969 6897326 8988755 9509240 8115566 6361867
36880F361867o14731O48267P81292l86732j599849j264894L81758J117463k63056
$$ 6361867 5747136 6395403 7176695 6789963 5190114 3925220 4306978 5424441 5161385
36871E161385k003949j924120o62104l75307j142721j100299K01589J075561N50774
$$ 5161385 3157436 1233316 571212 195905 -946816 -2047115 -1845526 -769965 -219191
36862b19191k44156q2333P55152J407132J478417P78272n92662j640596j340615
$$ -219191 -463347 -545680 209472 1616604 3095021 3873293 3280631 1640035 299420
36853B99420k34357K41394l5252j558L43127j00895j102238r22381P31875J785373
$$ 299420 65063 306457 271205 269647 612774 511879 -590359 -1512740 -780865 1004508
36843A004508Q79101o08787q82750k79320o9285k76600k63785k42646o28206q33853
$$ 1004508 1883609 1274822 392072 112752 43467 -233133 -496918 -739564 -1367770 -2201623
36833b201623j34126J020375J708493J780303J429232N11890o62008r31436J26186
$$ -2201623 -2335749 -1315374 393119 2173422 3602654 4114544 3452536 2521100 2647286
36824B647286J178329Q95814k30136r70581j166123j180243p10194L59485J000619
$$ 2647286 3825615 4721429 4491293 3520712 2354589 1174346 464152 823637 1824256
36815A824256N67316K34491J114905J950033Q02725j658041k846230j899759m27641
$$ 1824256 2391572 2626063 3740968 5691001 6493726 4835685 1989455 89696 -337945
36806c37945K61221M98237O98836N36294M7400j78897k06514n64501q36209k16915
$$ -337945 -76724 421513 1120349 1656643 1704043 1525146 1318632 754131 -82078 -298993
36796b98993N89065J54703r21035n39165J202509J625550j87937j505407j31214
$$ -298993 290072 444775 -476260 -1015425 187084 1812634 1624697 119290 -11924
36787a1924K073629K187034O52726o6850K27337l43915j929443k415595q80679
$$ -11924 2061705 4248739 4901465 4834615 5061952 4718037 2788594 372999 -507680
36778e07680J018989J673868J359383P54721l69715j933641k639996j595248K07508
$$ -507680 511309 2185177 3544560 4299281 3929566 1995925 -644071 -2239319 -2031811
36769b031811J179301J117318Q46008N95831k1676p69890p95723k2999M89664
$$ -2031811 -852510 264808 1110816 1706647 1684971 915081 119358 96359 586023
36760E86023M3738n76775j89200R40758J235255m1805j592754j703696n14778
$$ 586023 629761 52986 -136214 804544 2039799 1997994 405240 -1298456 -1813234
36751a813234L10163J9747l10262L66534J435121J634349Q77738Q3249k86169
$$ -1813234 -1503071 -1483324 -1793586 -1427052 8069 1642418 2520156 2603405 2317236
36742B317236m90904o04963l26846L18631Q37900Q57324L82336l37684p83436
$$ 2317236 1826332 1221369 894523 1213154 2051054 2908378 3290714 2953030 2169594
36733B169594m45795L44950N08866j76989m42352M49081J067252j15794j842794
$$ 2169594 1723799 2068749 2577615 2400626 1958274 2407355 3474607 3358813 1516019
36724A516019j511570P64694K092297J170063P7716O05763J311793J08557k128347
$$ 1516019 4449 769143 2861440 4031503 4109219 4714982 6026775 6135332 4006985
36715D006985k833033j485929J33117P66827P06005L42323l76269j043361r62105
$$ 4006985 1173952 -311977 -178860 587967 1293972 1636295 1260026 216665 -745440
36706g45440l52788j11256l25073j81128O90776J827814K676519K693742J213344
$$ -745440 -1098228 -1209484 -1534557 -1715685 -1024909 802905 3479424 6173166 7386510
36697G386510j410212l049986j992603L49774R03416q06371k002754p81611J268295
$$ 7386510 5976298 2926312 933709 1283483 2186899 1380528 -622226 -1403837 -135542
36688a35542J627630J96327j296626j812533j435350l26592J218782K257670K019055
$$ -135542 1492088 1688415 391789 -1420744 -2856094 -3182686 -1963904 293766 2312821
36679B312821R01481k15318j123044j912919k118895j293376j0874P13252P53467
$$ 2312821 3214302 2998984 1875940 -36979 -2155874 -3449250 -3460124 -2746872 -1993405
36670a993405P74526J040982J154953Q88490N58581M66172L75033k59627j500931
$$ -1993405 -1218879 -177897 977056 1865546 2424127 2890299 3265332 3005705 1504774
36661A504774k397001j748811J52751J326296O46726k77994N10463J836697R15810
$$ 1504774 -892227 -2641038 -2488287 -1161991 -515265 -793259 -282796 1553901 2469711
36652B469711j774281k471703P0250K236688J040730j242426r08487J341601K105128
$$ 2469711 695430 -1776273 -1706023 530665 1571395 328969 -579518 762083 2867211
36643B867211R72653L83266P66466J40675j521951j728945J3674R15882n86781
$$ 2867211 3839864 4223130 4989596 5130271 3608320 1879375 1893049 2808931 2222150
36634B222150k335748k034534m90839M27587N90299N79067M8584j065745j542827
$$ 2222150 -113598 -2148132 -2638971 -2211384 -1621085 -1042018 -993434 -2059179 -3602006
36625c602006p46486J81138M14172Q42711J890060K046942M80649r13154l16961
$$ -3602006 -4348492 -4167354 -3753182 -2910471 -1020411 1026531 1507180 594026 277065
36616B77065R12212M36597j234525j767242p56285K40832O44474J135758J475866
$$ 277065 1189277 1625874 391349 -1375893 -2132178 -1891346 -1246872 -111114 1364752
36607A364752O99393o43165q82034R2078P73211O69977P09169Q88999m6178k022393
$$ 1364752 2064145 1420980 538946 631024 1404235 2074212 2783381 3672380 3626202 1603809
36597A603809k942943j507308R61829K337361J962732N55379p82016r91840J10121
$$ 1603809 -1339134 -2846442 -1884613 452748 2415480 2970859 2188843 1197003 1307124
36588A307124J062522K52563j572291j995235m77325P91385L04550o04018k37250
$$ 1307124 2369646 2622209 1049918 -945317 -1422642 -631257 -326707 -930725 -1167975
36579a167975P50938P80406K1199j76636M45064J052164J300667J380164J028981
$$ -1167975 -417037 363369 384568 207932 652996 1705160 3005827 4385991 5414972
36570E414972l6803j120780j313901r26554r14228j240144j113903n67706l76823
$$ 5414972 5378169 4257389 2943488 2016934 1102706 -137438 -1251341 -1819047 -2195870
36561b195870m78401R1898J444338K289895J634456O4417j149373j468339j140553
$$ -2195870 -2674271 -2582373 -1138035 1151860 2786316 2850733 1701360 233021 -907532
36552i07532n09160J64302N80320N84155K98227j33001o82380j191214j317300
$$ -907532 -1416692 -1252390 -672070 -87915 210312 77311 -605069 -1796283 -3113583
36543c113583r45705l86592L4391L39561O48162Q03226N53975N830m31700n91638
$$ -3113583 -4059288 -4445880 -4411489 -4071928 -3423766 -2620540 -2066565 -2060735 -2492435 -3084073
36533c084073p58959j135021j312577o98688N25648J373815J270923Q33204R08377
$$ -3084073 -3843032 -4978053 -6290630 -6989318 -6463670 -5089855 -3818932 -2985728 -2077351
36524b077351J246942R53041Q3234k64911K95384O38974k80946j829851k505163
$$ -2077351 -830409 122632 205866 -59045 236339 875313 594367 -1235484 -3740647
36515c740647j818062m81141Q94911K236292L179877K889806J161297r24804j982994
$$ -3740647 -5558709 -6039850 -5144939 -2908647 271230 3161036 4322333 3397529 1414535
36506A414535j708874r62104o55437q46340q72882k03379R04291J618453J445431
$$ 1414535 -294339 -1256443 -1911880 -2758220 -3631102 -3834481 -2930190 -1311737 133694
36497A33694Q10690N59993R60573J444465J349862O52134j56372o94926r75796
$$ 133694 944384 1504377 2464950 3909415 5259277 5911411 5755039 5060113 4084317
36488D084317j131479j123643q57661m53606j80763j11097n8550M6333l4265m63148
$$ 4084317 2952838 1829195 971534 517928 337165 226068 167518 213851 179586 -283562
36478b83562r83019j244628j278604j263143j017926k84519N39791O16898j89009
$$ -283562 -1266581 -2511209 -3789813 -5052956 -6070882 -6355401 -5815610 -5198712 -5387721
36469e387721r73884r10855j80860N82321J217976J823866K053844J427270K38282
$$ -5387721 -6361605 -7272460 -7453320 -6870999 -5653023 -3829157 -1775313 -348043 -109761
36460a09761n63048m85978O7069N51002Q46988R03386M86219k80964o97638m15818
$$ -109761 -672809 -1158787 -1091718 -540716 306272 1209658 1695877 1414913 717275 301457
36450C01457j42599o21123j209679n49427J272819K429906J777690M48210K6220
$$ 301457 158858 -462265 -1671944 -2221371 -948552 1481354 3259044 3707254 3733474
36441C733474J07545p84396k353308k544083o82339J238533J314855L08070K06652
$$ 3733474 3841019 3056623 703315 -1840768 -2523107 -1284574 30281 338351 545003
36432E45003J275515J988106J325294j83642j416218j577021m82223J080661J643057
$$ 545003 1820518 3808624 5133918 4950276 3534058 1957037 1474814 2555475 4198532
36423D198532O73379n63760p64885m87644r33336j586210r77441N37893R41664
$$ 4198532 4871911 4308151 3543266 3055622 2122286 536076 -441365 96528 1038192
36414A038192l10047j399984r57144J78833P69686R22976J017631N64142o13919
$$ 1038192 728145 -671839 -1628983 -1450150 -680464 242512 1260143 1824285 1210366
36405A210366j430475j050585k50940j42078n98575r90379j306164j461637p56331
$$ 1210366 -220109 -1270694 -1521634 -1663712 -2262287 -3252666 -4558830 -6020467 -6776798
36396f776798P22317J426124N13874n41597j34690Q72985O33964n90909r57362
$$ -6776798 -6054481 -4628357 -4114483 -4656080 -4790770 -3917785 -3283821 -3874730 -4832092
36387d832092k5501R40504J297567J504060J434274L96785j007604j143740Q2005
$$ -4832092 -4857593 -3917089 -2619522 -1115462 318812 715597 -292007 -1435747 -1353742
36378a353742P80006j34200j332711j044723O51604K258258K605003J623387J83799
$$ -1353742 -573736 -707936 -2040647 -3085370 -2433766 -175508 2429495 4052882 4236681
36369D236681n31060j80367K89395J33758J35547J043815J443259n23015l491556
$$ 4236681 3705621 3525254 3814649 3948407 4083954 5127769 6571028 6048013 2556457
36360B556457l763670n85006K227439J464041j063107j423590R11769L007906
$$ 2556457 -1207213 -1792219 435220 1899261 836154 -587436 324333 3332239
36352C332239K934888J697134Q32225L22261n54500j758499k562180k383554j275224
$$ 3332239 6267127 7964261 8796486 9118747 8564247 6805748 4243568 1860014 584790
36343E84790m3582K35562o19165j436217j025395K75267J074440P30104q7039
$$ 584790 541208 776770 157605 -1278612 -2304007 -2028740 -954300 -224196 -311235
36334c11235n63526p21178j024801j482006j461934m43097J086720J783085R45965
$$ -311235 -874761 -1595939 -2620740 -4102746 -5564680 -6007777 -4921057 -3137972 -2192007
36325b192007l64212m84510O49671J476966J120603N00372O47228J151561J112016
$$ -2192007 -2556219 -3040729 -2391058 -914092 206511 706883 1354111 2505672 3617688
36316C617688N40472j41604r80728j747724j338912O14454K287165J517683j149696
$$ 3617688 4158160 4016556 3035828 1288104 -50808 563646 2850811 4368494 3218798
36307C218798k900797k175355k95972O93334N02058L29189J019527K122986K432071
$$ 3218798 318001 -1857354 -2153326 -1459992 -957934 -628745 390782 2513768 4945839
36298D945839J215640q58601k191982k002556j199247r40639r35380j93981J018847
$$ 4945839 6161479 5302878 3110896 1108340 -90907 -1031546 -1966926 -2160907 -1142060
36289a142060J388934O33138r2802j44835l16269j170352j722903q34595R03412
$$ -1142060 246874 880012 787210 642375 326106 -844246 -2567149 -3401744 -2498332
36280b498332J832760J412611O85391N94218P83903M35151l67198p81040n50620
$$ -2498332 -665572 747039 1432430 2026648 2810551 3245702 2878504 2097464 1546844
36271A546844m32398r27851j252446m20436R78232J305751L15881l32715L56004
$$ 1546844 1114446 186595 -1065851 -1486287 -508055 797696 1113577 780862 1136866
36262A136866J085300M29173o65247l62895R08263J024689l25278j093529k92625
$$ 1136866 2222166 2651339 1986092 1623197 2531460 3556149 3230871 2137342 1844717
36253A844717L66429n91703j830995j321123L26405P19739o63217j675055n34504
$$ 1844717 2211146 1619443 -211552 -1532675 -1206270 -486531 -1149748 -2824803 -3359307
36244c359307J848199L152805K337413M51740p73267o89158j81166m89896j632143
$$ -3359307 -1511108 1641697 3979110 4430850 3657583 2968425 2787259 2297363 665220
36235F65220k293173j479208J64960J169509J036310N78653O02044R30559Q64379
$$ 665220 -1627953 -3107161 -2942201 -1772692 -736382 -157729 444315 1374874 2239253
36226B239253J01927r67525j564515j073775L09576J438150J189744k30031j395210
$$ 2239253 2341180 1373655 -190860 -1264635 -955059 483091 1672835 1442804 47594
36217D7594j309096m75942N6686J83522M97824Q81334M95813n55856p67292O61097
$$ 47594 -1261502 -1737444 -1680758 -1497236 -999412 -118078 377735 -178121 -945413 -284316
36207b84316K138186J485024r56453k589201k034301o79212j87203j86107L32219
$$ -284316 1853870 3338894 2382441 -206760 -2241061 -2920273 -3107476 -3293583 -2961364
36198b961364P91729N5839j209578j261068m0695Q35349Q53364J188741K053543
$$ -2961364 -2169635 -2113796 -3323374 -4584442 -4625137 -3789788 -2936424 -1747683 305860
36189C05860J739351n02458k585831k313237n15147M96096M94162R97612J902811
$$ 305860 2045211 1542753 -1043078 -3356315 -3871462 -3375366 -2881204 -1883592 19219
36180A9219J201909j422068l199119j887109R47432K046012P91620n25695l12393
$$ 19219 1221128 -200940 -3400059 -5287168 -4339736 -2293724 -1502104 -2027799 -2340192
36171b340192N31266O99126M79739P13720J134491J028749O39828N34143K20760
$$ -2340192 -1808926 -1109800 -630061 83659 1218150 2246899 2886727 3420870 3641630
36162C641630j021579k302143j943156k60802M43546o72526j518739k97410J570060
$$ 3641630 2620051 317908 -1625248 -1886050 -1442504 -2115030 -3633769 -3931179 -2361119
36153b361119J607231N8916p82119k84506J0489n16217n46321M86929J053492
$$ -2361119 -753888 -694972 -1477091 -1761597 -1751108 -2267325 -2813646 -2326717 -1273225
36144a273225Q3489j009806m27291J210950J810352P55505o14090j068500p04792
$$ -1273225 -1189736 -2199542 -2626833 -1415883 394469 1149974 535884 -532616 -1237408
36135a237408k25241q650N6071L51670R94236J284145L34563j375837k030918
$$ -1237408 -1462649 -1471299 -1415228 -1063558 -69322 1214823 1549386 173549 -1857369
36126a857369q04554P96902R46021m3397n63253k61874j26178m16123l05714L44552
$$ -1857369 -2661923 -1865021 -919000 -962397 -1525650 -1787524 -1913702 -2329825 -2635539 -2290987
36116b290987N57796P203l12090J51088M50560j70936o97895K30039J980824K492318
$$ -2290987 -1733191 -1725988 -2038078 -1886990 -1436430 -1607366 -2305261 -2075222 -94398 2397920
36106B397920J083181o22902r47133k53560n0951p21884j226433r01292l99852
$$ 2397920 3481101 2858199 1911066 1657506 1606555 884671 -341762 -1243054 -1642906
36097a642906m32095n38323K5037Q08727P14519j92922o13437Q5020R83947J028384
$$ -1642906 -2075001 -2613324 -2588287 -1779560 -1065041 -1257963 -1871400 -1786380 -802433 225951
36087B25951L69370j93820k37185L40262J468550K352918J728287m21401k196056
$$ 225951 595321 401501 164316 504578 1973128 4326046 6054333 5632932 3436876
36078C436876j863244q422J356478J186364j30981j935355l491354l542232j385571
$$ 3436876 1573632 1565210 2921688 4108052 3977071 2041716 -1449638 -4991870 -6377441
36069f377441J569682K843229J772465J03498n48926m77502o22516q54832m45871
$$ -6377441 -4807759 -1964530 -192065 -88567 -637493 -1114995 -1737511 -2592343 -3038214
36060c038214N66938J404668J533591J009687J89125m22015l68298K54349P43885
$$ -3038214 -2471276 -1066608 466983 1476670 1665795 1243780 875482 1129831 1873716
36051A873716N82312N5181k04027o5677K9733k07883m25074p2200O38178N80634
$$ 1873716 2456028 2511209 2307182 2241505 2271238 2063355 1638281 1566081 2204259 2784893
36041B784893r55467k916829l298910j553152O93654J776455J851138J869730
$$ 2784893 1829426 -1087403 -4386313 -5939465 -5245811 -3469356 -1618218 251512
36033B51512J784341J023566k4469m78262m79038q31135j445375j536825j096943
$$ 251512 2035853 3059419 3034950 2556688 2077650 1246515 -198860 -1735685 -2832628
36024b832628p31908l10690O62083J566682J307384L04780m2936J56241m79019
$$ -2832628 -3564536 -3875226 -3213143 -1646461 -339077 -34297 -77233 79008 -400011
36015d00011j690497j415270O90807K084008J045641o79136o99290M85736Q17262
$$ -400011 -2090508 -3505778 -2814971 -730963 314678 -364458 -1063748 -578012 239250
36006B39250L0891n69950o75641j050605j581464j300554k06483O19404O70413
$$ 239250 270141 -299809 -975450 -2026055 -3607519 -4908073 -5114556 -4495152 -3824739
35997c824739M35871K87105J36433M2063J17172J04742p7372Q7838O63611O17310
$$ -3824739 -3388868 -3101763 -2965330 -2923267 -2806095 -2701353 -2778725 -2690887 -2027276 -1409966
35987a409966n24297j296133k27700J571997J725684J14260j003572m43253L98569
$$ -1409966 -1934263 -3230396 -3458096 -1886099 -160415 -46155 -1049727 -1492980 -1094411
35978a094411j9020j221702j792293j284906k89803M84884O59583M50994O72536
$$ -1094411 -1113431 -2335133 -4127426 -5412332 -5702135 -5217251 -4557668 -4106674 -3434138
35969c434138J623880K086390O99518j617181k212268j84988K188661K379053
$$ -3434138 -1810258 276132 975650 -641531 -2853799 -3038787 -850126 1528927
35961A528927O92649o50386n68421L9003N5439m51352p05333l97977r5309n88028
$$ 1528927 2221576 1571190 1002769 1041772 1097211 645859 -59474 -457451 -552760 -1140788
35951a140788j861124k816199k280434k66102J999914L170036K704263J118117
$$ -1140788 -3001912 -5818111 -8098545 -8364647 -6364733 -3194697 -490434 627683
35943F27683k44927j35772J262352K275011J625017r7531j496934k140899k280690
$$ 627683 382756 246984 1509336 3784347 5409364 5311833 3814899 1674000 -606690
35934f06690j677902k16631R15565M46119q32711r61990J97967Q20262J24992
$$ -606690 -2284592 -2501223 -1585658 -1139539 -1972250 -2934240 -2736273 -1916011 -1791019
35925a791019n10743j871Q48679J051749R72946J144430J053816K30043o82479
$$ -1791019 -2301762 -2303633 -1454954 -403205 569741 1714171 2767987 2998030 2315551
35916B315551q99445m87017K51107J095099J139621n60497k829708k871913j39681
$$ 2315551 1416106 929089 1180196 2275295 3414916 2854419 24711 -2847202 -2986883
35907b986883K303683J867064q0318p64497j74015j50876p70910n83771K79647
$$ -2986883 -683200 1183864 1103546 339049 165034 14158 -756752 -1340523 -1060876
35898a060876K15523p79809r29161J43062O13730m60541j503913q87249P01037
$$ -1060876 -845353 -1625162 -2554323 -2411261 -1797531 -2258072 -3761985 -4649234 -3948197
35889c948197J462605Q37387k92964q43813l15954Q69204J442492N21654j047739
$$ -3948197 -2485592 -1648205 -1941169 -2784982 -3100936 -2231732 -789240 -267586 -1315325
35880a315325j571902q08772j27352j77663L6638J104049J746606O18957j419331
$$ -1315325 -2887227 -3695999 -3823351 -4001014 -3964376 -2860327 -1113721 -494764 -1914095
35871a914095k172102q86892Q73162J132959l08903j685504j145013J067032K568181
$$ -1914095 -4086197 -4973089 -4099927 -2966968 -3275871 -4961375 -6106388 -5039356 -2471175
35862b471175J532859q82842j832608m52101J096082P05012q72528j296102J84622
$$ -2471175 -938316 -1821158 -3653766 -4105867 -3009785 -2304773 -3177301 -4473403 -4288781
35853d288781K026592K501946J465749L0855p79884q73307q77070j160164j159074
$$ -4288781 -2262189 239757 1705506 1736361 956477 83170 -793900 -1954064 -3113138
35844c113138j18981J488897K114771J134998j11798r9586P37686P82683j74178
$$ -3113138 -3232119 -1743222 371549 1506547 1394749 1295163 2032849 2815532 2641354
35835B641354n71618M01487J353567P54684n77648n97284P34122J162136m45422
$$ 2641354 2069736 2471223 3824790 4579474 4001826 3404542 4138664 5300800 4855378
35826D855378k173405j839738l18754j12312j321215j468588M77714K341335K001092
$$ 4855378 2681973 842235 523481 411169 -910046 -2378634 -1900920 440415 2441507
35817B441507L57114m69738k45938r2361r0457M69242J143409P51908m74027j043214
$$ 2441507 2798621 2328883 2082945 1990584 1900127 2369369 3512778 4264686 3790659 2747445
35807B747445n44922j75555p39901j575268j746046j139641j83673N70021O14335
$$ 2747445 2202523 2026968 1287067 -288201 -2034247 -3173888 -3357561 -2787540 -2173205
35798b173205J04404n2184L54253R5593j414297k316462o52711K212747L026067
$$ -2173205 -2068801 -2120985 -1766732 -1671139 -3085436 -5401898 -6054609 -3841862 -815795
35789h15795J204738p04697j099954r03375p02235M30758K155021K068023n15769
$$ -815795 388943 -315754 -1415708 -2319083 -3021318 -2590560 -435539 1632484 1116715
35780A116715k713933k117465l30498j43135j230445j296511N7808J296673J687752
$$ 1116715 -1597218 -3714683 -4045181 -4188316 -5418761 -6715272 -6657464 -5360791 -3673039
35771c673039J580876Q30075o50272j465802k83184J664741J900653K66643r78321
$$ -3673039 -2092163 -1262088 -1912360 -3378162 -3661346 -1996605 -95952 170691 -807630
35762h07630n01067O90559J219356R01943J74339n16086o04410P5445P25717N67001
$$ -807630 -1308697 -618138 601218 1503161 1677500 1161414 557004 632449 1358166 1925167
35752A925167J67k27648k76401m35924j13621Q80170J189703m3075j159147l04682
$$ 1925167 1925334 1697686 1421285 985361 871740 1751910 2941613 2898538 1739391 1434709
35742A434709J289186J041841q02354j775829j406159j430864j928660r74224
$$ 1434709 2723895 3765736 2963382 1187553 -218606 -1649470 -3578130 -4552354
35734d552354J296483K050837L98493q93894Q047J097272L48995p53592k59824
$$ -4552354 -3255871 -1205034 -806541 -1700435 -1692388 -595116 -246121 -999713 -1259537
35725a259537M76077o32601k200950j432872R30602J532946j92453j233941J2840
$$ -1259537 -783460 -1416061 -3617011 -5049883 -4119281 -2586335 -2778788 -4012729 -3999889
35716c999889J346381N61898j046787q68692R85767J869040L00147k124631k774923
$$ -3999889 -2653508 -2091610 -3138397 -4007089 -3021322 -1152282 -852135 -2976766 -5751689
35707e751689j040727J223579K055673J502991R71627R93775P12491l31503j128903
$$ -5751689 -6792416 -5568837 -3513164 -2010173 -1038546 -44771 667720 336217 -792686
35698g92686o25083O62996J328847Q16030k80223j132713j180484k49153J011566
$$ -792686 -1417769 -754773 574074 1390104 1109881 -22832 -1203316 -1452469 -440903
35689d40903J266345m3521j655054j750099j66428J380125J333031L4407p54226
$$ -440903 825442 781921 -873133 -2623232 -2789660 -1409535 -76504 -42097 -796323
35680g96323Q0050J549716J508526o76549k945865k873503p26393J059960J224542
$$ -796323 -716273 833443 2341969 1665420 -1280445 -4153948 -4880341 -3820381 -2595839
35671b595839Q43908R90095J141330P15189M31276R10312J262038M04425j187076
$$ -2595839 -1751931 -761836 379494 1094683 1525959 2436271 3698309 4102734 2915658
35662B915658k189235k016329q15798J026603K480614K254843O25889m68641k20072
$$ 2915658 726423 -1289906 -2105704 -1079101 1401513 3656356 4282245 3813604 3593532
35653C593532j67032j293692j912077m80442J316415R56291q37785j353493k75331
$$ 3593532 3426500 2132808 220731 -259711 1056704 2012995 1175210 -178283 -453614
35644d53614L27591j37896k56488J09771n90454k167060k151958J29322J896084
$$ -453614 -126023 -263919 -520407 -410636 -1001090 -3168150 -5320108 -5190786 -3294702
35635c294702R57031j034723j254718L10832J549392J460056P57468J58582k29800
$$ -3294702 -2337671 -3372394 -4627112 -4316280 -2766888 -1306832 -549364 -390782 -620582
35626f20582l27853j28681Q7229L23252R33078J533868R72409p74492j879340
$$ -620582 -948435 -1077116 -989887 -666635 266443 1800311 2772720 1998228 118888
35617A18888j030156N11832O14565p00425j433524m86267J024858J443626N54021
$$ 118888 -911268 -399436 215129 -485296 -1918820 -2405087 -1380229 63397 617418
35608F17418m63082n54442Q7522M98965M26445P18491J693073J923454N3141k586810
$$ 617418 154336 -400106 -312584 186381 612826 1331317 3024390 4947844 5000985 2414175
35598B414175l103260j017513R13890N93152p41043r73099l09330j85082m96717
$$ 2414175 -689085 -1706598 -792708 -199556 -940599 -1913698 -2223028 -2408110 -2904827
35589b904827j63319M64741Q9349j024054j276198n21355m42775j612090k178042
$$ -2904827 -3068146 -2603405 -2514056 -3538110 -4814308 -5335663 -5778438 -7390528 -9568570
35580i568570o06651J773377K489055J401445Q22742K145327L795900L334678
$$ -9568570 -10175221 -8401844 -5912789 -4511344 -3688602 -1543275 2252625 5587303
35572E587303P54613j520007j795210r37370n06223l57803N67333J883393K008523
$$ 5587303 6341916 4821909 3026699 2089329 1583106 1225303 1792636 3676029 5684552
35563E684552O92108m89469n39928l02726o59544j027101o36894j8742o0847n75655
$$ 5684552 6376660 5887191 5347263 5044537 4384993 3357892 2720998 2702256 2641409 2065754
35553B065754q75346r16836q85673m98115K92860P38766M17651M2377J73960J20286
$$ 2065754 1190408 273572 -612101 -1110216 -817356 -78590 339061 381438 555398 675684
35543F75684p38924j522200j083761J40610Q66657P92382M17695j08328n76525
$$ 675684 -63240 -1585440 -2669201 -2528591 -1661934 -869552 -451857 -560185 -1136710
35534a136710j05011J435780K281099R06432j442819k332341j575157r05776q03842
$$ -1136710 -1241721 194059 2475158 3381590 1938771 -393570 -1968727 -2874503 -3678345
35525c678345k07145P82949O95465m23903o33696N44753R54717o77728k303602
$$ -3678345 -3885490 -3102541 -2407076 -2830979 -3464675 -2919922 -1965205 -2642933 -4946535
35516d946535j417687J272190K935474K333545P23686k96382l29284J43783M67803
$$ -4946535 -6364222 -5092032 -2156558 176987 900673 604291 275007 418790 886593
35507H86593K71061j47006j14901M19719P57597N72456L62957M14309K34865m57474
$$ 886593 1157654 1010648 895747 1315466 2073063 2645519 3008476 3422785 3657650 3200176
35497C200176j089079j134871q23633m66941l9624J17654o48317j906883k064846
$$ 3200176 2111097 976226 152593 -314348 -353972 -236318 -884635 -2791518 -4856364
35488d856364n63817J052298J273192O16906L35641M02593K79024N05259J614615
$$ -4856364 -5420181 -4367883 -3094691 -2477785 -2142144 -1739551 -1460527 -955268 659347
35479F59347K281463P74259j955362k829664o86634K043813K409793L13122j949382
$$ 659347 2940810 3715069 1759707 -1069957 -1756591 287222 2697015 3010137 1060755
35470A060755k465510j240610L28002Q24785O7458o80731j49547J266352J974810
$$ 1060755 -1404755 -2645365 -2317363 -1492578 -1425120 -2105851 -2255398 -989046 985764
35461I85764J364585N30410M81965O72630O0755j136226j714249j161026j99912
$$ 985764 2350349 2880759 3362724 4035354 4096109 2959883 1245634 84608 -115304
35452a15304K62734P4695k90210l07329J66777O83404N37030k82629o94322K39598
$$ -115304 147430 222125 -68085 -375414 -208637 474767 1011797 729168 34846 274444
35442B74444J732511J844673J5045j857414j688755M0497R66936Q9922j013334
$$ 274444 2006955 3851628 3866673 2009259 320504 361001 1327937 1417859 404525
35433D04525o05000Q34724J578671J149541O17104P25533R39761N03925m74343
$$ 404525 -200475 634249 2212920 3362461 3979565 4705098 5644859 6148784 5674441
35424E674441j345112j734413j717050j509431j203446p04404j5688L94185K4393
$$ 5674441 4329329 2594916 877866 -631565 -1835011 -2539415 -2555103 -2160918 -2136525
35415b136525o09575k14694J276051J904939K04704k235044k532266n65476Q54421
$$ -2136525 -2746100 -2960794 -1684743 220196 424900 -1810144 -4342410 -4907886 -4053465
35406d053465J86317o85250M27058K626259L343363J940225J09646p33618q07432
$$ -4053465 -3867148 -4552398 -4125340 -1499081 1844282 3784507 3894153 3160535 2353103
35397B353103q30596r10742q28629n93913m15536m46050n73288l88211L16197
$$ 2353103 1522507 611765 -216864 -810777 -1226313 -1672363 -2245651 -2633862 -2317665
35388b317665R92836R09734L28080K08320N71360L59316o16266j002481p6883
$$ -2317665 -1324829 -415095 -87015 121305 692665 1051981 435715 -566766 -643649
35379f43649P79544R7038j287538j397730L2690J386709J383584J55126j419847
$$ -643649 135895 232933 -1054605 -2452335 -2419645 -1032936 350648 505774 -914073
35370i14073k178379j028207J716858L774304L130155N45597j509712j958325
$$ -914073 -3092452 -4120659 -2403801 1370503 4500658 5046255 3536543 1578218
35362A578218j604629j039360m4282R53588Q39397l78675j372797j499366j448621
$$ 1578218 -26411 -1065771 -1110053 -156465 682932 304257 -1068540 -2567906 -4016527
35353d016527j550368j087744J66487J318224J883306K400491K832125K029522
$$ -4016527 -5566895 -6654639 -6488152 -5169928 -3286622 -886131 1945994 3975516
35345C975516j69999j846446j360053L17116R97645J32234j072706j689787j808251
$$ 3975516 3805517 1959071 599018 916134 1913779 2046013 973307 -716480 -2524731
35336b524731j580864q31997L37299J397929J892881J622470N87529p52572j509923
$$ -2524731 -4105595 -4937592 -4600293 -3202364 -1309483 312987 900516 147944 -1361979
35327a361979j227529m37508J17214M62041J037957J690563J683890O93161o76538
$$ -1361979 -2589508 -3027016 -2909802 -2447761 -1409804 280759 1964649 2657810 1981272
35318A981272j441508j139801k18213M18198L08099j97935n45784n91263l31422
$$ 1981272 539764 -600037 -818250 -400052 -91953 -289888 -835672 -1426935 -1758357
35309a758357L91530J293379J382651K64852q06787l99593R59600J484341O60542
$$ -1758357 -1366827 -73448 1309203 1574055 767268 367675 1327275 2811616 3472158
35300C472158m83556j373075k236237k479691r69678J566991K667094J515298
$$ 3472158 2988602 1615527 -620710 -3100401 -4070079 -2503088 164006 1679304
35292A679304P7376j36064j54339j036334j639532q36492J28960j90282p02993
$$ 1679304 1756680 1620616 1466277 429943 -1209589 -2046081 -1917121 -2107403 -2810396
35283b810396K16995J489819R89187o22245q09654O23125J330051L55849o90901
$$ -2810396 -2593401 -1103582 -114395 -736640 -1546294 -923169 406882 762731 71830
35274G1830o88761m41434n05687k05413L94340M014j380609j787769l22586J186199
$$ 71830 -616931 -1058365 -1564052 -1769465 -1375125 -1371111 -2751720 -4539489 -4862075 -3675876
35264c675876J003443O0681J19659J004522J427455J259007J129376P48396m89475
$$ -3675876 -2672433 -2611752 -2492093 -1487571 -60116 1198891 2328267 3076663 2587188
35255B587188j799420j678865j10270J325202J474116O25632l61323q61920m93930
$$ 2587188 787768 -891097 -1001367 323835 1797951 2423583 2062260 1200340 706410
35246G06410O26918J548144J268716K3367r12435q20357k86414j61450m02972
$$ 706410 1333328 2881472 4150188 4173555 3261120 2440763 2154349 1992899 1589927
35237A589927l88313k8393J8148o47793j388250j240664k85317L60707J05870
$$ 1589927 1201614 1173221 1191369 543576 -844674 -2085338 -2370655 -2009948 -1904078
35228a904078l09420n8572N08054O64126O33983R78662J247650O62808k19937
$$ -1904078 -2213498 -2272070 -1764016 -1099890 -465907 512755 1760405 2423213 2203276
35219B203276j61191N56940L62073r52359j638165o39035Q70211J364276Q37970
$$ 2203276 2042085 2599025 2961098 2008739 370574 -268461 601750 1966026 2803996
35210B803996k3017r79068j586890r79476N57195J276526M80799j90751N83399
$$ 2803996 2780979 1801911 215021 -764455 -207260 1069266 1550065 1359314 1942713
35201A942713J467978O36599j141678j784840j180944p67696n93915N05414K002646
$$ 1942713 3410691 4047290 2905612 1120772 -60172 -827868 -1421783 -916369 1086277
35192A086277J711795p44335k845312k461557m15859J160514J463565R96340K27878
$$ 1086277 2798072 2053737 -791575 -3253132 -3668991 -2508477 -1044912 -48572 179306
35183A79306n51562q45280m25654K25067N36853N17392M68466N13690O47724Q04338
$$ 179306 -372256 -1217536 -1643190 -1418123 -881270 -363878 104588 618278 1266002 2070340
35173B070340P70648M66800K26676L17594M65321M50785O52394J116418P65354
$$ 2070340 2840988 3307788 3534464 3852058 4317379 4768164 5420558 6536976 7302330
35164G302330j122869l144908l133772j126502P01436J037885O02037K02410m15222
$$ 7302330 6179461 3034553 -99219 -1225721 -524285 513600 1115637 1318047 902825
35155I02825j267939j485008o90526M18956J359545K191136K307561Q81763j010271
$$ 902825 -365114 -1850122 -2540648 -2121692 -762147 1428989 3736550 4618313 3608042
35146C608042j030165P80426J465554m16319k361733j786676P7610N61112k32175
$$ 3608042 2577877 3358303 4823857 4407538 2045805 259129 336739 897851 665676
35137F65676m28177m0185n35294j691811j879967r48124j12329N17462J579634
$$ 665676 237499 197314 -337980 -2029791 -3909758 -4857882 -4970211 -4452749 -2873115
35128b873115K175023R41110q93378p53331R60478J219055n29744j263995M68626
$$ -2873115 -698092 243018 -650360 -1403691 -443213 775842 246098 -1017897 -549271
35119e49271J930047O62152j590439j963779r46017q62161j668905j288942P41140
$$ -549271 1380776 2042928 452489 -1511290 -2457307 -3319468 -4988373 -6277315 -5536175
35110e536175K572378K656907J145526r20124k249982j746985K04666J571008
$$ -5536175 -2963797 -306890 838636 -81488 -2331470 -4078455 -3873789 -2302781
35102b302781J142907K32267M33481R47534J36263j348707j431281k533J044965
$$ -2302781 -1159874 -927607 -494126 453408 589671 -759036 -2190317 -2192850 -1147885
35093a147885R40181P34044Q14372J61162j411550k384828j639871J62336J756485
$$ -1147885 -207704 526340 1340712 1501874 90324 -2294504 -3934375 -3772039 -2015554
35084b015554K351796J435601p20071k237785j350832P97627J278657l16945j239027
$$ -2015554 336242 1771843 1051772 -1186013 -2536845 -1739218 -460561 -777506 -2016533
35075b016533j1650J297768O73182p04557r57182p40060j401462j861815l22338
$$ -2016533 -2028183 -730415 -57233 -761790 -1718972 -2459032 -3860494 -5722309 -6044647
35066f044647K175171K949847J756708P68478Q70461Q55633K87642K92999J050380
$$ -6044647 -3869476 -919629 837079 1605557 2476018 3331651 3619293 3912292 4962672
35057D962672J116866J1822q50994o62976m81142j043053j421627r62214n25419
$$ 4962672 6079538 6091360 5240366 4577390 4096248 3053195 1631568 669354 143935
35048A43935n38205J27258J739131K195922L2488k711906l063809j365907l52425
$$ 143935 -394270 -267012 1472119 3668041 3700529 988623 -2075186 -3441093 -3793518
35039c793518p68773p79934L98984J192027N84597k03563o4680J16725o41078
$$ -3793518 -4562291 -5342225 -4943241 -3751214 -3166617 -3370180 -3434860 -3318135 -3959213
35030c959213j354560o05184J034273J822866J384214Q10181O76954N32936K41061
$$ -3959213 -5313773 -5918957 -4884684 -3061818 -1677604 -867423 -190469 342467 583528
35021E83528L34999Q02203P59642j95214j238822j420593q10142j16047K23103
$$ 583528 918527 1720730 2480372 2285158 1046336 -374257 -1184399 -1300446 -1077343
35012a077343J40700k80076o43933l82562L97554O96532p2410r72539o29582P48471
$$ -1077343 -936643 -1216719 -1860652 -2243214 -1845660 -1149128 -1221538 -2194077 -2823659 -2075188
35002b075188J480529P37660k83575j38089P61309Q30837l10227j352676j271285
$$ -2075188 -594659 143001 -140574 -278663 482646 1313483 1003256 -349420 -1620705
34993a620705o37961m24513m32002J53894J166624J519412Q04049j65749o24538
$$ -1620705 -2258666 -2683179 -3115181 -2961287 -1794663 -275251 528798 363049 -261489
34984b61489p76246j007773r89420l06976N30763O25822O6319j13247N38765J184355
$$ -261489 -1037735 -2045508 -3034928 -3341904 -2811141 -2185319 -2119000 -2232247 -1693482 -509127
34974e09127Q77020j40436q29825o92838j45987L11090P18800J261686J643352
$$ -509127 367893 227457 -602368 -1295206 -1441193 -1130103 -411303 850383 2493735
34965B493735J286435J80430p92219o86798L71326J199066Q52200l57651j382700
$$ 2493735 3780170 3960600 3168381 2481583 2852909 4051975 4904175 4546524 3163824
34956C163824j686265j550311j351064j136554r42352r11411r10459n65854Q5676
$$ 3163824 1477559 -72752 -1423816 -2560370 -3502722 -4414133 -5324592 -5890446 -5804770
34947e804770N22515N84649P69565J264476J370936N84772l37301l26492L31800
$$ -5804770 -5282255 -4697606 -3928041 -2663565 -1292629 -707857 -1045158 -1371650 -1039850
34938a039850L45936o27223j446151j132608j23011N37847N02558J31050k15635
$$ -1039850 -693914 -1321137 -2767288 -3899896 -4022907 -3485060 -2982502 -2851452 -3067087
34929c067087l56242j42685M19409J107409J711306K023412J629917L52947j000882
$$ -3067087 -3423329 -3566014 -3146605 -2039196 -327890 1695522 3325439 3678386 2677504
34920B677504j184597j71837N84007J07178p55851p52826j76286k63592j133153
$$ 2677504 1492907 1321070 1905077 2012255 1256404 503578 327292 63700 -1069453
34911a069453j584731q96760K53519Q03552M34339l92565q39187j87346J323504
$$ -1069453 -2654184 -3550944 -3297425 -2493873 -2059534 -2452099 -3291286 -3478632 -2155128
34902b155128K268979J521540j38391r08898m11288J9541l31546m54678M45853
$$ -2155128 113851 1635391 1497000 588102 176814 196355 -135191 -589869 -144016
34893a44016J343135R61193q8158k87200K68307Q4979j023251j263883L61429
$$ -144016 1199119 2160312 2072154 1784954 2053261 2138240 1114989 -148894 212535
34884B12535K065797J456003r79058k198092o21443J640535J539831q56345k550119
$$ 212535 2278332 3734335 2755277 557185 -64258 1576277 3116108 2259763 -290356
34875b90356j680842K22144O66345n37198j648797j653158r49200J18627J636531
$$ -290356 -1971198 -1749054 -1082709 -1619907 -3268704 -4921862 -5871062 -5752435 -4115904
34866d115904K963667K897415J496124L27030K94038N18537L7648p47132j181074
$$ -4115904 -1152237 1745178 3241302 3568332 3862370 4380907 4418555 3671423 2490349
34857B490349j548341k027954j754657l33335Q38448M10073o80808o39112K61825
$$ 2490349 942008 -1085946 -2840603 -3173938 -2335490 -1925417 -2606225 -3245337 -2983512
34848b983512L09990m89194k78317J421075K666464K043576O47470K9764j24835
$$ -2983512 -2673522 -3162716 -3441033 -2019958 646506 2690082 3337552 3367316 3242481
34839C242481q83580j900562j913169p28890N73391J085367Q15617L14669J64425
$$ 3242481 2358901 458339 -1454830 -2183720 -1610329 -524962 290655 605324 769749
34830G69749M30012K84474j060596k727007k667298m98200J485725J266953j66689
$$ 769749 1199761 1484235 423639 -2303368 -4970666 -5468866 -3983141 -2716188 -2882877
34821b882877n44243L17372P58243K02394k83414j73906j39575l16611J09796
$$ -2882877 -3427120 -3109748 -2351505 -2149111 -2432525 -2606431 -2746006 -3062617 -2952821
34812b952821J119147J498759R47755P46166J407238J440622k15735k097951k251320
$$ -2952821 -1833674 -334915 612840 1359006 2766244 4206866 3991131 1893180 -358140
34803c58140j159419o89669r36292l39655J260069J958157O74072j170675j731668
$$ -358140 -1517559 -2207228 -3143520 -3483175 -2223106 -264949 409123 -761552 -2493220
34794b493220j029464j62990M91992J044892J030772J09469o81782K6739J654381
$$ -2493220 -3522684 -3685674 -3193682 -2148790 -1118018 -1008549 -1690331 -1663592 -9211
34785i211J949535m421k344085k770114j348347O1723M81330N94434J036306J301096
$$ -9211 1940324 1935903 -408182 -3178296 -4526643 -4464920 -3983590 -3389156 -2352850 -1051754
34775a051754Q24768J03755p7896Q8280j61493p96985r42206k15646O71152R07554
$$ -1051754 -226986 -123231 -201127 -112847 -274340 -1071325 -2013531 -2229177 -1558025 -650471
34765f50471N52401J29423k54909q38585j462695j494946o52844M35592Q17383
$$ -650471 -98070 31353 -223556 -1062141 -2524836 -4019782 -4672626 -4237034 -3419651
34756c419651L46583o3389M11690J260470J088976m72236j934118j659336J2517
$$ -3419651 -3073068 -3136457 -2724767 -1464297 -375321 -847557 -2781675 -4441011 -4428494
34747d428494J249647J161194O28711N51878N57506J60027N5166J047223K370578
$$ -4428494 -3178847 -2017653 -1388942 -837064 -279558 -119531 -64365 982858 3353436
34738C353436K439101J020067n88754j458685j831440j949521j484177n84140
$$ 3353436 5792537 6812604 6223850 4765165 2933725 984204 -499973 -1084113
34730a084113k11878p02547j081421o76946l55148r85314j574489m96438J809328
$$ -1084113 -1295991 -1998538 -3079959 -3756905 -4112053 -5097367 -6671856 -7168294 -5358966
34721e358966L025477J987232O5335r22172q61793o40655l94396L73313J448341
$$ -5358966 -2333489 -346257 -280922 -1203094 -2064887 -2705542 -3099938 -2726625 -1278284
34712a278284J855610J165949N6205n80772n52807k75826j96142m47613p61428
$$ -1278284 577326 1743275 1799480 1218708 665901 390075 193933 -253680 -1015108
34703a015108n99885L22949J501730J890839R67986n41173j263380n87874O72017
$$ -1015108 -1614993 -1292044 209686 2100525 3068511 2527338 1263958 676084 1348101
34694A348101J182819N67099l15134o20798o16160j076395j891819k029827r98858
$$ 1348101 2530920 3098019 2782885 2162087 1545927 469532 -1422287 -3452114 -4450972
34685d450972L86253J104502J175083J199746J165315N77868l84220q10593l65375
$$ -4450972 -4064719 -2960217 -1785134 -585388 579927 1157795 773575 -37018 -402393
34676d02393J37489j04451p35968q14060j44178N70287P76199O94576Q07678J124736
$$ -402393 -264904 -369355 -1105323 -1919383 -2063561 -1493274 -717075 -22499 785179 1909915
34666A909915J176630O13888l05436q57560n94067M8094J63972m20363p48246
$$ 1909915 3086545 3700433 3394997 2537437 1943370 1991464 2155436 1735073 986827
34657I86827K1163J255200J449554K25542j010981p74998O61343J627842R44215
$$ 986827 1007990 2263190 3712744 3938286 2927305 2152307 2813650 4441492 5385707
34648E385707r80932k677388k818130j182069J035703K027146J049574p33148
$$ 5385707 4404775 1727387 -1090743 -2272812 -1237109 790037 1839611 1106463
34640A106463j548738j018500k82423k85988p82545j133714j195235j038417n87734
$$ 1106463 -442275 -1460775 -1743198 -2029186 -2811731 -3945445 -5140680 -6179097 -6766831
34631f766831k6113J56684N8961N49452J849391K705475J970378M06396k88164
$$ -6766831 -6792944 -6636260 -6577299 -6027847 -4178456 -1472981 497397 903793 615629
34622F15629J11366K67497m58719j084348p11548Q2120K44899k32900n44771k65524
$$ 615629 726995 994492 535773 -548575 -1260123 -1178003 -933104 -1166004 -1710775 -1976299
34612a976299K85323N39266J83450m95822o65665J27202J084123J043442L12632
$$ -1976299 -1690976 -1151710 -968260 -1464082 -2129747 -2002545 -918422 125020 437652
34603D37652M14494J563500J804275k38525k884495l249052j036444J167903J380303
$$ 437652 852146 2415646 4219921 3981396 1096901 -2152151 -3188595 -2020692 -640389
34594f40389M20296J12774N83879M50412q03726j828607j171261O09142J450270
$$ -640389 -220093 -107319 476560 926972 123246 -1705361 -2876622 -2267480 -817210
34585h17210M85660p12165l44696R45412J041266l18243j047815K5219J340474
$$ -817210 -331550 -1043715 -1388411 -442999 598267 280024 -767791 -742572 597902
34576E97902J126579L3122l12905J8997q8008n30263m38439j63304o20969j148696
$$ 597902 1724481 1757603 1444698 1463695 1375687 845424 406985 243681 -377288 -1525984
34566a525984l59021J086989J100280k77990o33195Q00574J570609j38393k385373
$$ -1525984 -1885005 -798016 302264 24274 -608921 191653 1762262 1623869 -761504
34557g61504k152911M30550K524952K257660K77388j638648k066584o34412J483283
$$ -761504 -2914415 -2483865 41087 2298747 2576135 937487 -1129097 -1763509 -280226
34548b80226K297982J227939j46876m47275m68091j466096k635189k148063o9722
$$ -280226 2017756 3245695 3098819 2651544 2183453 717357 -1917832 -4065895 -4135617
34539d135617J659473J893188J237067M99887j36470l82223J07078P26868M17486
$$ -4135617 -2476144 -582956 654111 1153998 1017528 635305 742383 1469251 1886737
34530A886737n83600q78452j23239L28255m15540j293738q70688N17333J210076
$$ 1886737 1303137 424685 301446 629701 214161 -1079577 -1950265 -1432932 -222856
34521b22856L87301j047611j662604j044897l2184M13941L02778L02152N22995
$$ -222856 164445 -883166 -2545770 -3590667 -3622851 -3208910 -2906132 -2603980 -2080985
34512b080985L96938n9537M8471Q37770Q62262p67863k439756j911098L88209
$$ -2080985 -1684047 -1743584 -1695113 -857343 4919 -762944 -3202700 -5113798 -4725589
34503d725589J797218J068372l02410o39933j66622J19297R8695K03746N47569
$$ -4725589 -2928371 -1859999 -2162409 -2802342 -2968964 -2849667 -2750972 -2547226 -1999657
34494a999657J088539J742713J901265R08852n85542j013039j39224M26255l14385
$$ -1999657 -911118 831595 2732860 3641712 3056170 2043131 1903907 2330162 2015777
34485B015777j200297q37832K23124N33334k8941m62450l93548k84345l05598
$$ 2015777 815480 -22352 200772 734106 705165 242715 -150833 -435178 -740776
34476g40776j72348J43454M47863P77790J066883Q04350j95026j172836j364197
$$ -740776 -913124 -769670 -321807 455983 1522866 2327216 2132190 959354 -404843
34467d04843r99713n76674J36422J305586J956599J098695m54173q69373J18561
$$ -404843 -1404556 -1981230 -1844808 -539222 1417377 2516072 2061899 1192526 1311087
34458A311087P79518k01098k019627k873479j973238r2574J298674J257744K12074
$$ 1311087 2090605 1889507 -130120 -3003599 -4976837 -5069411 -3770737 -2512993 -2300919
34449b300919m01406K11174J136667R69790k51124j233472j306676r72839o09609
$$ -2300919 -2702325 -2491151 -1354484 -384694 -635818 -1869290 -3175966 -4148805 -4758414
34440d758414R1712J058009J424257Q61392L47511P61674J392337Q11385j071477
$$ -4758414 -4666702 -3608693 -2184436 -1323044 -975533 -213859 1178478 1989863 918386
34431I18386k693221k577983q15723J225826K209848J799176P45018K12098P63210
$$ 918386 -1774835 -4352818 -5168541 -3942715 -1732867 66309 811327 1023425 1786635
34422A786635J776941J977721P54741j089137k132399j865826j082866o48459
$$ 1786635 3563576 5541297 6296038 5206901 3074502 1208676 125810 -522649
34414e22649m31179Q3278O62896O84333L44005M34416Q94415P77569l2705l53239
$$ -522649 -953828 -870550 -207654 476679 820684 1255100 2149515 2927084 2894379 2541140
34404B541140M00968J066916M64838p49131j155733o70775k30994l2561L90525
$$ 2541140 2942108 4009024 4473862 3724731 2568998 1898223 1667229 1634668 2025193
34395B025193O80022j14529j712808k451658j373921N62736J745323J582264O66407
$$ 2025193 2705215 2590686 877878 -1573780 -2947701 -2384965 -639642 942622 1609029
34386A609029m2127L324M38304K59276r38976k234678k428163j397540J91121
$$ 1609029 1566902 1570226 2008530 2267806 1328830 -905848 -3334011 -4731551 -4540430
34377d540430J783932K666119J815644n09309j977499r03233R93794Q75240p42657
$$ -4540430 -2756498 -90379 1725265 1215956 -761543 -1664776 -670982 204258 -538399
34368e38399p45281J369126K490301J044800l59568O47378K280618J799551N7916
$$ -538399 -1283680 85446 2575747 3620547 3260979 3908357 6188975 7988526 8046442
34359H046442m06495P0048o83123k185174j798493M55476J413377j94675j694952
$$ 8046442 7639947 7709995 7026872 4841698 3043205 3498681 4912058 4717383 3022431
34350C022431q34839P92523O48148p62305j142418j20139O78180M63778J8302
$$ 3022431 2187592 2980115 3628263 2865958 1723540 1603401 2281581 2745359 2763661
34341B763661j28244l74834q21117q91800m57905r8255P3301P08343J873699K427790
$$ 2763661 2635417 2260583 1439466 547666 89761 -8494 64807 773150 2646849 5074639
34331E074639J521690K7512m54895K99585R51403N06814m64715q61711n60467
$$ 5074639 6596329 6623841 6168946 6468531 7419934 7926748 7462033 6600322 6039855
34322F039855k40849j59810O4404N53740Q85994Q45911P19679O06050K02373l42478
$$ 6039855 5799006 5639196 5703600 6257340 7143334 7989245 8708924 9314974 9517347 9174869
34312I174869k04183Q02636J436601N71410r07389r18619J113536L428530M073575
$$ 9174869 8970686 9773322 11209923 11781333 10873944 9955325 11068861 14497391 18570966
34303A8570966L058332J976370K087791L230750M280226M319846L528020L056000
$$ 18570966 21629298 23605668 25693459 28924209 33204435 37524281 41052301 44108301
34295D4108301L858394N648334P267476P987193Q008616P720236P037961N647124
$$ 44108301 47966695 53615029 60882505 68869698 76878314 84598550 91636511 97283635
34287I7283635L411234L28226l438432p155700r572909r918668q773675p546713
$$ 97283635 100694869 101023095 97584663 90428963 80856054 70937386 62163711 54616998
$$ [...]
##END NTUPLES=NMR SPECTRUM
##END=
