##TITLE=31Pdec_DE-62_EtOH
 D2O, 64 sc
 22.7.2024
##JCAMPDX= 6.0         $$ Bruker NMR JCAMP-DX V2.0
##DATA TYPE= NMR SPECTRUM
##DATA CLASS= NTUPLES
##ORIGIN= UXNMR, Bruker Analytische Messtechnik GmbH
##OWNER= root
$$ XWIN-NMR		Version 3.5
$$ Mon Jul 22 16:03:39 2024 Russian Standard Time (UT+4h)  she@DPX200
##.OBSERVE FREQUENCY= 81.013821
##.OBSERVE NUCLEUS= ^31P
##.ACQUISITION MODE= SIMULTANEOUS
##.ACQUISITION SCHEME= undefined
##.AVERAGES= 64
##.DIGITISER RES= 17
##SPECTROMETER/DATA SYSTEM= spect
##.PULSE SEQUENCE= zgpg30
##.SOLVENT NAME= D2O
##.SHIFT REFERENCE= (INTERNAL, D2O, 0, 198.062)
##AUDIT TRAIL= $$ (NUMBER, WHEN, WHO, WHERE, WHAT)
$$ ##TITLE= Audit trail, XWIN-NMR		Version 3.5
$$ ##JCAMPDX= 5.01
$$ ##ORIGIN= Bruker BioSpin GmbH
$$ ##OWNER= she
$$ F:/spectra/data/she/nmr/P31/2/pdata/1/auditp.txt
$$ ##AUDIT TRAIL=  $$ (NUMBER, WHEN, WHO, WHERE, WHAT)
(   1,<2024-07-22 16:02:28.85 +0400>,<she>,<DPX200>,
      <created by zg, POWCHK disabled, PULCHK disabled
       configuration hash MD5:
       00 E9 B6 7A A2 85 ED C7 34 08 36 98 17 FE 4E 26
       data hash MD5: 32K
       AF 73 89 28 3E D5 0C 4D 15 81 F0 2A D2 1B E2 78>)
(   2,<2024-07-22 16:02:36.75 +0400>,<she>,<DPX200>,
      <Start of raw data processing
       efp BC_mod = 2 LB = 1.5 FT_mod = 6 PKNL = 1 PHC0 = 2714.641 PHC1 = -88.11304 SI = 64K 
       data hash MD5: 64K
       6B E0 97 BD 15 A7 CA BE A6 72 44 B2 8F 98 D1 59>)
(   3,<2024-07-22 16:03:03.70 +0400>,<she>,<DPX200>,
      <pk PHC0 = -101.1839 PHC1 = 274.5999 
       data hash MD5: 64K
       C8 80 FB D2 B7 E4 1B B4 A9 EB E8 0D C6 E4 3D E9>)
(   4,<2024-07-22 16:03:10.84 +0400>,<she>,<DPX200>,
      <abs ABSG = 5 
       data hash MD5: 64K
       7A E5 5B 28 86 0E 89 A0 7F DA 1D E1 8C 75 8E A4>)
$$ ##END=
$$ 
$$ hash MD5
$$ EE C4 52 AB 43 EF 2E 83 04 AD 8E 77 06 AE 3B D6
##$RELAX= 
##$RELAX= 
##$RELAX= 
##$RELAX= 
##$RELAX= 
##$RELAX= 
##$RELAX= 
##$RELAX= 
$$ Bruker specific parameters
$$ --------------------------
##$DU= <F:/spectra>
##$EXPNO= 2
##$NAME= <P31>
##$PROCNO= 1
##$TYPE= <nmr>
##$USER= <she>
##$AMP= (0..31)
100 100 100 100 100 100 100 100 100 100 100 100 100 100 100 100 100 100 
100 100 100 100 100 100 100 100 100 100 100 100 100 100 
##$AQSEQ= 0
##$AQ_mod= 1
##$AUNM= <au_zg>
##$AUTOPOS= <>
##$BF1= 81.014009
##$BF2= 200.13
##$BF3= 200.13
##$BF4= 200.13
##$BF5= 200.13
##$BF6= 200.13
##$BF7= 200.13
##$BF8= 200.13
##$BYTORDA= 1
##$CFDGTYP= 0
##$CFRGTYP= 5
##$CHEMSTR= <none>
##$CNST= (0..31)
1 1 145 1 1 1 1 1 1 1 1 1 1 1 1 1 1 1 1 1 1 1 1 1 1 1 1 1 1 1 1 1 
##$CPDPRG= <waltz16>
##$CPDPRG1= <>
##$CPDPRG2= <waltz16>
##$CPDPRG3= <>
##$CPDPRG4= <mlev>
##$CPDPRG5= <mlev>
##$CPDPRG6= <mlev>
##$CPDPRG7= <mlev>
##$CPDPRG8= <mlev>
##$CPDPRGB= <>
##$CPDPRGT= <>
##$D= (0..31)
0 1 0 0 0 0 0 0 0 0.06 0 0.03 2e-05 3e-06 0 0 0.0002 0 0 0 0 0 0 0 0 0 
0 0 0 0 0 0 
##$DATE= 1721649748
##$DBL= (0..7)
120 120 120 11 120 120 24 19 
##$DBP= (0..7)
150 150 150 150 150 150 150 150 
##$DBP07= 0
##$DBPNAM0= <>
##$DBPNAM1= <>
$$ [...]
##$SUBNAM3= <"">
##$SUBNAM4= <"">
##$SUBNAM5= <"">
##$SUBNAM6= <"">
##$SUBNAM7= <"">
##$SUBNAM8= <"">
##$SUBNAM9= <"">
##$SW= 400.765351723535
##$SWIBOX= (0..15)
0 1 3 0 0 0 0 0 0 0 0 0 0 0 0 0 
##$SW_h= 32467.5324675325
##$TD= 32768
##$TD0= 1
##$TE= 0
##$TE2= 300
##$TE3= 300
##$TEG= 300
##$TL= (0..7)
0 120 53 12 22 120 120 120 
##$TP= (0..7)
150 150 150 150 150 150 150 150 
##$TP07= 0
##$TPNAME0= <>
##$TPNAME1= <>
##$TPNAME2= <>
##$TPNAME3= <>
##$TPNAME4= <>
##$TPNAME5= <>
##$TPNAME6= <>
##$TPNAME7= <>
##$TPOAL= (0..7)
0.5 0.5 0.5 0.5 0.5 0.5 0.5 0.5 
##$TPOFFS= (0..7)
0 0 0 0 0 0 0 0 
##$TUNHIN= 0
##$TUNHOUT= 0
##$TUNXOUT= 0
##$USERA1= <user>
##$USERA2= <user>
##$USERA3= <user>
##$USERA4= <user>
##$USERA5= <user>
##$V9= 5
##$VALIST= <valist>
##$VCLIST= <CCCCCCCCCCCCCCC>
##$VD= 0
##$VDLIST= <DDDDDDDDDDDDDDD>
##$VPLIST= <PPPPPPPPPPPPPPP>
##$VTLIST= <TTTTTTTTTTTTTTT>
##$WBST= 1024
##$WBSW= 4
##$XGAIN= (0..3)
0 0 0 0 
##$XL= 0
##$YL= 0
##$YMAX_a= 10099
##$YMIN_a= -7915
##$ZGOPTNS= <>
##$ZL1= 120
##$ZL2= 120
##$ZL3= 120
##$ZL4= 120
##$ABSF1= 198.0616
##$ABSF2= -202.7028
##$ABSG= 5
##$ABSL= 3
##$ALPHA= 0
##$AQORDER= 0
##$ASSFAC= 0
##$ASSFACI= 0
##$ASSFACX= 0
##$ASSWID= 0
##$AUNMP= <proc_1d>
##$AZFE= 0.1
##$AZFW= 0.5
##$BCFW= 0
##$BC_mod= 2
##$BYTORDP= 0
##$COROFFS= 0
##$CY= -3
##$DATMOD= 1
##$DC= 0
##$DFILT= <>
##$DTYPP= 0
##$F1P= 0
##$F2P= 0
##$FCOR= 1
##$FTSIZE= 65536
##$FT_mod= 6
##$GAMMA= 0
##$GB= 0
##$INTBC= 1
##$INTSCL= 9.790993e-09
##$ISEN= 30
##$LB= 1.5
##$LEV0= 0
##$LPBIN= 0
##$MAXI= 10000
##$MC2= 0
##$MEAN= 0
##$ME_mod= 0
##$MI= 50
##$NCOEF= 0
##$NC_proc= -8
##$NLEV= 6
##$NOISF1= 182.463
##$NOISF2= 159.3651
##$NSP= 0
##$NTH_PI= 0
##$NZP= 0
##$OFFSET= 198.0616
##$PC= 4
##$PHC0= 2613.457
##$PHC1= 186.4869
##$PH_mod= 1
##$PKNL= yes
##$PPARMOD= 0
##$PSCAL= 0
##$PSIGN= 0
##$REVERSE= no
##$SF= 81.0140089999434
##$SI= 65536
##$SIGF1= 159.3651
##$SIGF2= -187.1042
##$SINO= 113.3802
##$SIOLD= 16384
##$SREGLST= <1H.CDCl3>
##$SSB= 0
##$STSI= 65536
##$STSR= 0
##$SW_p= 32467.5324675325
##$SYMM= 0
##$S_DEV= 0
##$TDeff= 32768
##$TDoff= 0
##$TI= <>
##$TILT= no
##$TM1= 0
##$TM2= 0
##$TOPLEV= 0
##$USERP1= <user>
##$USERP2= <user>
##$USERP3= <user>
##$USERP4= <user>
##$USERP5= <user>
##$WDW= 1
##$XDIM= 65536
##$YMAX_p= 293534684
##$YMIN_p= -48635815
$$ End of Bruker specific parameters
$$ ---------------------------------
##NTUPLES= NMR SPECTRUM
##VAR_NAME=  FREQUENCY,     SPECTRUM/REAL,   SPECTRUM/IMAG
##SYMBOL=    X,             R,               I
##VAR_TYPE=  INDEPENDENT,   DEPENDENT,       DEPENDENT
##VAR_FORM=  AFFN,          ASDF,            ASDF
##VAR_DIM=   65536,         65536,           65536
##UNITS=     HZ,            ARBITRARY UNITS, ARBITRARY UNITS
##FACTOR=    0.49542278885378, 1,            1
##FIRST=     16045.7642231865, 0,            0
##LAST=      -16421.768244346, 0,            0
##MIN=       -16421.768244346, -48635815,    0
##MAX=       16045.7642231865, 293534684,    0
$$ Real data points
##PAGE= N=1
##DATA TABLE= (X++(R..R)), XYDATA
$$ [...]
44516 -3139574 -2054430 -4711954 -5605398 -1725694 3082557 4271281 2934304 2622600
44508 2622600 3190491 1963750 -1136203 -3865298 -5800831 -8215313 -10549090 -10996396
44500 -10996396 -10446381 -11826359 -14929747 -15730691 -12218501 -7527717 -5274140 -4630709
44492 -4630709 -2593772 982502 3553860 3870748 2892997 1211062 -1649887 -5096354
44484 -5096354 -7074887 -6645153 -5109612 -3671630 -1657499 1637548 4670281 4924051
44476 4924051 1965885 -2052300 -4558236 -4169600 -862637 3802400 6850831 6164934
44468 6164934 3067595 1177006 2102416 3630100 2883074 -108844 -3016144 -4179914
44460 -4179914 -3733375 -2672260 -2058166 -2398803 -2673050 -883000 3042982 5885231 4558117
44451 4558117 312152 -2539381 -1818501 752109 2894939 4289507 5061344 4398052 2401552
44442 2401552 1501966 3891436 8384014 11645023 12129088 11220293 10636814 10263026 8954618
44433 8954618 6395824 3401709 731336 -1803039 -4869135 -8454692 -11544493 -13061534
44425 -13061534 -12651968 -10267002 -5858905 -498309 2987528 2299325 -1313675 -4002508
44417 -4002508 -3789987 -2563133 -2901397 -4531650 -5256425 -4299303 -3138126 -3326646 -4656831
44408 -4656831 -5585382 -5058877 -4006597 -4829762 -8548077 -12550380 -12649735 -7845883 -1610060
44399 -1610060 2174638 2922508 2158906 628746 -1682030 -4090314 -5747544 -6731249 -7015887
44390 -7015887 -5536690 -2177325 541092 245674 -1506306 -836641 3277841 7891039
44382 7891039 10083258 9576945 7265763 3874142 751170 -552406 -540107 -1404648 -3432429
44373 -3432429 -4137027 -2316587 -548499 -1630536 -4510992 -6129689 -5809109 -5186916 -4777769
44364 -4777769 -3538338 -1756128 -1633662 -4217868 -7651076 -9379060 -8789230 -6941905
44356 -6941905 -4833151 -2739076 -545804 1862917 4048027 4750344 3102899 289383
44348 289383 -1234387 -721206 -44000 -704107 -1278165 482022 3812052 5332746 3381198
44339 3381198 19076 -1843326 -1529230 126951 2685579 5480659 6462323 4127092
44331 4127092 248799 -1657994 -795393 152694 -863846 -2705405 -3600208 -3967520 -4961539
44322 -4961539 -6002857 -5867447 -4957484 -4303391 -3339568 -1137343 795560 -234541 -3862374
44313 -3862374 -6247340 -4783566 -1359814 -5044 -2678176 -8059556 -13156217 -15390974
44305 -15390974 -14251097 -11515867 -9090205 -6735994 -3320718 4825 261921 -3074108
44297 -3074108 -6554257 -6834669 -4467127 -2239654 -1451672 -1519788 -1861125 -2259511 -2327077
44288 -2327077 -2438008 -4496034 -9905085 -16931232 -21491824 -20710227 -15229302 -8689813
44280 -8689813 -5458249 -7577568 -12701591 -15909453 -14643929 -10946978 -8042420 -6420823
44272 -6420823 -4839997 -3424068 -3354064 -4440911 -5292358 -5259512 -4274283 -1732080 2159258
44263 2159258 4869332 4095148 1216377 -550146 -844229 -1862992 -3747344 -3952696 -1604440
44254 -1604440 1165937 3060306 5145543 7370097 7410497 4910391 3107835 3577170 2844523
44245 2844523 -2259474 -8693037 -10737885 -7605841 -3415915 -801459 1206481 3374354
44237 3374354 4631636 4822587 5488169 6852585 6945150 4846897 2356409 1353100 1664850
44228 1664850 2497532 3852925 5483201 6404861 6532967 7037562 8176216 8621352 7780074
44219 7780074 6684014 5603563 3264056 -3459 -900044 2623738 7685742 9661058
44211 9661058 7683417 4390874 1548024 -981874 -2759011 -2796917 -2192071 -3468617 -6566885
44202 -6566885 -8323372 -6912550 -4112508 -1919893 271917 3068901 4082126 525721
44194 525721 -6263615 -11659010 -12868308 -11103337 -8803009 -6855003 -4951057 -2895138
44186 -2895138 -797746 889857 1061105 -1212884 -5007797 -7717042 -7577864 -5365960
44178 -5365960 -3131580 -1959444 -1428084 -576347 1116987 3135622 3942136 2364238 -541986
44169 -541986 -1907524 -140986 3112073 4993847 4709798 3647785 2874700 2135781 1263456
44160 1263456 838211 855234 134878 -2018165 -4568194 -6068309 -6302576 -5588837 -3470852
44151 -3470852 261942 3811409 4647959 2770256 817570 265486 -617174 -3681864 -7390804
44142 -7390804 -8508898 -6547224 -4218619 -3471058 -3333225 -2368323 -1156424 -946824 -1448683
44133 -1448683 -1810784 -2780139 -5710059 -9658772 -11654952 -10451268 -8312813 -8008571 -9167721
44124 -9167721 -8912229 -5578481 -604308 3230261 4512246 3990970 3396127 3809539 4751355
44115 4751355 4492219 1560006 -3631538 -8781869 -11739468 -12412528 -12079312 -10991500 -8001132
44106 -8001132 -3293140 -4284 -1082325 -5025224 -7235696 -6074150 -4925905 -6808726
44098 -6808726 -9514306 -8846841 -4986563 -2098116 -2037472 -2068256 415340 4057815 5950526
44089 5950526 5416375 3602419 1230680 -1290700 -2943456 -3217471 -3156773 -3681630 -3942802
44080 -3942802 -3021439 -2152708 -3237209 -5879429 -7944229 -8574847 -8660324 -8679380 -8265567
44071 -8265567 -7936858 -9058149 -11497521 -13080615 -12194662 -9726978 -7786238 -7453326 -8201127
44062 -8201127 -8633247 -7495290 -4804987 -2213464 -1561925 -3127254 -5932747 -9189170
44054 -9189170 -12183761 -13354849 -11376947 -7189788 -3180869 -222212 2592911 4991258
44046 4991258 4596038 153623 -5962834 -9855363 -9742562 -6625511 -2470843 1154691
44038 1154691 3370904 3859113 2309349 -1755107 -7558298 -11977979 -12069129 -9028892 -7235266
44029 -7235266 -8399573 -9240278 -6623080 -2454581 -778454 -1785710 -1942777 639759
44021 639759 4094257 6124632 6676385 6623247 6109856 5331192 5247303 6131734 6436083 4518728
44011 4518728 1166876 -843887 -33328 1789028 1765108 26756 -32012 3498430 7529183
44002 7529183 7525449 3929052 1916801 4243997 7730419 8545922 7582167 7475813 7024830
43993 7024830 3024339 -3320677 -6441567 -3687319 933988 1783128 -2027532 -6753478
43985 -6753478 -8830018 -8095527 -6983567 -7419641 -8549426 -8042413 -5972499 -5683373 -9077189
43976 -9077189 -12826969 -12266169 -7972188 -4855007 -5040756 -5725464 -4653977 -3495100 -4116497
43967 -4116497 -5270138 -5321119 -5178350 -5980079 -6552362 -5817459 -5263496 -6148733 -6518522
43958 -6518522 -4253139 -1227195 -889866 -2997726 -4366735 -4017334 -3826423 -4297143 -3413825
43949 -3413825 -271229 3336880 5832812 7684860 9415267 10238171 9809054 9256864 9288785
43940 9288785 8939760 7218062 4502773 1494318 -1660494 -4312380 -4877584 -2489667
43932 -2489667 1972294 6963790 10958481 11838046 8020198 1547917 -2126683 322813
43924 322813 5956984 9025064 7715875 5377104 5567144 8281384 11368059 13521182
43916 13521182 14711605 14906979 13771761 11437957 8708755 6263505 3938971 1060420
43908 1060420 -2407921 -5240883 -5943302 -4469509 -2425394 -1223619 -544617 824810
43900 824810 3009677 4645927 4421260 2404866 -290504 -2692946 -4524027 -5822836
43892 -5822836 -6438983 -6094608 -4822431 -3034245 -1072921 969622 2827281 3988394
43884 3988394 4512979 5302387 6674439 7212651 5432260 2445488 1155845 2206645 2555192
43875 2555192 -519314 -5361284 -7849109 -6718343 -4826778 -4957635 -6397862 -6663222
43867 -6663222 -5154530 -3578641 -3291462 -3720436 -3695185 -3280789 -3442165 -4206570 -4150450
43858 -4150450 -2214775 557731 2011127 1481076 349158 -217016 -730136 -1701992 -1807494
43849 -1807494 513843 4185660 6221282 5454426 3685407 2638215 1733128 -46399
43841 -46399 -1899458 -2570274 -2704253 -3811607 -5634479 -6728197 -7293891 -8892924 -10894935
43832 -10894935 -9769320 -3507944 4801787 9599506 8397590 3545778 -711479 -1606068
43824 -1606068 943273 4638485 6215540 3982608 -493533 -3826786 -4021025 -1844251
43816 -1844251 463061 910183 -1288643 -5053123 -7805756 -7927935 -6976753 -7982235 -11234944
43807 -11234944 -13415486 -11679695 -7109942 -3016059 -1115871 -825245 -1352191 -2695761
43799 -2695761 -4715621 -6607112 -7573224 -7352095 -6163493 -4671686 -3667785 -3186902 -2365901
43790 -2365901 -798640 542602 510682 -673298 -1910120 -2599929 -2608024 -1671927 -76237
43781 -76237 856372 423120 -59474 712878 1358291 -419866 -3645376 -4526031 -1716953
43772 -1716953 1648318 2454254 1517671 1061024 564799 -2044882 -6312244 -9292679 -9376636
43763 -9376636 -7549767 -4838371 -1099971 2899366 4548146 2208406 -2201508 -4976502
43755 -4976502 -4472880 -2047963 400570 2436104 4365081 5692970 5349401 3276508
43747 3276508 880222 -509577 -1080700 -1866390 -3055809 -3830048 -3716446 -3063256 -2019420
43738 -2019420 -173425 2277676 4023229 4083503 3005403 1886783 939216 -262580 -1933252
43729 -1933252 -4271274 -7475873 -10520531 -11143648 -8746553 -6321384 -7278978 -10749838
43721 -10749838 -12404832 -10067152 -6125157 -3806845 -3475455 -3779340 -4200784 -4548029 -3533700
43712 -3533700 -223515 3666020 4943739 2561095 -1148894 -2896461 -1340280 2128762
43704 2128762 4690494 4434875 2008627 -408634 -1930716 -3608822 -5722928 -6255105
43696 -6255105 -3713813 -33538 1580098 786372 -317470 -1026180 -2448842 -4156247
43688 -4156247 -3743616 -782856 1712192 1443485 63782 293426 1830202 2456533 1722551
43679 1722551 993046 676278 -191599 -1963136 -4026933 -6188325 -8561286 -10334901 -10482053
43670 -10482053 -9553352 -8999498 -8850521 -7910329 -6191193 -5133122 -5114663 -4645810 -2592305
43661 -2592305 350885 2874672 4389558 4920860 5004291 5559477 6298366 4841441 -132780
43652 -132780 -5277314 -5523030 -1081518 2314831 1485111 -52686 1436345 3380494 1095819
43643 1095819 -4313587 -7272529 -5723363 -3018918 -2143230 -2545264 -3136187 -4243941 -5528618
43634 -5528618 -5594724 -4947574 -5986889 -8626532 -9222236 -5761649 -1138129 984545 911320
43625 911320 985789 1319083 584704 -471343 359841 3081439 5124860 4650428 2179880
43616 2179880 -1014700 -4284939 -7132973 -8741632 -8346057 -5595546 -1031678 3296181
43608 3296181 4894328 3634568 2309473 2991651 4205194 3653015 2390212 3429361
43600 3429361 6704326 8611495 7157811 4751958 4495234 5838004 5804010 3347712 660578
43591 660578 446386 3110455 6583881 8144510 6455158 2456400 -1467931 -3289289
43583 -3289289 -2489120 81654 2928391 4620037 4499471 3094474 1642658 1003623 1016295
43574 1016295 874295 102481 -856330 -1292229 -1550076 -2845730 -4916316 -4907493 -599637
43565 -599637 5658440 8906254 7919929 6635471 7958914 9471598 7914089 4972026
43557 4972026 4678387 6920217 8016790 6959090 6328715 6767883 5377800 1142431 -2342321
43548 -2342321 -1990499 293066 931296 -327315 -1603964 -2664831 -4210193 -5118861 -3878804
43539 -3878804 -1805433 -1467334 -2312787 -1199549 2417822 4939645 3403086 -470247
43531 -470247 -2449902 -587124 3409381 6589355 7433633 6651028 6076204 6477100 6258417
43522 6258417 3133386 -2460686 -6541777 -5225308 1085678 8017089 11597625 11381537
43514 11381537 9217665 6423376 3334452 600275 -1091492 -2506310 -4922588 -7173195
43506 -7173195 -6171070 -1969366 333199 -3187433 -8901527 -9539959 -4129408 312178
43498 312178 -1998898 -8697214 -13576869 -14299080 -12825304 -10714088 -7614125 -3490020
43490 -3490020 608866 3838010 5760557 5760920 3813875 1173195 -985810 -2617966 -3437931
43481 -3437931 -2262232 617229 2383444 1339665 -210363 513015 2021127 662152
43473 662152 -3662789 -7444925 -8634319 -8281914 -7499379 -6367166 -5796060 -6841181 -7980488
43464 -7980488 -6710400 -4059380 -3509533 -4977784 -4518558 -1305178 154572 -2549045
43456 -2549045 -4741323 -1119643 6165097 10282397 8404192 3444972 -1268317 -4786530
43448 -4786530 -6727377 -6720365 -5905250 -5976033 -6559047 -6021597 -4675984 -4505781 -5731257
43439 -5731257 -6334846 -5300988 -3864975 -3064242 -2303249 -1032718 48331 226492 -195308
43430 -195308 -580874 -607810 -290956 -432021 -2334369 -5447781 -6349739 -2608137 3084166
43421 3084166 5821624 5257409 5590726 8173081 8610062 3659643 -2738676 -4110705 -29287
43412 -29287 3763552 2878779 -1569884 -6140339 -9076578 -10329783 -10054333 -8543547 -6552040
43403 -6552040 -4743699 -3299184 -2247484 -1592560 -1225534 -1405122 -2971878 -6113574 -9230552
43394 -9230552 -10178753 -8545476 -5733745 -3133815 -1407892 -1156451 -2585311 -4454824
43386 -4454824 -5075061 -4708217 -5321883 -7389911 -8670776 -7187636 -3964789 -1544364 -928609
43377 -928609 -1300162 -1786352 -2050240 -1849067 -1439463 -1864732 -3470894 -4748858 -4237164
43368 -4237164 -3070987 -3749919 -6508829 -8904821 -9213922 -8163678 -6685946 -4117784
43360 -4117784 5626 4008910 5605922 4443109 1823800 -1113097 -3582459 -4579948
43352 -4579948 -3876546 -2956252 -3262056 -3996615 -3364729 -1445606 237432 1621066 3944679
43343 3944679 6386788 5814812 1400950 -2902507 -2790921 887225 3362513 1848242
43335 1848242 -2127355 -5851161 -8159289 -8447020 -5557856 349501 6109103 8065781
43327 8065781 6386604 5035985 6643020 8797948 7015891 777614 -5390518 -7346277
43319 -7346277 -6004836 -5226284 -6420241 -7417671 -6326947 -4207044 -3272566 -4123167 -5642361
43310 -5642361 -6439648 -5632113 -3352292 -1297680 -1641797 -4382844 -6648753 -5603580 -1370698
43301 -1370698 3565140 6861837 7489077 5661702 2793923 581148 -897569 -3093035
43293 -3093035 -6093728 -7554050 -6232277 -4867338 -6860280 -11059983 -12850677 -10232202
43285 -10232202 -5858843 -2645430 -282134 2636994 5330626 5475998 2056817 -3547595
43277 -3547595 -8538071 -10343601 -8510061 -5455548 -4203000 -5081114 -5958724 -5676892 -5203971
43268 -5203971 -5049083 -4052238 -1919841 -643273 -1697251 -3778003 -5241894 -6974167
43260 -6974167 -10423585 -14113163 -14883062 -12160838 -8551675 -6216679 -4812959 -3264999
43252 -3264999 -1641765 -606499 -291136 -300465 -36296 1155880 3363011 5547655 6320984
43243 6320984 5304649 3333224 1732071 1812873 4083996 6942759 7180259 3367444 -1864679
43234 -1864679 -4552483 -3987663 -2918324 -3530312 -5167416 -6134906 -5930108 -5244287 -5154620
43225 -5154620 -6543176 -8950150 -10003388 -7664593 -3153817 240763 1471936 2547490
43217 2547490 4348313 4330850 313517 -5430424 -8423026 -7454234 -5439131 -5033560 -5593313
43208 -5593313 -5023051 -3004650 -1321322 -1649432 -3899538 -6660933 -8748138 -9987296
43200 -9987296 -10554795 -10071830 -7937419 -4442411 -922979 1284887 1615055 231170 -1933208
43191 -1933208 -3165655 -2182862 174321 1366799 -34064 -2498443 -3081124 -545392
43183 -545392 3353303 5529405 4571650 2364076 2313392 5455151 9074428 10148111 9064414
43174 9064414 8070365 6982290 3452974 -2280191 -6183265 -5432766 -2050268 332856
43166 332856 1157559 2185344 3849019 4881622 4499894 2653266 -1046554 -6366046 -10953142
43157 -10953142 -11927951 -8871939 -3912431 453728 2354716 874718 -2416355 -3512397
43149 -3512397 -219939 4428086 5699908 3370963 1359390 1671990 2307396 1473456 236411
43140 236411 -148723 -343617 -868736 -729960 240133 211017 -1583743 -2839525 -1340136
43131 -1340136 1627730 3069435 2104325 183938 -1150316 -898743 1733542 6262892
43123 6262892 10228065 11225473 9198626 5777013 2394158 63885 -407714 590981 1533581
43114 1533581 2148748 4296448 8832380 13063349 13346303 9265447 3563728 -936297
43106 -936297 -2704518 -1306505 1958442 4275510 4160382 2995363 2059442 6724 -4155021
43097 -4155021 -7697597 -7385751 -4587952 -3203701 -3605515 -3172629 -2198041 -3838363 -7508563
43088 -7508563 -7911575 -2799900 3181389 5295704 4977647 5674873 6325484 3755720 -853027
43079 -853027 -2978024 -1399368 565496 416908 -730311 -1169260 -1157425 -1458645 -1743506
43070 -1743506 -1530349 -1165299 -1186408 -1757912 -2725922 -3168123 -1533149 2156438 5050895
43061 5050895 4671375 2781264 3286900 6384078 8034470 5995435 2997517 2121555 1961579
43052 1961579 -821849 -6024462 -10090075 -10969248 -9919456 -8628372 -7281157 -6057822
43044 -6057822 -6163061 -8038563 -10049628 -10326871 -9015893 -7538669 -6396143 -4980862
43036 -4980862 -3019402 -729624 2257169 6452025 10588304 11788803 8801469 4035675
43028 4035675 1054540 661246 780003 -331595 -2412084 -4545337 -6231218 -6632432 -4621887
43019 -4621887 -710597 2469199 3005418 2111817 2332290 4059945 5309094 4539232 2244978
43010 2244978 -144072 -1597408 -1634305 -367669 1283871 2311056 2772130 3536850 4890274
43001 4890274 6255097 7286750 8192695 8798590 8458966 7394515 7063047 8376500 10257314
42992 10257314 10869090 9864303 8501054 7714388 7087357 6043228 5220582 5831935 7889610
42983 7889610 9961597 10926889 11167598 11460138 11476121 10391952 8386141 6147962 3302171
42974 3302171 -772994 -4478267 -4734791 -1237206 2258880 2634637 1470097 2132501 4432023
42965 4432023 5190328 3311366 947991 -466175 -2059459 -4487019 -5981876 -5021619
42957 -5021619 -2691129 -662939 1253083 3564487 4732915 2920521 -467140 -1346386
42949 -1346386 2536277 9049236 13992306 15035388 13062628 10337710 7946357 5228327
42941 5228327 1671774 -1378207 -2018109 -649609 32908 -1429061 -3163895 -2551026 210204
42932 210204 2575177 2988206 2077883 727397 -1250085 -3817107 -5325373 -3771371 530679
42923 530679 4410715 4677869 1400125 -2255154 -3526719 -2560816 -1081280 97547 959437
42914 959437 826046 -897586 -2873893 -2944320 -1263055 -212693 -850725 -1704244 -1730942
42905 -1730942 -1963723 -2953119 -2965909 -599071 2603261 4005191 2927575 330726 -2860875
42896 -2860875 -5481957 -6077889 -5153674 -5670071 -9102911 -12828315 -13784480 -12647525 -11509337
42887 -11509337 -9777618 -6370080 -4063608 -6563323 -11852382 -13719487 -10364139 -6419769
42879 -6419769 -5286264 -4611122 -1673414 1435322 1370017 -1236508 -3618101 -5243860 -6816248
42870 -6816248 -7044023 -4141168 569986 3720540 3966838 2675003 1422873 974863 1718577
42861 1718577 2973910 2887166 1004638 -341087 652202 2081540 1050389 -1850899 -3652144
42852 -3652144 -3364613 -2124648 -125290 2959611 5164684 3893008 518448 -640079
42844 -640079 1304105 2253796 -692907 -4958344 -6258456 -3831643 107984 3750573
42836 3750573 6424430 7867611 8765775 10504619 12767333 12995476 9862642 5625535
42828 5625535 3241812 2707184 2198230 1484051 2009821 4298500 6968533 7790448 4772993
42819 4772993 -2430051 -10876081 -15680249 -14749263 -10855951 -7540720 -4919728 -1635254
42811 -1635254 1341772 2133315 1619106 1998410 2620573 1203035 -1134682 -379410 4118279
42802 4118279 7917624 7495961 4519646 2312746 1242060 -58871 -1492407 -2194885
42794 -2194885 -2604546 -3380452 -3719404 -3049211 -3114364 -5975941 -10688584 -13989812 -13733653
42785 -13733653 -10151796 -4747295 307241 2707062 1953914 93631 -1077409 -2447342
42777 -2447342 -5373891 -8426673 -9012945 -7448489 -6532604 -7353113 -8338699 -8489142 -8612569
42768 -8612569 -8817357 -7571434 -4376624 -1199037 -52254 -758105 -1850145 -2093127 -663877
42759 -663877 2234797 4408058 3481027 431283 -939951 986157 3536172 3845202 2541972
42750 2541972 1619728 1025316 -426149 -2712322 -5435497 -9062047 -12810374 -13265498 -8410446
42741 -8410446 -1843402 537489 -2356680 -6198319 -7459394 -6806006 -6009185 -5055664 -3671356
42732 -3671356 -2865486 -3197093 -3513945 -2933010 -2301689 -2251585 -1580471 652271 2851544
42723 2851544 2722441 518183 -1460883 -2114366 -2410103 -3101722 -3446751 -2797847 -2043138
42714 -2043138 -2309059 -2876639 -1729355 1549974 4444172 4027897 506417 -2868491 -3529619
42705 -3529619 -2090439 -758309 -707329 -1989445 -4544116 -7515781 -8564899 -6063540
42697 -6063540 -1665316 1421692 2669031 4509256 8056143 10896248 10260052 6638148
42689 6638148 2908208 975063 334824 -845011 -3896368 -8078199 -10525189 -8901658
42681 -8901658 -4321231 -190465 2008069 3828609 6351659 8087932 7687087 6373499
42673 6373499 5777706 5347515 4161855 3572609 5345772 8365534 9994814 9917091 9703254
42664 9703254 9048414 5795525 171675 -4137270 -4460170 -2316686 -655031 52226 1141039
42655 1141039 2753570 3731680 3872908 4237746 5131703 5432385 4458204 3255418 3068767
42646 3068767 3225146 1795365 -1553709 -4538367 -4878108 -3183760 -2020170 -2394460 -2728952
42637 -2728952 -1666236 -262338 -243962 -1203972 -1049992 1190837 4379474 6980777 8516991
42628 8516991 8960539 7596213 3420899 -2995561 -8378717 -8691445 -3423698 2708058
42620 2708058 4340769 1851148 844504 4538447 9434869 10499563 8095552 6672865
42612 6672865 8177588 10419115 11462561 11890850 12083774 10506229 6196314 816272
42604 816272 -3132049 -4660284 -4087670 -2173274 -373439 -403179 -2444214 -4833116 -6139190
42595 -6139190 -6412903 -6092768 -5284619 -4642713 -5209563 -6579986 -6905817 -5661164 -4765344
42586 -4765344 -5847395 -7849304 -8457110 -6616800 -2788027 1671929 4405884 3325157
42578 3325157 -454937 -2688257 -792499 2970919 4903273 4649412 4145307 3445087 971264
42569 971264 -2592184 -4083817 -2138689 963961 2516523 2160420 552641 -2417353
42561 -2417353 -6426021 -9351048 -9166154 -6745618 -5267783 -6732255 -9866749 -11547500
42553 -11547500 -9868246 -5870439 -2525097 -1966897 -3730240 -5900396 -7686946 -10002785
42545 -10002785 -13303914 -15881979 -15358325 -11694499 -7685121 -5964250 -6173996 -6002262
42537 -6002262 -4754217 -4407064 -6331620 -8328261 -6837904 -1795844 2779394 3514720
42529 3514720 1126176 -1772142 -4441356 -7906704 -12236898 -15837650 -17124238 -15657811
42521 -15657811 -12188573 -8768193 -7951509 -10174922 -12413934 -11165729 -6460975 -1311000
42513 -1311000 2243973 4367824 5088601 3609301 648870 -1206930 -929624 -673932 -2300448
42504 -2300448 -4225731 -3907064 -1906222 -806459 -1001768 -606282 540573 78147 -2572930
42495 -2572930 -4114485 -1890296 1581394 1717029 -1386334 -2920209 -718461 859806
42487 859806 -3160930 -10753998 -14462085 -10084506 -902943 6930486 10342179 9754187
42479 9754187 6522438 2371984 -272278 -165220 861790 -57404 -2936744 -4832325
42471 -4832325 -3696204 -737061 1309360 851968 -1863954 -5268545 -7177214 -6373706
42463 -6373706 -4274900 -3920739 -6390361 -9050593 -8384290 -4095649 554547 2355456
42455 2355456 1246552 -384918 -846242 -765877 -1365180 -1998764 -864948 1682886 2378296
42446 2378296 -934151 -5707508 -7199494 -4172283 37999 2200727 2630634 3169359
42438 3169359 3868698 3308410 1046737 -1762338 -3653117 -3806599 -2408418 -928424 -1353436
42429 -1353436 -4237874 -7973769 -10451431 -10632938 -8244585 -3608502 1151227 2557930
42421 2557930 -519303 -4700359 -5804182 -3999241 -2884338 -3851652 -4209297 -1480432
42413 -1480432 2985252 5959028 6037232 4115465 1762472 566810 1777637 4930047
42405 4930047 7602097 7901086 6488467 5016544 3662078 1797536 19693 -715533
42397 -715533 -1443711 -4183855 -8476444 -11405987 -11698605 -11321982 -11734607 -10882133 -6169287
42388 -6169287 911537 5565864 4892443 630154 -3116900 -3551248 -879139 2208053
42380 2208053 2743052 271532 -2662023 -3580043 -2877499 -2358857 -2052757 -594888 1829113
42371 1829113 3530053 4339830 5841276 7965223 8188063 5457514 2326054 1240863
42363 1240863 887824 -1395033 -5250344 -8089338 -9259846 -10600316 -13020816 -15012716
42355 -15012716 -14936301 -12949849 -10244572 -7751401 -5844294 -4125113 -1446982 2660896
42347 2660896 6617089 8053133 6468979 3539543 973958 -643312 -1093277 -279598
42339 -279598 882650 697043 -1504775 -4449658 -6110840 -5396675 -2893542 -545953 -192390
42330 -192390 -1714166 -3171443 -3337734 -2930055 -2380678 -237968 4070298 7459554 6347346
42321 6347346 2032069 -423485 1096231 3401714 3120543 994080 -454532 -794623
42313 -794623 -1091682 -1332367 -711163 484313 1132998 1092635 1623064 4059976 8250389
42304 8250389 11926870 12220653 9011911 6037319 6729089 9587055 10187660 7261183 3605044
42295 3605044 1255088 -209113 -169548 3313803 8495347 9559773 4384986 -1550900
42287 -1550900 -2802273 -1564599 -3010942 -6509416 -7373813 -5254069 -4337073 -5713854
42279 -5713854 -5882434 -3766871 -3403549 -7297976 -11619829 -11015890 -5267832 1427952 5590831
42270 5590831 6588288 5402109 3478324 1964538 768755 -956137 -3002958 -4119501
42262 -4119501 -4158909 -4471496 -5549607 -6103111 -5340194 -4472149 -4913246 -6395541 -7845419
42253 -7845419 -8896205 -9645169 -9970347 -9797882 -9140574 -7545226 -4599855 -1169283 1121718
42244 1121718 1701301 1029347 -870011 -3848073 -5867370 -4595221 -1336869 -499422 -3791708
42235 -3791708 -7474287 -7110272 -2890368 1697706 4529239 5841048 6079707 5428768 4879877
42226 4879877 5388016 5934908 4307023 190912 -3788684 -4680329 -2287760 705709 1597800
42217 1597800 523552 44253 1611214 3371700 2653030 -217482 -2408767 -2390003 -1047264
42208 -1047264 648929 2332068 2539385 -310608 -4286702 -4743090 -574976 3432658
42200 3432658 2810072 -930405 -3579185 -4385789 -5296104 -6061092 -4324521 82198 4579049
42191 4579049 7387930 8581298 7917621 4873483 934340 -1191615 -1016841 -264327 645164
42182 645164 2955198 5918840 6189954 2329466 -2856696 -6161778 -7663788 -8566555 -7671449
42173 -7671449 -2947476 4276384 9364177 8897714 3742581 -2367117 -6074687 -6235388
42165 -6235388 -3797118 -572579 2163988 4281557 6262262 8277888 9696049 9284227
42157 9284227 6251442 1674343 -1440984 -555000 3684529 7786180 8727801 6515782
42149 6515782 3549456 2129847 2600737 3244996 1952476 -1411401 -4441803 -4801074 -3175863
42140 -3175863 -2393487 -3432110 -3844770 -1202646 2898741 3934776 -216499 -6217123
42132 -6217123 -8525548 -5412642 -657200 1025973 -1012663 -3986463 -5997050 -7370421
42124 -7370421 -7989145 -6359759 -2531407 706539 1534554 1863033 3977149 6322275 5716287
42115 5716287 2545615 372194 872412 2492179 3974924 5713392 7188014 6610781
42107 6610781 4205605 2659050 2967649 2904563 1258817 489317 2797847 6177785 7187120
42098 7187120 5737531 4259488 3508958 2085745 -686438 -3948709 -6844380 -8757490
42090 -8757490 -8722847 -6713388 -4763228 -4610042 -5038306 -4021289 -2603545 -3439426 -5752594
42081 -5752594 -5575431 -2056982 32960 -3555983 -10369732 -14146127 -12720475 -10050742
42073 -10050742 -10265977 -12292260 -11796288 -7112510 -1258367 2134287 3226356 4845533
42065 4845533 7694662 9026089 6923940 3729801 2991538 4179900 3302654 -1193078
42057 -1193078 -5978492 -7390969 -6091490 -5377000 -6476548 -7767592 -7878495 -7210068 -6300284
42048 -6300284 -4831508 -3127620 -2991673 -5537760 -8905211 -9688423 -6712588 -2215306
42040 -2215306 1013236 2464846 3125022 3037982 1407194 -1023188 -1566187 1490938 6645859
42031 6645859 10848885 12635383 12605137 11578845 9744307 7410057 5147126 2912994
42023 2912994 206193 -2409607 -2859604 565316 7093977 13568286 16596455 14822546
42015 14822546 9631984 3844741 -381187 -2327063 -1866721 752932 3610304 3248571
42007 3248571 -1814148 -8329676 -11264877 -9408288 -5876255 -3115018 -353934 3087031
41999 3087031 5219768 4437683 2649291 2320478 2097042 -1027467 -5925151 -7629758 -3955648
41990 -3955648 1610398 4849413 5567398 5587048 4798000 2109083 -1270383 -2678928 -1806218
41981 -1806218 -1031941 -1740213 -2510691 -1630238 427617 2078783 2904222 3610508 4338752
41972 4338752 4136248 2116884 -1387629 -4849249 -6538861 -5738235 -3254932 -674771
41964 -674771 988443 1838459 2466181 3202304 4101888 5275074 6843146 8513768 9367468
41955 9367468 8401399 5682981 2930229 2334691 4376639 7051031 7497243 4185994 -2255283
41946 -2255283 -9277952 -13149197 -11062043 -4108590 2539082 4116357 929489 -2597985
41938 -2597985 -3163809 -1384755 370645 975525 839143 737427 1091116 1441738 384989
41929 384989 -2858639 -6805405 -9151769 -9849091 -10698644 -11567112 -9636399 -3800120 2409284
41920 2409284 4228648 665707 -5224536 -9373280 -8707654 -2554582 5548102 9424947
41912 9424947 6638369 1994444 1760438 5687757 8245959 6793859 4231013 3353635
41904 3353635 3015656 1479953 -79546 141951 1235390 932389 -1159379 -3530466 -4830673
41895 -4830673 -4547744 -2776687 -556736 608203 524719 465444 866502 464641 -1335342
41886 -1335342 -3036016 -3369408 -3427166 -4845407 -7194744 -8870905 -9491348 -9722922 -9619211
41877 -9619211 -8747667 -7240068 -5257496 -2170694 2254276 6571632 9067246 9863451
41869 9863451 10151204 9854185 7610029 2919549 -2857962 -7511607 -9252401 -7601503
41861 -7601503 -3928019 -529870 1541692 2942373 3859214 3014641 9431 -3158691
41853 -3158691 -4825579 -6345174 -9618108 -13140691 -13511710 -10546198 -7931185 -8348225
41845 -8348225 -10408250 -11168430 -9597593 -6613420 -3453589 -1189845 -657730 -1722763
41837 -1722763 -3144797 -3713936 -3097967 -1589514 145538 1041354 333889 -1481091 -3114637
41828 -3114637 -3956209 -4387400 -4738717 -4755621 -4155294 -3179348 -2670454 -3730381 -6556274
41819 -6556274 -9354321 -9732318 -7845634 -6450287 -6701929 -6128949 -2939635 -144170 -1982149
41810 -1982149 -7460941 -11277813 -10913732 -9062674 -8681377 -9372548 -9727346 -9815566 -9743618
41801 -9743618 -8633041 -6797552 -6427250 -8300506 -10071299 -9649361 -8151453 -7560859 -7497022
41792 -7497022 -6543861 -5081201 -4324907 -3665791 -1346637 2680073 6355068 7662228 6058075
41783 6058075 2480406 -995423 -2331941 -1346329 407515 1985988 3805162 5552045
41775 5552045 5534427 3305058 767706 -780903 -2381708 -4448281 -4803920 -2313750 50117
41766 50117 -821954 -3124818 -2919976 -543764 7116 -2649039 -6017512 -8560372 -11125105
41757 -11125105 -12906062 -10795583 -4664871 788016 1934406 593128 -12 -217899
41749 -217899 -1757830 -3311436 -2790751 -2070345 -4811198 -10027919 -12428832 -9943402 -6827354
41740 -6827354 -7534187 -10874880 -12711875 -11794265 -9799990 -7310563 -3450084 750298
41732 750298 2145127 -348785 -3928260 -5611655 -5743413 -6289809 -7565974 -8786952 -10448927
41723 -10448927 -13501263 -16683202 -17298186 -14787969 -11337823 -8729909 -6849917 -5639954
41715 -5639954 -5874099 -6931339 -6324540 -3143477 86454 877706 306726 953415 2928672
41706 2928672 4413286 4899819 5170057 4862660 2976413 493275 -463492 -319995 -2003716
41697 -2003716 -6383571 -10345199 -10724800 -8090611 -5140436 -3098235 -1486885 -289391
41689 -289391 -395789 -2187907 -4941338 -7465861 -8556593 -7291583 -3912680 -297133
41681 -297133 1287725 133851 -2373972 -4001305 -3375960 -1011432 998742 779383 -1338575
41672 -1338575 -2991067 -2494956 -1073725 -1522894 -4500415 -7057572 -5823239 -1399162
41664 -1399162 1752364 439559 -3494434 -5984106 -6329292 -7452251 -10462669 -12025152
41656 -12025152 -8963551 -3257228 168369 -598412 -3401397 -6162330 -8933792 -11502970
41648 -11502970 -12001903 -9536266 -6386857 -5744830 -7916258 -10078571 -9612199 -6830202
41640 -6830202 -4315592 -3982608 -5173298 -5857056 -5242347 -4201054 -3253170 -1848710 -233226
41631 -233226 4403 -1404738 -2255697 -1379747 -1237791 -4152480 -7697704 -7535951 -3837383
41622 -3837383 -748676 150584 1249035 3286903 3369993 497481 -1569434 -62621 1904469
41613 1904469 15439 -4321186 -5786713 -2371981 2993953 7184389 9686358 10818842
41605 10818842 10304840 8293313 5817802 3771613 2614849 2765179 3906379 4446527
41597 4446527 3226574 1329334 702270 1445809 1923108 1106094 -541835 -2000969 -2300285
41588 -2300285 -949881 981320 1199951 -1007114 -3451323 -4100376 -4078461 -5581281 -8120920
41579 -8120920 -9343404 -8635025 -7318559 -6015789 -4495041 -3487149 -3809183 -4235725 -3297720
41570 -3297720 -2648693 -4950159 -8415433 -7691677 -1348109 5358748 7055327 4328411
41562 4328411 1184216 -464235 -1135476 -1182181 -996026 -2242104 -5966976 -10300056 -12254379
41553 -12254379 -10974946 -7484954 -2743482 1755628 3108121 -10206 -4219212 -4747935
41545 -4747935 -1950261 -1121791 -4947108 -9364108 -8873171 -3516683 2040635 4963500
41537 4963500 6730178 9161154 10763689 8621086 2627625 -3946210 -7913868 -8760667
41529 -8760667 -7592137 -5103835 -1748107 1167794 2380867 2555591 3601116 5821006
41521 5821006 7438027 7704238 8692866 12316569 16681248 17636338 13973791 9161972 7142725
41512 7142725 7778784 7738416 5253490 2454830 2566076 5876573 9598412 11303044 11041679
41503 11041679 9725879 7081736 2696056 -1915852 -4334649 -4218265 -3402436 -2852330
41495 -2852330 -1462193 1520886 4805301 6772374 7140024 5792783 1871912 -4249743
41487 -4249743 -9761488 -12381439 -13343556 -15108766 -17103354 -16530251 -13067440 -9784456
41479 -9784456 -8850390 -8814795 -7046733 -2914501 2244852 6465664 7749908 5381139 1685776
41470 1685776 488890 2478477 3938840 1570067 -3309026 -7176557 -9004428 -10044031
41462 -10044031 -10400387 -8935407 -6082870 -3767828 -2437142 -941279 284068 -1096856
41454 -1096856 -5268987 -8514533 -7445586 -3328020 -333546 -667181 -3177381 -5858935
41446 -5858935 -7786553 -8781803 -8718039 -7493433 -5168541 -2321188 -404978 -783080 -2903904
41437 -2903904 -4649232 -5204450 -6034904 -7900798 -8795781 -6807251 -3361947 -1064493 331002
41428 331002 2594951 4556380 2944985 -1968275 -5562847 -5145139 -3565694 -4500417 -7149141
41419 -7149141 -8294005 -7196254 -5329749 -2962217 584921 4032805 4715368 2160553
41411 2160553 -1251279 -3256529 -3391724 -2056939 -227676 -54058 -3209248 -7969547
41403 -7969547 -9982411 -6894550 -878468 3956283 5306427 3482852 134906 -2921176
41395 -2921176 -4639072 -5310454 -5789697 -6219144 -6258109 -6079039 -5820560 -4519862 -1340130
41386 -1340130 2403373 4453728 4740132 4969760 5004760 2585010 -2321510 -5780525 -4464827
41377 -4464827 83455 3710857 4358888 2447720 -1588693 -7221466 -12069452 -13133368
41369 -13133368 -10124691 -5733025 -2438945 -591135 427601 889543 984235 1038786 941673
41360 941673 196711 -1195121 -2639188 -3802683 -4834074 -5719507 -6173632 -6277469 -6671590
41351 -6671590 -8045313 -10647748 -13905823 -16206916 -15832699 -12834945 -9232855 -6459066
41343 -6459066 -3540973 787010 4977693 5762418 2424881 -1952602 -4161064 -4178853 -3864873
41334 -3864873 -3781707 -2931581 -1034520 688397 1311131 1463743 2001347 2320777 1250349
41325 1250349 -734168 -1755763 -1362475 -1439834 -3140783 -4418086 -2637273 1248447 3641407
41316 3641407 3214196 2180024 2281301 2458507 1727676 1509894 2981505 4387082 3585923
41307 3585923 1661029 1260367 2397803 2580820 484234 -2984184 -6790345 -10463665
41299 -10463665 -12911348 -12933260 -11043968 -8940435 -7385528 -6377126 -6623126 -8409024
41291 -8409024 -9646288 -7981260 -4611816 -2861966 -2892474 -1324998 3182937 7555711
41283 7555711 8831686 7763852 6183487 4041381 1444434 714885 3350035 6914055
41275 6914055 7935218 6426282 4763901 3502533 1406173 -1239886 -2536478 -2037482
41267 -2037482 -1262402 -1236214 -1983876 -4283787 -8992108 -14084136 -15286022 -11241367 -6090656
41258 -6090656 -5016821 -8159014 -10534240 -7691415 -300881 6872404 9720108 8143030
41250 8143030 5050358 2791485 1218305 -981563 -4148120 -7316074 -9155194 -8665501
41242 -8665501 -5794465 -2062481 318050 786981 1003762 2201833 3151497 2078866 -517786
41233 -517786 -2719654 -3964839 -4902798 -5054056 -3083255 405952 2629487 1956203 -153514
41224 -153514 -1211389 -277475 2047320 4647357 6137365 5455459 3106772 769772 -914051
41215 -914051 -2850732 -5129933 -5813044 -3505399 7588 1374369 -523603 -3690180
41207 -3690180 -5601559 -5509254 -4385200 -3699695 -4318900 -5837314 -6946433 -6894586 -6260284
41198 -6260284 -5775287 -5031886 -3322844 -1201607 191718 1166034 3137171 5840051 6690738
41189 6690738 4231356 870709 223905 2260212 3362359 1533331 -813839 -613715
41181 -613715 1297731 1664205 -372350 -2781614 -4601562 -7070848 -10010907 -10489215 -7389877
41172 -7389877 -4736201 -7174466 -13390079 -17353595 -15804600 -11358510 -7905364 -6070735
41164 -6070735 -4457842 -2801082 -1939005 -2096819 -2861122 -3983852 -4985168 -4762592 -2761491
41155 -2761491 -96432 1202723 -311549 -4773426 -10601639 -14582018 -14011626 -9769312
41147 -9769312 -6043390 -5999308 -8724787 -11213015 -11961425 -11429361 -10261412 -8707587 -7204289
41138 -7204289 -6307065 -6390779 -7811948 -10311185 -12038805 -11206650 -9506906 -11199905 -16966640
41129 -16966640 -21454205 -19853162 -14479649 -10974345 -9886182 -7018033 -1518880 1948249
41121 1948249 329395 -3438600 -5393813 -5725450 -6136450 -5649996 -2716601 982519 2630291
41112 2630291 2586504 3057638 3670997 2108984 -1339391 -3536806 -3062910 -1763468 -1139214
41103 -1139214 -377145 711007 -347353 -5487960 -12433323 -16476318 -15501808 -11751805
41095 -11751805 -8878047 -8476149 -9473270 -9779238 -8021916 -4233106 360517 3924756
41087 3924756 4844152 2777236 -828782 -3770467 -4939001 -4794987 -4073860 -2953318 -1750174
41078 -1750174 -1254646 -1710961 -2531697 -3608561 -5441527 -7121369 -6226927 -2548328 -10226
41069 -10226 -2207964 -7300838 -10342648 -9812902 -8483459 -8306144 -8359019 -8176960 -8936120
41060 -8936120 -10019600 -8437285 -3898614 -946346 -3134276 -7824994 -9816704 -7833953
41052 -7833953 -4299778 -873857 2085735 3223573 1390571 -1552353 -2825450 -3210613
41044 -3210613 -5827274 -10644594 -14054455 -14277740 -13386046 -13039123 -11961849 -9281499 -7018212
41035 -7018212 -7002817 -7888007 -7577437 -6651272 -7102327 -9205314 -11727839 -13923651 -15319120
41026 -15319120 -14710336 -11459452 -7025154 -3426947 -874566 1511913 3454968 3760331
41018 3760331 2292059 122551 -1935790 -3659520 -4732562 -4870813 -4034488 -1612196
41010 -1612196 3391741 9954209 14264762 13566846 9805924 6958914 5388047 1826080
41002 1826080 -4950935 -11624858 -14611364 -14137500 -12327510 -9460558 -4687875 608478
40994 608478 3025707 1297993 -1508820 -1219279 2502188 5533720 4107295 -396712
40986 -396712 -2711610 -42369 4328630 5232677 2382664 586303 3089605 7263207
40978 7263207 8339317 5561416 2344562 1060644 189799 -2680073 -6866043 -9217631
40970 -9217631 -8234596 -6054597 -5822355 -7911159 -9595309 -8202237 -3806354 1096810
40962 1096810 3682170 2541405 -1334335 -4618991 -3900107 852522 5691382 6788519
40954 6788519 4654621 3015631 3968270 5882594 6076412 3902771 780005 -1432055
40946 -1432055 -1527064 343623 2375357 2459297 413684 -1866528 -2698485 -2016196 -347480
40937 -347480 2055926 4338398 4786852 2745125 -70560 -1259578 -149017 2126051
40929 2126051 3965626 3973330 1636040 -1323459 -1468870 2633046 7855289 9517157 6670893
40920 6670893 2679500 762836 930771 1513208 1634635 1232686 173075 -1426911 -2845927
40911 -2845927 -3605390 -3953284 -3909107 -2805133 -596092 1383225 2146414 2800426 5147716
40902 5147716 8842374 11342066 10813156 7952382 4736513 2486558 1536274 1636211 1850369
40893 1850369 877266 -1508941 -3804187 -4573428 -4609204 -6073251 -9281700 -11485086 -9640696
40884 -9640696 -3909165 2309177 5650772 5587606 4080029 3099588 2953464 2948512 3041583
40875 3041583 3964466 5552220 6009778 3975749 894465 -87291 2211425 5681566 7628035
40866 7628035 7498651 6334608 4979461 3978538 4027147 5024768 5518618 4561469 3345357
40857 3345357 3360342 3690397 2197895 -952079 -3182501 -3043711 -1747119 -806933 -263952
40848 -263952 107736 -69564 -436699 434976 2869236 5253400 6496377 7468030 8600056
40839 8600056 8108932 4747708 667937 -1117084 -1096079 -2219514 -4939102 -6389368 -5007764
40830 -5007764 -3059675 -3080431 -3920804 -2351015 2488828 8164927 12029135 13398150 12554648
40821 12554648 9515696 5066560 1799895 1982032 4234752 4359853 498956 -4315498
40813 -4315498 -6445516 -6717628 -8387900 -11179102 -11306264 -7775395 -4433076 -3982749 -3856678
40804 -3856678 -919075 3066939 4455625 3584507 3108687 2210297 -2325941 -9611625 -14400621
40795 -14400621 -14178504 -11894745 -10266470 -7939737 -3661214 -112334 -164125 -2258927
40787 -2258927 -3082981 -2661025 -3206477 -4615893 -5022342 -4865469 -6229382 -8024030 -5945389
40778 -5945389 1284560 8818003 11075636 8307381 5500472 5936728 8265106 9683554
40770 9683554 9539453 8779709 7572843 5343343 2629778 974582 604396 -67673 -1726332
40761 -1726332 -2582873 -1095155 1117750 1359132 57030 112352 2075279 2997768 1057237
40752 1057237 -1413493 -1252976 1169664 2802431 1716814 -1512234 -4858488 -5789000
40744 -5789000 -2747317 2449593 5126457 2773947 -1557514 -2936963 -463465 2742514
40736 2742514 4209681 3940754 2390979 -82255 -1713606 -391571 3121530 5593334
40728 5593334 5527083 4453396 3499049 1632600 -1460698 -3675246 -3608881 -3009228 -3857571
40719 -3857571 -5040035 -4535315 -3326337 -4086555 -6794256 -8816842 -9299999 -10302666 -12673850
40710 -12673850 -13620292 -10313520 -4196424 520714 1932113 1927539 2671761 3630133 2983218
40701 2983218 519388 -2420632 -5217482 -8403981 -11658521 -13092110 -11536237 -8386696
40693 -8386696 -5888996 -4303542 -2105536 1509012 5757592 9500739 11607896 10283594
40685 10283594 4318069 -4195136 -10415957 -11574377 -10010481 -9941939 -12214498 -13966695
40677 -13966695 -12893222 -9908398 -7413136 -6471953 -6343339 -5892079 -4820886 -3874334 -4098712
40668 -4098712 -5633111 -7212321 -7207081 -5142964 -1944467 1057509 2908023 3127696 1748819
40659 1748819 -745033 -4015776 -8244433 -13238905 -17331924 -18248985 -15583502 -11722068
40651 -11722068 -9621834 -9943914 -10879679 -10460903 -8269177 -4964781 -1273690 1792215
40643 1792215 2530215 -72859 -4288455 -6396176 -4530620 -947878 674599 -541845
40635 -541845 -2577920 -3891074 -4669210 -4744701 -2966891 186082 1747897 -20694 -2837404
40626 -2837404 -3663480 -3343906 -5012512 -8514373 -9857665 -6842784 -2174356 494749
40618 494749 1135023 1964548 3431128 4160868 4038004 4714610 6859603 8891921 9135589
40609 9135589 7918041 6761248 6347267 6050379 5020414 3087942 825254 -740496
40601 -740496 -559460 1630546 4529479 5792229 4236916 1617534 1086734 3279674 5210650
40592 5210650 4432492 2978692 4572647 8386557 9109783 4380057 -1264955 -2383119
40584 -2383119 116548 1119862 -1187204 -4103759 -5810174 -7246534 -8075200 -5519675
40576 -5519675 682748 6052261 6965193 5468710 5325065 5929225 4247546 1114468 761644
40567 761644 3970606 6051210 3096798 -2950008 -7374233 -8538266 -8526813 -9255126 -9999462
40558 -9999462 -8706534 -4725252 14865 2659952 2485267 1539903 1395759 535731 -2990030
40549 -2990030 -7324274 -8319198 -5282540 -1861970 -471989 584838 2863931 4373579
40541 4373579 3257213 1766231 2776618 4446694 2594790 -2600832 -6528925 -6719658
40533 -6719658 -5552237 -5737236 -6670351 -6662521 -5977326 -5960135 -7009752 -8604600 -9747999
40524 -9747999 -8749200 -4561539 905550 3952396 3503492 2212716 2211013 2252481 551492
40515 551492 -2093730 -4076381 -5621150 -7223164 -7467550 -5300575 -2898197 -2985297 -4278271
40506 -4278271 -3146866 453118 2394507 391595 -2781983 -3573199 -2372977 -1905755
40498 -1905755 -2942647 -4097928 -4821593 -6020691 -7611463 -7470316 -3833889 2027484
40490 2027484 6415596 6553597 3107142 -664609 -2080147 -1144983 282619 673120 -208531
40481 -208531 -1806577 -3406035 -4554445 -5575486 -7367887 -9952716 -11640078 -10696105
40473 -10696105 -7612533 -4507871 -2293009 163289 3612828 6516655 6608910 3795438
40465 3795438 598730 -186393 2123254 5819226 8446684 8682497 6800787 3679788
40457 3679788 -32984 -3646806 -6221863 -7387391 -7747735 -7705616 -6729983 -4988764 -4728388
40448 -4728388 -7916752 -12693967 -14480702 -11266375 -5897523 -2259444 -1009900 -340545
40440 -340545 667938 1249396 661507 -922944 -2901277 -4521597 -5068797 -4660058 -4383432
40431 -4383432 -4889791 -5490678 -5406915 -5044874 -5047492 -4976607 -4179714 -3202648 -2945914 -2993899
40421 -2993899 -2221090 -628570 852009 2019073 3413280 5007738 6440474 8287020
40413 8287020 11362930 14778153 16455763 15779984 14009400 11842396 8583144 4428828
40405 4428828 1622428 2041400 4943903 8170071 10338818 10913798 9658475 7506040
40397 7506040 6664886 8074502 9652020 8812913 5869374 2898963 33787 -4309689
40389 -4309689 -9346964 -11161746 -7634619 -1955386 1010581 587282 47665 1033364 1099966
40380 1099966 -2211370 -7127988 -9538534 -8190393 -5872576 -5441169 -6606163 -7284752
40372 -7284752 -6365131 -3817003 480590 5881201 9486538 7993028 1701012 -5137658
40364 -5137658 -8925038 -10075138 -10605095 -10213644 -7128066 -1985406 2065244 3664536
40356 3664536 5096550 8333547 11116635 9345000 2776125 -3985415 -6652549 -5657316
40348 -5657316 -4470451 -4937554 -5891213 -5856243 -5274047 -5401142 -6159736 -6209626 -4871233
40339 -4871233 -3048323 -2057490 -2178007 -2844484 -3991538 -6423113 -10340870 -13951895 -14668150
40330 -14668150 -12104013 -8801074 -6958616 -5465326 -1990920 2615466 4767657 3458622
40322 3458622 2102147 3443865 5630560 6133482 6747659 10208461 13471976 10241319
40314 10241319 877461 -5992702 -4495737 562371 664903 -5119934 -10509449 -11309211
40306 -11309211 -9122601 -6618114 -4192725 -1909130 -479154 943737 4527890 9850172
40298 9850172 12989002 11020927 5298620 -728252 -4713351 -5654695 -3683153 -1022168
40290 -1022168 -717559 -2820840 -4012053 -2480464 -750039 -1782412 -4629947 -6265323
40282 -6265323 -5738499 -4122877 -2206190 -865450 -2013246 -6144131 -10166990 -10760701
40274 -10760701 -9009509 -8606171 -10122237 -10462987 -8002812 -4958089 -3961276 -4942700 -6242452
40265 -6242452 -6668395 -5790237 -4099943 -3349347 -4918092 -7574710 -8669113 -7570539 -5913476
40256 -5913476 -4629954 -3258268 -2151400 -2355180 -2839574 -1069601 2660333 4637260
40248 4637260 2937293 229402 -370281 693845 1654208 2719020 4357957 4788009 2445091
40239 2445091 -782645 -2047352 -1943438 -3132345 -5511659 -6212414 -4234530 -1976033
40231 -1976033 -1779865 -3370030 -5029093 -5304827 -3454892 -122939 2398530 2337706 684507
40222 684507 -410828 -767231 -1441559 -1599226 846253 5419654 8968358 9956901 10018013
40213 10018013 10358352 9547199 6413624 2648719 554246 -34795 -734533 -1891985 -2584989
40204 -2584989 -2313694 -1280612 117569 999195 326583 -1359588 -1817242 -107148 1449938
40195 1449938 83 -3937908 -7013793 -7145912 -5527377 -4526871 -4902228 -5592135 -5638018
40186 -5638018 -5633771 -6824679 -8752483 -8883729 -5815197 -2017423 -1215724 -3129172 -3460918
40177 -3460918 51417 4228347 4744629 1586162 -1937127 -3778617 -4121368 -2999965
40169 -2999965 16445 3828671 5877450 4692178 1065278 -3161164 -6202540 -6717241
40161 -6717241 -4692569 -1763452 572381 2491685 4357642 4862040 2761775 -346808
40153 -346808 -1501834 -301126 1113704 1674839 2045739 1573433 -1906198 -7956096 -12369683
40144 -12369683 -12184584 -9491061 -7971396 -7621491 -5606011 -1120972 3411793 5628986
40136 5628986 5333668 3332453 263122 -2985952 -5220969 -5859585 -5078604 -3133119 -523026
40127 -523026 1543797 2384501 3468541 7002910 12391632 15833960 14511364 9906438
40119 9906438 5776841 3907150 3301901 2732298 2171179 1793182 1355877 1046749 1511752
40110 1511752 2432949 2417244 1105829 85933 629384 1823821 2414205 3227046 5618862
40101 5618862 8288831 8243548 4941964 965931 -1751716 -3643895 -4706534 -3140924
40093 -3140924 1254361 5019601 5137893 3408335 3796112 6663428 8704942 7930224 5627304
40084 5627304 3558209 2179617 1892822 3268248 5375167 6212653 5397847 4341723 3495954
40075 3495954 1923047 86667 231900 2834966 5258914 5468431 4834862 5544885 7214340
40066 7214340 8024371 7724486 7607198 8469277 9995189 11261604 10981307 8563054 5715356
40057 5715356 5296621 7613716 9703156 9256110 7114904 4858955 2690039 1359075
40049 1359075 3056555 7691818 10954697 9275113 4616780 1252636 76729 -283428
40041 -283428 870332 4768274 8821553 9106518 6838471 7227221 11500677 15050426 14570134
40032 14570134 12310103 11530302 11984174 12087843 11949505 11968113 11473551 10723218 11263829
40023 11263829 12577395 11735397 8448509 6910007 9980739 14890909 17693534 18689118
40015 18689118 19941188 20635306 19346613 18492930 21499310 26724046 29045148 27165219
40007 27165219 24907274 25016599 25788252 24760437 22361451 20640297 20789457 22742823
39999 22742823 25245440 26090240 24397025 22614133 23893711 27586973 30002760 29661611
39991 29661611 28901094 29970116 32532508 35620437 38970124 41434924 41071852 38216371
39983 38216371 35914570 35949466 36845956 36985460 36939991 37188234 36438339 34421755 33798473
39974 33798473 36671823 41187492 44177959 45460882 46883132 48665217 49567829 49547746
39966 49547746 49395758 48603076 46452117 44609024 45687025 49471421 53430979 56937826
39958 56937826 61913331 68679651 74088210 75170680 72624676 69359529 67213330 66382576
39950 66382576 66721182 68156326 70497279 73721956 77824184 81935656 84679983 86104366
39942 86104366 88150944 92186871 96898342 99790057 100312391 100424929 102223087 105912389
39934 105912389 110191514 113926915 117150432 120757327 125598392 131927304 139459170 147488908
39926 147488908 154859881 160505702 164642443 168951742 174772788 181478722 187675904 193752312
39918 193752312 201743833 212256909 222949085 231176810 237363619 244457493 254182947 264885861
39910 264885861 273363349 278138847 280506830 282767823 286027202 289697049 292517415 293534684
39902 293534684 292275281 288636948 282941057 275858129 268091230 260202735 252569332 245135796
39894 245135796 237465650 229677550 223007067 218309495 214088045 207570381 198197965 188406039
39886 188406039 180096236 172119236 162689347 152580437 143798105 136300632 128535768 120586601
39878 120586601 114184997 109717189 105659732 101130749 96671185 92260383 87002424 81309253
39870 81309253 76985713 74408126 71957108 69000350 66827657 65601441 63366555 59830339
39862 59830339 58068991 59782650 61465285 58812168 53197388 49811731 50087843 50054538
39854 50054538 46646772 41952370 39705944 40300586 41241473 40896582 39897079 39516891 40043781
39845 40043781 40672138 40491210 39697831 39646690 41032343 42336803 41305322 38059288 35450846
39836 35450846 35795675 38176635 39569407 38080925 34688748 32102941 31975373 33049909
39828 33049909 32555634 29857507 27737426 28941675 32484415 35186016 36136461 37151620
39820 37151620 38825156 38993226 36253326 32638672 30961694 31042283 30512710 28433338 26210217
39811 26210217 25317483 25834825 27337260 29787692 32889247 35280373 35225033 32361297 28519231
39802 28519231 26193207 25891675 25703743 24196221 22787379 23701185 26195280 27070918 25100474
39793 25100474 22585371 21738901 21894811 21687737 21716032 22892277 23885795 22797902 20366182
39784 20366182 18890521 18512612 17233714 14655305 13132774 14542901 17906432 20979007
39776 20979007 22527502 22333616 20622597 18433384 17102711 16364355 14311721 10397295
39768 10397295 7120865 7122433 9504616 10904239 9900678 8517330 9113644 11484840 13863247
39759 13863247 15470977 16708827 17416410 16570795 14120253 11944508 11940157 13491462 13882392
39750 13882392 11511275 8043119 6858594 9601398 14601726 18533237 19319688 17558086
39742 17558086 15469714 14620195 14675453 14328199 13052084 11454006 10146026 9164362 8669523
39733 8669523 9209588 10662128 11743609 11455915 10449270 10034923 10382321 10799663 11335224
39724 11335224 12600620 14010295 13855852 11797944 9947277 10376524 12363785 13248909
39716 13248909 11606643 8514164 5922781 4948828 5890002 8654390 12282230 14696023
39708 14696023 14128861 11054439 8033396 7266518 8711024 10939999 13249463 16001729
39700 16001729 19027888 20889880 20413092 18243022 15948036 13901917 11176997 7716604
39692 7716604 5407362 5930173 8018701 8242971 5001180 713895 -926144 781447
39684 781447 3418911 5264872 7137443 9638696 10718930 8135392 3184280 -532723
39676 -532723 -1644444 -1681776 -1245273 1238841 5693547 8405733 6426413 2060427 171860
39667 171860 2053590 4653607 5278531 4243909 2781108 1032707 -968579 -2328545
39659 -2328545 -2469917 -2059366 -1875899 -1645096 -619806 1384292 3869135 5926914 6619679
39650 6619679 5861603 4738551 4062812 3165497 1533941 950889 3640286 8177535 9883841
39641 9883841 6395252 792615 -2068447 -527410 3842270 9035329 13310724 14629334
39633 14629334 12128801 7864079 4991384 4239650 3816860 2588312 1417717 1116853
39625 1116853 945935 10835 -1157662 -1452322 -851288 -286283 -247068 -353280 -234354
39616 -234354 -111548 -198734 62413 1561117 4173419 6371549 6708031 5495416 4442745
39607 4442745 4681171 5687236 6104441 5120928 3276768 2582562 5309738 11329380 16896917
39598 16896917 17908787 14761221 12149519 13278442 16183276 17051292 15250195 13028869
39590 13028869 11678143 10568581 9400125 8819750 8672167 7894687 6729672 7185556 10416382
39581 10416382 14897553 17901801 17826995 14767781 10084479 5967333 4173353 4394925
39573 4394925 4803043 4719456 5491627 7948947 10534071 11524450 11939412 13981490 16876083
39564 16876083 16842312 12225462 6641442 5047893 7621209 9710854 7808148 3391930
39556 3391930 152457 -493960 519830 2672471 6101429 9495022 10360943 8124907
39548 8124907 5180232 4127038 5455378 8402681 12077791 14728734 14083384 10321278
39540 10321278 7145383 7733868 10666291 12013809 10609174 8824055 8528372 8845393
39532 8845393 8212676 6512283 4563156 3149623 2950692 3868478 4211110 2354449 -433368
39523 -433368 -896666 1679390 3925899 2789148 -186762 -809219 2422921 6595858 7612864
39514 7612864 3917090 -2617834 -8261455 -9981251 -7547676 -3498419 -688875 149898
39506 149898 378665 1520541 3851827 6597367 8944879 10719045 12095818 12747502 11827413
39497 11827413 9372147 7205982 7346268 9565225 11630024 12036435 11311031 10388771 9113313
39488 9113313 7061995 4729964 3035777 2498748 3587656 6788839 11209979 14012754
39480 14012754 12869747 9014930 6611799 8552916 13435357 17167725 17326568 15340450
39472 15340450 14141721 14365028 14076563 12267547 10817607 11781554 14182753 15413148
39464 15413148 14872498 13994614 13297631 12001821 10329865 9292398 8064908 4874405
39456 4874405 1161952 1089500 5211035 8428662 7051890 4492661 6076954 10775627
39448 10775627 12818739 10247715 6894572 5844833 5713849 4691823 4181023 6066224
39440 6066224 9113112 10525157 9454519 7048526 4275656 1422288 -1106273 -2885909
39432 -2885909 -3854585 -3785220 -2127508 938149 4135607 6410949 7737171 8149892 7249143
39423 7249143 5495748 4754273 6273215 8863919 10242605 9684370 8375593 7617095 7696818
39414 7696818 8280965 8990077 9574301 10074191 10746261 11502541 11719674 11019823 9956492
39405 9956492 9455769 9696970 9871250 9014110 6989074 4741847 3496951 3579817 4414885
39396 4414885 5947973 9121323 13798447 17062291 15748361 10950190 7822997 9663446
39388 9663446 13753063 14680802 10738422 5231960 2045051 1943684 3493291 5697850
39380 5697850 8400134 10863952 11531398 9761532 7163344 6251145 7551386 8802826
39372 8802826 7731737 5088976 3807795 5228333 7454959 7948142 6682136 5887601
39364 5887601 7258395 10208822 12629848 12793498 10607032 7309715 4031716 978109
39356 978109 -1690486 -3004175 -2412234 -1313501 -1563118 -2514376 -1704243 1070811 2903995
39347 2903995 2294272 1947298 4755522 9016630 10706332 9283336 7792606 7577500 6549901
39338 6549901 3402365 175431 -923985 -565846 -250478 531311 2784684 5330466 6211693
39329 6211693 5812358 6104349 7390269 8346251 9104208 11463996 15294545 17213003 14446154
39320 14446154 8508699 3452464 1355515 931643 -21186 -2149703 -4280036 -4619885
39312 -4619885 -2436116 732442 2003902 150678 -2887316 -4496827 -4670045 -5260572
39304 -5260572 -6520206 -6591394 -4768566 -3002722 -2962295 -3399032 -2171628 314328 1718891
39295 1718891 1319367 913236 1952279 3515458 3996135 3702996 4535923 7184731 9643377
39286 9643377 9297495 6366339 4129098 4780176 5989874 3588645 -2399710 -6967002
39278 -6967002 -6390978 -2709835 132452 2194872 6157505 11304680 13150948 9741129
39270 9741129 4835850 3204114 5180378 7610236 8340710 7946033 8153368 10069957 13260749
39261 13260749 15665152 15234312 12202565 8647779 5489333 1646736 -3097525 -6397028
39253 -6397028 -5949213 -2392425 1667455 4155564 3995886 999125 -2929276 -4074406
39245 -4074406 -607947 4865439 8138864 7744218 4938069 984324 -3130711 -5410863
39237 -5410863 -4145640 -389482 2946648 4301465 4108784 3028531 1653079 1245925
39229 1245925 2336401 3057429 1383916 -1386797 -2084850 -287461 1490618 2103869 2813309
39220 2813309 3544247 1934901 -2242811 -5037013 -3131556 1586861 4650972 4435155
39212 4435155 2667769 996412 -427072 -1557968 -1816889 -927549 748516 2607687
39204 2607687 3965096 4305637 3704458 2335790 -225006 -3808027 -6114443 -4782358
39196 -4782358 -1206638 680443 320572 1717636 6767576 11027453 9512032 3912900
39188 3912900 -71380 -656115 -654138 -1433544 -1406245 -767855 -2494795 -6776674 -8865269
39179 -8865269 -5448960 -57936 1320721 -1820537 -4411581 -2980841 244326 976462
39171 976462 -1658318 -4617723 -4932267 -2810782 -570059 573954 1398111 2209731 1135074
39162 1135074 -3457978 -9521492 -12446319 -9952747 -4213125 1276032 5129517 7640858
39154 7640858 8870999 8817443 8410760 8711444 9547346 10041250 9929485 9311412 7769773
39145 7769773 5069532 2325405 1043265 994638 275021 -2284334 -5691660 -7970157 -7908075
39136 -7908075 -5475003 -1503292 2486909 4904046 5352236 5053988 5445689 6519896 7064983
39127 7064983 6337337 4745893 2849704 694961 -1207740 -1194306 1818155 6089037 8204288
39118 8204288 7055812 5218255 5308034 6293193 5067120 828854 -4074455 -7279796 -8205923
39109 -8205923 -6675187 -2290030 3682084 7824326 7748897 4755722 1999138 981794
39101 981794 1129317 1647543 1934935 850526 -2300221 -5990203 -7432341 -5671011 -2389950
39092 -2389950 529432 2744484 4340688 4667739 3469378 2206528 2961914 6231444
39084 6231444 10470271 13531398 14085721 12152025 8989727 6302576 5022256 4961729 5768069
39075 5768069 7507117 9727546 10747728 9127039 5679628 2755744 1277202 -267462
39067 -267462 -3195774 -6173461 -6771007 -4988190 -3519280 -4050019 -4721168 -2472303 2855260
39058 2855260 8246764 11239002 12356018 13245980 13856623 12953624 10774673 9291596 9468765
39049 9468765 9794075 8493577 6124038 4642254 4504489 4274961 3105785 1958743 1700540
39040 1700540 1395941 -236763 -2496179 -3302656 -1925173 170868 1240608 925094 -18030
39031 -18030 -400813 1142034 5078936 9525719 11350509 9829358 7934324 8600142 10867493
39022 10867493 11585258 10100923 8857046 9358876 10019526 8855089 6354578 4452555
39014 4452555 4116903 5206539 7419324 9876483 10719124 8775090 5201323 2154345
39006 2154345 327977 -795777 -809482 1558750 6068926 10460398 13087758 14741755
38998 14741755 16866904 18930138 18815443 15612688 11098475 8244821 8519441 10596877
38990 10596877 11611975 9926448 6800485 5047232 5975745 8194305 9658153 10106443
38982 10106443 10634727 11353414 10886864 8696939 6795386 7886963 12003354 16141074
38974 16141074 17516892 16168550 13831832 11475193 9257102 8080492 9126962 11599796
38966 11599796 12842704 11732331 10548157 12055290 15600148 17698926 16259678 12837345
38958 12837345 10580939 11059623 13484245 16246739 18543098 20507488 22093895 22476649
38950 22476649 21275328 20001837 20833252 23590786 25556147 25210970 24503963 25932642
38942 25932642 28956351 31357968 32807309 34393266 35447089 33983202 30331842 27306030
38934 27306030 26207061 25469331 23989745 22832622 22428071 21101822 18293947 16558182
38926 16558182 17920798 20344115 20428454 18069947 15925151 15582898 16705442 18632503
38918 18632503 20182120 19073854 14563647 9894921 9094605 11803958 14312882 15245274
38910 15245274 16605697 18974447 19617452 16851035 13039810 11135466 10581910 8921482
38902 8921482 5913789 3896759 4796774 8328668 12735388 16336489 18629346 20162111
38894 20162111 20948190 19671220 15870592 12133730 11652739 13812513 15172978 15056100
38886 15056100 16459124 20157720 21944007 18587637 13394024 12138626 15365420 18322865
38878 18322865 17410628 13402807 9109889 7041058 8849596 13915819 18524297 19214271
38870 19214271 16981710 15740046 16939276 18489692 18857389 19080960 20186955 21399294
38862 21399294 21757406 21269377 19924404 17768808 16221918 16784920 18171312 17668230 15904903
38853 15904903 16894072 22080894 27719617 30046803 29887343 29726250 29250551 27059381 24526832
38844 24526832 24219787 25647166 26041708 24768373 23750130 23741202 23335834 22110904 21996894
38835 21996894 24490447 28348348 30962163 30818288 28239547 25004055 23555610 25260597
38827 25260597 28896405 31731951 32312837 31364218 30057904 28581602 26675228 24655766
38819 24655766 23536282 24400691 27260166 30095678 30097276 27069146 24556672 25675435 28457821
38810 28457821 27803396 22291416 16687841 16653134 22645148 30165484 34618531 34589033 31421500
38801 31421500 27437443 24708476 24314138 25828041 27445956 27179783 24657574 21749654
38793 21749654 20567415 20739548 20040047 18248869 18379088 22310612 26879859 26985773 21827622
38784 21827622 15372427 11100108 9272986 9281175 11048713 13047748 12315458 8520787 5554917
38775 5554917 6871957 11106568 14411825 15504500 16144220 17804559 20063593 21640283
38767 21640283 21449916 19441215 17541765 18274221 20941948 21159479 16523350 10969662
38759 10969662 10379257 14945738 19298115 19686855 17428732 15042136 12768706 10303245
38751 10303245 8945564 10083221 13377144 17706929 21985766 23984502 20905473 13229051
38743 13229051 6121359 4562202 8015745 11821250 12794354 11398819 9356121 7632394
38735 7632394 6609678 6045250 4716006 1918599 -701520 -823401 933119 1389158 -555660
38726 -555660 -2130616 -949464 1205680 1136423 -794325 -1302624 721934 2690090 2341451
38717 2341451 740807 135741 906450 2142983 3525024 4737294 4359371 1679017 -1066297
38708 -1066297 -761062 2294126 4635690 4737893 5347074 9198262 14291200 15684458 11393173
38699 11393173 4642911 190827 -330854 860887 809962 -796075 -1371399 1287322 5774805
38690 5774805 8145569 6438306 2948522 1369979 2856963 5790366 8172719 8917036
38682 8917036 7785578 5683603 4468149 5062647 6281603 6728447 6880852 7591955 7610146
38673 7610146 5168834 1708014 1150255 4844079 9594459 11665496 10759370 9027637
38665 9027637 8054592 8184046 9338260 10987300 12136541 12342544 12020834 11350546 10121239
38656 10121239 8996252 9095596 9619767 8097483 4331979 1825851 3226133 6343924
38648 6343924 7346676 6371936 6786767 9639529 12278379 12671451 11930407 11617875 11210449
38639 11210449 9655669 7496302 5970936 5365493 5405004 5973650 6381178 5325373 2891370
38630 2891370 1274055 1938346 3217405 2704905 1254345 2134237 6051676 9429171 8793522
38621 8793522 5148360 2329324 2089364 2860720 3139005 3803007 6066652 8767391 9453927
38612 9453927 7601237 5153545 4015639 4489631 6192730 8727837 10852030 10748555
38604 10748555 8341416 5983461 5439751 5411468 3829942 1620016 1867663 5445518 9678560
38595 9678560 11665563 10990084 8694038 5606207 2682627 1280846 1728191 2722892 3246114
38586 3246114 3959124 5600687 7204602 7346980 6193520 4730768 2795379 -278356
38578 -278356 -3567826 -5223036 -5246241 -5577247 -7000850 -8012784 -7667890 -7546128 -9169723
38569 -9169723 -10879609 -9569706 -5137710 -1055254 -205807 -1992983 -4254264 -6246719
38561 -6246719 -8300786 -9734983 -9050945 -5965746 -1733040 2430379 5704785 6631296
38553 6631296 4008474 -304149 -1740082 1792795 6465116 6674010 2021617 -2393019
38545 -2393019 -2670813 -408331 613731 -390665 -1167953 -57685 2322447 4336429
38537 4336429 4623860 2546669 -1187975 -4517095 -5778318 -5251242 -4061384 -2339669
38529 -2339669 -2552 1350103 -313491 -4004582 -5799405 -3508621 463665 2346480
38521 2346480 1688434 1028332 1834965 3005689 3365597 3490944 4150424 4478848 3146246
38512 3146246 715533 -527352 843806 3860194 6382395 7212707 6778262 6300902 6645167
38503 6645167 7566364 7745693 5965884 2636669 -306793 -1546546 -1857513 -2575095 -3165686
38494 -3165686 -1875030 1155708 3294619 2885812 1704595 2349653 4347280 5013292 3775431
38485 3775431 3225549 5327959 8618407 10276228 9458349 7279400 4702573 2052584
38477 2052584 -58795 -969575 -1038832 -1228431 -1559647 -982684 1120304 4095878 6719018
38468 6719018 8074338 7865859 6585074 5274717 4493303 3814450 3028622 3105285 4597233
38459 4597233 5642163 3568907 -1277075 -5282147 -5891661 -4468655 -3830662 -4561622 -5157065
38450 -5157065 -4513776 -2664022 28994 2809444 4338887 4024410 2964288 2378557 2032127
38441 2032127 1573933 2068100 4083234 5519067 4177366 1734790 1830615 4391699 5629816
38432 5629816 4268521 3666315 6057282 8677695 8455265 7147182 8091616 10368568 10449497
38423 10449497 8121614 6338394 5824794 4263585 1045263 -1393954 -1861304 -2137055
38415 -2137055 -3018322 -2322977 1010472 3906168 2875753 -1425731 -5817584 -8800559
38407 -8800559 -10510563 -10206144 -7103907 -3159514 -1955696 -4338071 -7185314 -7024154
38399 -7024154 -3411739 1578122 5830708 8517290 9815130 10053534 9170742 6977991
38391 6977991 3747727 58637 -3702002 -6802827 -7536030 -4820692 -545402 1742174
38383 1742174 1063143 -240300 -643049 -1422120 -3021008 -2856888 247573 2383866 -482058
38374 -482058 -5698419 -6846166 -2835311 735895 -281210 -3664849 -5300525 -4439598
38366 -4439598 -2487984 46014 3006025 5469299 7209129 9143977 10778507 9729638
38358 9729638 5641770 1975122 1657034 3338430 4339857 4807656 6004125 6822624 5740039
38349 5740039 4635262 6471291 9738820 9413551 4045066 -1651903 -2583124 934627
38341 934627 4502123 4734814 1614918 -2814227 -6579408 -8979482 -10372649 -10839954 -9531940
38332 -9531940 -5922742 -1001627 3734816 7683594 10445777 10930235 8858299 6047904
38324 6047904 4033330 1423473 -3651804 -9208936 -10960103 -8379834 -5723606 -5966717
38316 -5966717 -6955958 -5244443 -894727 3709811 7444326 10176080 10643762 7685318
38308 7685318 3075919 487383 1283842 3138494 3263257 1646965 420130 868010 2030352
38299 2030352 2319816 1777151 1732014 2254635 1613187 -537130 -1106318 2743516 8626460
38290 8626460 10829802 7546529 3114228 1934097 3121661 3093741 997636 -923873
38282 -923873 -834232 1145214 3919757 6135180 6765600 6364800 6627054 7611655 7199271
38273 7199271 4845588 3688217 6451398 10965563 12632815 10246394 6584424 4145881
38265 4145881 3199084 3430398 4522896 5256929 4744969 4460370 6441275 9607048 10588527
38256 10588527 8324008 5194419 3421905 2973248 3253765 4099391 4548249 3219259 534387
38247 534387 -1745933 -3401317 -5494276 -7202806 -6363130 -3804248 -3280350 -5553572 -6303635
38238 -6303635 -2283678 3712370 6874277 6653933 5896016 5863410 5506523 4316521 2744121
38229 2744121 598188 -2266468 -4370367 -4189422 -2693199 -2030865 -2299724 -1824698 -92835
38220 -92835 1742068 2830748 3128258 2417023 725997 -770293 -984449 -335615 664183
38211 664183 2922748 6606489 8827195 6576436 1359477 -2245601 -2501640 -1878448 -2389593
38202 -2389593 -2905282 -2057383 -884771 -998159 -2070034 -2525802 -1426759 1024567 3475117
38193 3475117 3644286 347605 -4306912 -6587043 -5383423 -2899757 -960384 852965
38185 852965 2778183 3449555 2387978 1543388 2520390 4085666 4194851 2905723 1536640
38176 1536640 389745 -850030 -1669002 -1579822 -1581848 -3030169 -5542824 -7331424 -7119603
38167 -7119603 -4867985 -1490501 1251967 1711363 285395 -717648 -121234 637855 244290
38158 244290 -47608 1461711 3899878 5268313 5820111 7355048 9552917 9641620 6150966
38149 6150966 1095510 -2179295 -2137249 136077 2154186 2002592 43638 -1410277 -796847
38140 -796847 885810 1788033 1734704 1687106 1662078 1051666 417672 915001 2088505 2196141
38130 2196141 862854 -310454 -84446 830263 685968 -1846207 -6762626 -11944527 -13907761
38121 -13907761 -11155210 -6392186 -3513646 -2891490 -1933749 183301 1393204 588855
38113 588855 -640984 -1171395 -2249104 -4629960 -6399930 -5638020 -3190099 -822681 1499721
38104 1499721 4407456 6947648 7967744 8301033 9175150 9577618 7688862 4043973 725846
38095 725846 -1821889 -4345558 -5618929 -3070653 2853895 7967143 9252060 8138651
38087 8138651 7495809 7633739 7294324 6807534 7577873 9088922 8994176 6461904 3373764
38078 3373764 1471701 52246 -2195869 -4255803 -3570965 303633 4479622 5872818
38070 5872818 4529699 2912002 2597372 2926285 2731781 2123520 2144344 3481529 5923492
38061 5923492 8430403 9426417 7821547 4320787 1104740 -387732 -811956 -1460381 -2124339
38052 -2124339 -1422652 986388 3583692 4607486 3774653 2043515 202230 -1696379
38044 -1696379 -3573265 -4685531 -4399913 -3475574 -3634632 -5294150 -6544608 -5481365 -3067085
38035 -3067085 -2213631 -3988087 -6203616 -6162625 -3453885 418845 3642385 4538699 2097135
38026 2097135 -2409660 -5449520 -4601885 -1484089 -156 -1994293 -5668931 -7835436
38018 -7835436 -6701399 -2964445 758416 2025565 1004816 180845 829194 973687 -1757804
38009 -1757804 -6437537 -9860164 -10304713 -8214535 -4116927 1390053 5970417 6938832
38001 6938832 4816955 2943757 2986153 3337106 2501779 1136347 -334539 -2907374 -5832837
37992 -5832837 -5322108 425506 6863351 7401202 1535454 -4404609 -4815985 -672312 2688528
37983 2688528 1684841 -2392335 -5206142 -3731275 633265 3341177 1601271 -2622952
37975 -2622952 -5364301 -5329748 -4147271 -2843723 -759453 1689131 1866882 -1728407 -6479642
37966 -6479642 -8072155 -5549485 -2259547 -1491217 -2631129 -2713295 -884594 555240 -45736
37957 -45736 -773183 1237910 5406297 8365836 8758214 8598950 9357782 9736153 8873113
37948 8873113 8802061 11146935 13716095 13505975 11267635 9516928 7461818 2334763 -4587167
37939 -4587167 -8079382 -6146980 -2870142 -2201898 -2630292 -664234 3243155 5415364
37931 5415364 4018520 804979 -1195600 116145 4739104 9865449 11738509 9969448
37923 9969448 8492691 10422750 13800674 14756926 12982215 10955259 9194162 6091994
37915 6091994 2075754 39066 862746 1653402 -277679 -3976111 -6538815 -6394184 -3955904
37906 -3955904 -749871 1145109 293732 -2547992 -5252682 -7070819 -8999360 -11039664
37898 -11039664 -11187348 -8304502 -4312748 -2109500 -2430965 -3938034 -5331604 -6157979
37890 -6157979 -6307847 -5850817 -5026451 -3941162 -2803381 -2357980 -2870500 -2824507 -593181
37881 -593181 2303508 2129586 -1757755 -5103564 -4221462 -1009259 154035 -1210885 -1757540
37872 -1757540 -102424 976394 -1162821 -5155542 -7361638 -5985689 -2484300 193104
37864 193104 165088 -1862778 -3360362 -2800949 -1453913 -1457184 -2609039 -2609251 -432796 2225119
37854 2225119 3344926 3005818 2637741 2833531 2775157 1467914 -914613 -2863809 -2945206
37845 -2945206 -1666504 -1241594 -2724047 -4308622 -3901052 -2510045 -2898660 -5126665 -6095968
37836 -6095968 -4268917 -2369783 -3796619 -8091648 -11861211 -13117012 -12807961 -12561968
37828 -12561968 -12716224 -12734665 -12303619 -11519933 -10475878 -8900440 -6295330 -2883191 -391541
37819 -391541 -803726 -3695909 -5848608 -4631525 -1136811 1287058 1221838 474641 1126094
37810 1126094 2729277 3211411 1686135 -630058 -2003754 -1763340 -265919 1709729
37802 1709729 2912676 1739104 -2353721 -7556573 -10906812 -10984717 -8481517 -4288921
37794 -4288921 1026916 5373857 5539852 1592781 -1406671 651388 4712241 4270293
37786 4270293 -1243919 -5451877 -4189161 -763316 343094 470273 3329436 7652619
37778 7652619 8406350 4302779 -510900 -2348001 -1652401 -207790 1700966 4005548
37770 4005548 5603248 6059649 6514674 7414881 7115399 4303297 443845 -1739779 -1307181
37761 -1307181 619383 2713477 4265453 4776462 4074313 2731785 1560376 854993 678712
37752 678712 1437142 3347681 5533412 6493806 5715625 4385970 4208759 5592469 7202261
37743 7202261 7444324 6306127 5374886 5899851 7252326 7656887 6154437 3502319 1395066
37734 1395066 1020312 1968678 2371912 767227 -1887322 -2967756 -1529497 130564 -754246
37725 -754246 -3874402 -6145594 -4995303 -545297 4638387 7133290 5257745 1361510
37717 1361510 173842 3253262 6627438 6123356 3289163 2696518 4509413 4091332 -638492
37708 -638492 -5733105 -6697321 -3951647 -742999 1480281 3137323 4213049 4487936 4565582
37699 4565582 4513632 2918753 -649358 -3726604 -3824205 -2041817 -1449468 -2696443 -3540915
37690 -3540915 -2258435 563358 3313331 4637491 3789299 1423833 -209022 642545
37682 642545 3208925 5397855 6289885 6185775 5235497 3711031 2672398 2518031 1871750
37673 1871750 -50941 -1135659 934636 4537626 5779811 4069143 2799598 4121930
37665 4121930 6171514 6421786 5005103 3496828 2863863 3913588 7402371 12055267
37657 12055267 14455432 12689172 8720063 5851497 5316589 6397533 7882612 7933409
37649 7933409 4717307 -689173 -3920851 -2379178 838900 852244 -2389812 -4662210
37641 -4662210 -4015402 -3074299 -4275057 -6290586 -6794788 -6092451 -5824400 -5839417 -4712933
37632 -4712933 -2512349 -920840 -827465 -1472555 -2005506 -2415603 -2597050 -1746320 561160
37623 561160 3316654 4792703 4212798 2463937 1276357 1806772 3869190 6399981 8563957
37614 8563957 10181143 11105548 10843765 9328090 7530277 6370001 5237659 2742356
37606 2742356 -968982 -3906951 -4723471 -4199933 -3430409 -1950449 753701 2949442 2152256
37597 2152256 -1174421 -3578407 -2807755 -173687 2070767 3836643 6230983 8911882
37589 8911882 10400908 10554690 10894530 12189944 12953446 11045740 6480620 2229918 1823342
37580 1823342 5638389 9819954 9884646 5470698 354162 -2309942 -2986124 -3447812 -3763257
37571 -3763257 -3296085 -2842999 -3339668 -3565828 -1792041 812310 1157376 -1228365 -3104587
37562 -3104587 -1567825 2801363 7416047 10354591 10761350 8448321 4390677 515267
37554 515267 -1966152 -3216526 -3425176 -2182340 86328 1497456 776996 -878560 -1177784
37545 -1177784 431174 2208110 2302525 966761 485447 2803320 7115314 10315910 10264581
37536 10264581 7862139 5278078 3427330 2569572 3856380 7720188 11539873 11944502
37528 11944502 9402997 7557014 7828344 8059706 7220036 7633401 10616358 13273392 12363323
37519 12363323 8862687 5896068 4194600 2521831 956894 748551 1998085 4077325
37511 4077325 7164143 10830453 12609402 11094856 9216201 10791714 14513049 15300283
37503 15300283 11660271 7660869 6761867 7551613 7254374 6062577 5630690 5899111 6133701
37494 6133701 7305049 10580635 14384962 15572920 13270307 9439916 5792317 2366468
37486 2366468 -398417 -492333 3046551 7476613 8442431 4930896 533421 -957418 243257
37477 243257 1432638 1788291 2787695 4664182 5453973 4506951 4188157 6203868 8420173
37468 8420173 7751439 4630575 1980578 934730 454010 364830 1462214 2611741 1085337
37459 1085337 -3331846 -7337559 -8447627 -7991671 -8246159 -8512756 -6070664 -154752 6691405
37450 6691405 11101786 11846880 10355440 8721173 7436680 5566254 3122581 1800288
37442 1800288 2364144 3021691 2363911 2346759 5405806 9587520 10196645 6267998 1691637
37433 1691637 -668373 -2066752 -3754185 -3735159 -180462 4960259 8533001 9964856
37425 9964856 9880131 7501391 2747718 -1109764 -798178 1891945 2057497 -1623752 -5555729
37416 -5555729 -6681102 -5971951 -5696474 -6055152 -5875956 -4625109 -2389066 698780 3884898
37407 3884898 5800394 6037238 5806445 6143148 6233009 4465099 723699 -3193407 -5362713
37398 -5362713 -5411896 -4357854 -3176608 -1962801 -581265 433734 385546 -363729 -630905
37389 -630905 25478 961466 1849533 3238395 5254188 6930018 7470531 7097157 6107376
37380 6107376 4475687 3099538 3723170 6319414 8114604 6916927 4130996 2548347
37372 2548347 2207396 710026 -2815019 -6241409 -7010703 -4562383 -230360 3827934
37364 3827934 5628161 4667606 2440954 881255 606289 1400185 3454293 6744579 9876135
37355 9876135 11047745 9797454 6822429 3050833 62815 -112440 2402242 4286678
37347 4286678 2957080 340864 -32099 1426590 1220197 -1307319 -2822181 -1313257
37339 -1313257 1130361 2089909 2138732 2750292 3623307 3976716 4328894 5130829 5346778
37330 5346778 4012315 1796641 -104314 -1056155 -243580 2868862 6193240 5788034 933201
37321 933201 -3802601 -3821308 25647 3418948 4072637 2575607 -469995 -4630728 -7621485
37312 -7621485 -6598192 -2007521 2334920 3671667 2955320 2585163 3207841 3558577 2412642
37303 2412642 35406 -1915690 -2015572 -977445 -1189142 -3447870 -5056058 -2662766 3451040
37294 3451040 9387193 11674022 10039261 6654017 4261389 4818362 8091792 11166966
37286 11166966 10808562 6939720 2845315 1590081 3112067 5029473 5256746 3392290
37278 3392290 437177 -2156933 -3530180 -3967246 -4356819 -5085690 -5634741 -5216253 -3736358
37269 -3736358 -2249146 -2169198 -3364195 -3351042 211578 5985073 9536908 8265884 4218739
37260 4218739 1010893 -292774 -689690 -462034 684076 1744902 1266529 -282619 -1193767
37251 -1193767 -1270877 -1730881 -2646015 -2877213 -2518924 -2836037 -3386225 -1858585 2202246
37242 2202246 5821553 6212479 4271016 2929403 3242712 3653785 2549831 371116 -703657
37233 -703657 1189153 5456122 8963165 8894822 5732709 2543438 1486731 2144477 3019931
37224 3019931 3124350 2073579 301532 -542494 1024404 4240666 6864522 8060653
37216 8060653 8750639 9047698 7618296 4213950 700760 -1334942 -2237987 -2923766 -3745259
37207 -3745259 -5123287 -7034055 -7460762 -4201096 990681 3348242 1573771 -98097
37199 -98097 1685647 4549844 4733063 2685766 702690 -1660987 -5147405 -6487766 -2170157
37190 -2170157 4875160 8123219 6593403 5437741 7099363 7906249 5126663 1719248
37182 1719248 1054529 1552932 276338 -1692600 -1459089 562364 1614252 1056851 283915
37173 283915 -712819 -3204364 -6476049 -7721462 -5497479 -1250636 2711669 5122483
37165 5122483 5707685 4827965 3349604 1891761 301764 -1557939 -3228224 -4549005
37157 -4549005 -6007274 -7186521 -6213045 -2249847 2550421 5176354 4903500 2902457
37149 2902457 115452 -2423528 -2455618 1447339 6935167 9535172 7579231 3670033
37141 3670033 1269983 1661460 4099105 6795926 7568513 5581175 2864074 2318651 4002994
37132 4002994 5299146 4919105 4468553 5461562 7075961 7888578 7868847 7559604 7098294
37123 7098294 7153397 8921164 11730046 12362923 8616642 2493178 -1740348 -1929283 659006
37114 659006 3371711 4222441 2815589 579074 -459595 33441 441260 -183744 -671163
37105 -671163 133248 1482121 2478070 4059018 7175672 10225190 10628208 8273578 5253434
37096 5253434 2728836 193604 -2558229 -4900078 -6639528 -7885879 -7950447 -6365515
37088 -6365515 -4558577 -4191208 -4195535 -2218624 998203 1833177 -956080 -4353889 -5771789
37079 -5771789 -6539879 -8641658 -10583065 -9325006 -4759490 438985 4440402 7217221
37071 7217221 8533227 7588171 4824003 2111771 777324 758247 1610067 2795643 3024218
37062 3024218 1194122 -1408606 -1532753 2183211 6755430 7723214 4321181 475987
37054 475987 96876 2384957 3154456 496593 -2878503 -3875221 -3505853 -4750429 -7222067
37045 -7222067 -7505042 -4964536 -3336752 -4827302 -6127790 -3349597 1581050 3288857
37037 3288857 518277 -2543617 -2434493 -409082 435727 -877847 -3262177 -5316588
37029 -5316588 -5724134 -3529686 725994 5017922 7486136 7360401 4793363 1501220
37021 1501220 941582 4978540 10057689 9886673 3213741 -3983645 -5887544 -3574332
37013 -3574332 -1802699 -1716230 -642729 1997815 2898490 -209495 -4933435 -7077422 -5359390
37004 -5359390 -1939478 632632 1800961 2833275 5051673 8147329 10149038 9309968
36996 9309968 5824280 1272387 -3121795 -6811304 -8939517 -8416585 -5345703 -1456935
36988 -1456935 1442879 3084045 4534063 6640699 8883334 9886212 9261017 8589931
36980 8589931 9641360 11632809 11774719 9198384 6647883 6813691 8457972 8277781 5611059
36971 5611059 2771911 1167006 -69787 -1260660 -893651 1598180 4047651 4254273
36963 4254273 2943065 2377149 3132009 3826374 3305251 1687326 -261090 -1662153 -1835750
36954 -1835750 -904894 350781 1689258 3519561 5330260 5465868 3491437 1229630
36946 1229630 -3239 -1543914 -4692677 -7434471 -6837845 -3958863 -2854699 -4436755
36938 -4436755 -4885296 -1577838 2624260 3474014 1451203 761402 3360874 6982150 8904122
36929 8904122 8936003 8082843 6543449 4274699 2088817 848835 309685 -263538 -949874
36920 -949874 -1564054 -2592944 -4543816 -6552154 -6953980 -5649907 -4787984 -6114359 -8210346
36911 -8210346 -7666394 -3216577 2430895 5668767 6102005 6344897 7947288 9074030 6969420
36902 6969420 1675499 -3873297 -7048116 -7672815 -7006132 -5776669 -3936406 -1841075
36894 -1841075 -759483 -1754154 -4119934 -5400644 -3593855 532696 3947106 4551887
36886 4551887 3238542 2187535 1984338 1657653 1035084 1254047 2626353 3648482 2997139
36877 2997139 1273999 -201241 -1240376 -2305165 -3197000 -3661350 -4534670 -6587140 -8570343
36868 -8570343 -8192304 -5127548 -1467752 1063868 2798055 4655901 6632582 8411558
36860 8411558 9906543 10256861 7889184 3048507 -946771 -758415 3215232 7555211
36852 7555211 9692557 9572935 8087767 5819014 3439833 1720128 755901 262086 475378
36843 475378 1431976 1776309 325712 -1270186 -50131 3425228 4656480 1337279 -2672166
36834 -2672166 -2098472 2906424 7774185 10053497 11101238 11356091 8161758 277803
36826 277803 -8241021 -11417781 -7649020 -814419 4214190 5658973 4966658 4443034 5030770
36817 5030770 5804756 5541273 4603840 4412704 4965706 4348490 1514110 -1819347 -3308703
36808 -3308703 -2989330 -2801051 -4017009 -6543692 -9816741 -12639228 -12927168 -9777754 -5538693
36799 -5538693 -3727430 -4876812 -6433441 -6727963 -6594831 -6579615 -5250267 -1742716 2114108
36790 2114108 4032485 4161969 4035231 3884227 2900086 1311573 261867 -87949 -780515
36781 -780515 -2499137 -4887454 -7118647 -8173352 -7101833 -4129702 -980502 999913
36773 999913 2397514 4235790 5817949 5766715 4620153 4351794 5317955 5607415 3856231
36764 3856231 1120457 -710852 -1194069 -1305366 -1799910 -2109530 -779341 2758765 6745247
36755 6745247 8384234 7118352 5293539 4684570 4247668 2967739 2637571 4850536 7105006
36746 7105006 5872229 2457934 1190261 2064454 554234 -4187202 -6550208 -2675928
36738 -2675928 3325221 5131965 2426439 -824103 -3168973 -5914561 -8534146 -8818734
36730 -8818734 -6953714 -5236469 -4020897 -1688351 1523740 3300275 3024667 2494867
36722 2494867 2534072 1840065 -379085 -3214927 -5781772 -7829100 -8705989 -8019416 -6981735
36713 -6981735 -6767372 -6342249 -4640800 -3590538 -5266399 -7182797 -5085612 -1267
36705 -1267 2666975 1353065 117832 1230315 1861320 263927 -633043 974723 1748958
36696 1748958 -1048501 -4598158 -5695879 -6338274 -9060060 -10854803 -7789892 -2552290
36688 -2552290 -924485 -2843236 -3487877 -1878947 -1637481 -3627963 -4604571 -3754993 -4174405
36679 -4174405 -6453445 -6778152 -3456305 75633 1188438 1992294 4474051 6291363
36671 6291363 4860224 1897032 385986 132010 -337779 -352842 953988 1867029 847983
36662 847983 -157068 1140004 2878770 1683896 -1660000 -3407964 -3028155 -3841262 -7159378
36653 -7159378 -9716875 -8270352 -3845564 245969 2592698 4092451 5239466 4758358
36645 4758358 1345237 -3684715 -6369702 -3936590 1285357 3581688 492454 -3993021
36637 -3993021 -4470711 -721734 2938011 3638545 2459296 1339361 353905 -1275828 -3443209
36628 -3443209 -5247623 -5742022 -4455425 -2201633 -987657 -1726633 -2575226 -1348923 885221
36619 885221 916591 -1939075 -4748611 -5030912 -3504306 -1849665 -113395 2001509 3049445
36610 3049445 1220825 -2818237 -6114310 -6370165 -3785677 -190076 2898398 5379603
36602 5379603 8069194 11072343 13007615 12565731 10515140 8911207 8271507 6963723
36594 6963723 3792624 -221828 -3287987 -4713954 -4550201 -2805752 -311765 714186
36586 714186 -1405085 -5611388 -8977404 -9571683 -7688089 -4737977 -2033441 -503937
36578 -503937 -516480 -1600674 -2722050 -2890126 -1425157 1866172 6272265 10278181 12637025
36569 12637025 13207749 12523100 11028564 9160381 7598416 6759345 6374255 6139072 6351217
36560 6351217 7157973 7559568 6237884 3512757 1538446 1997791 4112456 5626902 5639622
36551 5639622 5691979 7611795 10777387 12407906 10670611 6709129 3250622 1946679
36543 1946679 2494347 3386622 2732179 -592761 -5303840 -8083139 -7169125 -4812951 -4250135
36534 -4250135 -4967552 -3640732 345591 3491238 3206324 1220747 250642 -80496 -1544989
36525 -1544989 -3510092 -3714060 -1856869 185569 1274941 1907288 2422143 2255797 1003526
36516 1003526 -1077664 -3221313 -3731109 -640453 5328834 9627320 8250180 2754101
36508 2754101 -1528096 -1880728 -245561 737663 579585 -466198 -2364195 -3695719 -1955045
36499 -1955045 2900113 7389259 8616088 7623321 7268808 8619657 10892348 13046008
36491 13046008 13759851 11712770 7890608 5986690 8288342 12421572 14332789 13317549
36483 13317549 11825451 11435714 11722962 12417702 13778580 14826928 13857536 11087705 8538332
36474 8538332 6875472 4568332 764248 -3114957 -5425834 -6007105 -5019276 -2156651
36466 -2156651 1716536 4012154 3234271 1144474 559968 1996967 3970139 5556952
36458 5556952 6813463 7328250 6464224 5068779 5142202 7341324 10097825 11626398 11665497
36449 11665497 10779752 9069882 6343582 2856502 -778348 -3914569 -5711620 -5432981
36441 -5432981 -3600465 -2160703 -2521390 -3768307 -3815457 -2173553 -535581 -483530 -1616794
36432 -1616794 -2403089 -2081708 -1025714 350617 2294948 5221699 8699758 11019046
36424 11019046 10234821 6383823 2412429 1578392 3538861 4435648 1805640 -1954004
36416 -1954004 -2523593 982205 5481419 8053061 8351939 7135836 4992845 3128514
36408 3128514 2965178 3760679 2754283 -780246 -3587108 -2566914 689020 1967036
36400 1967036 131689 -1850751 -1373766 800243 2364867 2179067 410833 -2274703
36392 -2274703 -4626262 -5126501 -3502257 -1280845 -101253 50874 419956 1733917 3316423
36383 3316423 3766344 2501599 858526 1239184 4454785 8281093 9642769 7997439
36375 7997439 5386324 3298681 1087313 -2032527 -4874827 -5265849 -2533109 1705696
36367 1705696 4913398 5551472 4190350 2934390 3210532 4099816 3545347 1095401 -1570661
36358 -1570661 -2872082 -2907715 -2633129 -2736621 -3688527 -5545441 -7079766 -6403063 -3322403
36349 -3322403 -19647 1443256 1260074 669065 -251013 -2323351 -5511952 -8582943 -10161676
36340 -10161676 -9427840 -6443267 -2609285 -51419 486066 642804 2445686 5745659
36332 5745659 8403113 8523479 5812602 1372796 -2948314 -5503333 -6063482 -5929676 -6393635
36323 -6393635 -7446678 -8147422 -7544572 -5244916 -2222171 -964093 -2988561 -6058822
36315 -6058822 -6358293 -4107562 -3843998 -7439494 -10397647 -8242417 -3467418 -1755406
36307 -1755406 -3518593 -4439931 -3231476 -2832617 -3580686 -1557229 3977576 7149224 3324870
36298 3324870 -3717056 -6849095 -4924629 -2501197 -2228050 -2426684 -1713948 -1428400 -2611236
36289 -2611236 -4002117 -4291998 -3943659 -3683560 -3182605 -2305523 -1983852 -2668044 -3155761
36280 -3155761 -2112923 35431 1659510 1807249 802383 -558283 -1635436 -1971563
36272 -1971563 -1449907 -720682 -1008118 -2790846 -4632594 -4313740 -1861436 -390068 -2316955
36263 -2316955 -5499802 -5623345 -2395016 -167547 -1254330 -2129149 989559 5705315
36255 5705315 6701445 3864382 2437223 5038534 8061171 7416218 4111977 1906156
36247 1906156 2177446 3598094 4934414 5674923 5132238 3217044 1455210 1508439 3244175
36238 3244175 5487314 7660327 9311815 9329786 7515125 5820270 5782917 5594267 2386837
36229 2386837 -2910078 -6005347 -5032395 -2984114 -3044231 -4071596 -2953396 270027 2378386
36220 2378386 1559224 -508916 -1585765 -1893781 -3165044 -5921661 -9026679 -11442103
36212 -11442103 -13141251 -14076900 -13235049 -9563883 -3734932 1684017 4240435 3743053
36204 3743053 2246357 1887787 2728439 2648751 -471686 -6057903 -10344220 -9437666 -3567126
36195 -3567126 2359639 3586562 713898 -1210423 1085033 5415009 7560570 6801653
36187 6801653 6177142 7914099 10764828 12223701 11621445 10168861 9215493 9504117 11252331
36178 11252331 13858028 15989656 16775642 16422168 15084988 12150198 7810003 4375749
36170 4375749 4117353 6040488 6809787 5198026 3655314 4591526 6956066 8120959 7913181
36161 7913181 8677783 11548065 14492165 14643263 11546779 7512997 5255451 5488320 6479137
36152 6479137 5775812 2613003 -1347667 -3766689 -3799804 -2255517 -200182 1741110 3003214
36143 3003214 3144002 2548181 2224061 2547689 2937955 3180403 4263438 7065938 10603446
36134 10603446 12527884 11541865 8741930 6281859 5090066 4358012 3164020 1947437
36126 1947437 1843149 2822865 3393117 2564039 1425708 1899767 4196736 6534477 7509896
36117 7509896 7682252 8188663 8706282 8002723 6276716 5589561 7343144 10177168 11408030
36108 11408030 10382052 9382872 10828530 14310902 17170786 17710089 16958450 17039378 18435376
36099 18435376 19468676 18442415 15901640 14420677 15952844 19563652 22318001 22518254
36091 22518254 21296460 20533949 20272764 19539564 19052016 20988376 25621345 30043802 31389959
36082 31389959 30115902 28939688 29523676 31436933 33580930 35229149 36021939 36095798 36082126
36073 36082126 36379065 37017742 38713026 42684884 48305321 52529820 53673142 54438613
36065 54438613 58468054 64576304 67706316 65994002 63667836 65515048 70964582 75502811
36057 75502811 76178231 73794323 70848998 69118812 68660934 67879125 65048196 60581704
36049 60581704 57025556 56135391 56984592 57589478 57012592 55046067 51604030 47846754 46186620
36040 46186620 47253342 48217732 46211026 42209922 39254181 37952106 36502058 34392098
36032 34392098 32885783 31959232 30142194 28029587 28562823 32285949 35289245 34174489
36024 34174489 30867673 29775145 31518106 32445483 30086601 26421615 24995572 26498246
36016 26498246 28313582 27811537 25285218 23482048 24229093 25834818 24715533 19878688
36008 19878688 14696064 13405863 16802582 22378539 27529451 30848982 31150124 27917799
36000 27917799 23195990 20605539 21149429 21766075 19715517 16960193 17861217 23016130
35992 23016130 27821001 27704544 22964153 17527438 14445192 13932354 14799416 16002015
35984 16002015 16730673 16275370 14449953 11880901 9749914 9243318 10726176 13029771
35976 13029771 14105041 13025194 10863652 9001372 7438130 5890647 5583075 7930809
35968 7930809 11651918 13419270 11981529 9781188 9684028 11843685 14720739 17254834
35960 17254834 18548493 17253956 13441245 9832676 8799467 8853448 6572055 1736788
35952 1736788 -1941292 -1526708 1886160 5147427 6272081 4979835 2068581 -398561
35944 -398561 253231 4821689 10911007 15119061 16162339 15317782 14533864 14847722 16025179
35935 16025179 16878078 16123915 13445517 9714602 6301990 4497250 5035110 7104445
35927 7104445 8171972 6295719 2654628 285385 362213 1661028 3713998 7633535
35919 7633535 12760422 15587538 14321894 12000376 12047153 12719125 9813873 3941594 772041
35910 772041 3490419 8770341 11629646 11157514 9553205 8136081 6851350 6137569 6729854
35901 6729854 8136885 9017662 8637849 6886076 3844941 650053 -403464 1620839
35893 1620839 4555344 5771584 5791580 7094513 9839056 11339821 9965200 7030650
35885 7030650 4108828 869504 -3066807 -6096233 -6246079 -3673517 -107843 3170076
35877 3170076 5494801 6193211 5471742 4948766 5494125 5407889 2836604 -691545 -1680304
35868 -1680304 541317 3146149 4247495 4990456 6030932 5044862 329226 -5195684
35860 -5195684 -6773568 -3780858 627 1744262 2166315 2372469 1365845 -1481891
35852 -1481891 -3807417 -2765103 777806 3109974 2728372 2166043 3888119 6310623
35844 6310623 5788125 1708566 -2603838 -4317046 -4325921 -4819006 -5321506 -3489950 684357
35835 684357 4058041 4319440 2604040 1020536 -402135 -2523205 -4507830 -4896074 -4458586
35826 -4458586 -5409561 -7794753 -8992701 -7252061 -3720036 -350163 2281555 4193340
35818 4193340 4890619 4449517 4423833 6173077 8982126 10949539 11063832 9437097 6350518
35809 6350518 2425692 -690273 -1195524 1090304 4436397 6681481 6766733 5285027 3927056
35800 3927056 3864696 4365354 3762856 2060401 1259048 2335335 3425281 2491186 486210
35791 486210 -158877 729322 1369416 1750762 4118237 8930193 12932712 12908154 9515289
35782 9515289 5600747 2222320 -1393320 -4912049 -6613768 -6115302 -4980920 -4004750
35774 -4004750 -2078714 1099938 3256223 2423454 220984 -161205 1326885 1472138 -1383154
35765 -1383154 -4845208 -5717068 -3670907 -417460 2820901 5164750 5049432 1853848
35757 1853848 -2171009 -4006661 -3620230 -3323572 -3542172 -1975853 2240569 6014018 5558970
35748 5558970 788473 -4906713 -8247987 -8354155 -6401562 -4174756 -2523865 -702313
35740 -702313 2244217 5461565 6910639 6143483 4745256 3485438 1026759 -3383849
35732 -3383849 -7774170 -9590329 -8657156 -6586450 -4574102 -3226802 -3116951 -3745046 -3160462
35723 -3160462 -334723 3267573 6045904 8535245 11310254 12549933 10617821 7594587
35715 7594587 6778238 7576146 6686625 4011411 3181217 5574591 7926897 7397887 5344184
35706 5344184 3978780 2625772 149170 -1469331 577349 5293028 8588429 8206043
35698 8206043 5615893 3292592 2195293 2007453 2188372 2421176 2907274 4138656 5734696
35689 5734696 6120641 4358541 1714641 238292 225498 345335 13284 243030 1886891
35680 1886891 4083795 5066930 4158564 2518692 1732342 1703995 568608 -2616654 -5732239
35671 -5732239 -5714065 -2826225 -875755 -2344557 -5163442 -5832164 -4250698 -3394188 -4990332
35662 -4990332 -7707847 -9527552 -9930114 -9330036 -7961437 -6103822 -4362184 -2948033
35654 -2948033 -1300736 1017169 3538316 5483765 6711176 7490823 7538800 5986944 2660673
35645 2660673 -1002462 -2948113 -2482216 -705276 1101571 2641216 3791208 3952006
35637 3952006 3367006 3828714 6124755 7684630 5445105 892683 -840932 2336593
35629 2336593 6767259 8450864 8044254 8064991 7988161 5785772 2621817 1745890 2954228
35620 2954228 2188054 -2406704 -7335220 -8282745 -5288315 -1513050 1228794 3413589
35612 3413589 5303961 5899800 4589430 2242210 -4485 -2146786 -4697749 -7066138
35604 -7066138 -7605742 -5721218 -3106928 -1828225 -1589140 -453414 1619900 1969120 -973175
35595 -973175 -4845680 -6070981 -4173981 -1466859 547374 2105822 3048147 2363990 186737
35586 186737 -1883983 -2897962 -3141550 -2348124 436703 4377562 6369376 4466477 379158
35577 379158 -2693979 -3491316 -2801753 -1463915 227609 1913678 3371375 4927121 6767685
35568 6767685 8452150 9904068 11945220 14679106 16221103 14612291 10655916 7404023
35560 7404023 6865828 8356025 9875809 9762501 7090079 2257020 -2151605 -2738922 1009386
35551 1009386 5281323 5845103 3186722 2072914 5591848 11258660 14195909 12904673
35543 12904673 10045185 8164110 7120032 6198491 6245162 7961623 9797973 9809932 8663948
35534 8663948 8309537 8016392 4614307 -2453564 -8729235 -9220956 -4121682 1588650 3703779
35525 3703779 2582231 1592299 3031156 6005528 7822111 6994428 4676633 3105966
35517 3105966 3081907 3588181 3625179 3414193 3596156 4175883 4764982 5223686 5552207 5599414
35507 5599414 5300917 4889959 4627862 4603867 4802856 4931811 4318525 2734121 1344526
35498 1344526 1978290 5134236 9279764 12236603 12738892 10867308 7919064 5783648
35490 5783648 5352112 5512236 4812890 3904208 4673605 6943474 8216051 7395080 6440645
35481 6440645 6899586 6970462 4241894 -172349 -2776919 -2106330 486560 3794733 7639480
35472 7639480 10810584 11260959 9424966 8693700 10875996 13300925 12623162 9905649 9093701
35463 9093701 11031360 12073964 9384382 5089571 3538145 5997382 9896590 12354867
35455 12354867 12505048 10866571 8701013 8259767 11447888 17106067 21183783 20966850
35447 20966850 18072279 16056684 16197636 17142841 17687602 17875836 17775413 17226908 16946592
35438 16946592 18112981 20470141 22274532 22472943 21611950 20312720 18310245 15578086
35430 15578086 13167554 12254185 13203067 15870183 19797671 23832528 26673108 28176002
35422 28176002 29168898 29840871 29484724 27991729 26329985 25271688 24752755 24496266 24081977
35413 24081977 22794399 21078843 21541435 25961839 31459429 32701479 28509758 23237880
35405 23237880 20740820 20301828 19850541 19491623 19501524 18255367 15234668 13270068 14469157
35396 14469157 16445700 16171150 15099715 16211490 18015317 16536335 12276208 9982475
35388 9982475 11445624 13434440 13482158 13045413 13588786 13881016 13121670 12957901 14108540
35379 14108540 14290032 12073981 10022130 11144465 14273018 15665218 13775304 10164911
35371 10164911 6984442 5630976 6669616 9052574 10447245 10088322 10073545 12019460
35363 12019460 13935288 12856434 9472564 7310184 7761825 8816654 8944680 9401417
35355 9401417 11539309 14006123 14311223 12015209 8880588 6577624 5663828 6464352 9343768
35346 9343768 13568363 16944079 17569496 15762635 13656893 12993822 13786148 14923965 15338162
35337 15338162 14555188 12928697 11572718 11410983 12162917 12962520 13785838 14972853 15383523
35328 15383523 13006104 8109489 3776442 2093959 1797288 1238075 1457847 3917999
35320 3917999 7062656 8149458 7277108 6559194 6319842 5373571 4247960 4473498 5105000
35311 5105000 3888591 1884476 2656240 6167794 7838860 5159321 1217278 -299904
35303 -299904 138635 466213 815869 1964531 2964708 3296828 4900767 9142354 13877320
35294 13877320 16217938 16137241 14830339 11955680 7440294 3630318 2349094 1990651
35286 1990651 923245 1333496 5433236 9902412 9289322 4138752 571966 1611441
35278 1611441 3782489 3269110 1004891 -33521 1010947 3328129 6227959 8681880
$$ [...]
##END NTUPLES=NMR SPECTRUM
##END=
