##TITLE=31Pdec_DE-62_EA
 D2O, 64 sc
 19.7.2024
##JCAMPDX= 6.0         $$ Bruker NMR JCAMP-DX V2.0
##DATA TYPE= NMR SPECTRUM
##DATA CLASS= NTUPLES
##ORIGIN= UXNMR, Bruker Analytische Messtechnik GmbH
##OWNER= root
$$ XWIN-NMR		Version 3.5
$$ Fri Jul 19 14:04:46 2024 Russian Standard Time (UT+4h)  she@DPX200
##.OBSERVE FREQUENCY= 81.013821
##.OBSERVE NUCLEUS= ^31P
##.ACQUISITION MODE= SIMULTANEOUS
##.ACQUISITION SCHEME= undefined
##.AVERAGES= 64
##.DIGITISER RES= 17
##SPECTROMETER/DATA SYSTEM= spect
##.PULSE SEQUENCE= zgpg30
##.SOLVENT NAME= D2O
##.SHIFT REFERENCE= (INTERNAL, D2O, 0, 198.062)
##AUDIT TRAIL= $$ (NUMBER, WHEN, WHO, WHERE, WHAT)
$$ ##TITLE= Audit trail, XWIN-NMR		Version 3.5
$$ ##JCAMPDX= 5.01
$$ ##ORIGIN= Bruker BioSpin GmbH
$$ ##OWNER= she
$$ F:/spectra/data/she/nmr/P31/2/pdata/1/auditp.txt
$$ ##AUDIT TRAIL=  $$ (NUMBER, WHEN, WHO, WHERE, WHAT)
(   1,<2024-07-19 14:02:32.70 +0400>,<she>,<DPX200>,
      <created by zg, POWCHK disabled, PULCHK disabled
       configuration hash MD5:
       00 E9 B6 7A A2 85 ED C7 34 08 36 98 17 FE 4E 26
       data hash MD5: 32K
       08 83 9B C3 DE 14 9F 66 21 B9 EA C0 68 2C CE 58>)
(   2,<2024-07-19 14:02:35.68 +0400>,<she>,<DPX200>,
      <Start of raw data processing
       efp BC_mod = 2 LB = 1.5 FT_mod = 6 PKNL = 1 PHC0 = 2675.153 PHC1 = 16.88698 SI = 64K 
       data hash MD5: 64K
       7F 9C A9 ED AC D6 C1 5A E2 B4 6B 6D 92 6D 52 CB>)
(   3,<2024-07-19 14:02:53.45 +0400>,<she>,<DPX200>,
      <pk PHC0 = 10.71889 PHC1 = -13 
       data hash MD5: 64K
       2F 19 A9 D0 91 6D 61 F7 9A DD F9 D9 20 D8 C6 4F>)
(   4,<2024-07-19 14:02:59.70 +0400>,<she>,<DPX200>,
      <abs ABSG = 5 
       data hash MD5: 64K
       C7 22 D2 8B F9 18 C8 2C CE 93 A9 1A 8E 77 FF 4D>)
$$ ##END=
$$ 
$$ hash MD5
$$ CA 0B 99 70 BB 50 9A BB 9C 62 0E AC 54 08 43 7F
##$RELAX= 
##$RELAX= 
##$RELAX= 
##$RELAX= 
##$RELAX= 
##$RELAX= 
##$RELAX= 
##$RELAX= 
$$ Bruker specific parameters
$$ --------------------------
##$DU= <F:/spectra>
##$EXPNO= 2
##$NAME= <P31>
##$PROCNO= 1
##$TYPE= <nmr>
##$USER= <she>
##$AMP= (0..31)
100 100 100 100 100 100 100 100 100 100 100 100 100 100 100 100 100 100 
100 100 100 100 100 100 100 100 100 100 100 100 100 100 
##$AQSEQ= 0
##$AQ_mod= 1
##$AUNM= <au_zg>
##$AUTOPOS= <>
##$BF1= 81.014009
##$BF2= 200.13
##$BF3= 200.13
##$BF4= 200.13
##$BF5= 200.13
##$BF6= 200.13
##$BF7= 200.13
##$BF8= 200.13
##$BYTORDA= 1
##$CFDGTYP= 0
##$CFRGTYP= 5
##$CHEMSTR= <none>
##$CNST= (0..31)
1 1 145 1 1 1 1 1 1 1 1 1 1 1 1 1 1 1 1 1 1 1 1 1 1 1 1 1 1 1 1 1 
##$CPDPRG= <waltz16>
##$CPDPRG1= <>
##$CPDPRG2= <waltz16>
##$CPDPRG3= <>
##$CPDPRG4= <mlev>
##$CPDPRG5= <mlev>
##$CPDPRG6= <mlev>
##$CPDPRG7= <mlev>
##$CPDPRG8= <mlev>
##$CPDPRGB= <>
##$CPDPRGT= <>
##$D= (0..31)
0 1 0 0 0 0 0 0 0 0.06 0 0.03 2e-05 3e-06 0 0 0.0002 0 0 0 0 0 0 0 0 0 
0 0 0 0 0 0 
##$DATE= 1721383352
##$DBL= (0..7)
120 120 120 11 120 120 24 19 
##$DBP= (0..7)
150 150 150 150 150 150 150 150 
##$DBP07= 0
##$DBPNAM0= <>
##$DBPNAM1= <>
##$DBPNAM2= <>
$$ [...]
##$SUBNAM3= <"">
##$SUBNAM4= <"">
##$SUBNAM5= <"">
##$SUBNAM6= <"">
##$SUBNAM7= <"">
##$SUBNAM8= <"">
##$SUBNAM9= <"">
##$SW= 400.765351723535
##$SWIBOX= (0..15)
0 1 3 0 0 0 0 0 0 0 0 0 0 0 0 0 
##$SW_h= 32467.5324675325
##$TD= 32768
##$TD0= 1
##$TE= 0
##$TE2= 300
##$TE3= 300
##$TEG= 300
##$TL= (0..7)
0 120 53 12 22 120 120 120 
##$TP= (0..7)
150 150 150 150 150 150 150 150 
##$TP07= 0
##$TPNAME0= <>
##$TPNAME1= <>
##$TPNAME2= <>
##$TPNAME3= <>
##$TPNAME4= <>
##$TPNAME5= <>
##$TPNAME6= <>
##$TPNAME7= <>
##$TPOAL= (0..7)
0.5 0.5 0.5 0.5 0.5 0.5 0.5 0.5 
##$TPOFFS= (0..7)
0 0 0 0 0 0 0 0 
##$TUNHIN= 0
##$TUNHOUT= 0
##$TUNXOUT= 0
##$USERA1= <user>
##$USERA2= <user>
##$USERA3= <user>
##$USERA4= <user>
##$USERA5= <user>
##$V9= 5
##$VALIST= <valist>
##$VCLIST= <CCCCCCCCCCCCCCC>
##$VD= 0
##$VDLIST= <DDDDDDDDDDDDDDD>
##$VPLIST= <PPPPPPPPPPPPPPP>
##$VTLIST= <TTTTTTTTTTTTTTT>
##$WBST= 1024
##$WBSW= 4
##$XGAIN= (0..3)
0 0 0 0 
##$XL= 0
##$YL= 0
##$YMAX_a= 4685
##$YMIN_a= -7396
##$ZGOPTNS= <>
##$ZL1= 120
##$ZL2= 120
##$ZL3= 120
##$ZL4= 120
##$ABSF1= 198.0616
##$ABSF2= -202.7028
##$ABSG= 5
##$ABSL= 3
##$ALPHA= 0
##$AQORDER= 0
##$ASSFAC= 0
##$ASSFACI= 0
##$ASSFACX= 0
##$ASSWID= 0
##$AUNMP= <proc_1d>
##$AZFE= 0.1
##$AZFW= 0.5
##$BCFW= 0
##$BC_mod= 2
##$BYTORDP= 0
##$COROFFS= 0
##$CY= -3
##$DATMOD= 1
##$DC= 0
##$DFILT= <>
##$DTYPP= 0
##$F1P= 0
##$F2P= 0
##$FCOR= 1
##$FTSIZE= 65536
##$FT_mod= 6
##$GAMMA= 0
##$GB= 0
##$INTBC= 1
##$INTSCL= 9.790993e-09
##$ISEN= 30
##$LB= 1.5
##$LEV0= 0
##$LPBIN= 0
##$MAXI= 10000
##$MC2= 0
##$MEAN= 0
##$ME_mod= 0
##$MI= 50
##$NCOEF= 0
##$NC_proc= -8
##$NLEV= 6
##$NOISF1= 182.463
##$NOISF2= 159.3651
##$NSP= 0
##$NTH_PI= 0
##$NZP= 0
##$OFFSET= 198.0616
##$PC= 4
##$PHC0= 2685.872
##$PHC1= 3.88698
##$PH_mod= 1
##$PKNL= yes
##$PPARMOD= 0
##$PSCAL= 0
##$PSIGN= 0
##$REVERSE= no
##$SF= 81.0140089999434
##$SI= 65536
##$SIGF1= 159.3651
##$SIGF2= -187.1042
##$SINO= 113.3802
##$SIOLD= 16384
##$SREGLST= <1H.CDCl3>
##$SSB= 0
##$STSI= 65536
##$STSR= 0
##$SW_p= 32467.5324675325
##$SYMM= 0
##$S_DEV= 0
##$TDeff= 32768
##$TDoff= 0
##$TI= <>
##$TILT= no
##$TM1= 0
##$TM2= 0
##$TOPLEV= 0
##$USERP1= <user>
##$USERP2= <user>
##$USERP3= <user>
##$USERP4= <user>
##$USERP5= <user>
##$WDW= 1
##$XDIM= 65536
##$YMAX_p= 363466919
##$YMIN_p= -36402856
$$ End of Bruker specific parameters
$$ ---------------------------------
##NTUPLES= NMR SPECTRUM
##VAR_NAME=  FREQUENCY,     SPECTRUM/REAL,   SPECTRUM/IMAG
##SYMBOL=    X,             R,               I
##VAR_TYPE=  INDEPENDENT,   DEPENDENT,       DEPENDENT
##VAR_FORM=  AFFN,          ASDF,            ASDF
##VAR_DIM=   65536,         65536,           65536
##UNITS=     HZ,            ARBITRARY UNITS, ARBITRARY UNITS
##FACTOR=    0.49542278885378, 1,            1
##FIRST=     16045.7642231865, 0,            0
##LAST=      -16421.768244346, 0,            0
##MIN=       -16421.768244346, -36402856,    0
##MAX=       16045.7642231865, 363466919,    0
$$ Real data points
##PAGE= N=1
##DATA TABLE= (X++(R..R)), XYDATA
$$ [...]
$$ plain form
43150 -2009974 1304497 6015615 10178502 12094750 11463691 9287186 6654746 4221630
43142 4221630 2735865 2975670 4724189 6578056 7263345 6651720 5306208 3790245 2725654
43133 2725654 2658756 3367143 4114418 5063685 7286599 10427500 11624419 8570407 3109309
43124 3109309 -288118 172547 1749657 1204428 -1245622 -3250160 -3893557 -4019990 -4055851
43115 -4055851 -3742442 -3655821 -4668380 -5624453 -3806516 1300314 6497007 8434300 7367066
43106 7367066 5999521 5758280 5862594 5313125 3988609 2033531 -205478 -1646966 -1350024
43097 -1350024 -41229 564768 100852 -162095 397776 622841 -688395 -3095296 -5183438
43088 -5183438 -5958793 -5159093 -3256948 -1549065 -991733 -500483 2040831 6309673 8829526
$$ packed form
43150b009974L314471M711118M162887J916248o31059k176505k632440k433116
43142D221630j485765K39805J748519J853867O85289o11625j345512j515963j064591
43133B725654o6898P08387P47275R49267K222914L140901J196919l054012n461098
43124C109309l397427M60665J577110n45229k450050k004538o43397j26433l5861
43115d055851L13409Q6621j012559r56073J817937N106830N196693J937293j067234
43106G367066j367545k41241J04314n49469j324516j955078k239009j441488K96942
43097a350024J308795O05997m63916k62947N59871K25065j311236k406901k088142
43088e183438p75355P99700J902145J707883N57332M91250K541314M268842K519853
$$ plain form
43079 8829526 7055957 2661940 -824046 -2151301 -2110866 -634704 2935726 7125901
43071 7125901 8894079 7464495 5253061 4367787 4380115 4229263 3926982 3179949 613032
43062 613032 -3883242 -7833286 -9082586 -8512103 -7940446 -6895354 -3949708 -96330 2143896
43053 2143896 2501417 2826402 3135306 1050159 -3807135 -7845522 -7827814 -4999378 -2791789
43044 -2791789 -2127117 -1469155 -395199 -272768 -1515967 -2700756 -2912187 -2904758 -3159279
43035 -3159279 -2634894 -660043 1327998 1403455 -282858 -1904739 -2408858 -2244526 -1944462
43026 -1944462 -1404769 -747230 -610778 -972153 -564712 1693742 5027570 7162042 6271718
43017 6271718 2354271 -2951057 -7438082 -9476274 -8777532 -6361544 -3652149 -1496762
$$ packed form
43079H829526j773569m394017l485986j327255M0435J476162L570430M190175
43071G125901J768178j429584k211434q85274J2328j50852l02281p47033k566917
43062F13032m496274l950044j249300N70483N71657J045092K945646L853378K240226
43053B143896L57521L24985L08904k085147m857294m038387J7708K828436K207589
43044b791789O64672O57962J073956J22431j243199j184789k11431P429k54521
43035c159279N24385J974851J988041P5457j686313j621881n04119J64332L00064
43026a944462N39693O57539J36452l61375M07441K258454L333828K134472q90324
43017F271718l917447n305328m487025k038192O98742K415988K709395K155387
$$ plain form
43009 -1496762 -29145 735521 553315 -583725 -1796836 -1682370 117024 1858836 1157792
43000 1157792 -2032925 -4836219 -4874030 -3485741 -3899428 -6581015 -8600868 -7970777 -6094314
42991 -6094314 -4643102 -2587619 1185557 4303292 3475700 -84665 -1528724 947264
42983 947264 3755106 3429803 1312329 766595 2283290 3743841 3670045 1790467 -2037961
42974 -2037961 -6855742 -9809552 -9205954 -7622292 -9073816 -13390485 -16310723 -15233028
42966 -15233028 -11925305 -8974094 -6511532 -3774187 -1440476 -617270 -1100399 -2126312
42958 -2126312 -3481597 -4594955 -4024200 -1406927 1263413 1874550 779611 -227526
42950 -227526 -477202 -421243 -77666 667239 893168 -256652 -1720455 -1816127 -1280388 -2747812
$$ packed form
43009a496762J467617P64666j82206j137040j213111J14466J799394J741812p01044
43000A157792l190717k803294l7811J388289m13687k681587k019853O30091J876463
42991f094314J451212K055483L773176L117735q27592l560365j444059K475988
42983I47264K807842l25303k117474n45734J516695J460551p3796j879578l828428
42974b037961m817781k953810O03598J583662j451524m316669k920238J077695
42966a5233028L307723K951211K462562K737345K333711Q23206m83129j025913
42958b126312j355285j113358N70755K617273K670340O11137j094939j007137
42950b27526k49676N5959L43577P44905K25929j149820j463803r5672N35739j467424
$$ plain form
42940 -2747812 -6661750 -9831560 -9315536 -6231854 -4146713 -4546502 -5575644 -5052851 -3131922
42931 -3131922 -1392726 -367707 910197 3060970 5064115 5339291 3599835 858850
42923 858850 -2235876 -6039375 -10470548 -13897357 -14531364 -12628120 -10178844 -8264502
42915 -8264502 -5840460 -1925884 1767591 1842437 -2734733 -8578142 -10890696 -8243964
42907 -8243964 -3395258 474655 2837650 4616878 5715973 5580799 5249473 6373034
42899 6373034 8068428 7213278 2983100 -954873 -695783 2608849 3862645 208623
42891 208623 -5716894 -8961282 -7154854 -1670159 4648432 9494125 11388963 9760106
42883 9760106 5685709 1820378 262347 310141 -679126 -3876736 -7568005 -9771020 -10746875
$$ packed form
42940b747812l913938l169810N16024L083682K085141l99789j029142N22793J920929
42931c131922J739196J025019J277904K150773K003145K75176j739456k740985
42923H58850l094726l803499m431173l426809o34007J903244K449276J914342
42915h264502K424042L914576L693475P4846m577170n843409k312554K646732
42907h243964M848706L869913K362995J779228J099095j35174l31326J123561
42899F373034J695394q55150m230178l937973K59090L304632J253796l654022
42891B08623n925517l244388J806428N484695O318591M845693J894838j628857
42883I760106m074397l865331j558031M7794r89267l197610l691269k203015r75855
$$ plain form
42874 -10746875 -11387935 -10538717 -6594644 -1396038 503121 -2707011 -7802349 -10795976
42866 -10795976 -11197455 -10575756 -9266039 -6919064 -4848236 -5166021 -7910103 -10793959
42858 -10793959 -11470531 -8834473 -3046803 4048505 9258225 10540473 8860201 6478670
42850 6478670 4360873 2532930 1545701 1622068 1583309 761142 679614 2351818 3346941
42841 3346941 854215 -3306352 -4607530 -2462581 -780049 -1477937 -1963209 -585739
42833 -585739 -185196 -3409178 -8008736 -10231586 -10339993 -11032677 -12083993 -10519980 -5607370
42824 -5607370 -122404 3621492 6062055 7998851 8445831 6273187 2534684 -200562
42816 -200562 -299547 1826196 4535593 6298693 6600803 6153017 6257265 7547237 9065985
$$ packed form
42874a0746875o41060Q49218L944073N198606J899159l210132n095338k993627
42866a0795976m01479O21699J309717K346975K070828l17785k744082k883856
42858a0793959o76572K636058N787670P095308N209720J282248j680272k381531
42850F478670k117797j827943r87229P6367l8759q22167q1528J672204R95123
42841C346941k492726m160567j301178K144949J682532o97888m85272J377470
42833e85739M00543l223982m599558k222850j08407o92684j051316J564013M912610
42824e607370N484966L743896K440563J936796M46980k172644l738503k735246
42816b00562r8985K125743K709397J763100L02110m47786J04248J289972J518748
$$ plain form
42807 9065985 8884271 6273108 3143442 2168110 3122040 2760788 -448451 -3405575 -2646521
42798 -2646521 -23451 -440174 -4234331 -6086713 -2750248 2047893 2729272 -1234010
42790 -1234010 -6210932 -9512218 -10514335 -8981061 -5956876 -4918972 -8191902 -12740433
42782 -12740433 -13107211 -8561005 -4016878 -3390955 -5120166 -5288528 -2620030 1052848
42774 1052848 3483965 3788906 2601935 1408362 1105935 1027840 174498 -869275 -562406
42765 -562406 1194418 2754674 2820405 1450838 -897843 -3788586 -6348768 -8026093 -9660415
42756 -9660415 -12011302 -13487035 -11722913 -7618676 -5135330 -6169379 -8085557 -7659188
42748 -7659188 -5197925 -2979019 -1534337 227162 2346599 3547894 3276281 2239937
$$ packed form
42807I065985j81714k611163l129666r75332R53930l61252l209239k957124P59054
42798b646521K623070m16723l794157j852382L336465M798141O81379l963282
42790a234010m976922l301286j002117J533274L024185J037904l272930m548531
42782a2740433l66778M546206M544127O25923j729211j68362K668498L672878
42774A052848K431117L04941j186971j193573l02427p8095q53342j043773L06869
42765e62406J756824J560256O5731j369567k348681k890743k560182j677325j634322
42756i660415k350887j475733J764122M104237K483346j034049j916178M26369
42748g659188K461263K218906J444682J761499K119437J201295k71613j036344
$$ plain form
42740 2239937 1001654 -604389 -2541859 -3986954 -3924684 -2155616 64035 607652 -1320609
42731 -1320609 -3657980 -3689751 -1968385 -1898380 -4607356 -6879669 -6185249 -5219210 -8048955
42722 -8048955 -13233523 -15000977 -11354758 -6877647 -6109994 -7827520 -8387822 -7812305 -8961269
42713 -8961269 -12175520 -14632989 -15011476 -15307560 -16984464 -18135679 -16260687 -11933892
42705 -11933892 -7720104 -4685701 -1988558 864197 3448663 5853687 8666100 11248308
42697 11248308 11677295 8963728 4242017 -438320 -3324315 -3052778 573507 5249502
42689 5249502 7389242 5930784 3804731 4595550 8766433 13999533 17868741 18939997
42681 18939997 16615757 11705077 6486058 2738628 276247 -1517862 -1922628 -348196
$$ packed form
42740B239937j238283j606043j937470j445095O2270J769068K219651N43617j928261
42731a320609k337371l1771J721366P0005k708976k272313O94420R66039k829745
42722h048955n184568j767454L646219M477111P67653j717526n60302N75517j148964
42713h961269l214251k457469l78487k96084j676904j151215J874992M326795
42705a1933892M213788L034403K697143K852755K584466K405024K812413K582208
42697A1248308M28987k713567m721711m680337k885995K71537L626285M675995
42689E249502K139740j458458k126053P90819M170883N233100L869208J071256
42681A8939997k324240m910680n219019l747430k462381j794109m04766J574432
$$ plain form
42673 -348196 1562059 1598087 222694 -208233 681899 640806 -1595417 -4308283 -5306557
42664 -5306557 -4584062 -3369393 -2025227 -286055 1292572 1556347 373664 -834237
42656 -834237 -589567 728551 966815 -1123451 -3550382 -2880398 1155245 4582135 3908507
42647 3908507 291656 -2633543 -3374242 -2760679 -1025522 2346299 6634678 10609618
42639 10609618 14581174 18802370 20719776 17594427 11545756 7673740 6645739 3685408
42631 3685408 -3595593 -10769876 -12452208 -8959941 -4393333 -1198076 444701 563469
42623 563469 -87351 470157 2601457 3667135 1954584 -312604 -604488 -110784 -827586
42614 -827586 -1224572 1068951 4364644 5392101 5229788 7620615 11911785 13054185 9281615
$$ packed form
42673c48196J910255L6028j375393m30927Q90132m1093k236223k712866r98274
42664e306557P22495J214669J344166J739172J578627K63775j182683j207901
42656h34237K44670J318118K38264k090266k426931O69984M035643L426890o73628
42647C908507l616851k925199p40699O13563J735157L371821M288379L974940
42639A0609618L971556M221196J917406l125349o048671l872016j028001k960331
42631C685408p281001p174283j682332L492267M566608L195257J642777J18768
42623E63469o50820N57508K131300J065678j712551k267188k91884M93704p16802
42614h27586l96986K293523L295693J027457j62313K390827M291170J142400l772570
$$ plain form
42605 9281615 4790268 3250028 3079670 1378235 -1176041 -2108113 -1139009 294455 1617515
42596 1617515 2861133 3361004 2951054 3328547 6068558 9820660 11273167 8857291 4399004
42587 4399004 1136565 706619 1917912 2196486 471560 -1469946 -1019399 2182725 6083472
42578 6083472 8809423 10291963 11469365 13013771 14758132 15471605 13725545 10081672
42570 10081672 7428421 7403453 7569092 4639086 -294911 -2941238 -2036164 -809175 -1581568
42561 -1581568 -2589266 -1754175 -247795 32749 -171487 676595 1770869 1484076 596496
42552 596496 1239774 3434510 5102485 5076927 4139321 3472554 3692577 4822540 5719303
42543 5719303 4329451 178046 -4210530 -6178915 -6452672 -7783841 -10696172 -12894124
$$ packed form
42605I281615m491347j540240j70358j701435k554276r32072R69104J433464J323060
42596A617515J243618M99871m09950L77493K740011L752102J452507k415876m458287
42587D399004l262439m29946J211293K78574j724926j941506M50547L202124L900747
42578F083472K725951J482540J177402J544406J744361P13473j746060l643873
42570A0081672k653251k4968J65639k930006m933997k646327R05074J226989p72393
42561a581568j007698Q35091J506380K80544k04236Q48082J094274k86793q87580
42552E96496O43278K194736J667975k5558r37606o66767K20023J129963Q96763
42543E719303j389852m151405m388576j968385k73757j331169k912331k197952
$$ plain form
42535 -12894124 -12833198 -11615980 -10830073 -10296199 -8751487 -5652872 -1798290 1043657 1092090
42526 1092090 -1802085 -5396635 -7043182 -6589272 -6257887 -7498890 -9130291 -9038560 -6752061
42517 -6752061 -3741482 -1825500 -1792937 -3094353 -4338595 -4290926 -2812217 -947431 -71027
42508 -71027 -837768 -2714422 -4443434 -5152741 -5027770 -4736165 -4497301 -4211528 -4087804
42499 -4087804 -4237479 -3976322 -2735202 -1388311 -1078217 -876401 1188473 4380080 5115713
42490 5115713 1797458 -2688919 -5097633 -6056602 -7698113 -9191250 -8028715 -4631020
42482 -4631020 -2054462 -1300656 -309197 1920123 3332117 2070539 -736275 -2805890
42474 -2805890 -3498572 -3533602 -3367761 -3054985 -2705884 -2185379 -1105676 424449 1853640
$$ packed form
42535a2894124O0926J217218P85907N33874J544712L098615L854582K841947M8433
42526A092090k894175l594550j646547M53910L31385j241003j631401R1731K286499
42517f752061L010579J915982L2563j301416j244242M7669J478709J864786Q76404
42508g1027p66741j876654j729012p09307J24971K91605K38864K85773J23724
42499d087804j49675K61157J241120J346891L10094K01816K064874L191607P35633
42490E115713l318255m486377k408714r58969j641511j493137J162535L397695
42482d631020K576558P53806R91459K229320J411994j261578k806814k069615
42474b805890o92682l5030J65841L12776L49101N20505J079703J530125J429191
$$ plain form
42465 1853640 3113426 4449417 5363399 5078051 4114901 3901042 4628991 5064262 4670847
42456 4670847 4200143 3816086 2463951 -254287 -3184588 -5186358 -6084774 -5748043 -4106451
42447 -4106451 -2601836 -3532344 -7059348 -10667899 -12290428 -12008014 -10195098 -6709072
42439 -6709072 -3029767 -2240211 -4975577 -7945560 -8491569 -7951776 -8134117 -7412024 -3807493
42430 -3807493 369022 1148956 -1028496 -1861255 860497 5551065 10451504 14851687
42422 14851687 16714990 13406748 5902781 -1170089 -4851072 -6220919 -6684651 -5424815
42414 -5424815 -2186988 555395 439675 -1941932 -4704874 -7007531 -8199573 -7056643
42406 -7056643 -3859729 -1250447 -1042935 -1838802 -1423597 295650 2220774 3692662 3492463
$$ packed form
42465A853640J259786J335991R13982k85348r63150k13859P27949M35271l93415
42456D670847m70704l84057j352135k718238k930301k001770q98416L36731J641592
42447d106451J504615r30508l527004l608551j622529K82414J812916L486026
42439f709072L679305P89556k735366k969983n46009N39793j82341P22093L604531
42430c807493M176515P79934k177452q32759K721752M690568M900439M400183
42422A4851687J863303l308242p503967p072870l680983j369847m63732J259836
42414e424815L237827K742383j15720k381607k762942k302657j192042J142930
42406g056643L196914K609282K07512p95867M15205J719247J925124J471888k00199
$$ plain form
42397 3492463 -157755 -6256062 -10314141 -9958372 -8781108 -11003820 -14542409 -14003447
42389 -14003447 -9303588 -6025643 -7001051 -8706980 -7610268 -5559884 -6101372 -8750742
42381 -8750742 -10333310 -10169123 -10591120 -12794963 -14866789 -14476444 -11966836 -9881184 -9872658
42372 -9872658 -10792862 -10246046 -7737064 -5190170 -3978648 -2974034 -884741 852587
42364 852587 -314487 -4208708 -7894529 -9201295 -8218849 -5672275 -2209233 762401
42356 762401 1974663 2236603 3307313 5015117 6012383 6947954 9440906 11856885 10341767
42347 10341767 5252343 2286165 4886898 9172739 9328079 5109196 944385 13288
42339 13288 2286966 6335268 9907971 10302330 7024015 2836353 133681 -1654250 -2970803
$$ packed form
42397C492463l650218o098307m058079L55769J177264k222712l538589N38962
42389a4003447M699859L277945r75408j705929J096712K050384n41488k649370
42381h750742j582568J64187m21997k203843k071826L90345K509608K085652Q526
42372i872658r20204N46816K508982K546894J211522J004614K089293J737328
42364H52587j167074l894221l685821j306766R82446K546574L463042K971634
42356G62401J212262K61940J070710J707804R97266R35571K492952K415979j515118
42347A0341767n089424k966178K600733M285841J55340m218883m164811r31097
42339A3288K273678M048302L572703L94359l278315m187662k702672j787931j316553
$$ plain form
42330 -2970803 -1643700 3030050 6670024 4895844 49682 -2013490 -477379 201004
42322 201004 -2133335 -4849626 -5757866 -5696032 -5049434 -2389042 2022598 5322533 5948985
42313 5948985 4972029 2783075 -1584204 -6829723 -9257410 -7768637 -5148781 -3039879
42305 -3039879 162352 4729882 7483118 6736707 5120463 4603899 2892044 -1712388
42297 -1712388 -5770666 -5386929 -2499112 -1996073 -4595348 -6830369 -6617269 -4875042 -2732689
42288 -2732689 -741610 11756 -844264 -1623796 -1365091 -2477836 -7295902 -13308180 -15460312
42279 -15460312 -12425338 -7263376 -2689400 890142 3342263 4374427 4870104 5585918
42271 5585918 5069886 1987371 -1317917 -1230355 1669629 3357554 2442382 1650942 3029195
$$ packed form
42330b970803J327103M673750L639974j774180m846162k063172J536111O78383
42322B01004k334339k716291r08240O1834O46598K660392M411640L299935O26452
42313E948985r76956k188954m367279n245519k427687J488773K619856K108902
42305c039879L202231M567530K753236p46411j616244n16564j711855m604432
42297a712388m058278L83737K887817N03039k599275k235021K13100J742227K142353
42288b732689J991079P53366q56020p79532K58705j112745m818066o012278k152132
42279a5460312L034974N161962M573976L579542K452121J032164M95677P15814
42271E585918n16032l082515l305288Q7562K899984J687925r15172p91440J378253
$$ plain form
42262 3029195 5391052 7055781 7687976 6964269 4838037 3564823 5873409 10442158
42254 10442158 12682702 10705540 6992476 3638525 55940 -3585786 -5094125 -4274899
42246 -4274899 -4087749 -5552066 -5447322 -1739350 2447721 3395669 1951689 703250 -831311
42237 -831311 -4060298 -6779024 -5422761 -843555 2253514 1382437 -1524771 -3775142
42229 -3775142 -4610914 -3981148 -1393300 3016660 7762691 11023835 11843408 10621637 8945296
42220 8945296 8191701 7891779 6656470 4874100 4331447 4611191 2901163 -1041124 -3013359
42211 -3013359 -142116 4336750 5456223 3334202 1783094 1968923 1783784 521276
42203 521276 -206172 -1958 -181416 -692532 -244908 353748 -1316399 -5116249 -8245327
$$ packed form
42262C029195K361857J664729O32195p23707k126232j273214K308586M568749
42254A0442158K240544j977162l713064l353951l582585l641726j508339Q19226
42246d274899J87150j464317J04744L707972M187071R47948j443980j248439j534561
42237h31311l228987k718726J356263M579206L097069q71077k907208k250371
42229c775142q35772O29766K587848M409960M746031L261144Q19573j221771j676341
42220H945296p53595k99922j235309j782370n42653K79744j710028l942287j972235
42211c013359K871243M478866J119473k122021j551108J85829j85139j262508
42203E21276p27448K04214j79458n11116M47624N98656j670147l799850l129078
$$ plain form
42194 -8245327 -9671278 -10896187 -11794932 -9946264 -5439424 -2174375 -2286533 -3003026 -1564396
42185 -1564396 119594 -1189657 -4741359 -7066900 -6611165 -4083148 41699 5118138
42177 5118138 8595858 7895356 3707459 -802489 -3414183 -3592824 -1286016 2242851
42169 2242851 3513430 106341 -5451233 -8226869 -7324464 -6593494 -8523743 -10890836
42161 -10890836 -10838573 -9226988 -8684407 -9413892 -9383787 -7602061 -5139719 -3460103 -3257821
42152 -3257821 -4398153 -5660809 -5118304 -2137461 1402285 3080028 2618306 1383163
42144 1383163 -46608 -1975955 -3588706 -3138258 -796714 644220 -758865 -3250066
42136 -3250066 -3573868 -1313676 644872 -59249 -2464142 -3878260 -3305703 -2403994 -3263664
$$ packed form
42194h245327j425951j224909q98745J848668M506840L265049j12158p16493J438630
42185a564396J683990j309251l551702k325541M55735K528017M124847N076439
42177E118138L477720p00502m187897m509948k611694j78641K306808L528867
42169B242851J270579l407089n557574k775636R02405P30970j930249k367093
42161a0890836N2263J611585N42581p29485L0105J781726K462342J679616K02282
42152c257821j140332j262656N42505K980843L539746J677743m61722j235143
42144A383163j429771j929347j612751M50448K341544J440934j403085k491201
42136c250066l23802K260192J958548p04121k404893j414118N72557R01709q59670
$$ plain form
42127 -3263664 -5876640 -8000757 -7379652 -4015121 -290045 1116865 -489168 -3388389
42119 -3388389 -5105230 -4608044 -3076992 -2447833 -3129009 -3511702 -2039112 774895 3123421
42110 3123421 4286118 5176035 6688186 8730582 10863929 12426938 11921821 8259698
42102 8259698 3319910 1073520 2732222 4847903 4192482 2418619 3001354 5240790
42094 5240790 5191676 2109547 -79358 1535507 5226829 7916825 8864262 8414633 6088584
42085 6088584 2267088 -447756 14972 2607602 5170350 7175352 8449439 7311777
42077 7311777 2946014 -1724908 -2697300 54424 2807976 2998446 1361664 -577869
42069 -577869 -2479562 -4221635 -5089902 -4609568 -2929445 -379460 2106153 2681205 542656
$$ packed form
42127c263664k612976k124117O21105L364531L725076J406910j606033k899221
42119c388389j716841M97186J531052O29159o81176l82693J472590K814007K348526
42110C123421J162697Q89917J512151K042396K133347J563009n05117l662123
42102H259698m939788k246390J658702K115681o55421j773863N82735K239436
42094E240790m9114l082129k188905J614865L691322K689996R47437m49629k326049
42085F088584l821496k714844M62728K592630K562748K005002J274087j137662
42077G311777m365763m670922r72392K751724K753552J90470j636782j939533
42069e77869j901693j742073q68267M80334J680123K549985K485613N75052k138549
$$ plain form
42060 542656 -2150729 -2329316 128741 2530128 3142512 2580992 1450878 -703684 -3345250
42051 -3345250 -4312367 -2653532 -337462 343271 -150586 440654 2809928 4855016 3781249
42042 3781249 -890502 -6288138 -8484965 -6438067 -3139364 -1972295 -2703108 -2512379
42034 -2512379 -263302 2247920 3006594 1643086 -1430634 -5604651 -9412473 -11170487
42026 -11170487 -10736194 -9148572 -6661495 -3109384 9188 479850 -1264680 -2480766
42018 -2480766 -2461118 -3597370 -6908676 -9459915 -8180431 -3974069 -61922 1817722
42010 1817722 1702069 -90280 -2537831 -3583654 -2429765 -964754 -1023369 -1572534 -680015
42001 -680015 935954 608769 -2671029 -7169779 -10301839 -10185200 -6387520 -849880 2901889
$$ packed form
42060E42656k693385j78587K458057K401387O12384n61520j130114k154562k641566
42051c345250r67117J658835K316070O80733m93857N91240K369274K045088j073767
42042C781249m671751n397636k196827K046898L298703J167069p30813J90729
42034b512379K249077K511222P58674j363508l073720m174017l807822j758014
42026a1170487M34293J587622K487077L552111L118572M70662j744530j216086
42018b480766J9648j136252l311306k551239J279484M206362L912147J879644
42010A817722j15653j792349k447551j045823J153889J465011n8615n49165Q92519
42001f80015J615969l27185l279798m498750l132060J16639L797680N537640L751769
$$ plain form
41992 2901889 3272271 2529642 3605778 5939819 6358489 3318566 -1544345 -5487299 -6708012
41983 -6708012 -5089465 -2476656 -1453021 -2432533 -2933211 -1027911 1955001 3770012
41975 3770012 4451514 4995181 4762370 3082978 1835527 2999560 4717084 3512423 -73361
41966 -73361 -1869728 -114655 2604465 3832264 3983197 3791469 2645864 841315 256267
41957 256267 1096576 772893 -2195748 -5694839 -7296690 -7697271 -8789854 -10234501 -10121546
41948 -10121546 -7710582 -3751972 652151 4006027 4643457 2602412 148942 -796726
41940 -796726 -383450 1072358 4646001 10574539 16241146 18760054 18458026 17587887 16595986
41931 16595986 14074109 9828517 5603110 2849620 1748492 2266698 4102987 5465418
$$ packed form
41992B901889L70382p42629J076136K334041M18670l039923m862911l942954j220713
41983f708012J618547K612809J023635r79512n00678J905300K982912J815011
41975C770012O81502N43667k32811j679392j247451J164033J717524j204661l585784
41966g3361j796367J755073K719120J227799J50933j91728j145605j804549n85048
41957B56267Q40309l23683k968641l499091j601851m00581j092583j444647J12955
41948a0121546K410964L958610M404123L353876O37430k041045k453470r45668
41940g96726M13276J455808L573643N928538N666607K518908l02028q70139r91901
41931A6595986k521877m245592m225407k753490j101128N18206J836289J362431
$$ plain form
41923 5465418 4039002 -30167 -3574737 -3708313 -856735 2038522 2642697 1123106
41915 1123106 -532939 -654562 567955 1652652 1795267 1554005 1280104 -50278 -3366965
41906 -3366965 -7540863 -10207873 -10380160 -9116154 -7663897 -6075955 -3897894 -1320600
41898 -1320600 799054 1655706 1096702 -143296 -836216 -275626 1121018 2472084 3483850
41889 3483850 4512780 5789793 6928953 7125859 5829461 3575251 2001811 2191258
41881 2191258 2960768 2070590 -402823 -1421228 1135797 5270719 7255884 6343480 5025489
41872 5025489 4894786 4561053 2331005 -940082 -2985851 -3049246 -2317823 -1890686 -1538929
41863 -1538929 -630089 538765 855309 -283629 -2004927 -2394156 54935 5235258 11358649
$$ packed form
41923E465418j426416m069169l544570j33576K851578K895257O04175j519591
41915A123106j656045j21623J222517J084697J42615k41262k73901j330382l316687
41906c366965m173898k667010j72287J264006J452257J587942K178061K577294
41898a320600K119654Q56652n59004j239998o92920N60590J396644J351066J011766
41889C483850J028930J277013J139160J96906j296398k254210j573440J89447
41881B191258P69510q90178k473413j018405K557025M134922J985165r12404j317991
41872E025489j30703l33733k230048l271087k045769o3395P31423M27137L51757
41863a538929R08840J168854L16544j138938j721298l89229K449091N180323O123391
$$ plain form
41854 11358649 15994082 17588768 16504266 14553136 13200012 12364771 11300966 10098158
41846 10098158 9395014 8952168 7810709 5900697 4098335 2464853 81711 -2755018
41838 -2755018 -4027004 -2901621 -1429763 -1576334 -2017540 -279917 2764875 3371746 150932
41829 150932 -3649428 -4139838 -1393749 1142604 803607 -1794879 -3796255 -2863133 671441
41820 671441 3869830 3800692 502420 -2980558 -3705051 -1471540 1817331 4651842 7018976
41811 7018976 9305344 11008869 11128854 9732938 8482950 8966003 10667241 11417607 9985873
41802 9985873 7246225 4321762 749050 -4368729 -10123197 -14109963 -14815945 -12674032
41794 -12674032 -9017322 -5143974 -2255175 -965403 -549990 359999 2050951 3486738
$$ packed form
41854A1358649M635433J594686j084502j951130j353124q35241j063805j202808
41846A0098158p03144m42846j141459j910012j802362j633482k383142k836729
41838b755018j271986J125383J471858j46571m41206J737623L044792O06871l220814
41829A50932l800360m90410K746089K536353l38997k598486k001376R33122L534574
41820F71441L198389o9138l298272l482978p24493K233511L288871K834511K367134
41811G018976K286368J703525J19985j395916j249988M83053J701238P50366j431734
41802I985873k739648k924463l572712n117779n754468l986766p05982K141913
41794a2674032L656710L873348K888799J289772M15413R09989J690952J435787
$$ plain form
41786 3486738 3947691 4010173 4508592 5174367 4735412 2136765 -2284023 -6445433 -7620160
41777 -7620160 -4663715 743665 5496585 7583515 6943168 4538804 1607308 -457664
41769 -457664 -638119 946261 3174651 4713887 4558448 2619036 344734 -248853 975977
41760 975977 1997735 1902557 2772586 6287493 9947390 9666528 5489560 1527108 249404
41751 249404 211636 -30692 581504 2586608 3705257 2046928 -583388 -1068315 836881
41742 836881 2836234 3261348 1923766 -821288 -3748301 -4795125 -3746512 -3756382 -7582673
41733 -7582673 -13112998 -15588327 -14076036 -12576106 -13966615 -15806620 -14031708 -8930162
41725 -8930162 -5028259 -5472564 -8535132 -10231762 -9054292 -6862819 -5563608 -4628889
$$ packed form
41786C486738M60953O2482M98419O65775m38955k598647m420788m161410j174727
41777g620160K956445N407380M752920K086930o40347k404364k931496k064972
41769d57664j80455J584380K228390J539236j55439j939412k274302n93587J224830
41760I75977J021758r5178Q70029L514907L659897k80862m176968l962452j277704
41751B49404l7768k42328O12196K005104J118649j658329k630316m84927J905196
41742H36881J999353M25114j337582k745054k927013j046824J048613r870l826291
41733g582673n530325k475329J512291J499930j390509j840005J774912N101546
41725h930162L901903m44305l062568j696630J177470K191473J299211R34719
$$ plain form
41717 -4628889 -2753968 -623627 -207538 -1730342 -3345372 -4026004 -4793421 -6403138 -7720479
41708 -7720479 -7520854 -6365495 -5472263 -4941157 -4091957 -2374860 696671 4902263 8016230
41699 8016230 7383890 3764573 986198 418595 -1020025 -5174888 -8611517 -7872880 -5605006
41690 -5605006 -6614682 -9966978 -10501756 -7199225 -4268782 -3830369 -3263595 -964791 742550
41681 742550 538409 1068297 4199795 7389037 7805347 6625026 6086473 5300679 2369735
41672 2369735 -1645752 -4072473 -4175113 -2807811 -521401 1505277 924492 -2559495
41664 -2559495 -5545123 -5396046 -4168575 -4980747 -6810030 -6639539 -4650902 -2906710 -516044
41655 -516044 4863658 11403347 14205730 12431695 10502597 11117226 11552233 8708019 3968062
$$ packed form
41717d628889J874921K130341M16089j522804j615030o80632p67417j609717j317341
41708g720479J99625J155359Q93232N31106Q49200J717097L071531M205592L113967
41699H016230o32340l619317k778375n67603j438620m154863l436629P38637K267874
41690e605006j009676l352296n34778L302531K930443M38413N66774K298804J707341
41681G42550k04141N29888L131498L189242M16310j180321n38553p85794k930944
41672B369735m015487k426721j02640J367302K286410K026678n80785l483987
41664b559495k985628J49077J227471q12172j829283J70491J988637J744192K390666
41655e16044N379702O539689K802383j774035j929098O14629M35007k844214m739957
$$ plain form
41646 3968062 707534 -94332 492227 1688311 2841019 2766732 1163262 -692185 -1925669
41637 -1925669 -3217572 -4968009 -6140949 -6090274 -5728479 -5678188 -5009992 -2977981 -306453
41628 -306453 2166134 4073335 3866717 -632971 -8186576 -13193142 -11326753 -4403031
41620 -4403031 2472673 6558541 7818287 5999547 1244285 -3383176 -3935265 -452843
41612 -452843 3191976 4680165 5704772 8416035 11978451 13826758 12532893 8425875
41604 8425875 2886356 -2011189 -4417239 -4298570 -3442531 -3392361 -4046940 -4436673 -3969234
41595 -3969234 -2757865 -1620257 -1747936 -3314408 -4485667 -3182279 2218 2101152
41587 2101152 1461884 -242604 -426545 1159679 2563847 2217398 373428 -1671154 -2950085
$$ packed form
41646C968062l260528q01866N86559J196084J152708p4287j603470j855447j233484
41637a925669j291903j750437j172940N0675L61795N0291O68196K032011K671528
41628c06453K472587J907201k06618m499688p553605n006566J866389O923722
41620d403031O875704M085868J259746j818740m755262m627461n52089L482422
41612d52843L644819J488189J024607K711263L562416J848307j293865m107018
41604H425875n539519m897545k406050J18669Q56039N0170o54579l89733M67439
41595c969234J211369J137608j27679j566472j171259J303388L184497K098934
41587B101152o39268j704488j83941J586224J404168l46449j843970k044582j278931
$$ plain form
41578 -2950085 -3425177 -3684410 -4242732 -5146908 -6128234 -6758714 -6476254 -5236644 -4384460
41569 -4384460 -5704086 -8807689 -10683321 -9099975 -5357299 -2143809 82309 2444411
41561 2444411 4488756 4544475 2834659 1147378 -688208 -4646728 -10089078 -12996965
41553 -12996965 -11234452 -7409102 -4394512 -1128567 4112773 8877200 9055380 5192013
41545 5192013 2387669 3729227 6822631 7371226 3833039 -2011950 -7098644 -9033423
41537 -9033423 -7586302 -4811925 -2740918 -1155016 1181181 3849717 5331714 5744432
41529 5744432 6588146 7732926 7202897 4449930 1373642 -688605 -2479826 -4159493
41521 -4159493 -3656709 351179 5635534 8714121 8755439 7308899 5251703 2163563 -1730157
$$ packed form
41578b950085m75092k59233n58322r04176r81326o30480K82460J239610Q52184
41569d384460j319626l103603j875632J583346L742676L213490K226118K362102
41561B444411K044345N5719j709816j687281j835586l958520n442350k907887
41553a2996965J762513L825350L014590L265945N241340M764427J78180l863367
41545E192013k804344J341558L093404N48595l538187n844989n086694j934779
41537i033423J447121K774377K071007J585902K336197K668536J481997M12718
41529E744432Q43714J144780n30029k752967l076288k062247j791221j679667
41521d159493N02784M007888N284355L078587M1318j446540k057196l088140l893720
$$ plain form
41512 -1730157 -4946100 -6203783 -5389556 -3265317 -1103037 -115473 -320124 -514764 -117061
41503 -117061 -20250 -630743 -442439 1750073 4373068 4887522 3273124 1496527 219761
41494 219761 -1342158 -2647526 -1948346 489055 2308323 3000667 4795374 8223966 10050396
41485 10050396 8070948 5174808 5214032 6721954 4881677 -693395 -4279894 -1267266
41477 -1267266 5989595 11283402 11558652 9073845 7818596 9433863 12226042 13131318
41469 13131318 10798355 7119295 5291792 6266904 7921208 7872707 5994940 3767887
41461 3767887 2407383 2382010 3643035 5336666 6132121 5764721 5451243 5852790 5581276
41452 5581276 3081106 -594966 -2397024 -680536 3016715 5633745 5358149 2954286
$$ packed form
41512a730157l215943j257683Q14227K124239K162280R87564k04651j94640L97703
41503a17061R6811o10493J88304K192512K622995N14454j614398j776597j276766
41494B19761j561919j305368O99180K437401J819268O92344J794707L428592J826430
41485A0050396j979448k896140L9224J507922j840277n575072l586499L012628
41477a267266P256861N293807K75250k484807j255249J615267K792179R05276
41469A3131318k332963l679060j827503R75112J654304m8501j877767k227053
41461C767887j360504k5373J261025J693631P95455l67400l13478M01547k71514
41452E581276k500170l676072j802058J716488L697251K617030k75596k403863
$$ plain form
41444 2954286 943013 1142967 2625567 2909852 1700783 1907032 5430659 9393220 9082677
41435 9082677 4092200 -1263517 -3804517 -4869809 -6910888 -9438079 -10220988 -8631635
41427 -8631635 -5754597 -2464722 619007 2235500 1622422 135323 -41971 1416166
41419 1416166 3013308 3700676 3459434 1980506 -1246067 -5319675 -8212902 -9197298 -9491640
41410 -9491640 -9943160 -9561852 -7206682 -3483644 8615 2368491 3481161 3446139 2951591
41401 2951591 3272815 4597616 5026108 2669825 -1613997 -4995875 -5994201 -5577969 -5043751
41392 -5043751 -4557654 -4234925 -4837936 -6327997 -7224374 -6788395 -6518910 -7700733 -8656644
41383 -8656644 -6933384 -3629691 -2399247 -3626719 -2933131 2614115 9551219 12210009
$$ packed form
41444B954286k011273J99954J482600K84285j209069K06249L523627L962561l10543
41435I082677m990477n355717k541000j065292k041079k527191p82909J589353
41427h631635K877038L289875L083729J616493o13078j487099j77294J458137
41419A416166J597142O87368k41242j478928l226573m073608k893227r84396k94342
41410i491640m51520L81308K355170L723038L492259K359876J112670l5022m94548
41401B951591L21224J324801M28492k356283m283822l381878r98326M16232N34218
41392e043751M86097L22729o03011j490061q96377M35979K69485j181823r55911
41383h656644J723260L303693J230444j227472O93588N547246O937104K658790
$$ plain form
41375 12210009 10150079 8010054 8644513 10035557 9511351 7668287 6489965 5969162
41367 5969162 4595551 1814562 -1629265 -4779868 -6625433 -6215696 -3882049 -1443104
41359 -1443104 -177843 315341 319041 -1249174 -4594260 -7116193 -6171047 -3001021 -1457930
41350 -1457930 -3088029 -5875812 -7893581 -9605612 -11735653 -13111328 -12214369 -9655545
41342 -9655545 -7640000 -7413450 -8117135 -7933807 -5980299 -3385754 -2519592 -4479432 -7285609
41333 -7285609 -7465134 -3768147 1407618 4589209 4514360 2557920 720953 -70603 15587
41324 15587 665102 1982443 4021226 6022105 6743353 5732002 3650185 1124197 -1850184
41315 -1850184 -4921734 -6888666 -6989291 -5743573 -3810070 -1308801 838595 805732 -1101093
$$ packed form
41375A2210009k059930k140025O34459J391044n24206j843064j178322n20803
41367E969162j373611k780989l443827l150603j845565M09737K333647K438945
41359a443104J265261M93184L700j568215l345086k521933R45146L170026J543091
41350a457930j630099k787783k017769j712031k130041j375675Q96959K558824
41342i655545K015545K26550p03685J83328J953508K594545Q66162j959840k806177
41333g285609j79525L696987N175765L181591p4849j956440j836967p91556Q6190
41324A5587O49515J317341K038783K000879P21248j011351k081817k525988k974381
41315a850184l071550j966932j00625J245718J933503K501269K147396l2863j906825
$$ plain form
41306 -1101093 -1125152 3552406 10277640 13725312 12562782 10290820 9853171 10712752 11355445
41297 11355445 11317759 10190929 7818189 6097932 7242554 9483095 8238346 2856039
41289 2856039 -1686259 -1660012 731738 1861262 1692640 989138 -2370906 -9466137 -15551443
41280 -15551443 -14628133 -7549895 -772373 2142753 3099057 4146688 4736583 4818358 5864692
41271 5864692 7331444 6111937 1410549 -3050791 -3612437 -940765 1811237 2691210
41263 2691210 1417470 -1341823 -3570172 -3061336 -561141 477782 -1109879 -1924020
41255 -1924020 1069531 5570582 6864131 4414706 2480300 4407880 8845837 11922627
41247 11922627 11281311 7459782 2755257 -458081 -1019894 584330 2867002 4383820
$$ packed form
41306a101093k4059M677558O725234L447672j162530k271962m37649Q59581O42693
41297A1355445l7686j126830k372740j720257J144622K240541j244749n382307
41289B856039m542298K6247K391750J129524j68622p03502l360044p095231o085306
41280a5551443R23310P078238O777522K915126R56304J047631N89895Q1775J046334
41271E864692J466752j219507m701388m461340n61646K671672K752002Q79973
41263B691210j273740k759293k228349N08836K500195J038923j587661q14141
41255a924020K993551M501051J293549k449425j934406J927580M437957L076790
41247A1922627o41316l821529m704525l213338n61813J604224K282672J516818
$$ plain form
41239 4383820 4432114 3380153 2440150 2537620 3323784 3865646 4028019 4097692 3301289 426796
41229 426796 -3671485 -5927744 -4402107 -505568 2978258 4794724 5137222 4074248
41221 4074248 1680538 -940763 -2251117 -1817330 -583351 -57537 -1689294 -6028521
41213 -6028521 -11464018 -14546821 -12819439 -7208043 -1063070 2709635 3268118 1745722
41205 1745722 475714 1328548 3649528 4556865 2388820 -928319 -2272659 -1362366 -642238
41196 -642238 -1326868 -1550077 677425 3973290 4557214 746793 -4576869 -6850211 -4923795
41187 -4923795 -2129664 -1792791 -3071084 -2832767 -686725 438693 -1039664 -2738303
41179 -2738303 -1626489 1975565 5224402 6007240 3798556 -1189116 -7590336 -12484206
$$ packed form
41239D383820M8294j051961r40003R7470P86164N41862J62373O9673p96403k874493
41229D26796m098281k256259J525637L896539L483826J816466L42498j062974
41221D074248k393710k621301j310354M33787J233979N25814j631757m339227
41213f028521n435497l082803J727382N611396O144973L772705N58483j522396
41205A745722j270008Q52834K320980R07337k168045l317139j344340R10293P20128
41196f42238o84630k23209K227502L295865N83924l810421n323662k273342J926416
41187d923795K794131L36873j278293K38317K146042J125418j478357j698639
41179b738303J111814L602054L248837P82838k208684m987672o401220m893870
$$ plain form
41171 -12484206 -13550279 -11558710 -9364112 -8694338 -9029928 -9108247 -8299600 -6919234 -6173773
41162 -6173773 -7174527 -9138547 -9611328 -7535853 -4725583 -2920954 -1253114 1054233
41154 1054233 1338064 -3389537 -10439970 -12659598 -6932488 1473326 4791320 1028083
41146 1028083 -5103840 -7778705 -4983325 782537 4918678 4374592 208425 -3593961
41138 -3593961 -4281001 -2700269 -1216931 -500733 544986 2417225 3964630 3857377 2298145
41129 2298145 702202 -298303 -1934209 -5493063 -9435490 -9827820 -4817832 2386496
41121 2386496 6601542 6069320 3143462 353309 -1888813 -3808134 -5104428 -5974758
41113 -5974758 -7148840 -7968656 -6343515 -1781738 3103924 5317747 4517613 2534411
$$ packed form
41171a2484206j066073J991569K194598O69774l35590p8319Q08647J380366P45461
41162f173773j000754j964020m72781K075475K810270J804629J667840K307347
41154A054233K83831m727601p050433k219628N727110Q405814L317994l763237
41146A028083o131923k674865K795380N765862M136141n44086m166167l802386
41138c593961o87040J580732J483338P16198J045719J872239J547405j07253j559232
41129B298145j595943j000505j635906l558854l942427l92330N009988P204328
41121B386496M215046n32222k925858k790153k242122j919321j296294q70330
41113e974758j174082q19816J625141M561777M885662K213823q00134j983202
$$ plain form
41105 2534411 1294567 2037214 4875421 7888246 8184186 5237148 1733947 -237551
41097 -237551 -2052142 -5567548 -8875421 -7992390 -2507866 3119563 4510656 1829659
41089 1829659 -1306767 -2009579 -541774 490079 -1212624 -5256828 -8578554 -8319636
41081 -8319636 -4772545 -1071221 -53316 -1820582 -4141684 -4709936 -3098328 -854938
41073 -854938 360541 553209 694747 609037 -841113 -3089530 -3427659 -616314 2788011
41064 2788011 3674473 2543382 1961823 1876103 -317308 -4875826 -8050498 -6624744 -1887511
41055 -1887511 2390442 4232684 4213525 3430646 2568133 2192453 2313737 1961999 414661
41046 414661 -1506200 -2474062 -2617259 -3243984 -4830612 -6508751 -7550508 -8162460 -8535394
$$ packed form
41105B534411j239844P42647K838207L012825K95940k947038l503201j971498
41097b37551j814591l515406l307873Q83031N484524N627429J391093k680997
41089A829659l136426p02812J467805J031853j702703m044204l321726K58918
41081h319636L547091L701324J017905j767266k321102n68252J611608K243390
41073h54938J215479J92668J41538q5710j450150k248417l38129K811345L404325
41064B788011Q86462j131091n81559q5720k193411m558518l174672J425754M737233
41055a887511M277953J842242j9159p82879q62513l75680J21284l51738j547338
41046D14661j920861r67862j43197o26725j586628j678139j041757o11952l72934
$$ plain form
41037 -8535394 -8133062 -6389995 -3430393 154328 3444548 4895685 3125635 -1101513
41029 -1101513 -4632811 -5043497 -3621125 -3820119 -6772375 -9897317 -10442824 -8810352 -7232481
41020 -7232481 -6466251 -5575795 -4361530 -3918441 -4519705 -4778920 -3819369 -2972043 -4088420
41011 -4088420 -6784018 -8436916 -6797647 -2054026 3415803 6910502 7450328 6522727
41003 6522727 6528785 8078185 9152600 7356763 2685712 -2305683 -4807329 -4041719 -1723878
40994 -1723878 -483671 -1366125 -2784148 -2521651 -593603 1068566 1759761 2901710 4942803
40985 4942803 5490621 2646713 -1137921 -1322206 2681618 6185293 4681691 -1135299
40977 -1135299 -6711726 -8639709 -7250568 -5118959 -4210880 -4411472 -4191783 -2504883 50590
$$ packed form
41037h535394M02332J743067K959602L584721L290220J451137j770050m227148
41029a101513l531298m10686J422372j98994k952256l124942n45507J632472J577871
41020g232481P66230Q90456J214265M43089o01264k59215R59551Q47326j116377
41011d088420k695598j652898J639269M743621N469829L494699N39826r27601
41003F522727O058J549400J074415j795837m671051m991395k501646P65610K317841
40994a723878J240207q82454j418023K62497J928048J662169O91195J141949K041093
40985D942803N47818k843908l784634j84285M003824L503675j503602n816990
40977a135299n576427j927983J389141K131609R08079k00592K19689J686900K555473
$$ plain form
40968 50590 2067198 2971018 3294111 3580552 3813356 3945169 4246546 4837553 5231344 4514155
40958 4514155 2015481 -1792090 -4979946 -5635076 -4152147 -3023196 -3529815 -3925103 -2260533
40949 -2260533 384753 1676099 1938037 3313282 5309933 4758044 1210173 -1045982
40941 -1045982 1354753 5753450 7010384 4612703 2919991 4698465 7653233 8216562
40933 8216562 6208366 4084419 3193924 2895325 2870403 4164016 7185795 10112260 10692127
40924 10692127 9084376 7374832 6373829 4788966 2216401 770381 1865281 3061986
40916 3061986 981071 -3253048 -4663277 -1049848 3849688 5049735 1891988 -2491800
40908 -2491800 -5250948 -5565272 -3927522 -1715907 -685395 -1406677 -2824080 -4049320
$$ packed form
40968E0590K016608R03820L23093K86441K32804J31813L01377N91007L93791p17189
40958D514155k498674l807571l187856o55130J482929J128951n06619l95288J664570
40949b260533K645286J291346K61938J375245J996651n51889l547871k256155
40941a045982K400735M398697J256934k397681j692712J778474K954768N63329
40933H216562k008196k123947q90495k98599k4922J293613L021779K926465N79867
40924A0692127j607751j709544j001003j584863k572565j446020J094900J196705
40916C061986k080915m234119j410229L613429M899536J200047l157747m383788
40908b491800k759148l14324J637750K211615J030512p21282j417403j225240
$$ plain form
40900 -4049320 -5161778 -5453051 -3195263 1075730 3446252 1564862 -1201603 41348
40892 41348 4716982 8006608 8536853 10151155 14984778 19220787 18385206 13761361 10273055
40883 10273055 9668856 8974625 5250696 -636957 -5314037 -6503588 -5005369 -3669755
40875 -3669755 -4237150 -5079822 -3081078 1942610 6408419 7570760 6974505 7356910 7955274
40866 7955274 6019275 2056191 -341020 -378002 -1706993 -6122225 -9194009 -5964532
40858 -5964532 1040352 4075703 247275 -5123508 -6331557 -4226644 -2710598 -1972267
40850 -1972267 456386 3810453 4280805 1237761 -1132903 279674 3571518 5531058
40842 5531058 6074512 6635695 6846248 5704973 4098873 3224269 2038463 -702756 -3175629
$$ packed form
40900d049320j112458k91273K257788M270993K370522j881390k766465J242951
40892D1348M675634L289626N30245J614302M833623M236009q35581m623845l488306
40883A0273055o04199o94231l723929n887653m677080j189551J498219J335614
40875c669755n67395q42672J998744N023688M465809J162341n96255L82405N98364
40866G955274j935999l963084k397211l6982j328991m415232l071784L229477
40858e964532P004884L035351l828428n370783j208049K104913J516046P38331
40850a972267K428653L354067M70352l043044k370664J412577L291844J959540
40842E531058N43454N61183K10553j141275j606100q74604j185806k741219k472873
$$ plain form
40833 -3175629 -2616753 33241 1090694 -443785 -1813380 -1127632 237518 577632 148687
40824 148687 -490253 -1636738 -2812277 -2647449 -1706041 -2790010 -6772458 -10476091 -10533143
40815 -10533143 -7357091 -3599696 -760372 801361 609915 -840521 -1377183 225221
40807 225221 2261055 2651969 1859583 1261822 676179 121142 1933559 7538764 13473272
40798 13473272 14653124 11154451 7837730 7247340 7040482 5287656 4068039 5553411
40790 5553411 7750133 7147434 3882457 1552571 2594176 5872323 8559914 8890552
40782 8890552 7035499 4244850 1468235 -1142209 -3240759 -3549527 -1340585 1734644
40774 1734644 3071008 2539213 2634353 4648475 6670827 6599557 5487694 6125844 9073485
$$ packed form
40833c175629N58876K649994J057453j534479j369595O85748J365150L40114m28945
40824A48687o38940j146485j175539J64828R41408j083969l982448l703633n7052
40815a0533143L176052L757395K839324J561733j91446j450436n36662J602404
40807B25221K035834L90914p92386n97761n85643n55037J812417N605205N934508
40798A3473272J179852l498673l316721n90390k06858j752826j219617J485372
40790E553411K196722o02699l264977k329886J041605L278147K687591L30638
40782H890552j855053k790649k776615k610444k098550l08768K208942L075229
40774A734644J336364n31795R5140K014122K022352p1270j111863O38150K947641
$$ plain form
40765 9073485 11687852 10991868 6598662 927210 -2882001 -3420579 -1786763 59215
40757 59215 1400161 2710488 4067306 4876158 5067262 5203777 5325228 5085344 5106444
40748 5106444 6473379 8492904 8783871 6353405 2916699 341955 -1430024 -2815517
40740 -2815517 -2818862 -628783 2185242 2875697 460025 -3573054 -6734929 -6870305 -3276079
40731 -3276079 2097798 5446577 4589455 1259511 -987589 -479523 1762547 3973251
40723 3973251 5342262 6418820 8501929 11824110 14129970 12701860 8351129 5252469
40715 5252469 5706365 7418692 7588299 7078136 8019560 9601746 9493156 7838297 6458265
40706 6458265 5317150 3335117 1715196 2474771 4084471 2835664 -1055897 -2894449
$$ packed form
40765I073485K614367o95984m393206n671452l809211n38578J633816J845978
40757E9215J340946J310327J356818Q08852J91104J36515J21451k39884K1100
40748E106444J366935K019525K90967k430466l436706k574744j771979j385493
40740b815517l345K190079K814025O90455k415672m033079l161875j35376L594226
40731c276079N373877L348779q57122l329944k247100N08066K242070K210704
40723C973251J369011J076558K083109L322181K305860j428110m350731l098660
40715E252469M53896J712327J69607n10163R41424J582186j08590j654859j380032
40706F458265j141115j982033j619921P59575J609700j248807l891561j838552
$$ plain form
40698 -2894449 -179784 3986908 5831687 5804891 6393810 7910958 8984722 9210585 8957949
40689 8957949 8049428 6705941 6604730 9201548 13933763 19320305 24514933 28467791
40681 28467791 29162046 25637851 19907266 15206046 12832316 11727189 10357793 8037888
40673 8037888 5258503 3549720 4062960 5709746 6045080 4597845 3580847 4427780 5654278
40664 5654278 5474037 4487088 4068724 4074124 4210460 5834224 9893108 14555032 17539354
40655 17539354 19576981 22632790 25593838 25128373 20954961 17167653 17316260 20221520
40647 20221520 21645273 18824694 12893722 7945064 7860736 12987670 19880403 25016994
40639 25016994 28087853 30689128 33261105 35446938 38313505 43209667 48604851 51128405
$$ packed form
40698b894449K714665M166692J844779k6796N88919J517148J073764K25863k52636
40689H957949r08521j343487j01211K596818M732215N386542N194628L952858
40681B8467791O94255l524195n730585m701220k373730j105127j369396k319905
40673H037888k779385j708783N13240J646786L35334j447235j016998Q46933J226498
40664E654278j80241r86949m18364N400J36336J623764M058884M661924K984322
40655A7539354K037627L055809K961048m65465m173412l787308J48607K905260
40647B0221520J423753k820579n930972m948658q4328N126934O892733N136591
40639B5016994L070859K601275K571977K185833K866567M896162N395184K523554
$$ plain form
40631 51128405 50408348 50236528 53870665 60422349 67195518 73663142 81425284 91411977
40623 91411977 102799529 114396769 126116795 138878134 152831895 165364644 171854001
40616 171854001 169967781 162764735 155745002 151120547 147057605 142285296 138546938 137782378
40608 137782378 139772548 144239059 153109515 168766181 191486212 220107282 253492313
40601 253492313 289263803 322317280 346980790 360551544 363466919 356801877 341324888
40594 341324888 318550291 290810919 259970069 227234472 194478892 164798946 141208180
40587 141208180 124835818 114244861 106522600 99612198 93684986 89556462 86017199 80383500
40579 80383500 72230776 64786854 61276441 61163921 61500952 60857795 59998103 59212155 57082480
$$ packed form
40631E1128405p20057j71820L634137O551684O773169O467624P762142R986693
40623I1411977J1387552J1597240J1720026J2761339J3953761J2532749O489357
40616A71854001j886220p203046p019733m624455m062942m772309l738358p64560
40608A37782378J990170M466511Q870456J5656666K2720031K8621070L3385031
40601B53492313L5771490L3053477K4663510J3570754K915375o665042j5476989
40594C41324888k2774597k7739372l0840850l2735597l2755580k9679946k3590766
40587A41208180j6372362j0590957p722261o910402n927212m128524l539263n633699
40579H0383500q152724p443922l510413j12520L37031o43157q59692p85948k129675
$$ plain form
40570 57082480 52371389 45927640 40114183 36684294 35292151 34031729 31776163 29751051
40562 29751051 29727545 30831753 30172272 27312066 25695307 27847552 31304198 31941890 29784372
40553 29784372 28249619 28432427 27824290 25026604 22171688 21258361 20902604 18699142 14910382
40544 14910382 11852238 10866612 11588174 13211370 14862825 15393001 14248535 12186069
40536 12186069 10158216 8172736 6319361 6067130 8886579 13683299 16953043 15861117
40528 15861117 10671586 4336446 227964 -242890 1318769 1853329 171497 -1740673
40520 -1740673 -1489300 530566 2128455 2817234 4230967 6977344 9312849 9921743 10238514
40511 10238514 12536122 16747662 20499645 21563532 19283104 14641844 10290170 9446389
$$ packed form
40570E7082480m711091o443749n813457l429889j392143j260422k255566k025112
40562B9751051k3506J104208o59481k860206j616759K152245L456646O37692k157518
40553B9784372j534753J82808o08137k797686k854916r13327l55757k203462l788760
40544A4910382l058144r85626P21562J623196J651455N30176j144466k062466
40536A2186069k027853j985480j853375k52231K819449M796720L269744j091926
40528A5861117n189531o335140m108482m70854J561659N34560j681832j912170
40520a740673K51373K019866J597889O88779J413733K746377K335505O08894L16771
40511A0238514K297608M211540L751983J063887k280428m641260m351674q43781
$$ plain form
40503 9446389 12796688 16914085 17706794 15315923 13620387 14807314 16695888 16184310
40495 16184310 13252094 10236130 8741216 8756455 9645081 10501076 10343629 9274532 8780079
40486 8780079 9852188 11665965 13127167 14584790 16672789 18597226 19219631 18899479
40478 18899479 18538900 17690580 15493476 12703222 10823037 9924604 9261811 9042717 9261199
40469 9261199 7976949 3910085 -115266 -166931 2567844 2912154 -269323 -1871685 1668020
40460 1668020 6790895 8141551 5954000 4322104 4589735 4590194 3204446 1849252 1637326
40451 1637326 1895490 1533925 22526 -2500191 -4564878 -3940582 -571643 2525832 3277420
40442 3277420 3654714 6214143 9389139 9599880 6817665 4374014 3849903 3780735 3253637
$$ packed form
40503I446389L350299M117397P92709k390871j695536J186927J888574n11578
40495A6184310k932216l015964j494914J5239Q88626Q55995j57447j069097m94453
40486H780079J072109J813777J461202J457623K087999J924437O22405l20152
40478A8899479l60579q48320k197104k790254j880185q98433o62793k19094K18482
40469I261199j284250m066864m025351n1665K734775L44310l181477j602362L539705
40460A668020N122875J350656k187551j631896K67631M59j385748j355194k11926
40451A637326K58164l61565j511399k522717k064687O24296L368939L097475P51588
40442C277420L77294K559429L174996K10741k782215k443651n24111o9168n27098
$$ plain form
40433 3253637 3226844 4009799 4652479 5163333 6260549 6666819 3951006 -1312150 -5351057
40424 -5351057 -5916424 -4266879 -1928139 1130483 4090311 4564421 2040671 -679372
40416 -679372 -963776 1219807 5222525 10727284 15469232 15677765 11111880 6413363 5007011
40407 5007011 4957086 3663770 2978528 5548066 9017642 8863938 5399272 3054200 3493382
40398 3493382 4307061 4465460 6084479 9573995 11360786 8659418 3544158 81102
40390 81102 -516049 14920 59641 -570960 -1478578 -2398401 -3445521 -5057668 -6958967
40381 -6958967 -7318339 -4567079 -367045 1197743 -1541854 -5354015 -5742983 -1895771
40373 -1895771 3322304 7267766 9694565 11370970 12206271 11356514 8481429 4366320
$$ packed form
40433C253637k6793P82955O42680N10854J097216M06270k715813n263156m038907
40424e351057n65367J649545K338740L058622K959828M74110k523750k720043
40416f79372k84404K183583M002718N504759M741948K08533m565885m698517j406352
40407E007011m9925j293316o85242K569538L469576j53704l464666k345072M39182
40398C493382Q13679J58399J619019L489516J786791k701368n115260l463056
40390H1102n97151N30969M4721o30601r07618r19823j047120j612147j901299
40381f958967l59372K751260M200034J564788k739597l812161l88968L847212
40373a895771N218075L945462K426799J676405Q35301q49757k875085m115109
$$ plain form
40365 4366320 481999 -1780357 -1495026 1639021 6725812 11148850 11834191 8336834
40357 8336834 4276280 4191272 8598313 13256609 13839072 10437169 6815331 5984479 7449560
40348 7449560 8549997 7569839 5167471 3173938 2607747 3120541 3970430 4800304 5400196
40339 5400196 5537025 5466271 5912230 6977813 7760230 7690872 7436749 7569663 7235284 5462700
40329 5462700 3043458 1402450 90728 -2448663 -5518737 -5960246 -2320807 2724702
40321 2724702 5665471 6459355 7737064 10596994 13268043 13898704 12810908 11326885
40313 11326885 9639863 6912288 3042665 -579681 -2308284 -1923695 -768244 -73131
40305 -73131 547458 2280555 4681469 5047853 1273233 -4975883 -9104296 -7935179 -2558112
$$ packed form
40365D366320l884321k262356K85331L134047N086791M423038O85341l497357
40357H336834m060554q5008M407041M658296N82463l401903l621838q30852J465081
40348G449560J100437r80158k402368j993533n66191N12794Q49889Q29874N99892
40339E400196J36829p0754M45959J065583P82417o9358k54123J32914l34379j772584
40329E462700k419242j641008j311722k539391l070074m41509L639439N045509
40321B724702K940769P93884J277709K859930K671049O30661j087796j484023
40313A1326885j687022k727575l869623l622346j728603L84589J155451O95113
40305g3131O20589J733097K400914L66384l774620o249116m128413J169117N377067
$$ plain form
40296 -2558112 3196073 6136067 5356709 1988627 -1495258 -2679118 -1531534 -1010820
40288 -1010820 -3749334 -8166179 -9638102 -6002117 -230031 3193114 3022054 1314701
40280 1314701 248156 417669 1257159 1572538 440062 -1065083 -137099 4032383 7946513
40271 7946513 7505433 3239409 -597851 -1488007 -403962 1304398 3186518 3621419 481625
40262 481625 -4648305 -6439468 -2215252 4373219 8246573 8822025 8586715 8380514 7341921
40253 7341921 5765134 4653072 3433367 1050967 -1515852 -2580128 -2746555 -3782952
40245 -3782952 -5210108 -4974205 -3148521 -2033055 -2551916 -3193378 -2693186 -1456879 -286039
40236 -286039 135526 -1258117 -4516691 -7034176 -5956829 -2189970 604613 878933 205188
$$ packed form
40296b558112N754185K939994p79358l368082l483885j183860J147584N20714
40288a010820k738514m416845j471923L635985N772086L423145j71060j707353
40280A314701j066545J69513Q39490L15379j132476j505145R27984M169482L914130
40271G946513m41080m266024l837260q90156J084045J708360J882120M34901l139794
40262D81625n129930j791163M224216O588471L873354N75452k35310k06201j038593
40253G341921j576787j112062j219705k382400k566819j064276j66427j036397
40245c782952j427156K35903J825684J115466n18861o41462N00192J236307J170840
40236b86039M21565j393643l258574k517485J077347L766859K794583K74320o73745
$$ plain form
40227 205188 -432336 -1851609 -3649369 -3631391 -1670396 -926696 -3336853 -6443835 -6618761
40218 -6618761 -3353270 1267700 5263535 7279967 6523034 4124411 2950448 4296978
40210 4296978 6154448 6108986 4308058 2146146 -139589 -2828555 -5300234 -7015768
40202 -7015768 -8487026 -9702760 -9184709 -6336193 -3174878 -1857323 -1840243 -1283919 78007
40193 78007 1205487 1492734 635905 -1507147 -3136051 -761511 6135932 12507125 12857155
40184 12857155 7765976 2442418 115122 127135 1369163 3554575 5323230 5056440
40176 5056440 4044748 5275846 8470331 9956290 8430618 7003315 7768083 8042528
40168 8042528 4753196 -351517 -3173671 -3036994 -2621049 -3201553 -3189788 -1116980 2682506
$$ packed form
40227B05188o37524j419273j797760J7978J960995P43700k410157l106982j74926
40218f618761L265491M620970L995835K016432p56933k398623j173963J346530
40210D296978J857470m5462j800928k161912k285735k688966k471679j715534
40202g015768j471258j215734N18051K848516L161315J317555J7080N56324J361926
40193G8007J127480K87247q56829k143052j628904K374540O897443O371193L50030
40184A2857155n091179n323558k327296J2013J242028K185412J768655k66790
40176E056440j011692J231098L194485J485959j525672j427303P64768K74445
40168H042528l289332n104713k822154J36677M15945n80504J1765K072808L799486
$$ plain form
40159 2682506 7317379 11707449 13612347 11105175 5925266 2894680 4454599 7615350
40151 7615350 8032580 5510792 3302411 3144782 3799507 4267463 5393251 7309785 7912511
40142 7912511 5733472 2556110 1099398 1351569 1372867 772655 912950 2098608 3107129
40133 3107129 3562814 4427252 5934253 7340864 8848600 11043492 12053945 8636894
40125 8636894 1469095 -3934851 -3829689 -970041 -96204 -1299679 -1310741 537720 1697589
40116 1697589 1023420 113447 -145777 -1006853 -3127993 -5177041 -6072741 -6392370 -6692878
40107 -6692878 -6344079 -4832775 -2616158 -138743 2382696 3844890 2874315 248133
40099 248133 -1180937 30369 2100758 2696269 1832719 809168 -336843 -2445907 -4886685
$$ packed form
40159B682506M634873M390070J904898k507172n179909l030586J559919L160751
40151G615350M17230k521788k208381j57629O54725M67956J125788J916534O02726
40142G912511k179039l177362j456712K52171K1298o00212J40295J185658J008521
40133C107129M55685Q64438J507001J406611J507736K194892J010453l417051
40125H636894p167799n403946J05162K859648Q73837j203475j1062J848461J159869
40116A697589o74169r09973k59224q61076k121140k049048q95700l19629l00508
40107f692878L48799J511304K216617K477415K521439J462194r70575k626182
40099B48133j429070J211306K070389N95511q63550j023551j146011k109064k440778
$$ plain form
40090 -4886685 -5460659 -3088049 525504 2709621 2904970 2995045 4386801 5878828 5563999
40081 5563999 4023365 3640109 4885975 5778286 5550480 5872063 6920729 5499181 -59746
40072 -59746 -5780965 -6591351 -3170698 -270728 360781 807102 1620817 928355 -778681
40063 -778681 -288078 2490076 3296282 262691 -2757225 -2332072 -538034 -414331 -324780
40054 -324780 2663159 6691474 7388924 4684893 2699377 3556699 5553716 7261326 9369092
40045 9369092 11923806 13253357 12699913 11759927 11491664 10940055 9067116 6522487 4731264
40036 4731264 4534226 5999528 8150777 8813651 6448443 2445181 -10233 269547 1301180
40027 1301180 888849 -787120 -2083057 -2023461 -823030 684079 1441007 586062 -2114149
$$ packed form
40090d886685n73974K372610L613553K184117J95349R0075J391756J492027l14829
40081E563999j540634l83256J245866Q92311k27806L21583J048666j421548n558927
40072e9746n721219q10386L420653K899970O31509M46321Q13715o92462j707036
40063g78681M90603K778154Q06206l033591l019916M25153J794038J23703Q9551
40054c24780K987939M028315O97450k704031j985516Q57322J997017J707610K107766
40045I369092K554714J329551n53444r39986k68263n51609j872939k544629j791223
40036D731264j97038J465302K151249O62874k365208m003262k455414K79780J031633
40027A301180m12331j675969j295937N9596J200431J507109P56928q54945k700211
$$ plain form
40018 -2114149 -6345176 -11201940 -14586050 -13951528 -9276365 -4357583 -3014750 -4529872
40010 -4529872 -5181215 -3808972 -2786358 -3299768 -3317697 -1631263 -387930 -1120711 -1271500
40001 -1271500 1863895 5857403 6028723 2764911 1583199 5447582 11091016 14348470
39993 14348470 15316352 15763892 14735537 10452792 4688346 1166661 248592 -871556
39985 -871556 -2616904 -1871065 2365732 6171284 6154207 4569243 5542555 8338826 8437284
39976 8437284 4484103 184357 -1026358 224276 1616977 2377089 2931937 3683491 5286671
39967 5286671 8065427 10151669 8509521 3180069 -1674966 -2617672 -889668 190485
39959 190485 -181122 -466538 57892 772640 1352331 1689344 918530 -1411636 -3807767
$$ packed form
40018b114149m231027m856764l384110O34522M675163M918782J342833j515122
40010d529872o51343J372243J022614n13410j7929J686434J243333p32781j50789
40001a271500L135395L993508J71320l263812j181712L864383N643434L257454
39993A4348470R67882M47540j028355m282745n764446l521685r18069j120148
39985h71556j745348P45839M236797L805552j7077j584964R73312K796271R8458
39976H437284l953181m299746j210715J250634J392701P60112N54848P51554J603180
39967E286671K778756K086242j642148n329452m855035r42706J728004J080153
39959A90485l71607k85416N24430P14748N79691L37013p70814k330166k396131
$$ plain form
39950 -3807767 -4427740 -3684635 -3425996 -4049727 -4248975 -3123893 -803927 2412422 5688077
39941 5688077 7113074 5650118 3100773 1988020 2029525 1139877 -542399 -617938 1382628
39932 1382628 2827730 1975645 505121 667787 2040927 2728923 2246252 1644664 1816750
39923 1816750 2900329 4487460 5411500 4139978 378476 -4116195 -6803877 -6115115
39915 -6115115 -2226889 2814169 5908184 5370127 2844982 1433220 1848841 2044076 705871
39906 705871 -941195 -1349491 -639889 364407 1123267 639452 -1993962 -5125182 -4987590
39897 -4987590 -408406 4892682 6677290 5115273 3291181 2605968 2300702 2218584 3049952
39888 3049952 4376932 5137814 5679436 6792298 7066389 4161950 -1056637 -4667705 -4930878
$$ packed form
39950c807767o19973P43105K58639o23731j99248J125082K319966L216349L275655
39941E688077J424997j462956k549345j112753M1505q89648j682276p5539K000566
39932A382628J445102q52085j470524J62666J373140O87996m82671o01588J72086
39923A816750J083579J587131R24040j271522l761502m494671k687682O88762
39915f115115L888226N041058L094015n38057k525145j411762M15621J95235j338205
39906G05871j647066m08296P09602J004296P58860m83815k633414l131220J37592
39897d987590M579184N301088J784608j562017j824092o85213l05266q2118Q31368
39888C049952J326980P60882N41622J112862K74091k904439n218587l611068k63173
$$ plain form
39879 -4930878 -4719214 -7218345 -11379379 -13637083 -12720269 -10562211 -8919792 -7038767
39871 -7038767 -3186005 2389464 6703634 6524571 1811951 -3724191 -6227078 -5543681
39863 -5543681 -4439942 -4371017 -3879050 -1574125 1328161 2756211 2640914 2495714 3113581
39854 3113581 4172433 5341175 6253566 6080383 4774323 4096918 5456880 7173203 6281495
39845 6281495 3180501 1837386 4439861 8322471 9830812 9084232 8594640 8749224 7665351
39836 7665351 5102881 3509751 4369248 5664680 4309649 -889 -4413183 -5851215
39828 -5851215 -3773849 -389534 1627858 1762859 1534807 1463291 -330004 -4797370 -8635871
39819 -8635871 -7414684 -1992849 1526471 -697805 -5802270 -8842426 -8811594 -7572408
$$ packed form
39879d930878K11664k499131m161034k257704R16814K158058J642419J881025
39871g038767L852762N575469M314170j79063m712620n536142k502887O83397
39863e543681J103739O8925M91967K304925K902286J428050j15297j45200O17867
39854C113581J058852J168742R12391j73183j306060o77405J359962J716323q91708
39845F281495l100994j343115K602475L882610J508341p46580m89592J54584j083873
39836G665351k562470j593130Q59497J295432j355031m310538m412294j438032
39828e851215K077366L384315K017392J35001k28052p1516j793295m467366l838501
39819h635871J221187N421835L519320k224276n104465l040156L0832J239186
$$ plain form
39811 -7572408 -5463598 -1517022 3300950 6536785 7466908 6981385 4787990 -72072
39803 -72072 -5859092 -8467376 -5994854 -642668 4563679 8639456 11598109 13083121
39795 13083121 13367840 13844911 15169622 16172642 15424530 12634666 8194657 3111081
39787 3111081 -276390 139959 3007137 4122847 1539389 -2106776 -3734343 -3855974
39779 -3855974 -4500369 -5455142 -5362191 -4849406 -5351947 -5712187 -3319914 1299321 4064496
39770 4064496 2372725 -1643911 -3923320 -2979620 -686560 238336 -1378283 -4518431
39762 -4518431 -6935588 -7032409 -5031224 -2191443 616777 2903026 3824013 2825685 899890
39753 899890 -101093 447595 1620295 2687911 3793066 4576721 3683740 621781 -2907589
$$ packed form
39811g572408K108810L946576M817972L235835R30123m85523k193395m860062
39803g2072n787020k608284K472522N352186N206347M075777K958653J485012
39795A3083121K84719M77071J324711J003020p48112k789864m440009n083576
39787C111081l387471M16349K867178J115710k583458l646165j627567j21631
39779c855974o44395r54773R2951N12785n02541l60240K392273M619235K765175
39770D064496j691771m016636k279409R43700K293060R24896j616619l140148
39762d518431k417157r6821K001185K839781K808220K286249R20987r98328j925795
39753H99890j000983N48688J172700J067616J105155P83655q92981l061959l529370
$$ plain form
39744 -2907589 -4650468 -4209127 -2877847 -1614270 -322910 1075768 2199122 3175269
39736 3175269 4914197 7582373 9564733 9048801 6351482 3567885 1974082 1006683
39728 1006683 11587 -462710 127699 1161479 2020744 3208024 4826393 5056550 2190240
39719 2190240 -2345154 -5132708 -4883465 -3462089 -2803815 -2915989 -3216049 -3645036 -3767597
39710 -3767597 -2789401 -1330301 -1313454 -3158275 -4844192 -4698690 -3391248 -2300622 -1779091
39701 -1779091 -1909500 -2829527 -3230106 -988707 3157148 5066462 2336715 -2315011 -5013798
39692 -5013798 -5676916 -6338974 -6922024 -6134009 -4821508 -4605221 -4223036 -1043114 4269189
39683 4269189 8154060 8959629 8043435 6574061 4959325 5184523 9428263 15750523 19265376
$$ packed form
39744b907589j742879M41341J331280J263577J291360J398678J123354R76147
39736C175269J738928K668176J982360n15932k697319k783597j593803r67399
39728A006683r95096m74297N90409J033780Q59265J187280J618369K30157k866310
39719B190240m535394k787554K49243J421376O58274j12174l00060m28987j22561
39710c767597R78196J459100J6847j844821j685917J45502J307442J090626N21531
39701a779091j30409r20027m00579K241399M145855J909314k729747m651726k698787
39692e013798o63118o62058n83050P88015J312501K16287L82185L179922N312303
39683D269189L884871Q05569r16194j469374j614736K25198M243740O322260L514853
$$ plain form
39674 19265376 18622846 17287823 17104402 15122317 9316128 3288760 1594282 3363808
39666 3363808 4606257 4768277 6629468 10510152 12852243 11167533 7242269 4338156
39658 4338156 3413059 3279644 3008452 2980712 4226011 7405694 12110505 16936350 20578462
39649 20578462 22844490 24297266 25207949 25448418 25225325 25183944 25559720 25578946 23996909
39640 23996909 20365335 15834188 12468329 11400567 11730994 11577881 10064860 7913994
39632 7913994 6365988 6042450 6636231 7201735 6971818 6194467 5623470 5012672 3395781
39623 3395781 1509954 2077372 6003078 10022116 10603114 8862857 8557879 10119023 10400383
39614 10400383 8240233 6189684 5817210 5286744 3409537 2483783 4491517 7360762
$$ packed form
39674A9265376o42530j335023j83421j982085n806189o027368j694478J769526
39666C363808J242449J62020J861191L880684K342091j684710l925264k904113
39658D338156r25097j33415k71192k7740J245299L179683M704811M825845L642112
39649B0578462K266028J452776R10683K40469k23093m1381L75776J9226j582037
39640B3996909l631574m531147l365859j067762L30427j53113j513021k150866
39632G913994j548006l23538N93781N65504k29917p77351n70997o10798j616891
39623C395781j885827N67418L925706M019038N80998j740257l04978J561144K81360
39614A0400383k160150k050549l72474n30466j877207r25754K007734K869245
$$ plain form
39606 7360762 8053807 7288070 8015869 10504020 11982829 10753180 8246847 7014784 8152454
39597 8152454 10483530 11460619 9712351 7297572 7868757 11780658 15157948 15114642 13362119
39588 13362119 12651653 12416968 11032947 10072049 12263896 16361312 18149578 16409143
39580 16409143 14205240 13973384 14752004 15035209 15252072 16132091 17020802 17230989 17423481
39571 17423481 18563277 20627071 22769207 23650626 21816041 17453343 13573171 13262380
39563 13262380 15572987 16346617 13533900 9446895 7050091 6266711 5110740 2692658
39555 2692658 -79864 -1412381 573843 6356568 13334379 17114774 15688850 11351912
39547 11351912 7697743 5809123 4158490 1134813 -3166683 -6835706 -7446202 -4549202
$$ packed form
39606G360762O93045p65737P27799K488151J478809j229649k506333j232063J137670
39597H152454K331076R77089j748268k414779N71185L911901L377290m3306j752523
39588A3362119p10466k34685j384021r60898K191847M097416J788266j740435
39580A6409143k203903k31856P78620K83205K16863Q80019Q88711K10187J92492
39571A7423481J139796K063794K142136Q81419j834585m362698l880172l10791
39563A3262380K310607P73630k812717m087005k396804p83380j155971k418082
39555B692658k772522j332517J986224N782725O977811L780395j425924m336938
39547A1351912l654169j888620j650633l023677m301496l669023o10496K897000
$$ plain form
39539 -4549202 -1054106 -622189 -3319434 -5554304 -4842807 -2654476 -1601605 -1866421 -1933734
39530 -1933734 -1189015 -18456 1424316 2790274 2857961 1043752 -1089420 -1465416 -172961
39521 -172961 923307 801694 48471 -759343 -1996259 -4093023 -6580564 -8241847 -7933740
39512 -7933740 -5616522 -2885736 -1779590 -2505497 -3091472 -1890937 469786 2409809
39504 2409809 3628502 4870157 6230926 7038429 7127042 7217356 8135495 10070744 12017265
39495 12017265 11734246 7661681 1701824 -1562690 45216 3449369 4468411 3363426
39487 3363426 3568911 5858623 7261863 6100581 4686029 5461557 7045883 6246034 2463605
39478 2463605 -1887747 -4388870 -4355809 -2435220 -255249 -5672 -2554534 -5862483 -6571369
$$ packed form
39539d549202L495096M31917k697245k234870P11497K188331J052871k64816o7313
39530a933734P44719J170559J442772J365958O7687j814209k133172l75996J292455
39521a72961J096268j21613p53223q07814j236916k096764k487541j661283L08107
39512g933740K317218K730786J106146p25907n85975J200535K360723J940023
39504B409809J218693J241655J360769Q07503Q8613R0314R18139J935249J946521
39495A2017265k83019m072565n959857l264514J607906L404153J019042j104985
39487C363426K05485K289712J403240j161282j414552P75528J584326p99849l782429
39478B463605m351352k501123L3061J920589K179971K49577k548862l307949p08886
$$ plain form
39469 -6571369 -3356052 2162899 7521412 11075414 11700624 8753762 3363413 -1389068
39461 -1389068 -2890465 -1342648 925096 1908962 932603 -2019756 -6422991 -10567489
39453 -10567489 -12229797 -10816436 -8169459 -6594667 -6599032 -7109434 -7246251 -6951625 -6251200
39444 -6251200 -5058581 -3891765 -3867722 -5460240 -7629704 -8479476 -6648595 -2296548 2649192
39435 2649192 5350466 4280759 1187056 12188 2899956 7577064 9563647 6871170
39427 6871170 1701189 -2409779 -3946974 -3467367 -1597983 1469027 4736817 6352230
39419 6352230 5610715 4062199 3675005 4502522 5096806 4627475 3381165 1646078 -301614
39410 -301614 -1261019 -136917 1603105 522203 -4511987 -10164652 -12105506 -9419253
$$ packed form
39469f571369L215317N518951N358513L554002O25210k946862n390349m752481
39461a389068j501397J547817K267744R83866r76359k952359m403235m144498
39453a0567489j662308J413361K646977J574792m365n10402j36817K94626P00425
39444f251200J192619J166816K4043j592518k169464q49772J830881M352047M945740
39435B649192K701274j069707l093703j174868K887768M677108J986583k692477
39427F871170n169981m110968j537195M79607J869384L067010L267790J615413
39419F352230p41515j548516l87194Q27517N94284m69331j246310j735087j947692
39410c01614r59405J124102J740022j080902n034190n652665j940854K686253
$$ plain form
39402 -9419253 -4371984 559797 3591681 3205415 -381419 -3934039 -4082641 -1414973
39394 -1414973 638429 737567 636742 1130582 325845 -2767403 -5790600 -6145951 -4478921
39385 -4478921 -3047868 -2253889 -879330 1388430 3695126 5576956 7127213 8172954
39377 8172954 8588260 8731472 8427313 6498205 2680280 -953197 -2022965 -557889 1661608
39368 1661608 3481448 4527082 4077373 1857885 -675688 -1876707 -2260897 -3325814
39360 -3325814 -4558525 -4028195 -1849814 -479248 -1047578 -1716725 -565802 1821370 3618457
39351 3618457 3905766 2587385 -161824 -3139635 -4281630 -3074441 -1758984 -2642671
39343 -2642671 -4962418 -5900918 -4256761 -1606592 111418 733840 1079890 1005375 -720479
$$ packed form
39402i419253N047269M931781L031884l86266l586834l552620j48602K667668
39394a414973K053402R9138j00825M93840q04737l093248l023197l55351J667030
39385d478921J431053P93979J374559K267760K306696J881830J550257J045741
39377H172954M15306J43212l04159j929108l817925l633477j069768J465076K219497
39368A661608J819840J045634m49709k219488k533573j201019l84190j064917
39360c325814j232711N30330K178381J370566n68330o69147J150923K387172J797087
39351C618457K87309j318381k749209k977811j141995J207189J315457q83687
39343b642671k319747r38500J644157K650169J718010O22422L46050p4515j725854
$$ plain form
39334 -720479 -4518095 -8651396 -10562090 -9687093 -8142676 -7941380 -8296885 -6978814 -3951187
39325 -3951187 -1850649 -2386123 -3950231 -3964272 -2436224 -1707052 -3158996 -5569856 -6769904
39316 -6769904 -5920307 -3920779 -2221516 -1495441 -1175608 -248174 1349086 2426076 2076472
39307 2076472 1227211 1903526 4793722 8097794 9148932 6953590 2931944 -572508
39299 -572508 -2158441 -1901687 -622046 979310 2639177 4451565 6549756 8525199
39291 8525199 9098274 6940392 2348979 -2164299 -3652165 -1348498 2736428 5930619
39283 5930619 7353642 8082403 9103214 9653389 8096031 4316439 356839 -2004717
39275 -2004717 -3626718 -6634879 -10730778 -12515880 -9475196 -3580715 448942 201034
$$ packed form
39334g20479l797616m133301j910694Q74997J544417K01296l55505J318071L027627
39325c951187K100538n35474j564108j4041J528048P29172j451944k410860j200048
39316f769904Q49597J999528J699263P26075L19833R27434J597260J076990l49604
39307B076472q49261O76315K890196L304072J051138k195342m021646l504452
39299e72508j585933K56754J279641J601356J659867J812388K098191J975443
39291H525199N73075k157882m591413m513278j487866K303667M084926L194191
39283E930619J423023P28761J020811N50175j557358l779592l959600k361556
39275b004717j622001l008161m095899j785102L040684N894481M029657k47908
$$ plain form
39267 201034 -2212294 -2987718 -782422 2288169 3359856 2133866 1251090 3153128 6937595
39258 6937595 9231449 8280170 6078355 5867099 8397253 11405077 12164532 9952080 6516663
39249 6516663 4451905 4463742 4298638 1570508 -2542864 -4501024 -3537343 -2727824 -3732063
39240 -3732063 -3742146 -206340 4314117 5566567 3778315 2426870 2388201 1719961 357852
39231 357852 264824 1093222 560250 -542562 1155442 5168542 6674743 4362699 3239892
39222 3239892 6643890 10775103 11292261 10507567 12671183 15871283 14894761 9980374 6425701
39213 6425701 6324308 6564631 5072956 3607015 3561578 3740210 3368149 3191747 2719755
39204 2719755 525215 -1865501 -977094 2331519 2468248 -2630954 -7523347 -6891462 -2984085
$$ packed form
39267B01034k413328p75424K205296L070591J071687j225990q82776J902038L784467
39258F937595K293854r51279k201815k11256K530154L007824P59455k212452l435417
39249F516663k064758J1837j65104k728130m113372j958160R63681Q09519j004239
39240c732063j0083L535806M520457J252450j788252j351445l8669o68240j362109
39231C57852r3028Q28398n32972j102812J698004M013100J506201k312044j122807
39222C239892L403998M131213N17158p84694K163616L200100r76522m914387l554673
39213F425701j01393K40323j491675j465941m5437J78632l72061j76402m71992
39204B719755k194540k390716Q88407L308613J36729n099202m892393O31885L907377
$$ plain form
39195 -2984085 -1178076 -1532167 -598 3939135 6477505 5906241 4704217 4435471 3169164
39186 3169164 -207644 -2898409 -2105770 505189 1168062 -607771 -1864359 -870837 660453
39177 660453 432123 -1393333 -2988596 -3398644 -3048946 -2317283 -843830 1599852 4307666
39168 4307666 6055235 6093270 4739919 3309565 3318875 5169696 7517807 8446185 7302002
39159 7302002 4855575 1943271 -832986 -2061137 -118182 4015714 6114904 2807276
39151 2807276 -4305298 -10190773 -11460335 -8428857 -3138236 2280667 5636576 5791857
39143 5791857 4284306 3658048 3742335 1984021 -1885585 -4410251 -3216525 -627682 -141980
39134 -141980 -1394647 -1511645 -102608 377212 -1104312 -2650817 -2728533 -2347694 -2833960
$$ packed form
39195b984085J806009l54091J531569L939733K538370n71264j202024k68746j266307
39186C169164l376808k690765P92639K610959O62873j775833j256588R93522J531290
39177F60453k28330j825456j595263m10048L49698P31663J473453K443682K707814
39168D307666J747569L8035j353351j430354R310J850821K348111R28378j144183
39159G302002k446427k912304k776257j228151J942955M133896K099190l307628
39151B807276p112574n885475j269562L031478N290621N418903L355909J55281
39143E791857j507551o26258Q4287j758314l869606k524666J193726K588843M85702
39134a41980j252667j16998J409037M79820j481524j546505p7716L80839m86266
$$ plain form
39125 -2833960 -3413358 -2571090 -652948 529711 411049 676984 3130601 7187231 10229803
39116 10229803 10477714 8682326 6369131 3367892 -1239700 -6073055 -7803047 -5420029
39108 -5420029 -1930346 -299386 200230 1534808 2969791 2812546 2727234 6178636 12398945
39099 12398945 15916556 13583830 8878172 7124651 8925165 10800890 10553603 9152210
39091 9152210 8065408 7365962 6669752 6100984 5795350 5454010 4701784 3401952 1769344
39082 1769344 537615 454721 1125251 1169643 200466 -408756 290402 1087913 605596 -68503
39072 -68503 1104974 3502600 4249206 2480712 742765 1218640 2743498 3042842 2136074
39063 2136074 1536582 1328724 453096 -547825 362171 3302289 5364102 4292303 1865395
$$ packed form
39125b833960n79398Q42268J918142J182659j18662K65935K453617M056630L042572
39116A0229803K47911j795388k313195l001239m607592m833355j729992K383018
39108e420029L489683J630960M99616J334578J434983j57245q5312L451402O220309
39099A2398945L517611k332726m705658j753521J800514J875725k47287j401393
39091I152210j086802o99446o96210n68768l05634l41340p52226j299832j632608
39082A769344j231729q2894O70530M4392r69177o09222O99158P97511m82317o74099
39072f8503J173477K397626P46606j768494j737947M75875J524858K99344r06768
39063B136074n99492k07858q75628j000921R09996K940118K061813j071799k426908
$$ plain form
39054 1865395 1858517 5194474 8772046 9152697 6029069 1708972 -1540701 -2879230 -2680168
39045 -2680168 -2120475 -2546538 -4178643 -5590216 -5377460 -4192784 -4043887 -5469544 -6582631
39036 -6582631 -5482703 -2717805 -530182 -168558 -804281 -1002353 -565850 -589142 -1740833
39027 -1740833 -2729780 -1091496 3917926 9664279 12459690 11541865 9582700 9101906 9850549
39018 9850549 10274754 9754275 7998441 3835972 -3052297 -9782520 -12150049 -9402684
39010 -9402684 -5405099 -4288726 -6147858 -7726639 -6357989 -2479761 1074702 1707560
39002 1707560 -565546 -3167812 -3968731 -4072464 -6360898 -11058130 -14428668 -13035854
38994 -13035854 -8112032 -4134023 -3594107 -4772233 -4656666 -2471653 366006 2577460
$$ packed form
39054A865395o878L335957L577572L80651l123628m320097l249673j338529J99062
39045b680168N59693m26063j632105j411573K12756J184676J48897j425657j113087
39036f582631J099928K764898K187623L61624o35723j98072M36503k3292j151691
39027a740833r88947J638284N009422N746353K795411r17825j959165m80794P48643
39018I850549M24205n20479j755834m162469o888269o730223k367529K747365
39010i402684L997585J116373j859132j578781J368650L878228L554463O32858
39002A707560k273106k602266q00919j03733k288434m697232l370538J392814
38994a3035854M923822L978009N39916j178126J15567K185013K837659K211454
$$ plain form
38986 2577460 3987404 4482271 3401018 613814 -2583612 -4633738 -5477717 -6113991 -6521039
38977 -6521039 -5426866 -2541262 544947 2669278 4780702 7751951 9863764 8726062
38969 8726062 5001449 1798292 668707 751908 1704478 4199558 6723856 5411448 -655301
38960 -655301 -6478663 -6217118 192304 7762550 12397725 13547464 12047680 8483354
38952 8483354 3953641 134571 -2132254 -3112015 -3082965 -2249182 -1499654 -1816934 -3012983
38943 -3012983 -4203733 -5122011 -5676764 -4858104 -1797444 2426399 5685546 7196663 7505019
38934 7505019 6774717 5130303 4162215 5615294 8556317 10176965 9581023 8465634 7834821
38925 7834821 6579829 3915426 793030 -1860851 -3956457 -4565315 -2095728 2643281
$$ packed form
38986B577460J409944M94867j081253k787204l197426k050126q43979o36274m07048
38977f521039J094173K885604L086209K124331K111424K971249K111813j137702
38969H726062l724613l203157j129585Q3201R52570K495080K524298j312408o066749
38960f55301n823362K61545O409422P570246M635175J149739j499784l564326
38952H483354m529713l819070k266825r79761K9050Q33783P49528l17280j196049
38943c012983j190750r18278n54753Q18660L060660M223843L259147J511117L08356
38934G505019p30302j644414r68088J453079K941023J620648n95942j115389o30813
38925G834821j254992k664403l122396k653881k095606o08858K469587M739009
$$ plain form
38917 2643281 6086974 6160530 4623008 3682790 2784835 816908 -822958 -48442 2537840
38908 2537840 4582921 5185853 5000797 4297884 3128831 2449172 2994893 3963033 4638297
38899 4638297 5980200 8423760 9658523 7455748 3560922 1598761 1822118 1294943
38891 1294943 -1041536 -3100850 -3728234 -4381213 -5652638 -5421933 -2261028 1808625 3848616
38882 3848616 3491975 2358064 1644935 1782818 2970537 4577666 5288357 5081774 5648306
38873 5648306 7521408 8408820 6210200 2414578 325845 617081 853159 -745684 -3216434
38864 -3216434 -4972366 -6159868 -7755881 -9349944 -9216922 -6531619 -2499270 1145384
38856 1145384 4090108 7072821 9860168 10853200 9172241 6064373 3443817 1966496
$$ packed form
38917B643281L443693P3556j537522r40218q97955j967927j639866P74516K586282
38908B537840K045081O02932j85056p02913j169053o79659N45721R68140O75264
38899D638297J341903K443560J234763k202775l894826j962161K23357n27175
38891A294943k336479k059314o27384o52979j271425K30705L160905M069653K039991
38882C848616l56641j133911p13129J37883J187719J607129P10691k06583N66532
38873E648306J873102Q87412k198620l795622k088733K91236K36078j598843k470750
38864c216434j755932j187502j596013j594063J33022K685303M032349L644654
38856A145384K944724K982713K787347R93032j680959l107868k620556j477321
$$ plain form
38848 1966496 1437141 1942073 3152549 3581706 2391936 1075464 1216239 1472242 -430557
38839 -430557 -3246452 -3234960 95230 3031609 3526239 4087040 6742229 8960229 7823927
38830 7823927 5085855 3986793 3420648 121867 -4506987 -5035134 40815 5633506
38822 5633506 6867252 4718871 2849416 2089724 863472 -1047560 -2127268 -1648922
38814 -1648922 -379840 760027 1165492 245164 -1845136 -3512889 -2985308 -35226 4218800
38805 4218800 8434631 11064186 10397801 6306885 1512341 -519126 1007401 3992102
38797 3992102 6331098 7705312 8719955 9852798 11443275 13297567 14023944 12208033
38789 12208033 8708052 6342894 6642473 8279235 9427602 10035626 10540047 9969230 7301652
$$ packed form
38848A966496n29355N04932J210476M29157j189770j316472J40775K56003j902799
38839d30557k815895J1492L330190K936379M94630N60801K655189K218000j136302
38830G823927k738072j099062n66145l298781m628854n28147N075949N592691
38822E633506J233746k148381j869455p59692j226252j911032j079708M78346
38814a648922J269082J139867M05465r20328k090300j667753N27581K950082M254026
38805D218800M215831K629555o66385m090916m794544k031467J526527K984701
38797C992102K338996J374214J014643J132843J590477J854292P26377j815911
38789A2208033l499981k365158K99579J636762J148367O08024N04421n70817k667578
$$ plain form
38780 7301652 3788620 1899952 2413263 4333942 7095641 10603834 13357602 13138192
38772 13138192 10057046 6634400 4285631 2173790 322763 891513 4540299 8196254
38764 8196254 8953654 8056638 8142048 8432798 6249904 2107525 -748815 -1629129 -3065859
38755 -3065859 -5544398 -5719689 -1770919 2900755 4034845 2215314 1268757 2364113
38747 2364113 2735220 112089 -3961632 -5986572 -4613661 -2202438 -2241237 -5227600 -7752846
38738 -7752846 -6583844 -2943676 -957029 -2201642 -4238535 -4780363 -4428174 -4200143 -3302043
38729 -3302043 -1344741 -306869 -1810101 -4312402 -5531948 -6004081 -7455546 -8991953
38721 -8991953 -8043694 -4538787 -1267199 -178589 -603666 -934813 6565 2830629 6656407
$$ packed form
38780G301652l513032j888668N13311J920679K761699L508193K753768k19410
38772A3138192l081146l422646k348769k111841j851027N68750L648786L655955
38764H196254P57400q97016Q5410K90750k182894m142379k856340q80314j436730
38755c065859k478539j75291L948770M671674J134090j819531r46557J095356
38747B364113L71107k623131m073721k024940J372911K411223l8799k986363k525246
38738g752846J169002L640168J986647j244613k036893n41828L52189K28031Q98100
38729c302043J957302J037872j503232k502301j219546m72133j451465j536407
38721h991953R48259L504907L271588J088610m25077l31147R41378K824064L825778
$$ plain form
38712 6656407 8885455 8120082 6504177 6559624 6745951 3803647 -876419 -1669111 3390965
38703 3390965 9180584 10097329 6854913 4044714 3509303 3388748 2352509 1468996 1828914
38694 1828914 2618178 2228779 260870 -1936373 -2417930 -564366 1998375 2917935 1570433
38685 1570433 -700065 -2469896 -3116697 -2188508 186549 2213868 1970351 442044 603966
38676 603966 2738489 3451251 748266 -2763113 -3855046 -3136749 -2692150 -1736093 1486900
38667 1486900 4951795 4533509 468029 -2096518 -177139 2969051 2741539 -679507
38659 -679507 -3615183 -4349452 -4352000 -4722800 -4267955 -1816727 1415730 3123877 2858931
38650 2858931 2392477 3035280 3713945 2662323 499554 97367 2878134 6536423 7559316
$$ packed form
38712F656407K229048p65373j615905N5447J86327k942304m680066p92692N060076
38703C390965N789619R16745l242416k810199n35411j20555j036239q83513L59918
38694A828914P89264l89399j967909k197243m81557J853564K562741R19560j347502
38685A570433k270498j769831o46801R28189K375057K027319k43517j528307J61922
38676F03966K134523P12762k702985l511379j091933P18297M44599R56057L222993
38667A486900L464895m18286m065480k564547J919379L146190k27512l421046
38659f79507k935676p34269k548l70800M54845K451228L232457J708147k64946
38650B858931m66454O42803O78665j051622k162769m02187K780767L658289J022893
$$ plain form
38641 7559316 5183653 1598869 -1040113 -2086859 -1248413 1807723 5947714 8478890
38633 8478890 7993901 6333524 6294354 7911257 8474762 6193470 2420400 -328615 -1513131
38624 -1513131 -2615861 -4337406 -4966775 -2284850 3319847 8513903 10047104 7605929
38616 7605929 3372660 -556348 -3416718 -4774048 -3780097 -388898 3395037 4827653
38608 4827653 3215574 535696 -1040868 -1359109 -1441367 -1452623 -827065 31318 -138892
38599 -138892 -1349468 -1938855 -1079730 -379821 -1727159 -4466225 -6179285 -5757417 -4198244
38590 -4198244 -2549595 -600392 2069885 4900053 6757178 7019250 6103557 5246459 5420209
38581 5420209 5969489 4990533 1877086 -1385815 -2689914 -2596724 -2914801 -3367815 -2128314
$$ packed form
38641G559316k375663l584784k638982j046746Q38446L056136M139991K531176
38633H478890m84989j660377l9170J616903N63505k281292l773070k749015j184516
38624a513131j102730j721545o29369K681925N604697N194056J533201k441175
38616G605929m233269l929008k860370j357330R93951L391199L783935J432616
38608D827653j612079k679878j576564l18241q2258j1256O25558Q58383j70210
38599a38892j210576n89387Q59125O99909j347338k739066j713060M21868J559173
38590d198244J648649J949203K670277K830168J857125K62072r15693q57098J73750
38581E420209N49280r78956l113447l262901j304099R3190l18077m53014J239501
$$ plain form
38572 -2128314 577448 2103574 1089388 -899577 -2101305 -2534982 -2412946 -1137561
38564 -1137561 788752 1303473 4335 -329785 2501300 6631885 8551019 7496681
38556 7496681 5321724 3443738 2224019 2097358 2868882 2904729 1433350 629802 2756309
38547 2756309 6107012 6826511 4372932 2025434 1840576 2256494 1420479 -58834 -1023874
38538 -1023874 -2057911 -4180949 -6821359 -8548390 -8710901 -7237901 -3913322 932047
38530 932047 5726499 8779980 9892471 10226895 10666258 10578162 8402585 3868863 -590617
38521 -590617 -2039464 -1123061 -1892099 -5984621 -9289850 -7421630 -2805914 -2065926 -6676130
38512 -6676130 -10856733 -9843036 -5807015 -3292469 -2734003 -1954701 -1143152 -2059132 -3748502
$$ packed form
38572b128314K705762J526126j014186j988965j201728m33677J22036J275385
38564a137561J926313N14721j299138l34120K831085M130585J919134j054338
38556G496681k174957j877986j219719j26661P71524L5847j471379q03548K126507
38547B756309L350703P19499k453579k347498j84858M15918q36015j479313r65040
38538a023874j034037k123038k640410j727031j62511J473000L324579M845369
38530I32047M794452L053481J112491L34424M39363q8096k175577m533722m459480
38521e90617j448847R16403p69038m092522l305229J868220M615716P39988m610204
38512f676130m180603J013697M036021K514546N58466P79302Q11549r15980j689370
$$ plain form
38503 -3748502 -3379652 -1286739 -1394487 -5641006 -10859773 -12711227 -10712224 -7676454
38495 -7676454 -5513994 -3612320 -1105575 1136123 1680895 780414 178607 742737 1514161
38486 1514161 1591605 1712595 2865729 4347273 4760948 4274135 4054036 3889639 2499190
38477 2499190 121222 -1496333 -1881552 -2118464 -1923234 598388 5147152 8317584 8489333
38468 8489333 8671310 11567613 14295187 11930477 5135544 180086 1232215 6026817
38460 6026817 9860242 10867546 10042502 8456982 6486484 4821196 4639386 6557363
38452 6557363 9580662 11204558 9480351 5705451 3774882 5325768 6869682 4205138
38444 4205138 -1258816 -3838971 -1153017 3269323 5817319 7403761 10022705 12049100
$$ packed form
38503c748502L68850K092913j07748m246519n218767j851454J999003L035770
38495g676454K162460J901674K506745K241698N44772r00481o01807N64130P71424
38486A514161P7444J20990J153134J481544M13675m86813k20099j64397j390449
38477B499190k377968j617555l85219k36912J95230K521622M548764L170432J71749
38468H489333J81977K896303K727574k364710o794933m955458J052129M794602
38460F026817L833425J007304q25044j585520j970498j665288j81810J917977
38452F557363L023299J623896j724207l774900j930569J550886J543914k664544
38444D205138n463954k580155K685954M422340K547996J586442K618944K026395
$$ plain form
38436 12049100 10525165 6288920 3077418 2136561 1130477 -1454302 -3916701 -4178415
38428 -4178415 -2523159 -383624 1595655 3046402 3144946 1818696 390064 -294965 -1145969
38419 -1145969 -2871693 -4096093 -3287289 -1512800 -1023959 -1692509 -1388132 111269 281271
38410 281271 -2300431 -5625270 -7004665 -6195540 -4433307 -2223334 236538 2118230
38402 2118230 3378318 5603871 9284186 11689824 10161357 6465019 4805403 6022233
38394 6022233 7041393 6048963 4602563 3809741 2013446 -1908189 -5843789 -7280202
38386 -7280202 -6644125 -5642710 -4220385 -1605565 1077843 1816398 595374 -757258
38378 -757258 -1009608 -214441 1112648 1851714 456960 -2726196 -4364721 -1703396 3394446
$$ packed form
38436A2049100j523935m236245l211502r40857j006084k584779k462399k61714
38428d178415J655256K139535J979279J450747R8544j326250j428632o85029q51004
38419a145969j725724j224400Q08804J774489M88841o68550L04377J499401J70002
38410B81271k581702l324839j379395Q09125J762233K209973K459872J881692
38402B118230J260088K225553L680315K405638j528467l696338j659616J216830
38394F022233J019160r92430j446400p92822j796295l921635l935600j436413
38386g280202O36077J001415J422325K614820K683408P38555j221024j352632
38378g57258k52350P95167J327089P39066j394754l183156j638525K661325N097842
$$ plain form
38369 3394446 6293748 5089520 1997119 -385337 -1561012 -1681545 -333138 2073625
38361 2073625 3554429 2508312 -504286 -3594183 -5278202 -5094878 -3607406 -2223208
38353 -2223208 -2065075 -2695946 -2802299 -2199147 -2063014 -3019306 -4206070 -4636376 -4413708
38344 -4413708 -4058682 -3532208 -2629839 -1856966 -2277585 -4429589 -7415325 -9176605 -8205695
38335 -8205695 -5197903 -2324677 -580113 1143327 3828756 6557072 8021219 8508080
38327 8508080 8902552 8805261 7301250 4738713 2125154 -343991 -2493903 -3034049 -1278234
38318 -1278234 994409 1700973 1623323 2959726 5520509 7095114 6948420 6006499 4165195
38309 4165195 807911 -2259307 -2166064 397599 1701655 827246 1050570 4067659 6783728
$$ packed form
38369C394446K899302j204228l092401k382456j175675j20533J348407K406763
38361B073625J480804j046117l012598l089897j684019J83324J487472J384198
38353b223208J58133o30871j06353O03152J36133r56292j186764m30306K22668
38344d413708L55026N26474R02369P72873m20619k152004k985736j761280R70910
38335h205695L007792K873226J744564J723440K685429K728316J464147M86861
38327H508080L94472r7291j504011k562537k613559k469145k149912n40146J755815
38318a278234K272643P06564p7650J336403K560783J574605j46694r41921j841304
38309D165195l357284l067218R3243K563663J304056q74409K23324L017089K716069
$$ plain form
38300 6783728 6059892 3419490 2512566 4321341 7103909 9061162 9249879 7779500 6409029
38291 6409029 6771636 7227710 4540596 -453209 -2918306 -1388225 -302683 -2381390
38283 -2381390 -3516676 341356 5709421 6644012 3849472 2345649 2507293 554213
38275 554213 -3089304 -3438609 327536 2764277 877766 -1136102 1032951 4984092
38267 4984092 5683253 2822446 203922 -59193 640483 201196 -1994037 -4838221 -5991681
38258 -5991681 -3777768 341703 2672493 1599762 -744897 -1951797 -2230600 -2574866
38250 -2574866 -2393653 -927129 715577 893655 -423094 -2337554 -4446845 -6110117
38242 -6110117 -5858171 -3363541 -805098 -456119 -1765703 -2361374 -1136140 981361 2416784
$$ packed form
38300F783728p23836k640402r06924J808775K782568J957253J88717j470379j370471
38291F409029L62607M56074k687114m993805k465097J530081J085542k078707
38283b381390j135286L858032N368065R34591k794540j503823J61644j953080
38275E54213l643517l49305L766145K436741j886511k013868K169053L951141
38267D984092O99161k860807k618524k63115O99676m39287k195233k844184j153460
38258e991681K213913M119471K330790j072731k344659j206900k78803l44266
38250b574866J81213J466524J642706J78078j316749j914460k109291j663272
38242f110117K51946K494630K558443L48979j309584n95671J225234K117501J435423
$$ plain form
38233 2416784 1861974 -1138136 -5102315 -7035452 -5300931 -1313261 2605181 5757202
38225 5757202 8146384 8596673 6026872 1936635 -458500 469228 3656069 7126219
38217 7126219 9437594 9735914 7979987 5264719 2881719 1007904 -1048192 -3681361
38209 -3681361 -6724607 -9669917 -11276167 -9727280 -4460364 2411704 7452970 8624308
38201 8624308 6426236 3143540 1420978 2483643 4927791 6152977 5522237 4805046
38193 4805046 4979690 4656202 2941064 1603171 2222987 3106793 1839760 -431069 -413916
38184 -413916 2306215 4847490 5483746 5342641 5253798 4008130 973657 -1952836 -2536944
38175 -2536944 -880121 1126067 1767241 279549 -2944191 -6191632 -7651648 -7320682
$$ packed form
38233B416784n54810l000110l964179j933137J734521L987670L918442L152021
38225E757202K389182M50289k569801m090237k395135R27728L186841L470150
38217G126219K311375K98320j755927k715268k383000j873815k056096k633169
38209c681361l043246k945310j606250J548887N266916O872068N041266J171338
38201H624308k198072l282696j722562J062665K444148J225186o30740p17191
38193D805046J74644l23488j715138j337893O19816Q83806j267033k270829J7153
38184d13916K720131K541275O36256j41105q8843j245668l034473k926493n84108
38175b536944J656823K006188O41174j487692l223740l247441j460016L30966
$$ plain form
38167 -7320682 -6600916 -5880917 -4067740 -853063 2240595 3696255 3455134 2097308 133665
38158 133665 -1441166 -1624904 -1046185 -1375489 -2474644 -2149871 295100 2397659 1935947
38149 1935947 182521 -20006 1939667 4289209 5337858 4399484 1362306 -2799151
38141 -2799151 -5834915 -6268907 -5111808 -4174767 -3554693 -2434681 -1481131 -2250392 -4352753
38132 -4352753 -5166335 -2827632 1571019 4857362 4186176 -762801 -6863783 -9564621
38124 -9564621 -7303694 -3378349 -2012083 -3388529 -4470911 -3932832 -3575674 -4743764
38116 -4743764 -6025698 -5491756 -3227203 -600021 1409619 2296872 2046572 1920487 3505971
38107 3505971 5886089 5633449 1349464 -3352876 -3711219 131526 3369117 2789750 427725
$$ packed form
38167g320682P19766P19999J813177L214677L093658J455660k41121j357826j963643
38158A33665j574831j83738N78719l29304j099155L24773K444971K102559m61712
38149A935947j753426k02527J959673K349542J048649r38374l037178m161457
38141b799151l035764m33992J157099R37041O20074J120012R53550p69261k102361
38132d352753q13582K338703M398651L286343o71186m948977o100982k700838
38124i564621K260927L925345J366266j376446j082382N38079L57158j168090
38116d743764j281934N33942K264553K627182K009640Q87253k50300j26085J585484
38107C505971K380118k52640m283985m702340l58343L842745L237591n79367k362025
$$ plain form
38098 427725 129899 2354229 4027151 2799129 -280103 -2582498 -3144387 -3212229 -4174831
38089 -4174831 -6135720 -8523500 -10773817 -11760142 -9892524 -5282925 -1074125 -727182
38081 -727182 -3974738 -7130875 -7558361 -6012206 -4199132 -2285932 -92716 1267674
38073 1267674 971241 451171 1669108 4140593 5682777 5633522 5310581 5552388 5893670
38064 5893670 6134107 6506662 6015651 2997927 -1780674 -4794829 -3930608 -1256407 -79208
38055 -79208 -716801 -966497 421413 2745643 5021908 6525833 6046168 2794160 -1678782
38046 -1678782 -4282314 -3682213 -1563633 -324276 -730157 -2008717 -2834155 -1927159 789956
38037 789956 3173170 2637331 -292981 -1870720 338139 4282049 6029383 4121324
$$ packed form
38098D27725k97826K224330J672922j228022l079232k302395n61889o7842r62602
38089d174831j960889k387780k250317r86325J867618M609599M208800L46943
38081g27182l247556l156137m27486J546155J813074J913200K193216J360390
38073A267674k96433n20070J217937K471485J542184m9255l22941K41807L41282
38064E893670K40437L72555m91011l017724m778601l014155Q64221K674201J177199
38055g9208o37593k49696J387910K324230K276265J503925m79665l252008m472942
38046a678782k603532O00101K118580J239357m05881j278560q25438R06996K717115
38037G89956K383214n35839k930312j577739K208859L943910J747334j908059
$$ plain form
38029 4121324 -72427 -4730182 -8222333 -8614839 -5193082 -204424 3211975 4764683
38021 4764683 6559786 9105848 10370219 9209425 7091927 5450036 3760788 1566920
38013 1566920 102233 213549 724229 785714 1808299 4548972 6058045 2849828 -3611061
38004 -3611061 -7954766 -7574429 -5195824 -4179898 -4333806 -3975663 -3639921 -5155896 -8070618
$$ packed form
38029D121324m193751m657755l492151l92506L421757M988658L416399J552708
38021D764683J795103K546062J264371j160794k117498j641891j689248k193868
38013A566920j464687J11316N10680O1485J022585K740673J509073l208217o460889
38004c611061m343705L80337K378605J015926j53908L58143L35742j515975k914722
$$ [...]
##END NTUPLES=NMR SPECTRUM
##END=
