##TITLE=31Pdec_DE-62EA_2EXT
 D2O, 64 sc
 22.7.2024
##JCAMPDX= 6.0         $$ Bruker NMR JCAMP-DX V2.0
##DATA TYPE= NMR SPECTRUM
##DATA CLASS= NTUPLES
##ORIGIN= UXNMR, Bruker Analytische Messtechnik GmbH
##OWNER= root
$$ XWIN-NMR		Version 3.5
$$ Mon Jul 22 14:00:10 2024 Russian Standard Time (UT+4h)  she@DPX200
##.OBSERVE FREQUENCY= 81.013821
##.OBSERVE NUCLEUS= ^31P
##.ACQUISITION MODE= SIMULTANEOUS
##.ACQUISITION SCHEME= undefined
##.AVERAGES= 64
##.DIGITISER RES= 17
##SPECTROMETER/DATA SYSTEM= spect
##.PULSE SEQUENCE= zgpg30
##.SOLVENT NAME= D2O
##.SHIFT REFERENCE= (INTERNAL, D2O, 0, 198.062)
##AUDIT TRAIL= $$ (NUMBER, WHEN, WHO, WHERE, WHAT)
$$ ##TITLE= Audit trail, XWIN-NMR		Version 3.5
$$ ##JCAMPDX= 5.01
$$ ##ORIGIN= Bruker BioSpin GmbH
$$ ##OWNER= she
$$ F:/spectra/data/she/nmr/P31/2/pdata/1/auditp.txt
$$ ##AUDIT TRAIL=  $$ (NUMBER, WHEN, WHO, WHERE, WHAT)
(   1,<2024-07-22 13:59:03.81 +0400>,<she>,<DPX200>,
      <created by zg, POWCHK disabled, PULCHK disabled
       configuration hash MD5:
       00 E9 B6 7A A2 85 ED C7 34 08 36 98 17 FE 4E 26
       data hash MD5: 32K
       69 0C 65 AE 30 02 DF 2D 42 E3 1E AA 29 E7 C6 45>)
(   2,<2024-07-22 13:59:12.46 +0400>,<she>,<DPX200>,
      <Start of raw data processing
       efp BC_mod = 2 LB = 1.5 FT_mod = 6 PKNL = 1 PHC0 = 2678.432 PHC1 = 3.886981 SI = 64K 
       data hash MD5: 64K
       C1 0A 27 A2 66 A8 9D A8 D4 78 B0 F0 20 A2 01 4C>)
(   3,<2024-07-22 13:59:33.25 +0400>,<she>,<DPX200>,
      <pk PHC0 = 34.42269 PHC1 = -87.2 
       data hash MD5: 64K
       9C 17 E6 3A C0 DC 1A C3 8E 38 40 84 69 F5 37 A6>)
(   4,<2024-07-22 13:59:42.04 +0400>,<she>,<DPX200>,
      <abs ABSG = 5 
       data hash MD5: 64K
       0B 55 B3 4A A1 F1 06 10 31 4B 9F 18 12 1E 04 7E>)
$$ ##END=
$$ 
$$ hash MD5
$$ 1D 17 16 A2 F2 73 A1 72 4B 54 2A 4B 92 B0 1B 96
##$RELAX= 
##$RELAX= 
##$RELAX= 
##$RELAX= 
##$RELAX= 
##$RELAX= 
##$RELAX= 
##$RELAX= 
$$ Bruker specific parameters
$$ --------------------------
##$DU= <F:/spectra>
##$EXPNO= 2
##$NAME= <P31>
##$PROCNO= 1
##$TYPE= <nmr>
##$USER= <she>
##$AMP= (0..31)
100 100 100 100 100 100 100 100 100 100 100 100 100 100 100 100 100 100 
100 100 100 100 100 100 100 100 100 100 100 100 100 100 
##$AQSEQ= 0
##$AQ_mod= 1
##$AUNM= <au_zg>
##$AUTOPOS= <>
##$BF1= 81.014009
##$BF2= 200.13
##$BF3= 200.13
##$BF4= 200.13
##$BF5= 200.13
##$BF6= 200.13
##$BF7= 200.13
##$BF8= 200.13
##$BYTORDA= 1
##$CFDGTYP= 0
##$CFRGTYP= 5
##$CHEMSTR= <none>
##$CNST= (0..31)
1 1 145 1 1 1 1 1 1 1 1 1 1 1 1 1 1 1 1 1 1 1 1 1 1 1 1 1 1 1 1 1 
##$CPDPRG= <waltz16>
##$CPDPRG1= <>
##$CPDPRG2= <waltz16>
##$CPDPRG3= <>
##$CPDPRG4= <mlev>
##$CPDPRG5= <mlev>
##$CPDPRG6= <mlev>
##$CPDPRG7= <mlev>
##$CPDPRG8= <mlev>
##$CPDPRGB= <>
##$CPDPRGT= <>
##$D= (0..31)
0 1 0 0 0 0 0 0 0 0.06 0 0.03 2e-05 3e-06 0 0 0.0002 0 0 0 0 0 0 0 0 0 
0 0 0 0 0 0 
##$DATE= 1721642343
##$DBL= (0..7)
120 120 120 11 120 120 24 19 
##$DBP= (0..7)
150 150 150 150 150 150 150 150 
##$DBP07= 0
##$DBPNAM0= <>
##$DBPNAM1= <>
$$ [...]
##$SUBNAM3= <"">
##$SUBNAM4= <"">
##$SUBNAM5= <"">
##$SUBNAM6= <"">
##$SUBNAM7= <"">
##$SUBNAM8= <"">
##$SUBNAM9= <"">
##$SW= 400.765351723535
##$SWIBOX= (0..15)
0 1 3 0 0 0 0 0 0 0 0 0 0 0 0 0 
##$SW_h= 32467.5324675325
##$TD= 32768
##$TD0= 1
##$TE= 0
##$TE2= 300
##$TE3= 300
##$TEG= 300
##$TL= (0..7)
0 120 53 12 22 120 120 120 
##$TP= (0..7)
150 150 150 150 150 150 150 150 
##$TP07= 0
##$TPNAME0= <>
##$TPNAME1= <>
##$TPNAME2= <>
##$TPNAME3= <>
##$TPNAME4= <>
##$TPNAME5= <>
##$TPNAME6= <>
##$TPNAME7= <>
##$TPOAL= (0..7)
0.5 0.5 0.5 0.5 0.5 0.5 0.5 0.5 
##$TPOFFS= (0..7)
0 0 0 0 0 0 0 0 
##$TUNHIN= 0
##$TUNHOUT= 0
##$TUNXOUT= 0
##$USERA1= <user>
##$USERA2= <user>
##$USERA3= <user>
##$USERA4= <user>
##$USERA5= <user>
##$V9= 5
##$VALIST= <valist>
##$VCLIST= <CCCCCCCCCCCCCCC>
##$VD= 0
##$VDLIST= <DDDDDDDDDDDDDDD>
##$VPLIST= <PPPPPPPPPPPPPPP>
##$VTLIST= <TTTTTTTTTTTTTTT>
##$WBST= 1024
##$WBSW= 4
##$XGAIN= (0..3)
0 0 0 0 
##$XL= 0
##$YL= 0
##$YMAX_a= 8169
##$YMIN_a= -4944
##$ZGOPTNS= <>
##$ZL1= 120
##$ZL2= 120
##$ZL3= 120
##$ZL4= 120
##$ABSF1= 198.0616
##$ABSF2= -202.7028
##$ABSG= 5
##$ABSL= 3
##$ALPHA= 0
##$AQORDER= 0
##$ASSFAC= 0
##$ASSFACI= 0
##$ASSFACX= 0
##$ASSWID= 0
##$AUNMP= <proc_1d>
##$AZFE= 0.1
##$AZFW= 0.5
##$BCFW= 0
##$BC_mod= 2
##$BYTORDP= 0
##$COROFFS= 0
##$CY= -3
##$DATMOD= 1
##$DC= 0
##$DFILT= <>
##$DTYPP= 0
##$F1P= 0
##$F2P= 0
##$FCOR= 1
##$FTSIZE= 65536
##$FT_mod= 6
##$GAMMA= 0
##$GB= 0
##$INTBC= 1
##$INTSCL= 9.790993e-09
##$ISEN= 30
##$LB= 1.5
##$LEV0= 0
##$LPBIN= 0
##$MAXI= 10000
##$MC2= 0
##$MEAN= 0
##$ME_mod= 0
##$MI= 50
##$NCOEF= 0
##$NC_proc= -9
##$NLEV= 6
##$NOISF1= 182.463
##$NOISF2= 159.3651
##$NSP= 0
##$NTH_PI= 0
##$NZP= 0
##$OFFSET= 198.0616
##$PC= 4
##$PHC0= 2712.854
##$PHC1= -83.31302
##$PH_mod= 1
##$PKNL= yes
##$PPARMOD= 0
##$PSCAL= 0
##$PSIGN= 0
##$REVERSE= no
##$SF= 81.0140089999434
##$SI= 65536
##$SIGF1= 159.3651
##$SIGF2= -187.1042
##$SINO= 113.3802
##$SIOLD= 16384
##$SREGLST= <1H.CDCl3>
##$SSB= 0
##$STSI= 65536
##$STSR= 0
##$SW_p= 32467.5324675325
##$SYMM= 0
##$S_DEV= 0
##$TDeff= 32768
##$TDoff= 0
##$TI= <>
##$TILT= no
##$TM1= 0
##$TM2= 0
##$TOPLEV= 0
##$USERP1= <user>
##$USERP2= <user>
##$USERP3= <user>
##$USERP4= <user>
##$USERP5= <user>
##$WDW= 1
##$XDIM= 65536
##$YMAX_p= 399780753
##$YMIN_p= -137927379
$$ End of Bruker specific parameters
$$ ---------------------------------
##NTUPLES= NMR SPECTRUM
##VAR_NAME=  FREQUENCY,     SPECTRUM/REAL,   SPECTRUM/IMAG
##SYMBOL=    X,             R,               I
##VAR_TYPE=  INDEPENDENT,   DEPENDENT,       DEPENDENT
##VAR_FORM=  AFFN,          ASDF,            ASDF
##VAR_DIM=   65536,         65536,           65536
##UNITS=     HZ,            ARBITRARY UNITS, ARBITRARY UNITS
##FACTOR=    0.49542278885378, 1,            1
##FIRST=     16045.7642231865, 0,            0
##LAST=      -16421.768244346, 0,            0
##MIN=       -16421.768244346, -137927379,   0
##MAX=       16045.7642231865, 399780753,    0
$$ Real data points
##PAGE= N=1
##DATA TABLE= (X++(R..R)), XYDATA
$$ [...]
42148A1863218k905247o08861p23259j523210j84720J399135J71024j586525N55600
42139F457155M897024N110732K35693l396590j910577Q50445R46402R27398L623798
42130A7741480M718942j106171r602774j0771835k951092M465905L716944k533104
42122C678295p196117p410795m162445J145832N727860N591653J056112j679860
42114c249465J155995M767635L045535j544130j879543K088139L098564j666909
42106E815821n922189l862735J535946L636178J237697j822404l210409l484056
42098f076151k541903L38084K923722J189473m456258q037608n673320j145600
42090b3479561j04997j119609K106853R810298J3613250P728216k123161n670704
$$ plain form
42148 11863218 8957971 8349110 7625851 6102641 5917921 7317056 7488080 5901555 6457155
42139 6457155 11354179 16464911 16700604 13304014 11393437 12243882 13190284 14117682 17741480
42130 17741480 22460422 21354251 11751477 979642 -1971450 2494455 6211399 3678295
42122 3678295 -3517822 -10928617 -15091062 -13945230 -8217370 -2625717 -1569605 -3249465
42114 -3249465 -2093470 2674165 5719700 4175570 2296027 4384166 7482730 5815821
42106 5815821 -106368 -3969103 -2433157 1203021 2440718 618314 -2592095 -6076151
42098 -6076151 -8618054 -8279970 -5356248 -4166775 -8623033 -16660641 -22333961 -23479561
42090 -23479561 -23584558 -24704167 -22597314 -12787016 826234 8554450 6431289 760585
42082G60585j065189M320922M537382R68119k265016l381321k299557L39669J898865
42073C814459k33864l755097l180887J531750L432793r58855n129571j870895
42065f350167N387885P496575L020498j136824j599083k377769n243152m721639
42057e523676K531097R871936Q970896K200072p74231K471487L793948k606877
42049B0934652j0937958j2024823o036757r19451m51988o80391J669324M120984
42041d326408M214848M126598N221218L375446m009915j0234604o548730M173200
42033d008347R397218L615208m694416n487243M00589N244765N067275J399670
42025A0934719l125322n902258m454353r8340J471652k255266n532747j867905
$$ plain form
42082 760585 -304604 4016318 8553700 9521819 7256803 3875482 1575925 1915594 3814459
42073 3814459 3580595 -174502 -3355389 -1823639 1609154 650299 -4479272 -6350167
42065 -6350167 -962282 6534293 9554791 8417967 6818884 4441115 -802037 -5523676
42057 -5523676 -2992579 6879357 15850253 18050325 17276094 19747581 23541529 20934652
42049 20934652 9996694 -2028129 -8064886 -8984337 -9436325 -10116716 -8447392 -4326408
42041 -4326408 -111560 4015038 9236256 12611702 8601787 -1632817 -8181547 -4008347
42033 -4008347 5388871 9004079 4309663 -1177580 -776991 4467774 9535049 10934719
42025 10934719 7809397 1907139 -2547214 -2645554 -1173902 -3429168 -8961915 -10829820
42017a0829820N979897R058989L848362m284646q410027o351792m57874M820934
42009f625977N736941K993947J484199L419273M458520O18877m468681m899920
42001B717179j971701j166425j852724J503444Q191906J0274997M597899k215219
41993B0079356l812139k224975k262644l833288m168330l065813j838182n87401
41985a713416K59869r46802l808602n074158l279737o97485R03058K220362K801554
41976i335357P15235k331344j584516K514574L441855n07456j934578L702033
41968e319554R324167O779089m15745l751365l627099n936195q475618l198586
41960a4620906Q160086J2964498N449940m510895n455271Q57914M743821K704104
$$ plain form
42017 -10829820 -4849923 4209066 8057428 3772782 -4637245 -10989037 -11446911 -6625977
42009 -6625977 -889036 2104911 3589110 7008383 11466903 12085780 7617099 2717179
42001 2717179 745478 -420947 -2273671 -770227 7421679 17696676 22294575 20079356
41993 20079356 16267217 14042242 11779598 7946310 3777980 712167 -1126015 -1713416
41985 -1713416 -1453547 -2400349 -6208951 -11283109 -14562846 -15260331 -14357273 -12136911 -9335357
41976 -9335357 -8620122 -10951466 -12535982 -10021408 -6579553 -7087009 -9021587 -5319554
41968 -5319554 4004613 10783702 10367957 6616592 2989493 -2946702 -11422320 -14620906
41960 -14620906 -6460820 6503678 11953618 7442723 1987452 2845366 7589187 10293291
41952A0293291o89284j798351k237393m563494q030008r447138o452384J36942
41944b2787819O450906Q634839O209679J807249j776131k864059n97090L797078
41936a125348O236159L797261o97814j832900N88251J127127l028853p754946
41928b691063p777164l106173K284893M926529L164049k506252q078515q171094
41920b1954790k116163M622255P147197O274653M874011K773487j210375n062483
41912d652208n462130k375277J392845L761208L941387J585476j686641k122489
41904e617829J515024N223820N010873K452243J209843Q00650j117858k664252
41896F812514l30853L395864K016451m738930r290238o647250n02711L477163
$$ plain form
41952 10293291 9604007 7805656 5568263 1004769 -7025239 -16472377 -22924761 -22787819
41944 -22787819 -16336913 -7702074 -1492395 314854 -1461277 -4325336 -4922426 -1125348
41936 -1125348 5110811 8908072 8210258 6377358 6965609 8092736 5063883 -2691063
41928 -2691063 -10468227 -13574400 -11289507 -6362978 -3198929 -5705181 -13783696 -21954790
41920 -21954790 -24070953 -19448698 -12301501 -6026848 -1152837 1620650 410275 -4652208
41912 -4652208 -10114338 -12489615 -11096770 -7335562 -3394175 -1808699 -3495340 -5617829
41904 -5617829 -4102805 1121015 6131888 8584131 9793974 10594624 9476766 6812514
41896 6812514 6481661 9877525 11893976 7155046 -2135192 -8782442 -9285153 -5807990
41888e807990M726122M991334L855432J218490j03803J253069J816075j286568
41880A0662161m900588m803771k973595m033698o648006n205767M15332L577393
41872a3910539P40317l232683k272000K710566N913392M184407j63771k433732
41864h464043J40540N669106Q485902M683356k878633p522869o856250m689973
41856a1432864m442937m755058l214305l32859K512285N206005O303477K573777
41848g582479n106654r461800n390965K327129N423303L567660K950106N192474
41840h081226N324351J215557k441327j889675J45979k60774k476213l912504
41832a2375832l837431j588126M253771J1301196J2795182O291403j219759k173892
$$ plain form
41888 -5807990 -1081868 3909466 7764898 8983388 8879585 10132654 11948729 10662161
41880 10662161 5761573 957802 -2015793 -6049491 -12697497 -17903264 -17487932 -13910539
41872 -13910539 -13170222 -16402905 -18674905 -15964339 -10050947 -5866540 -6030311 -8464043
41864 -8464043 -8323503 -2654397 5831505 10514861 7636228 113359 -6742891 -11432864
41856 -11432864 -15875801 -20630859 -23845164 -24178023 -21665738 -16459733 -10156256 -7582479
41848 -7582479 -12689133 -22150933 -27541898 -25214769 -19791466 -16223806 -13273700 -8081226
41840 -8081226 -2756875 -1541318 -3982645 -5872320 -5726341 -5987115 -8463328 -12375832
41832 -12375832 -16213263 -17801389 -13547618 -2246422 10548760 16840163 15620404 13446512
41824A3446512J214708J497170k192572m133822k309283q39263j633414j041200
41816D008836K945536O382498N379061J579313j344705k449774k019788L46845
41808A4827822K997961J918778l046246n851079k678179J304016o23184n819138
41800C030751n941631J12970M759120L605014J036451J593037K878857J249343
41792A2323912j186289o34368J427038J255683J00662K179328O540228P188941
41784B9195135J877483m611298p328724o613596m844089k253390J090659K779926
41776I292106J198176j239942j483107n76520j392473l221911k884099o09113
41768i16883k15110k697679l955781q97077L640676M844693K398439j17852q18575
$$ plain form
41824 13446512 14661220 16158390 13965818 9831996 7522713 6683450 5050036 4008836
41816 4008836 6954372 13336870 18715931 20295244 18950539 16500765 14480977 14827822
41808 14827822 17825783 19744561 16698315 10847236 8169057 9473073 8849889 3030751
41800 3030751 -2910880 -2797910 1961210 5566224 6602675 8195712 11074569 12323912
41792 12323912 11137623 10503255 11930293 13185976 13286638 15465966 22006194 29195135
41784 29195135 31072618 26461320 19132596 12519000 7674911 5421521 6512180 9292106
41776 9292106 10490282 9250340 7767233 7190713 5798240 2576329 -307770 -916883
41768 -916883 -1131993 -3829672 -7785453 -8682530 -5041854 -197161 2201278 2083426 1264851
41759A264851j081756j774048j220732J778372N056881N259843K349350J00439
41751A1733200J416603M281216M004179m53570m438569l406102Q67384K618660
41743A6623001o7994l359264m109074m009595n048279m824129o73675M056717
41735a412292L274817k750994o698975l635025L201564P656996P730841N187879
41727A2554811J817540q30329q65511J287204J717505k018225o465460o435645
41719G61890k267399J029850J038283J4842j37519l38466q16721M52403L793838
41710C531001N913782M278158M59060l110475o607502j0213886j1084264o959008
41702b3793134j048132J008330j333593k787340N90399O544799R791485P895224
$$ plain form
41759 1264851 183095 -1590953 -2811685 -1033313 4023568 9283411 11632761 11733200
41751 11733200 13149803 17431019 21435198 20981628 16543059 13136957 14004341 16623001
41743 16623001 16555007 13195743 9086669 5077074 28795 -4795334 -5469009 -1412292
41735 -1412292 1862525 -888469 -7587444 -11222469 -8020905 -363909 7366932 12554811
41727 12554811 14372351 13542022 12676511 13963715 15681220 13662995 7197535 761890
41719 761890 -1505509 -475659 562624 577466 439947 101481 -715240 -262837 3531001
41710 3531001 9444783 13722941 14182001 11071526 4464024 -5749862 -16834126 -23793134
41702 -23793134 -24841266 -23832936 -25166529 -27953869 -27363470 -20818671 -11027186 -3131962
41694c131962L210767L08483J669148M983980N398811J575329k092212j443410
41686A0478934J230903N79572l400966n092122j744870K558676L249637J433933
41678I293697Q50064J716979J061307k294437n977244o876276m080166M31607
41670e874469L124863J962993j154698k201615L63085M327764O975145P147149
41662A4670217M113306j993641p595422p505306j573246L885960L760163J391
41654G763422k682232l171937k386036Q38431P114343J1985607R679686J090603
41646C0231887o413525p448598l674632m76915j342842n404931q582625p725771
41638a0837952m536878l136048k931051J407995J0128003J4434814Q010563k440271
$$ plain form
41694 -3131962 78805 387288 2056436 7040416 12439227 14014556 11922344 10478934
41686 10478934 11709837 12289409 8888443 3796321 2051451 4610127 7859764 9293697
41678 9293697 10143761 11860740 12922047 10627610 4650366 -2225910 -6306076 -5874469
41670 -5874469 -2749606 -786613 -1941311 -4142926 -3779841 547923 7523068 14670217
41662 14670217 18783523 16789882 9194460 1689154 115908 4001868 7762031 7763422
41654 7763422 5081190 1909253 -476783 361648 7475991 19461598 29141284 30231887
41646 30231887 23818362 16369764 12695132 12218217 10875375 5470444 -3112181 -10837952
41638 -10837952 -15374830 -18510878 -21441929 -20033934 -9905931 4528883 12539446 10099175
41630A0099175n485500j68126N097662N745036L908020J38659p035399j3264375
41622i64848j1060480k258091K602248R7607j503034K566728N095627J70738n502403
41613a0755908l539056K124591K359230j951167k376709K920917P378898O672731
41605B833527K862104r44288l036834j662993K394543L711350r11570o022815
41597g76976n037236j215762k412017o985785n428549L625662R774952O341239
41589b114472Q460j30581M384236N677333J748216k352415k969294j405057M39971
41580C286397L077049O684089Q226757L957728n070249j1900649j0299139k158957
41572d196974M531965N457959L839576L246970J878552k189908n138946k884813
$$ plain form
41630 10099175 4613675 4445549 9543211 15288247 19196267 19334926 12299527 -964848
41622 -964848 -12025328 -14283419 -11681171 -11583564 -13086598 -10519870 -5424243 -5253505 -10755908
41613 -10755908 -14294964 -12170373 -9811143 -11762310 -14139019 -11218102 -3839204 2833527
41605 2833527 5695631 4751343 1714509 51516 2446059 6157409 5245839 -776976
41597 -776976 -5814212 -7029974 -9441991 -16427776 -21856325 -18230663 -8455711 -2114472
41589 -2114472 -2106012 -2236593 2147643 7824976 9573192 7220777 4251483 2846426 3286397
41580 3286397 6363446 13047535 21274292 25232020 20161771 8261122 -2038017 -4196974
41572 -4196974 334991 5792950 9632526 12879496 14758048 12568140 7429194 4544381
41564D544381R92351k39791n774715p963301l206123L956149P503869N314237
41556E127057j463995q788819j0253031l263091N828732Q701621O080997M965750
41548F935221O253223M018953k502673n973520k805911Q30255q82321m669398
41540A203829m402374j45962L790221N147322M049665J135912j507181j446136
41532G825296L6211n45380k195923k71902M610922N824847J444633k067578n43508
41523A4117618J429192n41318k967976j577794R38871O42405n42098J02433L4529
41514A1635862k795650m220013j081093J773504m88194l548407j536802J765271
41506A504478p01773o043132n393201J446866O054828M836025K208898O91769
$$ plain form
41564 4544381 5536732 5296941 -477774 -8441075 -11647198 -7691049 -187180 5127057
41556 5127057 3663062 -5125757 -15378788 -18641879 -12813147 -4111526 1969471 6935221
41548 6935221 13188444 17207397 14704724 8731204 5925293 6755548 5873227 1203829
41540 1203829 -3198545 -3344507 445714 5593036 9642701 10778613 9271432 7825296
41532 7825296 7861507 7316127 5120204 4848302 9459224 15284071 16728704 14661126 14117618
41523 14117618 15546810 15005492 12037516 10459722 11398593 12040998 11498900 11601333 11635862
41514 11635862 8840212 4620199 3539106 5312610 4824416 1276009 -260793 1504478
41506 1504478 802705 -5240427 -10633628 -9186762 -3131934 1704091 3912989 4604758
41498D604758k220046o337627o978246k796503J841608L696694L546054J952568
41490b690740j163485k687446Q25081O141624O364201J314693k380477j945421
41482C778030j339807k566362k328557O06026K450576J435950Q21402K351504
41474E208762L432190L171404M224442O017079L571523l312564o893420k209387
41466A3210029M977157N838887n68285q098171j1017294p470198J08103N315608
41458B295836L365565j486948j03385P618141J0611873K529077q312199j1067983
41450E449977p142293m939320n800444m428585K42798L747176M085687L265736
41442e519268J974364k75629r02791K725088O925929N644986K79445k195113j150073
$$ plain form
41498 4604758 2384712 -3952915 -10931161 -13727664 -11886056 -8189362 -4643308 -2690740
41490 -2690740 -3854225 -6541671 -5716590 425034 6789235 8103928 5723451 3778030
41482 3778030 2438223 -128139 -2456696 -1850670 599906 2035856 2857258 5208762
41474 5208762 8640952 11812356 16036798 22053877 25625400 22312836 15419416 13210029
41466 13210029 18187186 24026073 23457788 15359617 4342323 -3127875 -3019772 2295836
41458 2295836 5661401 4174453 4071068 11689209 22301082 24830159 16517960 5449977
41450 5449977 -1692316 -6631636 -12432080 -16860665 -16617867 -12870691 -8785004 -5519268
41442 -5519268 -3544904 -3820533 -4723324 -1998236 4927693 10572679 10852124 8657011 7506938
41433G506938l573642j1009501j4057633n498713P584657J2015596N315748k923314
41425d639864n001826l065341k003015j368657J211188L077023n50943p619935
41417a9961370r579247k708906N876548P215766J882081k241950j132053J937670
41409a8711461L265589L308994L547751L587050K925013J823839o21414n325672
41401f200311r184812o857011J490996Q481150P996824J907575l455151l783199
41393i603939J640936R984611J4288848Q325774m490068j2200416q505125q75141
41385a434520M81986l296506l366546K800770Q798747R270721N327182k4510n501232
41376A3056092r424731r030955l821696L223248Q469138R640474N963170p56760
$$ plain form
41433 7506938 3933296 -7076205 -21133838 -26632551 -19047894 -7032298 -1716550 -4639864
41425 -4639864 -9641690 -12707031 -14710046 -16078703 -14867515 -11790492 -12341435 -19961370
41417 -19961370 -29540617 -32249523 -26372975 -19157209 -17275128 -19517078 -20649131 -18711461
41409 -18711461 -15445872 -12136878 -8589127 -5002077 -2077064 -253225 -874639 -6200311
41401 -6200311 -15385123 -22242134 -20751138 -12269988 -4273164 -2365589 -5820740 -9603939
41393 -9603939 -7963003 2021608 16310456 24636230 20146162 7945746 -559379 -1434520
41385 -1434520 -952534 -4249040 -7615586 -4814816 3983931 13254652 18581834 18557324 13056092
41376 13056092 3631361 -5399594 -9221290 -5998042 2471096 12111570 18074740 17317980
41368A7317980o064579o863798m653831k361111l5742L012773M454090K035542
41360F841324j571577k346479j764753m013920p253874m726272M365492J1699955
41352A229896J0129693J990418n513829q690075q258974n961331l699666l228133
41344b2002001l759473k209685J903050M610189L227481J050587K624101O340277
41336h215474O214394O54803m852117n018735j198275J891483L263092N433775
41328a827054P782358N370720k963643r733326p430122J97745K417461k913794
41320i099655o100422r02309N214058K787055m125565l657665N664010J2732511
41312B512018J0154259L090116r19697k317419m583731n675606j553863N144978
$$ plain form
41368 17317980 11253401 4389603 -264228 -2625339 -2661081 351692 4805782 6841324
41360 6841324 5269747 2923268 1158515 -2855405 -10109279 -14835551 -10470059 1229896
41352 1229896 11359589 13350007 7836178 -853897 -9112871 -15074202 -18773868 -22002001
41344 -22002001 -25761474 -27971159 -26068109 -21457920 -18230439 -17179852 -14555751 -8215474
41336 -8215474 -2001080 -1346277 -6198394 -11217129 -12415404 -10523921 -7260829 -1827054
41328 -1827054 5955304 11326024 8362381 -1370945 -8801067 -8603322 -6185861 -9099655
41320 -9099655 -15200077 -16102386 -10888328 -8101273 -12226838 -15884503 -10220493 2512018
41312 2512018 12666277 15756393 14836696 12519277 7935546 2259940 706077 5851055
41304E851055P126609K641571k172383k356900q32338l046219p823983q137809
41296h750397j297342N906414N393020j385549n497617k775961J530194J729532
41288e147706m46991n27454J022006Q41670r90675k033110k489453l887674m683545
41279a8342932k422828J324346L275799L912987N424379O416206M754341L337227
41271G679525N694060P686338K300102p863892j2376619q182007l289184l032980
41263a1384657k757137J553885N052130K863863p57089N32582M991283O843346
41255F938206N552255M045633J947090k352381o249371o320486m381550l936718
41247d757322l529079j94228L219682J551537l406380m477545L60083N535812
$$ plain form
41304 5851055 12977664 15619235 13446852 11089952 10257614 7211395 -612588 -8750397
41296 -8750397 -10047739 -4141325 1251695 -133854 -5631471 -8407432 -6877238 -5147706
41288 -5147706 -5594697 -6122151 -5100145 -4258475 -5249150 -7282260 -9771713 -13659387 -18342932
41279 -18342932 -20765760 -19441414 -16165615 -12252628 -6828249 -412043 4342298 7679525
41271 7679525 13373585 21059923 23360025 15496133 3119514 -5062493 -8351677 -11384657
41263 -11384657 -14141794 -12587909 -7535779 -4671916 -5429005 -4896423 94860 6938206
41255 6938206 12490461 16536094 18483184 16130803 9881432 3560946 -820604 -4757322
41247 -4757322 -8286401 -8480629 -5260947 -3709410 -7115790 -11593335 -11233252 -5697440
41239e697440O218957L273480m79054l435091l932890r20238K924971L046326
41231I99021q76194m238805l598324q2215L485869N259581L946920n11811n257668
41222h73626o867273n756567m958198m613287j781023L738621P776387P513615
41214e821351N050833L369578K112660k05620k481453k388314o0956K016674K310604
41205C902655J771979K119750L509644M222507K738853p1479j788106j765056
41197A4640747k036121l883179n401657m432450k308348k100909m057739n332130
41189a4911786l788137O5341M347423O965041O217261K326958k228144n492424
41181f498467p804420r108112o920470j76471O866654Q662934N412125K202848
$$ plain form
41239 -5697440 521517 3794997 3315943 -119148 -4052038 -4972276 -2047305 999021
41231 999021 122827 -4115978 -7714302 -7796517 -4310648 948933 4895853 4384042 -873626
41222 -873626 -7740899 -13497466 -18455664 -23068951 -24849974 -21111353 -13334966 -5821351
41214 -5821351 -770518 2599060 4711720 4506100 2024647 -363667 -424623 1592051 3902655
41205 3902655 5674634 7794384 11304028 15526535 18265388 18193909 16405803 14640747
41197 14640747 12604626 8721447 3319790 -1112660 -3421008 -5521917 -9579656 -14911786
41189 -14911786 -18699923 -18634582 -14287159 -7322118 -1104857 1222101 -1006043 -6498467
41181 -6498467 -14302887 -23410999 -30331469 -30507940 -23641286 -14978352 -9566227 -7363379
41173g363379J826517K497416K441997K454706L184113L415229K083058l74173
41165A0165484k868053l952470k346378M76856M40259k930449l600215K181521
41157b433445P389155K722185p954000j0895610k431027N415364L530659j066070
41149e722789J509737O948337M317744m996606q758023k863050L256570K004540
41141d303540k214447k422420l9741l43272k890099l214483p90872R51105J099676
41132a4168093K215752M807676N392935J374895m893056q223272n541503J425088
41124a7609578P261861P313147K689534j07071L066462P698000N785163k890369
41116A3207149r498476p806294k054956L44418o81896l40125J404406K45750l296583
$$ plain form
41173 -7363379 -5536862 -3039446 -597449 1857257 5041370 8456599 10539657 10165484
41165 10165484 7297431 3344961 998583 1475439 1915698 -1014751 -4614966 -2433445
41157 -2433445 4955710 7677895 -276105 -11171715 -13602742 -8187378 -4656719 -5722789
41149 -5722789 -4213052 2735285 7053029 2056423 -6701600 -9564650 -6308080 -4303540
41141 -4303540 -6517987 -8940407 -8980148 -9323420 -12213519 -15428002 -16218874 -15267769 -14168093
41132 -14168093 -11952341 -7144665 -1751730 -376835 -5269891 -13493163 -19034666 -17609578
41124 -17609578 -10347717 -3034570 -345036 -452107 2614355 10312355 16097518 13207149
41116 13207149 3708673 -4097621 -6152577 -5808159 -6490055 -6830180 -5425774 -5180024 -8476607
41107h476607l322540J219082L553676j19634m016426k180682J848740J681911
41099i812480p76597O80421M785645M639122K16036j015547K814592M201787p87092
41090D945887m884009j013520N777059N410216k635239r558754r699744n510574
41082a7168678r67822L100027O264545O776057M632435K566445K171079J812217
41074I186305l12105l476771n835937o250104l855489J691379Q178435J1193765
41066A0519478Q301260J663583m589639q154334q627838n771495m9248N850908
41058h57325Q366818O340966J843066k108043l495378j635337K245078M570715
41050A5270560K080037l831898p651380o461920l935442m868354p758889p036380
$$ plain form
41107 -8476607 -11799147 -10580065 -7026389 -7146023 -11162449 -13343131 -11494391 -9812480
41099 -9812480 -10589077 -9908656 -5123011 -483889 -267853 -1283400 1531192 5732979 4945887
41090 4945887 61878 -951642 4825417 10235633 7600394 -1958360 -11658104 -17168678
41082 -17168678 -18136500 -15036473 -8771928 -1995871 2636564 5203009 7374088 9186305
41074 9186305 8874200 5397429 -438508 -6688612 -10544101 -8852722 -674287 10519478
41066 10519478 18820738 20484321 15894682 7740348 -887490 -6658985 -6708233 -857325
41058 -857325 7509493 13850459 15693525 13585482 10090104 8454767 10699845 15270560
41050 15270560 17350597 13518699 5867319 -594601 -4530043 -9398397 -17157286 -24193666
41042b4193666j810474K799487L788495M096990N826548N253853o06139o754303
41034a1599209n833280J176746O224259N263828J842251l49054j955110l530407
41026h759976k768771R41027L973277L633783K058554K110568L014218K918694
41018G121374K179161J049771k076177o471385p008029j107881N356506M801427
41010C844767j330072m608620j666328K091650J629198r26436j244098K55753
41002a954186K20298j776580l093122k373415p38046P78804K084022K427045P63994
40993c661186j667185j742581J229387L914740L744443L076474N223039P908218
40985A8025349N665780j029866m884378k491533k6599l440289q183864n934292
$$ plain form
41042 -24193666 -26004140 -23204653 -19416158 -15319168 -9492620 -4238767 -4844906 -11599209
41034 -11599209 -17432489 -16255743 -10031484 -4767656 -2925405 -3274459 -5229569 -8759976
41026 -8759976 -11528747 -10587720 -6614443 -2980660 -922106 1188462 4202680 7121374
41018 7121374 9300535 10350306 8274129 1802744 -5205285 -6313166 -956660 3844767
41010 3844767 2514695 -2093925 -3760253 -1668603 -39405 -965841 -2209939 -1954186
41002 -1954186 -1733888 -3510468 -6603590 -8977005 -9715051 -8936247 -6852225 -4425180 -3661186
40993 -3661186 -5328371 -7070952 -5841565 -1926825 1817618 4894092 10117131 18025349
40985 18025349 23691129 22661263 17776885 15285352 15258753 11818464 3634600 -2299692
40977b299692J831566N768956K992193k4946K31426q45085n344662o866091j465821
40968f022156L690117Q54741n364782m922086K054772O462966M770284K275593
40960C799449K150066J192870j636592j605182L027919O084900K380415l849980
40952A1543865m862023k86450L011131K37058o227762j0409615q794469l182483
40944a8970748J171019J032981r13514M20337M999312O980406K935648k799807
40936e144366l783152K21561M039594M552875L552607L328047K903491J48666
40928I819323m154604o248776l552858J922249N143949L325989j048484l123093
40920B083695q60282L634078P031748P334565M160608j197795n708045o557590
$$ plain form
40977 -2299692 -468126 5300830 8293023 8268077 8499503 7654418 2309756 -4556335 -6022156
40968 -6022156 -2332039 -1477298 -6842080 -11764166 -9709394 -3246428 1523856 3799449
40960 3799449 5949515 7142385 5505793 3900611 6928530 13013430 15393845 11543865
40952 11543865 6681842 6395392 9406523 9643581 3415819 -6993796 -15788265 -18970748
40944 -18970748 -17799729 -16766748 -17680262 -17259925 -12260613 -5280207 -2344559 -5144366
40936 -5144366 -8927518 -8705957 -4666363 -113488 3439119 6767166 9670657 9819323
40928 9819323 5664719 -584057 -4136915 -2214666 2929283 6255272 5206788 2083695
40920 2083695 1223413 4857491 11889239 19223804 23384412 22186617 16478572 9920982
40912I920982l955143q24843N71933O29864J036559K509994L743585J981717m037649
40903A1576999j0509879j0400334j946850O776846O393828j674980p025614m213256
40895a1023240J414013L553519L819342O359995R131903P044803R89444k898476
40887A8391303k303461j241566k962439n409442n409794l425489j852585j334216
40879e547689j116447j264417k208204k922252j495179K440265O765308Q354992
40871C006377N305348j450867p841379q689474j996294P828579J2359848P089246
40863A5611384k775742o913719j802152M532906K824419m615922o971971p80236
40855h91033M491775M92782o879789n821596L487225Q814735M027616k310336
$$ plain form
40912 9920982 5965839 5140996 5712929 6342793 7379352 9889346 13632931 15614648 11576999
40903 11576999 1067120 -9333214 -11280064 -4503218 1890610 215630 -6809984 -11023240
40895 -11023240 -9609227 -6055708 -2236366 4123629 13255532 20300335 21289779 18391303
40887 18391303 16087842 14846276 11883837 6474395 1064601 -2360888 -4213473 -5547689
40879 -5547689 -6664136 -7928553 -10136757 -13059009 -14554188 -12113923 -5348615 3006377
40871 3006377 8311725 6860858 -980521 -9669995 -11666289 -3837710 8522138 15611384
40863 15611384 12835642 5921923 4119771 8652677 11477096 6861174 -110797 -891033
40855 -891033 3600742 4093524 -2786265 -8607861 -5120636 3694099 7721715 5411379
40847E411379o99768M992542M436944k878610p290974l629674K408796M098479
40839F849114K463335J769307K145774J361032k52501j572277m161252q750366
40831a47834j0772169n360313M356082R906432Q244354M079087J183236k157440
40823I331435p148614j0138980p760428j847634L985479Q409392J0066911O347939
40815A1245500j196475n100310j252187M048076K533692l957941p091177n163143
40807e933965m081923n761417m587703K382454R544029J0888564P950532N265177
40799A5665748K780053k098708p953521r963160o185037K09814M680067N253184
40791B388440L251573J481281J314605J302675l93074k857186l839185l540061
$$ plain form
40847 5411379 4711611 9704153 14141097 11262487 3971513 341839 2750635 6849114
40839 6849114 9312449 11081756 13227530 14588562 14336061 12763784 8602532 -147834
40831 -147834 -10920003 -16280316 -11924234 -2017802 6226552 10305639 11488875 9331435
40823 9331435 2182821 -7956159 -15716587 -17564221 -13578742 -5169350 4897561 11245500
40815 11245500 10049025 4948715 3696528 7744604 10278296 6320355 -770822 -5933965
40807 -5933965 -10015888 -15777305 -20365008 -17982554 -8438525 2450039 10400571 15665748
40799 15665748 18445801 16347093 8393572 -1569588 -7754625 -7544811 -2864744 2388440
40791 2388440 5640013 7121294 8435899 9738574 9345500 6488314 2649129 -890932
40783h90932l711533l346346M29838O456341R131442N742989O2364l533993n284496
40774E055674o568174n610259r74078L836264M174789R48290j014919k86623q2979
40765e22015k292234m468598l884637j380908N23835J198007J582741J551599
40757g692210j1831k352878k509049L23413J963686j577554o659042n050442L829192
40748a9736715R845485N952774p89492M33186P349469Q459682J865983j996873
40740A1383499J662247L751676l110826j1441620j0048268p66226N484948M437235
40732A352665J033740o23030j168133j286247n33849j42874j243610j659186M51281
40723c819243K264484J079856l2345J883545K026389m953273j2898540j0335649
$$ plain form
40783 -890932 -4602465 -7948811 -7518973 -1062632 8068810 13811799 13874163 10340170 5055674
40774 5055674 -1512500 -7122759 -8096837 -4260573 -85784 862506 -152413 -439036 -522015
40765 -522015 -2814249 -7282847 -11167484 -12548392 -12024557 -10826550 -9243809 -7692210
40757 -7692210 -7704041 -10056919 -12565968 -12242555 -10278869 -11856423 -18515465 -23565907 -19736715
40748 -19736715 -9891230 -3938456 -4727948 -4294762 3054707 11514389 13380372 11383499
40740 11383499 13045746 16797422 13686596 2244976 -7803292 -8569518 -3084570 1352665
40732 1352665 2386405 1763375 595242 -691005 -1224854 -1367728 -2611338 -4270524 -3819243
40723 -3819243 -1554759 -474903 -507248 1376297 3402686 -1550587 -14449127 -24784776
40715b4784776J372867P686640J652728n856670k448535Q193684J3009528P961968
40707F787434R16761j280503k79847l61148j755615k490947k726741l581719l473263
40698h245588K83128N747126O360222j34414n873412j656380R338579J3744477
40690A9563738N636428n495989q478492m787136k624354l190601j938966P10675
40682f04697K14850k157101l03115N517791P778589L454119j710596k793025j761312
40673G635503j338736j02836K857995M455640K271729j849548n055294n976910
40665B897543l252282K929977P371741M566596k397933m973881k004121p51903
40657D385737l445140l091830L269805P642334L881721j906044j859961P88162
$$ plain form
40715 -24784776 -23411909 -15725269 -14072541 -19929211 -22377746 -14184062 -1174534 6787434
40707 6787434 7704195 6423692 6143845 5782697 4027082 1536135 -1190606 -4772325 -8245588
40698 -8245588 -7962460 -2215334 4144888 4010474 -1862938 -3519318 5819261 19563738
40690 19563738 25200166 19704177 11225685 6438549 3814195 623594 -1315372 -604697
40682 -604697 -389847 -2546948 -2850063 2667728 10446317 13900436 12189840 9396815 7635503
40673 7635503 6296767 6193931 9051926 13507566 15779295 13929747 8874453 2897543
40665 2897543 -354739 2575238 9946979 14513575 12115642 7141761 5137640 4385737
40657 4385737 940597 -2151233 1118572 8760906 12642627 10736583 8876622 9664784
40649I664784j182651n321484l555105L558970O767560J488367o705441r958384
40641e243384n707129K916651R361176P661341j201560q383910o626763J278669
40633e944909O928540O359005J983541k166081l142508l84764K182075m50616
40625E364283n765214m739180M129526R577052L273242o944205q636862k602758
40617f344116J692361K390192M076881M766314j306732r444362q018631K601231
40609i586862Q829913M415314j346381k80430K935895K119598P46806L426992
40601A1260845N829027K237662m046601o484710n610317n464725m908561p56325
40593g943705M335483N042433J717543j279420k862800m162637l006456K957452
$$ plain form
40649 9664784 8482133 3160649 -394456 3164514 9932074 11420441 4715000 -5243384
40641 -5243384 -10950513 -8033862 1327314 8988655 7787095 -596815 -7223578 -5944909
40633 -5944909 983631 7342636 9326177 7160096 4017588 3632824 5814899 5364283
40625 5364283 -400931 -5140111 -1010585 8566467 11839709 4895504 -3741358 -6344116
40617 -6344116 -4651755 -2261563 1815318 6581632 5274900 -4169462 -12188093 -9586862
40609 -9586862 -756949 3658365 2311984 2031554 4967449 7087047 7833853 11260845
40601 11260845 17089872 19327534 15280933 8796223 3185906 -2278819 -7187380 -7943705
40593 -7943705 -3608222 1434211 3151754 1872334 -990466 -5153103 -8159559 -5202107
40585e202107R112490P693589p60673o635642l810343K527030L633579j104303
40577E453620m315632j268919L683714L277046k195770m865765p05418L989536
40569C052412J746072m579065o221976k011544J041570J93261L88080L452515
40561b938675L964523J13782j090055M204928Q477033M754377j155166l25210
40553A6005537L739455R12869p963492j1724046o314451J61363J308000P61281
40545c113484L233592O041727M430204o31155m312777l627313J290606P691481
40537A1002881J0353096N656544k751392o746365l750356N11483O94733j719570
40529A3251054k619291r58428K032871M633698L591661l310505j1118157j0368947
$$ plain form
40585 -5202107 3910383 11603972 10843299 4207657 397314 2924344 6557923 5453620
40577 5453620 1137988 -130931 3552783 6829829 4634059 -231706 -937124 3052412
40569 3052412 4798484 219419 -6002557 -8014101 -6972531 -6779270 -6391190 -2938675
40561 -2938675 1025848 1139630 49575 4254503 12731536 17485913 16330747 16005537
40553 16005537 19744992 20657861 12694369 970323 -5344128 -5182765 -3874765 -3113484
40545 -3113484 120108 6161835 10592039 9960884 5648107 2020794 3311400 11002881
40537 11002881 21355977 27012521 24261129 17514764 13764408 14275891 14970624 13251054
40529 13251054 10631763 9673335 11706206 16339904 19931565 16621060 5502903 -4866044
40521d866044L2914Q724259O258467j960884m298312N0046J791727k473649n078679
40512a820155j49523O726471O403066j368877q278875p636789m76722O864874
40504B63470Q451046L384947k987393l850843J215499M928873J143172o968568
40496E580203j0856245p434359j952317q8803j423200k217098j039961R12061
40488a8519719K521041K957855J125654k096492k627109K184117Q379099Q714736
40480B639182J585565o778294r856696p311633k729606J536922M767881N808371
40472a0338308L939359Q76012n75032M56603K534194L699107K603282o41352l414323
40463h60458k170036L084042P486378O579603J554670k736684l600012k179382
$$ plain form
40521 -4866044 -4833130 3891129 10149596 8188712 3890400 3940446 5732173 3258524 -1820155
40512 -1820155 -1969678 4756793 11159859 9790982 1512107 -6124682 -6601404 263470
40504 263470 8714516 12099463 9112070 5261227 6476726 11405599 12548771 5580203
40496 5580203 -5276042 -12710401 -14662718 -14751521 -16174721 -18391819 -19431780 -18519719
40488 -18519719 -15998678 -13040823 -11915169 -14011661 -16638770 -14454653 -6075554 2639182
40480 2639182 4224747 -2553547 -12410243 -19721876 -22451482 -20914560 -16146679 -10338308
40472 -10338308 -6398949 -5522937 -6097969 -5641366 -3107172 591935 3195217 2553865 -860458
40463 -860458 -3030494 53548 7539926 14119529 15674199 12937515 9337503 7158121
40455G158121o67064j44972k41214P66320L950108O402757K978798n760982j0937103
40446C504769n667351M535095P944147K172118l408055j543081L641768M198025
40438A5377435n93450n007133m978702j300834K920913M589051K110463k687610
40430A0430133n496638m218343j017161J537980L644863N775558O068901K888664
40422A9613957k303105o855893r265921p928404j490177O640329Q716968K444483
40414I572237l639294j003678N605886L946909p279528j4845849q702379M363102
40406a1982594R989811M111721m423698o466469j972658K780144K731945k236090
40398g467888q177696j0236605o249007J700070R223349J2884926J1818665P665646
$$ plain form
40455 7158121 6491057 6346085 6104871 6871191 10821299 17224056 20202854 14441872 3504769
40446 3504769 -2162582 2372513 10316660 12488778 9080723 7537642 11179410 15377435
40438 15377435 14783985 9776852 4798150 3497316 6418229 11007280 13117743 10430133
40430 10430133 4933495 715152 -302009 1235971 4880834 10656392 16725293 19613957
40422 19613957 17310852 10454959 1189038 -6739366 -8229543 -1589214 7127754 9572237
40414 9572237 5932943 4929265 10535151 14482060 7202532 -7643317 -16345696 -11982594
40406 -11982594 -1992783 2118938 -2304760 -8771229 -10743887 -7963743 -5231798 -7467888
40398 -7467888 -15645584 -25882189 -32131196 -30431126 -21207777 -8322851 3495814 11161460
40390A1161460L581701J799661J201927j214387n573685p959505n664887j316859
40382c984574Q28256P01008J075773J892065L81647l313290n413399m500429l622889
40373a5955832m280340k962556K561912P417894N402730j571299n599750l670757
40365a8657998n05546R6539N68478L633043O433776M908021M88787k135113j738522
40356f908535p33316k57121N55124J392007J141096Q53976K062229K625841p67123
40347c5822n718781n528715N65414M296427m64658p915428p257536K777748J2060570
40338g220781J1586164K979824n582997q746078o847970k394720K648908O415504
40330g162146P015796M422966J380152Q35860K560254L635471K482179P38473
$$ plain form
40390 11161460 14743161 16542822 17744749 16530362 10956677 2997172 -2667715 -3984574
40382 -3984574 -3156318 -2455310 -1379537 512528 894175 -2419115 -7832514 -12332943 -15955832
40373 -15955832 -20236172 -23198728 -20636816 -13218922 -7816192 -9387491 -14987241 -18657998
40365 -18657998 -19163544 -19067005 -18498527 -14865484 -8431708 -3523687 -3034900 -5170013 -6908535
40356 -6908535 -7641851 -7898972 -7343848 -5951841 -4810745 -3956769 -1894540 731301 -35822
40347 -35822 -5754603 -11283318 -10717904 -6421477 -6886135 -14801563 -22059099 -19281351 -7220781
40338 -7220781 4365383 7345207 1762210 -6983868 -13831838 -16226558 -13577650 -7162146
40330 -7162146 -146350 4276616 5656768 6492628 9052882 12688353 15170532 15909005
40322A5909005L38194O51510K74255r4984Q52542J940430J003043j301758k536062
40313A7036175k779697m106415o140679o536422n797680o407800o832339k870027
40305b4434884L538323M522321j239914m432478P42077O433182L603800k600366
40297a3867939j245003N696552O687434Q19501l33006O798830J0255732J760205
40289A6572306r345674j0467437m028324p91851k460043k583461j3354N99891
40281a2517947k27346L228915J0479148J3248068P379147j547078o577258o540289
40273F925360l083664K499454O957635N985809N31421l221843k748373k313961
40265A1531838m537281n536167k723143o44293k866856m067380J593284Q514019
$$ plain form
40322 15909005 16247199 16898709 17172964 17077980 17930522 19870952 20873995 19572237 17036175
40313 17036175 14256478 10150063 4009384 -2527038 -8324718 -14732518 -21564857 -24434884
40305 -24434884 -20896561 -16374240 -17614154 -22046632 -21304555 -14871373 -11267573 -13867939
40297 -13867939 -15112942 -9416390 -2728956 -1909455 -2242461 4556369 14812101 16572306
40289 16572306 7226632 -3240805 -7269129 -8060980 -10521023 -13104484 -13117838 -12517947
40281 -12517947 -12745293 -9516378 962770 14210838 21589985 20042907 13465649 6925360
40273 6925360 3841696 6341150 13298785 19284594 19816015 16594172 13845799 11531838
40265 11531838 6994557 1458390 -1264753 -1909046 -4775902 -8843282 -7249998 1264021
40257A264021O048917m496756r716673k890613O542212O912159k2256m079883
40249d38872j886165J177215J805464K789981N348584N259666K95618m198769
40241A0152722k283638L472943N418376J668360k172878k140907j083632k702875
40233A0328471n083265l780066J215545N209717M567308K73554l607955l472720
40225E650589O86010M389906K703883l457761p577741n987368k642593k209529
40217h444604k291392J954536Q344243J0062384O597191M389752N637432M612462
40209C0862004j837547p838828p501676l860908k604787k306118J505153O265196
40201A2682489M978652k360893q099902q112475o262087o148343n446303j688802
$$ plain form
40257 1264021 7312938 2816182 -6900491 -9791104 -3248892 3663267 3641011 -438872
40249 -438872 -2325037 -1147822 657642 3447623 8796207 14055873 14351491 10152722
40241 10152722 7869084 11342027 16760403 18428763 16255885 14114978 13031346 10328471
40233 10328471 5245206 1465140 2680685 7890402 12457710 12731264 9123309 5650589
40225 5650589 6336599 10726505 13430388 9972627 2394886 -3592482 -6235075 -8444604
40217 -8444604 -10735996 -8781460 -437217 9625167 16222358 20612110 26249542 30862004
40209 30862004 29024457 21185629 13683953 9823045 7218258 4912140 6417293 12682489
40201 12682489 17661141 15300248 7200346 -912129 -7174216 -13322559 -18768862 -20457664
40193b0457664K144164K328352P61036J815400N038754N686968K107191j347038
40185a922837N1658N104604P819756M412428k369047o852056p254391o442874
40177g452759n890514k787416M286315J0318268R110106J818343m641760o794008
40169b033425o930909o594264l945260R61398M159560L624935K173652J900954
40161f683359R15467j176402k52960M984726P926806K953786m390898m016112
40153B61054L627921P385431J116115p945745r526807l390051K020583P61349
40145e690150m722096p757643m858888J079121M149024J909274k191676l500899
40137b1583933j547949J070565L066026M511540M231749J300363j801626k002753
$$ plain form
40193 -20457664 -18313500 -15985148 -15224112 -13408712 -8369958 -2682990 -575799 -1922837
40185 -1922837 -1871179 3233425 11053181 15465609 13096562 6244506 -1009885 -7452759
40177 -7452759 -13343273 -16130689 -11844374 -1526106 7584000 9402343 4760583 -2033425
40169 -2033425 -8964334 -15558598 -19503858 -18542460 -14382900 -10757965 -8584313 -6683359
40161 -6683359 -5767892 -6944294 -7197254 -2212528 5714278 8668064 4277166 261054
40153 261054 3888975 11274406 12390521 4444776 -5082031 -8472082 -6451499 -5690150
40145 -5690150 -10412246 -18169889 -23028777 -21949656 -17800632 -15891358 -18083034 -21583933
40137 -21583933 -23131882 -22061317 -18995291 -14483751 -10252002 -8951639 -10753265 -12756018
40129a2756018r36206k274949m102247m06451Q435254J3439772Q697556l34244
40121I762467m382119j542655L373473O235185N453880N32533n730538p089673
40113F612553j758125K874695N159n449140l792229L580532N444876j584475p271537
40104a337691l300203M799688P109458L163776p20778k234119l396966l857474
40096B25691j642508J398569J794218O63690J359332K430076j28600m549625m785556
40087c234713n05157K096476N91410n56033O18742m60515n325731o946893k70834
40078a3993248Q208527R109775L618484Q1386P13869P18785j223237j113508J531770
40069G652603K122585R085M69017M597970N308348j829336j0569667j2544503
$$ plain form
40129 -12756018 -13692224 -15967173 -20069420 -20475871 -12040617 1399155 10096711 9762467
40121 9762467 5380348 3837693 7211166 13446351 18900231 19432764 13702226 6612553
40113 6612553 4854428 7729123 7734282 2285142 -1507087 2073445 7518321 5933846 -1337691
40104 -1337691 -4637894 161794 7271252 10435028 9714250 7480131 4083165 225691
40096 225691 -1416817 -18248 1775970 2439660 3798992 6229068 6100468 1550843 -3234713
40087 -3234713 -3739870 -1643394 -1051984 -1608017 -989275 -1449790 -6775521 -13722414 -13993248
40078 -13993248 -5784721 3325054 6943538 7024924 7738793 8457578 7234341 6120833 7652603
40069 7652603 9775188 9784273 10253290 14851260 20159608 18330272 7760605 -4783898
40061d783898q334963l833634l53194M235252P659205M891931k705787p192145
40053a0417233m438946Q30239K276319k31009k293054j238520J634216L261938
40045a0616050J832532j309601k615959n21592K109585J876337q778K89095K960380
40036f004051M471499L733413L632004N243172N184280J102831m043154o046518
40028G273476m753249k543594l69615J643846K169879O24817q08372l57786J9741
40019B899143j968587m045775k200569K488842M614941K293733l65668j2026J010353
40010D714387q59589m231448m722420j544455J477486J331192q48662k690596
40002g374105m121162n946568o640598l710530J657657M624199L243968K262730
$$ plain form
40061 -4783898 -13118861 -16952495 -17305689 -13070437 -5411232 -519301 -3225088 -10417233
40053 -10417233 -14856179 -14025940 -11749621 -11980630 -14273684 -15512204 -13877988 -10616050
40045 -10616050 -8783518 -10093119 -12709078 -13230670 -11121085 -9244748 -9253526 -8964431 -6004051
40036 -6004051 -1532552 2200861 5832865 11076037 16260317 17363148 13319994 7273476
40028 7273476 2520227 -23367 -392982 1250864 3420743 4045560 3237188 2879402 2899143
40019 2899143 930556 -3115219 -5315788 -2826946 1787995 4081728 3716060 3704034 4714387
40010 4714387 3854798 -376650 -5099070 -6643525 -5166039 -3834847 -4683509 -7374105
40002 -7374105 -11495267 -17441835 -24082433 -27792963 -26135306 -21511107 -18267139 -16004409
39994a6004409O842601J3933562J4692519O202630l982202p425716m717784j978811
39986G562390j074932R95244M590506N802900L181048L87442p0813q79331m443804
39977A6050650p466629n339261O59160N076727N597371M086080J400365l457109
39969A6607354q391489p864266l52705P529062P935541Q66555o679598r158022
39961D92432p052692l916654k031052j276300j55574K432314N308768N619261
39953e79497K711097j53474l31172j50405k922359o086534l799860L492417Q235357
39944D15570O463260L198480L627455M812804J663864l684070n396833l596670
39936G503860k888186l165155k08069M810342N149918l62691m257740j974394
$$ plain form
39994 -16004409 -9161808 4771754 19464273 25666903 21684701 14258985 9541201 7562390
39986 7562390 6487458 7482702 12073208 17876108 21057156 21444598 21373785 20494454 16050650
39977 16050650 8584021 3244760 3903920 8980647 14578018 18664098 20064463 16607354
39969 16607354 8215865 351599 -1106 7527956 15463497 16330052 9650454 492432
39961 492432 -6560260 -10476914 -12507966 -13784266 -13939840 -11507526 -6198758 -579497
39953 -579497 2131600 1978126 1646954 1496549 -1425810 -7512344 -11312204 -7819787 415570
39944 415570 6878830 10077310 13704765 18517569 20181433 16497363 11100530 7503860
39936 7503860 4615674 1450519 1242450 6052792 11202710 10840019 6582279 4607885
39928D607885R40110j740212o413621n064817K560742Q561764O975696n89760
39920I837787q064582r711257l475546O456362J1726438Q041284K58290l626741
39912A1442035j707098J775889L259368K630981Q18119j206358j966699j397459
39904A3648778j730745l387694k681136K209689O142586L665433j871368k924757
39896A3070786K20722L30243m026168n774540j638280J751528j318570o080275
39888c464554m726557J822782O159818N021907J436502j705488m248444n541266
39880e245300l789672N24684L933391L714550O55076k199352k712069j890579
39872g009271k856352o141484o918638o51390Q485546J0416392K691117m684323
$$ plain form
39928 4607885 5547995 3807783 -2605838 -7670655 -5109913 3451851 10427547 9837787
39920 9837787 1773205 -7938052 -11413598 -4957236 6769202 14810486 15068776 11442035
39912 11442035 9734937 11510826 14770194 17401175 18219294 17012936 15046237 13648778
39904 13648778 11918033 8530339 5849203 8058892 14201478 17866911 15995543 13070786
39896 13070786 13291508 13621751 9595583 3821043 2182763 3934291 2615721 -3464554
39888 -3464554 -8191111 -6368329 -208511 4813396 6249898 4544410 295966 -5245300
39880 -5245300 -9034972 -8510288 -4576897 -862347 -207271 -2406623 -5118692 -7009271
39872 -7009271 -9865623 -16007107 -22925745 -23577135 -15091589 -4675197 -1984080 -6668403
39864f668403k473032N027510P070082K471296r60L708479O872597L004426m356116
39855A4655879p389020m625625o37813J992920M750792P729458P313828J450433
39847B5240852n796623q044525m041342J488706M458637N578769O351052M552617
39839B9788143k057465r512968j0789899n400811k30561N46017L30273K163161
39831D835890K614175j072657l551890J222487Q829562R388421K372311k528730
39823B2109569J5031M282055L970079J286202R88175J769802n61323n458976q834018
39814A9566596r256274q075680n404385o44849M300013O550874O173474N164843
39806A8374612L749174J245318p66153l90192L09689k333021o951940p734745
$$ plain form
39864 -6668403 -9141435 -4113925 2956157 5427453 5426493 9134972 16007569 19011995 14655879
39855 14655879 7266859 2641234 2003421 3996341 8747133 16476591 23790419 25240852
39847 25240852 19444229 11399704 7358362 8847068 13305705 18884474 25235526 29788143
39839 29788143 27730678 18217710 7427811 2027000 1796439 2342456 2672729 4835890
39831 4835890 7450065 6377408 2825518 4048005 12877567 22265988 24638299 22109569
39823 22109569 22124600 26406655 30376734 31662936 32651111 34420913 33859590 28400614 19566596
39814 19566596 10310322 2234642 -3169743 -3814592 485421 7036295 13209769 18374612
39806 18374612 22123786 23369104 22602951 22212759 22522448 20189427 13237487 5502742
39798E502742k735370L006361M717779M124334N363573P940341P701199L165714
39790C8786673k717146o312469n834875j217313M985477P191061J750049o823655
39782B9807802r034382k097751N571885N157291p46368k486809K307341N612469
39774C4091478J453317n061723n332671M41460M159380J322696l789577m882305
39766B2402055j259457K960430M373708L070671J350012J072707J698338P64817
39758C6433281k648408n422100l614454J620255M194987O93261m589136m691698
39750B1975988J241639O989267O852401J809804k549921k431996R63355L601496
39742C8452033K764834n83684k710618o43677M428143P704276N999390K279235
$$ plain form
39798 5502742 2767372 5773733 10491512 14615846 19979419 27919760 35620959 38786673
39790 38786673 36069527 29757058 23922183 22704870 27690347 34881408 36631457 29807802
39782 29807802 20773420 18675669 24247554 29404845 28658477 26171668 28479009 34091478
39774 34091478 35544795 30483072 25150401 25591861 29751241 31073937 27284360 22402055
39766 22402055 21142598 24103028 28476736 31547407 32897419 33970126 35668464 36433281
39758 36433281 33784873 28362773 24748319 26368574 30563561 31256822 26667686 21975988
39750 21975988 23217627 30206894 37059295 38869099 36319178 33887182 34850537 38452033
39742 38452033 41216867 40633183 37922565 37278888 41707031 49411307 55410697 57689932
39734E7689932K998244R995395J7062635J6641560Q535221o30360n446208n668519
39726A01177900k762429K420520O958546N981929p23895n942757l517354K968167
39718A06560627N140731J638329j097663O05337K969598K358985J399807L876110
39710A23451861Q093480R929267R656136J0973866J4567488J7056053J6304499
39703B10032650J4140173J3158583J3839950J5976978K0315055K6520814L0818367
39696C44802570K8403764J8887080P603277Q4062l836697q586432j6075238k3062064
39688C48220322k5862468k4567137k0720970j3981776m472167L994342P540593
39681B70150739P827563R292084J1530962R981756M463498O37370P39484r57153
$$ plain form
39734 57689932 60688176 70683571 87746206 104387766 112922987 112292627 106846419 101177900
39726 101177900 98415471 100835991 107794537 113776466 113052571 107109814 103592460 106560627
39718 106560627 111701358 113339687 112242024 112847361 115816959 118175944 119575751 123451861
39710 123451861 131545341 141474608 151130744 162104610 176672098 193728151 210032650
39703 210032650 224172823 237331406 251171356 267148334 287463389 313984203 344802570
39696 344802570 373206334 392093414 399696691 399780753 395944056 387357624 371282386 348220322
39688 348220322 322357854 297790717 277069747 263087971 258615804 262610146 270150739
39681 270150739 277978302 287270386 298801348 308783104 313246602 313883972 314623456 313666303
39673C13666303r323708k0033743k5323278k4568086k3290765k3725053k2515116
39666A64886554j7508718j1339760p252561n668822o204900r290680j3748502
39659I3872611j5597816j1854843m401383J601168K618393o90903m958686p233296
39651E3355245o964564n525643m069215k327895K00331K667412L465540K230596
39643D3031807M80638J07772J454400K891419K478670K34039j857435k544660
39635D6276650k728210l019606j874273J198937K497700j488305p478858q588825
39627B4795210m404412j686264l314380l492480K062944P808093O516000O85482
39619B8970193j714617L42134Q46497k390821m807985l296554k62637J605380
$$ plain form
39673 313666303 304342595 284308852 258985574 234417488 211126723 187401670 164886554
39666 164886554 147377836 136038076 128785515 123116693 116911793 107621113 93872611
39659 93872611 78274795 66419952 62018569 63619737 66238130 65547227 60588541 53355245
39651 53355245 46390681 40865038 36795823 34467928 34668259 37335671 40801211 43031807
39643 43031807 43512445 43620217 45074617 47966036 50444706 50678745 48821310 46276650
39635 46276650 43548440 40528834 38654561 39853498 42351198 40862893 33384035 24795210
39627 24795210 20390798 18704534 15390154 11897674 13960618 21768711 28284711 28970193
39619 28970193 27255576 27597710 28444207 26053386 21245401 17948847 17686210 19291590
39611A9291590K462511K020762r46230m411457m280009j495317j905267o594693
39603D141890q591130l021576N020365P704983N180364L429191M453824M762004
39595B3079915K589033Q79953K108414M174467L306136j024060n550945o725983
39587B2836930l977619J93811K801384K650988K77669k992165n081532m001461
39579A2708005n25288J547974K09855j435947J66193L080292L133967J431451
39571B0316502K531931N547561M170779k956405q943255q612532n195330l241318
39563C617933j245568L356969P275434N873706R57548k036499j852516q39057
39555A5107950O16643L112561M033876O65444l946578m352972r66902R44705j26384
$$ plain form
39611 19291590 21754101 23774863 22828633 18417176 14137167 12641850 10736583 4141890
39603 4141890 -4449240 -7470816 -2450451 5254532 10434896 13864087 18317911 23079915
39595 23079915 25668948 26548901 28657315 32831782 36137918 35113858 29562913 22836930
39587 22836930 18859311 19053122 21854506 24505494 24783163 21790998 16709466 12708005
39579 12708005 12182717 13730691 13940546 12504599 12670792 15751084 18885051 20316502
39571 20316502 22848433 28395994 32566773 29610368 20667113 12054581 6859251 3617933
39563 3617933 2372365 5729334 13004768 18878474 19836022 17799523 15947007 15107950
39555 15107950 15724593 18837154 22871030 23536474 19589896 15236924 14270022 15214727 15088343
39546A5088343l34070K504572N963071P472246O579569K592149m550385j0466570
39538B4848925r073697p16417P171239Q923204N782941J335998k958102n829323
39530B9484768m893376l37984L598418L413224K9582l589714n440935m288891
39522A7975092l24275K943271J612792k591100l733370m02632K165793N86574
39514A8232145j934677k410071l455932p147020r008439m436352K695007M520788
39506b944551O9290m502311n054454k892879N2626L433176N580930L826319j012120
39497c443974m508575m097532j387302J504666M442407P225398Q238272O525255
39489A4498615L211148J59617j315202p63583N67679J99342k039676k587451M91869
$$ plain form
39546 15088343 14754273 17258845 23221916 30694162 37273731 39865880 35315495 24848925
39538 24848925 15775228 15058811 22230050 31153254 36936195 38272193 35314091 29484768
39530 29484768 24591392 24253408 27851826 31265050 31294632 27704918 22263983 17975092
39522 17975092 17650817 20594088 22206880 19615780 15882410 15479778 17645571 18232145
39514 18232145 16297468 13887397 10431465 3284445 -5723994 -10160346 -7465339 -2944551
39506 -2944551 -2875261 -7377572 -12432026 -15324905 -15272279 -11839103 -6258173 -2431854 -3443974
39497 -3443974 -7952549 -12050081 -13437383 -11932717 -7490310 -264912 7973360 14498615
39489 14498615 17709763 17869380 16554178 15790595 16358274 16557616 14517940 11930489 12422358
39480A2422358K748695j004453p319971o886536K138188J0029088Q032412l12977
39472A9846804n056913l165267k29520n79930j691062L73994M081906L824056
39464A7404068k777394j0802024j2229568m588661N365792Q364107L047533k691499
39456A092354j714427L794601O151933K506382k169350k156742K080834N177929
39448A4763514L285274k174627o609763p144739n056835l405538k986365j866550
39440a1195629J110581M138320M695700K647924N3758r26077R27545N143998Q439590
39431A5035710O535727l53490n701281l865853J988053L482931j527888o187070
39423I406839m935152j315684j529530m324902l270261K592005O852735N226222
$$ plain form
39480 12422358 15171053 14166600 6846629 -39907 2098281 12127369 20159781 19846804
39472 19846804 14789891 11624624 11395104 10815174 9124112 9498106 13580012 17404068
39464 17404068 14626674 3824650 -8404918 -12993579 -7627787 736320 3783853 1092354
39456 1092354 -622073 3172528 9324461 11830843 9661493 7504751 9585585 14763514
39448 14763514 18048788 15874161 9264398 2119659 -2937176 -6342714 -9329079 -11195629
39440 -11195629 -10085048 -5946728 -1251028 1396896 1450654 524577 1452122 6596120 15035710
39431 15035710 21571437 21217947 15516666 11650813 13638866 17121797 15593909 9406839
39423 9406839 4471687 3156003 1626473 -2698429 -5968690 -3376685 3476050 8702272
39415H702272J138607m82398p468r8608J828K287735M674626L337047p22990k898199
39405A5932452k575244l663203o526323n791788O24830O120975M225300j385960
39397F961039k032413L184830O587070L430006k440111n576474n562914m303280
39389B47753j894258J404424L058942J813028L58061R34330J006123k742474q276237
39380d090308j0392025p702939l207719J146291N781996R481885R135368N010199
39372E162748J981753L037872M901939L071049j420125l860107k946953k016809
39364G911367l220197m234793k302417J203843K767250J920127J548449K931292
39356H524921L301127J1167m743295o085799k988201J76894l65041k538407j331385
$$ plain form
39415 8702272 9840879 9358481 9351013 9252405 9254233 11541968 16216594 19553641 18830651 15932452
39405 15932452 13357208 9694005 3167682 -2624106 -1999276 4121699 8346999 6961039
39397 6961039 4928626 8113456 14700526 18130532 15690421 10113947 4551033 247753
39389 247753 -1646505 -242081 2816861 4629889 4987950 5922280 6928403 4185929 -4090308
39380 -4090308 -14482333 -22185272 -25392991 -24246700 -18464704 -8982819 152549 5162748
39372 5162748 7144501 10182373 15084312 18155361 16735236 12875129 9928176 7911367
39364 7911367 4691170 456377 -1846040 -642197 2125053 4045180 5593629 8524921
39356 8524921 11826048 11837215 7093920 1008121 -1980080 -1803186 -2168227 -4706634 -6038019
39347f038019M068628Q519850O802241k66966o668734p720608m725181k407108
39339h435897k355080j207025L303304O957141L741824m505427q299934k505725
39331a3306819O428513Q959415M307720j263440m819710q258373j0476355o449597
39323b4878646L406499J0187134P517965M55707j995395P18300K088698j36967
39315b636705j293130J383678L914474J972767k587224m680900k450289J943991
39307d433338N539977N862090J168576p140043j3321563j1944254m037017L947554
39299b4358018P618408Q379686Q813329P625208K330867m615057o618930j045062
39291a869569O473790Q185266L127814k642226m026252k266871j866285m555675
$$ plain form
39347 -6038019 -1969391 6550459 13352700 13085734 6417000 -1303608 -6028789 -8435897
39339 -8435897 -10790977 -11998002 -8694698 -1737557 2004267 -2501160 -10801094 -13306819
39331 -13306819 -6878306 2081109 6388829 5125389 305679 -7952694 -18429049 -24878646
39323 -24878646 -21472147 -11285013 -3767048 -3311341 -5306736 -4588436 -2499738 -2636705
39315 -2636705 -3929835 -2546157 1368317 3341084 753860 -3927040 -6377329 -4433338
39307 -4433338 1106639 6968729 8137305 997262 -12324301 -24268555 -28305572 -24358018
39299 -24358018 -16739610 -8359924 453405 8078613 10409480 5794423 -824507 -1869569
39291 -1869569 4604221 12789487 15917301 13275075 9248823 6981952 5115667 559992
39283E59992p855889q401776n261315l89407L382652N030980O096818Q022979
39275A185034R022106N517436k550218r841672j0822799n778247P0085K664827
39267a0533448K505651K303108L192478L929860K963201O33628r44454n47036
39259C502988J85670j015018l030915k277819J383821K962706p19813n206046
39251d214426l715172L145091P715075N351194l18804l142950j384638K535535
39243E970905N425361M566266p24299o365909n968697Q89617O283932L778955
39235A3856131k506223l821423N06577K791962q56973m950699l283271K586703
39227D322784P007870P913301O663472L731490n46119l164785j644803R83798
$$ plain form
39283 559992 -7295897 -15697673 -20958988 -21348395 -17965743 -12934763 -6837945 1185034
39275 1185034 10207140 15724576 13174358 3332686 -7490113 -13268360 -13198275 -10533448
39267 -10533448 -8027797 -5724689 -2532211 1397649 4360850 4994478 4050024 3502988
39259 3502988 3688658 2673640 -357275 -2635094 -1251273 1711433 991620 -4214426
39251 -4214426 -7929598 -4784507 2930568 8281762 7962958 4820008 3435370 5970905
39243 5970905 11396266 15962532 15238233 8872324 2903627 3793244 10077176 13856131
39235 13856131 11349908 7528485 8035062 10827024 9970051 5019352 1736081 4322784
39227 4322784 11330654 19243955 25907427 29638917 29092798 25928013 24283210 25267008
39219B5267008m39621n042276o514873k672205J268147J278170Q10350M250053
39211A8204753Q564065P344999P04335n120209p116072q074407r321635p465054
39203b279225j115583M503670L785127j803500o312501o784424m490106r74036
39195a5470578L052965O077880O629338N092562K171634k722992q496136j0185226
39187a3850553m455678M108612P532895M912941K802264M681112O144853K849662
39179A4726108k277105l659875j172768N12107j419979n254442p416110n525527
39171a1487591j46462M978691O183295M290475L123066K943995k03290o502946
39163C179233q975004k565474P448744J1654273Q220594K672616j527655n224890
$$ plain form
39219 25267008 24827387 19785111 13270238 10598033 11866180 13144350 13954700 18204753
39211 18204753 26768818 34113817 34818152 29697943 22581871 14507464 5185829 -2279225
39203 -2279225 -3394808 1108862 4893989 3090489 -3222012 -10006436 -14496542 -15470578
39195 -15470578 -12417613 -6339733 289605 5382167 7553801 4830809 -3665327 -13850553
39187 -13850553 -18306231 -14197619 -6664724 -1751783 1050481 5731593 11876446 14726108
39179 14726108 12449003 8789128 7616360 8128467 6708488 1454046 -5962064 -11487591
39171 -11487591 -11634053 -6655362 -472067 3818408 6941474 9885469 9682179 3179233
39163 3179233 -5795771 -8361245 -912501 10741772 18962366 21634982 20107327 14882437
39155A4882437p523143n265712J83668K532489m31415l191353j136195K313263
39147B364039J539167k332589l591648q96610J249126j87818k350138p07510M913798
39138a83J0093133J0471549N639370r61234n024841m312852K42694N053667N787939
39129B6989242Q87374n848644q292082n293335k624563m938097q406603n980680
39121a3507388J556173N787612K372022l545623n701077m702417m068489l279108
39113b5088295K05765N204110Q134073Q124186O492953L164893j742421m565001
39105f9737j827811L233279L414116k523246p579630n580980J687260Q050557
39097a196192R799279O953521J237393m420678o782380n316153k760117j003732
$$ plain form
39155 14882437 7359294 2093582 2277250 4809739 4378324 1186971 50776 2364039
39147 2364039 3903206 1570617 -2021031 -2917641 -1668515 -1856333 -4206471 -4913981 -183
39138 -183 10092950 20564499 26203869 25242635 20217794 15904942 16147636 21201303 26989242
39129 26989242 27876616 22027972 13735890 8442555 5817992 879895 -7526708 -13507388
39121 -13507388 -11951215 -6163603 -3791581 -7337204 -13038281 -17740698 -21809187 -25088295
39113 -25088295 -24882530 -19678420 -11544347 -3420161 3072792 6237685 4495264 -69737
39105 -69737 -1897548 1335731 4749847 2226601 -5353029 -10934009 -9246749 -1196192
39097 -1196192 8603087 15556608 16794001 12373323 5590943 274790 -2485327 -3489059
39089c489059J393119N507273Q325931N970979n18909n817762o519562m125844
39081G26166j785992n90998P6109M75466L26796K1568P51628K967246M917807
39072G885796L581152j757295o991522o352405N76419O812281N474045j516046
39064G712425n352358j280266N693445P692676L636262j053895k540650k204814
39056A2302825k223768j824909O9700J670414Q18714j234770j734496r26716j239536
39047E677458k529631k022308N54560J696719n36656l385867l598251j618383
39039e762359O00155K494614K811788j238488q234245r926930j129436J0246130
39031a0138771J1382916K391683l482885M56802M829581J53926p280681n555120
$$ plain form
39089 -3489059 -2095940 3411333 11737264 17708243 17189334 11371572 4852010 726166
39081 726166 -1059826 -1650824 -1574715 -1099249 -772453 -750885 743 2967989 7885796
39072 7885796 11466948 9709653 2718131 -3634274 -3057855 3754426 9228471 7712425
39064 7712425 2360067 1079801 6773246 14465922 18102184 17048289 14507639 12302825
39056 12302825 10079057 8254148 8323848 9994262 10812976 9578206 7843710 6916994 5677458
39047 5677458 3147827 1125519 1680079 3376798 2840142 -545725 -4143976 -5762359
39039 -5762359 -5162204 -2667590 144198 -1094290 -9328535 -19255465 -20384901 -10138771
39031 -10138771 1244145 3635828 152943 609745 5439326 5593252 -1687429 -7242549
39023g242549L316333O561546J064858k869382R742J033072o211179j2056777
39015a6394336m068407J2240584J8550169Q408441m650067o246466R29422L894710
39007A2664050k074959q859322p622460N35763P324239P397802L590286K489716
38999A5445115O060149R037589N469194l452728j0347165j0146237n081251p91501
38991F193165j07957j755489k876020j432238K107118M514713L158837M2972m26557
38982I418544J619563R80591m190350q130193n489326N03998L043139J622999
38974f21035Q06645J584547J259137R08372M734160J0856594J0915296K114045
38966C2557761p295416q882883m478257q55061N65998K512632M440374L332376
$$ plain form
39023 -7242549 -3926216 2635330 3700188 830806 840548 1873620 -4337559 -16394336
39015 -16394336 -20462743 -8222159 10328010 18736451 14086384 7839918 8769340 12664050
39007 12664050 10589091 1729769 -5892691 -5356928 1967311 9365113 12955399 15445115
38999 15445115 21505264 30542853 36012047 32559319 22212154 12065917 6984666 6193165
38991 6193165 6085208 4329719 1453699 21461 2128579 6643292 9802129 9845101 9418544
38982 9418544 11038107 12018698 7828348 -301845 -5791171 -5287173 -2244034 -621035
38974 -621035 185610 1770157 3029294 3937666 8671826 19528420 30443716 32557761
38966 32557761 25262345 16379462 11901205 11046144 11612142 14124774 18565148 21897524
38958B1897524n6648k058524k248595l323495n616828o855417o678362o322207
38950a1262552m565434M20541N543039N369385R10129o34104L240879O086997
38942E108880K433260l676477m748734m18581L141362K087081j428858l380902
38934h82969k094669J055494K762266N66822l759438n448357l095986j007187
38926a1904024k562371m484961j845256L788416O349784M047948P04750j195346
38918g101060k925498m204292j592102M990305R178881N824005j434391m574264
38910a838416j292031L460305M986459L538965J219039j634527m820494n711829
38902b092529j551607N901211J0482388P757185K51213m965708m230833j451091
$$ plain form
38958 21897524 21840876 19782352 17533757 14210262 8593434 1738017 -4940345 -11262552
38950 -11262552 -15827986 -15407445 -9864406 -4495021 -3584892 -4218996 -978117 5108880
38942 5108880 7542140 3865663 -883071 -1301652 1839710 3926791 2497933 -882969
38934 -882969 -2977638 -1922144 840122 1406944 -2352494 -7800851 -10896837 -11904024
38926 -11904024 -14466395 -18951356 -20796612 -17008196 -10658412 -6610464 -5905714 -7101060
38918 -7101060 -10026558 -14230850 -15822952 -10832647 -1653766 4170239 2735848 -1838416
38910 -1838416 -3130447 329858 5316317 8855282 10074321 8439794 3619300 -2092529
38902 -2092529 -3644136 2257075 12739463 20496648 20747861 15782153 11551320 10100229
38894A0100229k953522q897915j2161346o875859L515033R013113M241146m759585
38886h778706o588592K563514J3647899J4137214K212788j0812136j3100185m781517
38878a1499721M336791P120658N031623K489849N90836j468129k661164j393151
38870B547592J304034K759451J904412m39930l177146m928860m100744j193736
38862e324927P35174L74708O48431L585099N278299J016850o099141p898982k649995
38853a0334484K584772K593600N27529P96794J784612M65892q92544J256354M583091
38844C365616M153420N55974j627209j848911l312649n466098m275371p34527
38836i189755j258897o719300q384683M2871J1803521J4983726P963668K51496
$$ plain form
38894 10100229 7146707 -1751208 -13912554 -20788413 -17273380 -8260267 -4019121 -8778706
38886 -8778706 -15367298 -12803784 844115 14981329 17194117 6381981 -6718204 -11499721
38878 -11499721 -7162930 -42272 4989351 7479200 8070036 6601907 3940743 2547592
38870 2547592 3851626 6611077 8515489 8075559 4898413 -30447 -4131191 -5324927
38862 -5324927 -4589753 -4215045 -3566614 18485 5296784 6313634 214493 -7684489 -10334484
38853 -10334484 -7749712 -5156112 -4628583 -3831789 -2047177 -1581285 -2473829 -1217475 3365616
38844 3365616 7519036 8075010 6447801 4598890 1286241 -4179857 -8455228 -9189755
38836 -9189755 -10448652 -17167952 -25552635 -25509764 -13706243 1277483 9241151 9492647
38828I492647j067218J011556P02764j456555r79222K021485J994102l558430
38820H161129q901417o808930J282995O351981L571217j626804j892206J895279
38812B033244L492701J343940l07967P20294J912550J687709J625404J761607
38804A4269482m31436m249323m670629M441M727128N243916L876142L925319L649663
38795B6344703P98093j714067o79048P83426j857093n897325m835152J045150
38787A3988687M622791K434860j127448j166138J314113K052996p29468m522643
38779A6867750m915338l14832M804389M137656j345097l225184K176161P484862
38771B5670367N792484J878327L248537N843708N48420r407806j1373679l523009
$$ plain form
38828 9492647 8425429 9436985 10139749 8683194 7703972 9725457 11719559 8161129
38820 8161129 -740288 -7549218 -6266223 85758 3656975 2030171 137965 2033244
38812 2033244 5525945 6869885 6561918 7282212 9194762 10882471 12507875 14269482
38804 14269482 13838046 9588723 4918094 4922535 9649663 14893579 18769721 22695040 26344703
38795 26344703 27142796 25428729 24749681 25533107 23676014 17778689 12943537 13988687
38787 13988687 18611478 21046338 19918890 18752752 20066865 22119861 21390393 16867750
38779 16867750 11952412 11637580 16441969 20579625 19234528 16009344 18185505 25670367
38771 25670367 31462851 33341178 36589715 42433423 42981843 33574037 22200358 18677349
38763A8677349K000948j011779l818772O32536N197803J649822m313604k227294
38755A6787009O075949R766656N284696r06627l749237m762954o160415o969502
38747A5365575n704196k283252K650430P231970Q564138O131487L017253J599306
38739C6572711R81769K96662J37625r02394m953330p874279j799088J0957664
38731C3417340J5987142O088289o624133p656190p86313N97395m018762l727702
38723C3277066L036105N483788o15891n738130k260764M902221Q213415P735014
38715E4032824O298728L452615m69775j925092o43789j517074n848966q070869
38707D5308602n434516l062146m093588k936751M559501J1247533P734168l289166
$$ plain form
38763 18677349 20678297 19666518 15847746 16480282 21678085 23327907 19014303 16787009
38755 16787009 22862958 32629614 37914310 37007683 33258446 28495492 22335077 15365575
38747 15365575 9661379 7378127 10028557 17260527 25824665 31956152 34973405 36572711
38739 36572711 37554480 37851142 37988767 37086373 32133043 24258764 22459676 33417340
38731 33417340 49404482 55492771 48868638 41212448 40426135 41023530 37004768 33277066
38723 33277066 36313171 41796959 41181068 35442938 33182174 38084395 46297810 54032824
38715 54032824 60331552 63784167 63314392 61389300 60745511 59228437 53379471 45308602
38707 45308602 39874086 36811940 32718352 29781601 34341102 45588635 53322803 50033637
38699E0033637j0495010r119848m647148k519865j931699p72607m65473l090205
38691A6991782p006080q051823m377972J228002M322855L924764L229179M333583
38683A4594290M777049K091956r58892l70081J980545J121772k401078l456391
38675A7379170j165184O98283J798516M964532P419395K715583o313001q042138
38667A9455156j81023M370904k910775j2101018j0430199k051803N41453k488152
38659e795457o83287O828727Q864205M92791q858095r113896k142246L165344
38651g241914J873574l975979q731284p779841j995299K841215L850350N172442
38643a5986736R834178J2334637O866086j365459k931393M47271j206214q519379
$$ plain form
38699 50033637 39538627 30418779 25771631 23251766 21320067 20547460 20081987 16991782
38691 16991782 9985702 1933879 -2444093 -1216091 3106764 7031528 10260707 14594290
38683 14594290 19371339 21463295 20504403 20134322 22114867 23236639 20835561 17379170
38675 17379170 16213986 16912269 18710785 23675317 31094712 33810295 27497294 19455156
38667 19455156 19274133 23645037 20734262 8633244 -1796955 -3848758 -3307305 -5795457
38659 -5795457 -6478744 349983 9214188 9706979 848884 -8265012 -10407258 -7241914
38651 -7241914 -5368340 -9344319 -18075603 -25855444 -27850743 -25009528 -21159178 -15986736
38643 -15986736 -6152558 6182079 13048165 11682706 8751313 9198584 7992370 -527009
38635e27009j0552998k448793O589878P569715L586650J483717O11542k792720
38627C519982o782097o887057l789691j378378k89983J432916L942481N930456
38619d301371O758619N395748P38289m486276m711728L85146L669977L14738m990453
38610a227311n111991l91213L501891L950587K592812J144276N83485J723206
38602F765742K767461j78295o327318q507722l101761L307135L477096P28737
38594a068925K524009O826142M898158l793413r902337q301403m069069j936562
38586a4823400Q03850O311423R412412N360607j531380m133689l311861n057996
38578f970034r165839q756569j489540N856687O706512L435152K915901O507310
$$ plain form
38635 -527009 -11080007 -13528800 -6938922 630793 4217443 5701160 6312702 3519982
38627 3519982 -3262115 -10149172 -13938863 -15317241 -15607224 -14174308 -10231827 -4301371
38619 -4301371 2457248 7852996 8591285 4105009 -606719 -221573 3448404 3763142 -1227311
38610 -1227311 -6339302 -6730515 -3228624 721963 3314775 4459051 5042536 6765742
38602 6765742 9533203 9354908 3027590 -5480132 -8581893 -5274758 -1797662 -1068925
38594 -1068925 1455084 8281226 13179384 9385971 -516366 -8817769 -12886838 -14823400
38586 -14823400 -14019550 -7708127 1704285 7064892 5533512 1399823 -1912038 -6970034
38578 -6970034 -16135873 -24892442 -26381982 -20525295 -13818783 -10383631 -7467730 -960420
38570i60420R001989O629224J930105l93598L72427J015226p01562l316478l918637
38561I658276j849337M21460K3594k681680l715021P033N877233P637522L282692
38552A8661772j777462j916419Q43547R0968n319316r746685q924045m698245
38544a2785885m65455L287374O581070P462951N305438L325053M164900N343346
38536B2218792K713055l275049q223060r471213p878732m777927m46267M197032
38528d943369O741671N012983o86751o647353p549089j428479O924523J0389010
38520G813146P840931M480640L205675Q85808m395229q214479o511685k550203
38512B554604j550414k452270j441014j43008k653020o585730n466716M04277
$$ plain form
38570 -960420 8041569 14670793 16600898 16207300 16579727 17594953 16893391 13576913 9658276
38561 9658276 7808939 8230399 8253993 5572313 1857292 1864325 7741558 15379080 18661772
38552 18661772 16884310 14967891 15811438 15902406 10583090 836405 -8087640 -12785885
38544 -12785885 -13251340 -9963966 -3382896 4080055 9385493 12710546 16875446 22218792
38536 22218792 24931847 21656798 13433738 3962525 -3916207 -8694134 -9140401 -4943369
38528 -4943369 1798302 6811285 6124534 -522819 -8071908 -9500387 -2575864 7813146
38520 7813146 15654077 20134717 23340392 24226200 19830971 11616492 5104807 2554604
38512 2554604 1004190 -1448080 -2889094 -3032102 -5685122 -12270852 -17737568 -17333291
38504a7333291L691784J503373o41208J690858N479053O236488M194027J335991
38496F157075k228262n549623n484911j677233J382349O67311j009984j42727
38488g886005K040773K746468K269591J806626L70433k259965l162263r63643
38480e037985O71200j176777k846399N43234O520213P988634L205664k561315
38472G306469m817385m098405k385079j07640K262869L288196K414068N45130
38464D408223j361992k475613j833891j22628j47695k787680m393586j658935
38456a0373797K898175M402638K664877J039679O5193k087381m029847k508000
38448g928463Q61025R81263j912555j842760K889082O353599M305469l9358k883049
$$ plain form
38504 -17333291 -13641507 -12138134 -12779342 -11088484 -5609431 627057 4821084 6157075
38496 6157075 3928813 -1620810 -7105721 -8782954 -7400605 -6733294 -7743278 -7886005
38488 -7886005 -5845232 -3098764 -829173 977453 1347886 -912079 -4074342 -5037985
38480 -5037985 -4366785 -5543562 -8389961 -7846727 -1326514 6662120 9867784 7306469
38472 7306469 2489084 -1609321 -3994400 -4102040 -1839171 1449025 3863093 4408223
38464 4408223 3046231 570618 -1263273 -1385901 -1533596 -4321276 -8714862 -10373797
38456 -10373797 -7475622 -3072984 -408107 631572 696765 -1390616 -5420463 -7928463
38448 -7928463 -7067438 -6086175 -7998730 -9841490 -6952408 -598809 3706660 3667302 784253
38439G84253n481887q454266p520391j079141M163863K589381m19182L462002
38431a1955368J1234232J2055763L474886n486553p820600n860868l331693R00486
38423f789715P146741J0419711O992506L90614l907817n490774o282961n101435
38415b623130m59254M180848L868384l77417k734996q04986J867873J711502m93696
38406D135128k166129k662794k856155k898773k036494k4438K252729L774406
38398b482520M792492O423594Q104972O883486J589702l465482k999750J045072
38390A9891566J016785m980203q805613l505725N932363Q695157K075702o502667
38382A3817365r650094o670744j160452K739942K205313j514587k978187N19324
$$ plain form
38439 784253 -4697634 -13151900 -20672291 -21751432 -17587569 -14998188 -15417370 -11955368
38431 -11955368 -721136 11334627 14809513 9322960 1502360 -4358508 -7690201 -6789715
38423 -6789715 357026 10776737 17769243 18159857 14252040 8761266 2478305 -2623130
38415 -2623130 -3082384 1098464 4966848 4589431 1854435 1049449 2917322 4628824 4135128
38406 4135128 1968999 -693795 -3549950 -6448723 -8485217 -8509655 -6256926 -2482520
38398 -2482520 2309972 8733566 16838538 23722024 25311726 21846244 18846494 19891566
38390 19891566 20908351 15928148 7122535 3616810 9549173 18244330 20320032 13817365
38382 13817365 4167271 -2503473 -3663925 -923983 1281330 -233257 -3211444 -2692120
38374b692120L819073J093258m249450m189357R74301L293178P60212J24755L977004
38365B910854N509633P27531m017459l100646j106184l218002m543187Q50548
38357e986912P059414M467586l640809n456280K94079K973068j526748m162924
38349e979526J637424R410553J0626086O587560K519984j886467p910906j0478690
38341D526018m717924M328681P623256N149610M091412N599977L218202m553595
38333B5265637r800842p191045k504346l361855p282390o189753N64068N556489
38325d944037M920088K960861L572431M071507J519263n65282K144137O000499
38317A9679467L566336m395549q583409m175757K645059M193295J114435j725327
$$ plain form
38374 -2692120 1126953 2220211 -2029239 -6218596 -5244295 -1951117 -1190905 -1066150 2910854
38365 2910854 8420487 9148018 5130559 2029913 923729 -2294273 -6837460 -5986912
38357 -5986912 1072502 5540088 1899279 -3557001 -3262922 -289854 -1816602 -5979526
38349 -5979526 -4342102 5068451 15694537 22282097 24802081 22915614 15004708 4526018
38341 4526018 -191906 4136775 11760031 16909641 21001053 26601030 29819232 25265637
38333 25265637 15464795 8273750 5769404 2407549 -4874841 -11064594 -10500526 -4944037
38325 -4944037 -23949 2936912 6509343 10580850 12100113 11534831 13678968 19679467
38317 19679467 23245803 18850254 10266845 6091088 8736147 12929442 14043877 12318550
38309A2318550l579852n753168n365240Q71337Q234015P416672k781782j2873932
38301a513400j4328541p953123P71114Q146265J1271135P364934q52534m229252
38293a323402K229157J1060861J0787953O82220q999439j0521467o091914j530887
38285c706918R32808J226369j485875n992841o991502r80642P274652R087273
38277f36676K820284l905556m361767r30164j34744k708414l433738K39127M754847
38268h296801O516795O361976N626623K470081l829973q619461p209561k294206
38260i274527l89458k047060j741816K478404N759242M548585J928535J859941
38252C121846L153099K826701J282954J72563j283307l577442l773001J3340L504865
$$ plain form
38309 12318550 8738698 2985530 -2379710 -1508373 6725642 14142314 11360532 -1513400
38301 -1513400 -15841941 -23795064 -23023950 -14877685 -3606550 3758384 2905850 -1323402
38293 -1323402 905755 11966616 22754569 23436789 14437350 3915883 -2176031 -3706918
38285 -3706918 -2774110 -1547741 -3033616 -9026457 -16017959 -16998601 -9723949 -636676
38277 -636676 2183608 -1721948 -6083715 -7013879 -7148623 -9857037 -13290775 -13051648 -8296801
38268 -8296801 -1780006 4581970 10208593 12678674 8848701 229240 -6980321 -9274527
38260 -9274527 -9663985 -11711045 -13452861 -10974457 -5215215 -666630 1261905 3121846
38252 3121846 6274945 9101646 10384600 10557163 9273856 5696414 1923413 1936753 5441618
38243E441618J250312m524572n917509n38741M774261L339212k603102n535215
38235d313736k452736K332843L302837k72186m984838p806354q136522o138089
38227b8468781j725350L521165N725908K863048j568523k370990K93060J618980
38219b0111483J28591l6069L416323O333674M731770J743971K845384O812247
38211E864408P085695J231940o027412r280504p673289l500146L80168J119574
38203a0799566k210164o032758m963060J275674O427520N112563n21609l704067
38195a5415467j181038L802106O236099M985930K799736J738536N34519k484423
38187A015998n305962l790359K362118P913953P925464L408278n45475q02607
$$ plain form
38243 5441618 6691930 2167358 -3750151 -4288892 485369 3824581 1221479 -4313736
38235 -4313736 -6766472 -4433629 -1130792 -1402978 -6387816 -14194170 -22330692 -28468781
38227 -28468781 -30194131 -26672966 -20947058 -18084010 -19652533 -22023523 -21730463 -20111483
38219 -20111483 -19982892 -20018961 -16602638 -10268964 -5537194 -3793223 -947839 5864408
38211 5864408 12950103 14182043 8154631 -1125873 -8799162 -12299308 -11919140 -10799566
38203 -10799566 -13009730 -19042488 -24005548 -22729874 -16302354 -11189791 -11711400 -15415467
38195 -15415467 -16596505 -12794399 -6558300 -1572370 1227366 2965902 3500421 1015998
38187 1015998 -4289964 -8080323 -5718205 2195748 10121212 13529490 12984015 12181408
38179A2181408J289833K220706k48588m939709p801232o066996k073287m17145
38171e855010j170304M7580M065078N388276O17460n170342n182876m21384K785219
38162d896303J987724m1089j154298j699856j845154j606578k074751k716878
38154a4047183k09400N545399Q169118L810715p09354K919974J0374258R864648
38146B5718175O0986q145307q315233n555878m550860j979224M218540Q220657
38138I671856N609898J213553R43639K591936J258016k142009m129838m848664
38130A0168387n091890k857097J334058J918909k619172m968489o08869L182556
38122D58393o85716n183589O86762J2534981J5078513M615713o229506p283145
$$ plain form
38179 12181408 13471241 15691947 15443359 10503650 2702418 -3364578 -5437865 -5855010
38171 -5855010 -7025314 -6977734 -2912656 2475620 3093080 -2077262 -7260138 -7681522 -4896303
38162 -4896303 -2908579 -2949668 -4103966 -5803822 -7648976 -9255554 -11330305 -14047183
38154 -14047183 -14256583 -8711184 -542066 3268649 2559295 5479269 15853527 25718175
38146 25718175 25779161 17633854 9318621 3762743 -788117 -2767341 1451199 9671856
38138 9671856 15281754 16495307 17438946 20030882 21288898 19146889 15017051 10168387
38130 10168387 5076497 2219400 3553458 5472367 2853195 -2115294 -2724163 458393
38122 458393 -227323 -5410912 -4724150 7810831 22889344 27505057 21275551 13992406
38114A3992406k229814J341843K144066J299450k098659o413191o270524r48847
38106H16730K794970R60751j210840J809338O457178N769814p5629n042563n893917
38097F385832m032311j067810K225103L781397J378662m394098j0572803j4094777
38089b0390805j2514785n364613L324325P333517N747763M665216Q345944J2419726
38081C566288J0179522K560950l249325l437907q62785N80470M61328M03191J359027
38072A1560759K723527K442261j231522o576911q824119n783485q40863K001325
38064d529028L118349M073434K971997j916038o508956n139045N92719L391745
38056c944823O26760k948204l354673k082036j235012p2184J402695J168106K07506
$$ plain form
38114 13992406 11762592 13104435 15248501 16547951 14449292 8036101 1765577 816730
38106 816730 3611700 4572451 3361611 5170949 11628127 17397941 17322312 12279749 6385832
38097 6385832 2353521 1285711 3510814 7292211 8670873 4276775 -6296028 -20390805
38089 -20390805 -32905590 -38270203 -34945878 -27612361 -21864598 -17199382 -8853438 3566288
38081 3566288 13745810 16306760 13057435 9619528 8756743 9337213 9798541 10201732 11560759
38072 11560759 14284286 16726547 15495025 8918114 93995 -5689490 -6530353 -4529028
38064 -4529028 -1410679 2662755 5634752 3718714 -2790242 -7929287 -7336568 -3944823
38056 -3944823 -3318063 -6266267 -9620940 -11702976 -12937988 -13010172 -11607477 -10439371 -10231865
38047a0231865K950731R116264J1007182L987226n446713q157036m794682k738326
38039d307219l655984k303529L064594P198175O143937K340205o54421k684435
38031E141323l747500j658326L620065P588215O687304K875584j52303j838356
38023A8516006k889986k351440l37998k99247m257431q651562r348149p934668
38015a7554475p973832p766659l187537L920193P258863N798736M885854O735310
38007g883547P116500L852337J380536K683783L072531k144108q573912q249388
37999h745268j564550L285886K012212j159910j320573O00128J532123J930578
37991c429374M033787O743866N968533N5985p305696j0344690o673234O72006
$$ plain form
38047 -10231865 -7281134 1835130 12842312 16829538 11382825 3225789 -1568893 -4307219
38039 -4307219 -7963203 -10266732 -7202138 -3963 6139974 8480179 7825758 5141323
38031 5141323 1393823 -264503 3355562 10943777 17631081 20506665 20354362 18516006
38023 18516006 15626020 13274580 12936582 12637335 8379904 -271658 -9619807 -17554475
38015 -17554475 -25528307 -33294966 -36482503 -32562310 -25303447 -19504711 -14618857 -7883547
38007 -7883547 -767047 3085290 4465826 7149609 10222140 8078032 -495880 -8745268
37999 -8745268 -10309818 -7023932 -5011720 -6171630 -7492203 -6892075 -5359952 -3429374
37991 -3429374 604413 7348279 13316812 13372797 6067101 -4277589 -10950823 -10278817
37983a0278817O108634O213798K123357j953925k528673N4288J941871J09190
37975A789723l369385l236096J630835N405905K709402l379914n125913r43951
37967d519394K867095J594112k201454m108870l582285j553283K463791P118107
37959a922181P735901K710500k506862k831961j431102m263308r430264q967135
37951b0906412p44543P800305Q925443K899351m136367p033157n265167k114671
37943b0575218p40429n0312L740775R953024J1767306N545400k318748l793262
37935C528536r93369j933468o741339p377753j318884L929435K579416j506324
37927i833750k551157j391847j421020j758450J67332L222250M546914M103824
$$ plain form
37983 -10278817 -4170183 2043615 4166972 2213047 -315626 -261338 1680533 1789723
37975 1789723 -1579662 -4815758 -3184923 2220982 4930384 1550470 -3575443 -4519394
37967 -4519394 -1652299 -58187 -2259641 -6368511 -9950796 -11504079 -9040288 -1922181
37959 -1922181 5813720 8524220 6017358 3185397 1754295 -2509013 -11939277 -20906412
37951 -20906412 -21650955 -13850650 -4925207 -2025856 -6162223 -13195380 -18460547 -20575218
37943 -20575218 -21315647 -21365959 -17625184 -7672160 4095146 9640546 7321798 3528536
37935 3528536 2535167 601699 -6139640 -13517393 -14836277 -10906842 -8327426 -9833750
37927 -9833750 -12384907 -13776754 -15197774 -16956224 -16788892 -13566642 -9019728 -4915904
37919d915904L613954L555196L843950M496327L640021j186727p672231r460726
37911d086140n013921n54136o21691j269822K405218P159872O483272R95752k803264
37902B695140k172696k73303K77773L57902R76367J437914J094830K2700j487271
37893B929356k177234n94072J431628m52780n989511q258359l050567M010059
37885a2151480N126191J118520j702352j744809j896000k047969k1459J936817
37877a1382541m1783l411468k657606K06860j630883o530366m970464M307687
37869b6110564J0056777N309480j963001j838666K942941L905458J135339P28338
37861e833898K625711J242012l800965o839325n652327l760062k960022r41783
$$ plain form
37919 -4915904 -1301950 2253246 6097196 10593523 14233544 13046817 5374586 -4086140
37911 -4086140 -9100061 -9654197 -10275888 -11545710 -9140492 -1980620 4502652 5498404 2695140
37902 2695140 522444 249141 526914 884816 1861183 3299097 4393927 4416627 2929356
37893 2929356 752122 158050 1589678 1136898 -4852613 -13110972 -16161539 -12151480
37885 -12151480 -7025289 -5906769 -7609121 -9353930 -11249930 -13297899 -13319358 -11382541
37877 -11382541 -11424324 -14835792 -17493398 -17286538 -18917421 -25447787 -30418251 -26110564
37869 -26110564 -16053787 -10744307 -12707308 -14545974 -11603033 -7697575 -6562236 -5833898
37861 -5833898 -3208187 -1966175 -5767140 -12606465 -18258792 -22018854 -24978876 -25920659
37853b5920659K565110L974063K080217M30037J316335K479678K166902K657300
37845h251017N583727P741159N366109n6377l850557m226920l070526j985903
37837b750305q25583K54656J16975j483939k933889k063593J980561P319517R385439
37828H999839M617965m088450q181409l217088L994011L044030n609034j0123364
37820a0563500l471653O183053O673144j143249n159518N56174Q182089P822022
37812I078562Q3326o777255p554843l563449J460872M433438L544592k82498l169046
37803b746301k214208J040283K951321K149597l21193l246488n227286m456644
37795a2070919j241105J144813Q08094K37568K064847M549457M899337M098334
$$ plain form
37853 -25920659 -23355549 -19381486 -17301269 -16871232 -15554897 -13075219 -10908317 -8251017
37845 -8251017 -2667290 5073869 10439978 10383601 6533044 2306124 -764402 -2750305
37837 -2750305 -3575888 -3321232 -3204257 -4688196 -7622085 -9685678 -7705117 -385600 8999839
37828 8999839 13617804 9529354 1347945 -1869143 2124868 5168898 -440136 -10563500
37820 -10563500 -14035153 -7852100 -1178956 -2322205 -7481723 -6925549 1256540 9078562
37812 9078562 9161888 2384633 -5170210 -8733659 -7272787 -2839349 705243 422745 -2746301
37803 -2746301 -4960509 -3920226 -968905 1180692 859499 -2386989 -7614275 -12070919
37795 -12070919 -13312024 -12167211 -11359117 -11121549 -9056702 -4507245 392092 4490426
37787D490426L897956K160100k870077o349964k383267N472041P459434J692844
37779A3569493l425464k462686m0485j434370m388247n208966n619528p349160
37771a6359413o210954J077590Q841687Q954437K352623l208192m457084m251308
37763a3260614l697072p35515L319920L406837j439553n783665n084120m35406
37755b3709188M960459Q830816Q387814K013660n372294m896154M465535J2041820
37747F722468Q327766k627856r230332p177767j690079K741567O709089R494557
37739A3269413O574504k438162r290895o348998K769471P648060M685061K14658
37731A7083112j94212P50569j920978o911608q874867o493176l279548j181141
$$ plain form
37787 4490426 8388382 10548482 7678405 1328441 -1054826 4417215 11876649 13569493
37779 13569493 10144029 7681343 7640858 6206488 1818241 -3390725 -9010253 -16359413
37771 -16359413 -22570367 -21492777 -12651090 -3696653 -1344030 -4552222 -9009306 -13260614
37763 -13260614 -16957686 -17693201 -14373281 -10966444 -12405997 -18189662 -23273782 -23709188
37755 -23709188 -18748729 -9917913 -1530099 483561 -4888733 -9784887 -5319352 6722468
37747 6722468 15050234 12422378 3192046 -3985721 -5675800 -2934233 3774856 13269413
37739 13269413 19843917 17405755 8114860 1765862 4535333 12183393 16868454 17083112
37731 17083112 16888900 17639469 15718491 8806883 -67984 -6561160 -9840708 -11021849
37723a1021849J673096O022836Q502987N914055j4007m454438m832504k598940
37715h08764m89668L89451P87023J504592J866251M62908k446191m437287l816337
37706f988022j781222k45301R50136K370156K173304j475741n860110n642437
37698a6499237J35887O477367Q516346N972104J279610k818914l337057O29984
37690C56090M419961J800351n422684p447917J94005Q837516P704155j500836
37682H940641p755543o041848k085930j837663l200627q90421N016605R032537
37674A177751P229705J760277j853079j171194M44236j381164n555669o708604
37666f057741k821641K203602M623264N002086M293044R84234m169562n665069
$$ plain form
37723 -11021849 -9348753 -3325917 5177070 11091125 11077118 6622680 1790176 -808764
37715 -808764 -1298432 -908981 -121958 1382634 3248885 3711793 1265602 -3171685 -6988022
37706 -6988022 -8769244 -9014545 -8064409 -5694253 -3520949 -4996690 -10856800 -16499237
37698 -16499237 -16363350 -9885983 -1369637 4602467 5882077 3063163 -273894 356090
37690 356090 4776051 6576402 1153718 -6294199 -6100194 2737322 10441477 8940641
37682 8940641 1185098 -4856750 -6942680 -8780343 -11980970 -12871391 -7854786 1177751
37674 1177751 8407456 10167733 8314654 7143460 7587696 6206532 650863 -6057741
37666 -6057741 -8879382 -6675780 -2052516 2949570 7242614 8226848 4057286 -1607783
37658a607783q13285M333341K770798k948006m688855q20885K865514K892348
37650A983187J305319m08650l150402n386272l651251P74477K359437K17219m8761
37641f005697M210965P779957N613569M64579j621595M04381K606792J790719
37633A5243670j585795m369655l279281J336983M285209J342859m196914n397732
37625C379344j761697M36059j642378l620147k068697M38679J206485J750045
37617a882307K915992K115655q41652j682983M27467l3478m758091n904562K211956
37608g432003J2110908J2469756L889801l429795m308507j979065N20220L031102
37600A4872417L532397k82548m748722l848546O55539R74539m003739o318415
$$ plain form
37658 -1607783 -2421068 1912273 4683071 1735065 -2953790 -3774675 -909161 1983187
37650 1983187 3288506 2879856 -270546 -5656818 -9308069 -8533592 -6174155 -5956936 -6005697
37641 -6005697 -1794732 5985225 11598794 12063373 10441778 10846159 13452951 15243670
37633 15243670 13657875 9288220 6008939 7345922 11631131 12973990 8777076 3379344
37625 3379344 1617647 2053706 411328 -3208819 -5277516 -4838837 -3632352 -1882307
37617 -1882307 1033685 3149340 2307688 624705 1052172 1018694 -3739397 -9643959 -7432003
37608 -7432003 4678905 17148661 21038462 17608667 13300160 11321095 11841315 14872417
37600 14872417 18404814 18122266 13373544 9524998 10180537 11155076 7151337 832922
37592H32922j387074N290722P279111N737067M385901K347462k246399n966350
37584A6273362l785331K707814O100783K306555m471673o816980k577001K809666
37576A2547195K818733j868000l858454R31954O859698N571856k941155j0840470
37568I221357j2367415q212185j318361N431734P554792J967851o751176r366420
37560a3839823l524658L392888N163676M146961M551997M913784K519653q6508
37552G237970N69680J866880q31595n419107n332234N9108L954747K083360j439582
37543B749227p78856L029403L793112r57746o261634o028308j192398J256952
37535d390248k096056n827523l211001L603327O380534L002087J40560K123395
$$ plain form
37592 832922 -554152 4736570 12015681 17752748 22138649 24486111 22239712 16273362
37584 16273362 12488031 15195845 21296628 23603183 19131510 12314530 9737529 12547195
37576 12547195 15365928 13497928 9639474 10571428 17431126 23002982 20061827 9221357
37568 9221357 -3146058 -11358243 -12676604 -7244870 309922 2277773 -4473403 -13839823
37560 -13839823 -17364481 -13971593 -8807917 -4660956 -108959 4804825 7324478 7237970
37552 7237970 7807650 9674530 8842935 3423828 -1908406 -1849298 2105449 4188809 2749227
37543 2749227 1970371 4999774 8792886 7835140 1573506 -4454802 -5647200 -4390248
37535 -4390248 -6486304 -12313827 -15524828 -11921501 -5540967 -2538880 -2398320 -274925
37527b74925M094383N09808n288974n964584r92236L623372M392621L284244K604138
37518E987847K207509J753644J558707J184811L26988K89239J530121J386727
37510A6225593k013392n387430m309231n6748K396627J860545J080412O84583
37502A0480959q40379j802536J041909N074057L560002l439611p470006m045818
37494B558577P79570O08622j619368k75214K638890J572131k152364k417678R92756
37485B685922K005372j369456l774358j239011L066062M262858K003135j275690
37477F364834m019133m699690j241903N153913Q543589M512952l686860q702283
37469B225419p686642m129984j892988j073243k26855O44929J015765J622354
$$ plain form
37527 -274925 3819458 4329266 -959708 -6924292 -7916528 -4293156 99465 3383709 5987847
37518 5987847 8195356 9949000 11507707 12692518 13019506 13308745 14838866 16225593
37510 16225593 14212201 8824771 4515540 4458792 6855419 8715964 9796376 10480959
37502 10480959 9640580 7838044 8879953 13954010 17514012 14074401 6604395 2558577
37494 2558577 3338147 3946769 2327401 2052187 4691077 6263208 4110844 1693166 2685922
37485 2685922 4691294 3321838 -452520 -1691531 1374531 5637389 7640524 6364834
37477 6364834 2345701 -2353989 -3595892 1558021 10101610 14614562 10927702 2225419
37469 2225419 -5461223 -9591207 -11484195 -12557438 -12784293 -12139364 -11123599 -9501245
37461i501245L303038N001795M680199J982039j275010l234250l585402k919104
37453e547940j542186M96185K758915M384360M554330K877165k30753l290006
37445D460070m474478l138314l08505K670433N340701P417809P778095N463573
37437B5209384J379911k333197m621572n987849o645870n728486k888562N76958
37429a039283L006074L891120L485914J886623n35113k421872k260285m0258K306290
37420H279210K366514m00423l516870l657408r00460N55440k060783n234801l407166
37411g976747K429003N249842K375872k30773K326571N132664Q81481p099198
37403C088715p611622K205448J1370983R151416j276797q011271n401989J311884
$$ plain form
37461 -9501245 -6198207 -1196412 3483787 5465826 4190816 956566 -2628836 -5547940
37453 -5547940 -7090126 -6593941 -3835026 549334 5103664 7980829 7750076 4460070
37445 4460070 -14408 -3152722 -3461227 -790794 4549907 11967716 19745811 25209384
37437 25209384 26589295 24256098 19634526 13646677 7000807 1272321 -1616241 -1039283
37429 -1039283 1966791 5857911 9343825 11230448 10695335 8273463 6013178 5972920 8279210
37420 8279210 10645724 10245301 6728431 3071023 2170563 2726003 665220 -4569581 -7976747
37411 -7976747 -5547744 -297902 2077970 1847197 4173768 9306432 10187913 3088715
37403 3088715 -4522907 -2317459 9053524 18204940 16928143 8916872 3514883 4826767
37395D826767M366253J665863l039966m701744j581658K677811K514842k239914
37387D488254m826729m93432N735561N510553j84920j881451M025651R458877
37379B1832364O968358Q62657n90054R64831l105988j3183047j8573914j2124977
37371a6949770R280P130823O584300L002365J20234q73307J420027O440279Q860400
37362A5744631M454751k351751l343992J540382M178454P72824l169345k574733
37354A5251221r496P01114J072873K850999K420357k993519q238627o653769k22349
37345D178804L892402M038981L639603K649319j678351o724819o680918l031297
37337B83724l227461p421311o638044K326843R901724P176992j661201o513014
$$ plain form
37395 4826767 9193020 10858883 7818917 3117173 1535515 4213326 6728168 4488254
37387 4488254 -338475 -831907 4903654 10414207 10229287 8347836 12373487 21832364
37379 21832364 28800722 29663379 29073325 30038156 26932168 13749121 -4824793 -16949770
37371 -16949770 -16940490 -9809667 -3225367 -223002 -102768 -976075 443952 6884231 15744631
37362 15744631 20199382 17847631 14503639 16044021 20222475 20995299 17825954 15251221
37354 15251221 15241725 15942839 17015712 19866711 22287068 19293549 11054922 4401153 4178804
37345 4178804 8071206 12110187 15749790 18399109 16720758 9995939 3315021 283724
37337 283724 -2943737 -10365048 -17003092 -14676249 -4774525 2402467 741266 -5771748
37329e771748m335146J061149N965317P497193L444100k609896k482040L963452
37321F732381N217683m515596j2974262o700187O901039R348569j087628q088638
37313e166639l476827K616360J448669r84007K127076N164949J025060n292755
37305b538114n068438k69677J028110j941240l686394k627444j018036J707075
37297a4414158O662139R598987N971460m47924k494179j116070l137134q714540
37289h091419j0253668m422373L020873O009138M884035K681346P80475j535R23020
37280d470108J851559O93534r87673m25443P97939n65893k360441K4425M041243
37271a400858K052258n644666r001869k738723N903235Q584048P103051P213714
$$ plain form
37329 -5771748 -10106894 -9045745 -3080428 4416765 7860865 5250969 2768929 6732381
37321 6732381 11950064 7434468 -5539794 -12239981 -5338942 4009627 2921999 -5166639
37313 -5166639 -8643466 -6027106 -4578437 -5562444 -3435368 1729581 2754641 -2538114
37305 -2538114 -7606552 -7876229 -6848119 -8789359 -12475753 -15103197 -16121233 -14414158
37297 -14414158 -7752019 1846968 7818428 7370504 4876325 3760255 623121 -8091419
37289 -8091419 -18345087 -22767460 -19746587 -13737449 -8853414 -6172068 -5391593 -5393128 -4470108
37280 -4470108 -2618549 -1925015 -2912688 -3338131 -2540192 -3106085 -5466526 -5442101 -1400858
37271 -1400858 651400 -4993266 -13995135 -16733858 -10830623 -2246575 4856476 12070190
37263A2070190Q192285N975215J593123j200531l163387p007642j0205828p818312
37255a564887j236722K870463K090398N13917J187526K132798R83234j318709
37247E658018k914321l286240k135095M36416J981692j80692m040853m182579
37239h663654N29625M669287L930669J145293J213782L260247K517486j507616
37231G095119l913093j911613J207124J693999J061696K657219N129952M097451
$$ plain form
37263 12070190 20262475 26237690 27830813 26630282 23466895 16459253 6253425 -1564887
37255 -1564887 -2801609 68854 2159252 2673169 3860695 5993493 6976727 5658018
37247 5658018 2743697 -542543 -2677638 -2241222 -259530 -440222 -4481075 -8663654
37239 -8663654 -8134029 -3464742 465927 1611220 2825002 6085249 8602735 7095119
37231 7095119 3182026 1270413 2477537 4171536 5233232 7890451 13020403 17117854
$$ [...]
##END NTUPLES=NMR SPECTRUM
##END=
