##TITLE=31Pdec_DE-61rm_5h
 , 64 sc
 8.7.2024
##JCAMPDX= 6.0         $$ Bruker NMR JCAMP-DX V2.0
##DATA TYPE= NMR SPECTRUM
##DATA CLASS= NTUPLES
##ORIGIN= UXNMR, Bruker Analytische Messtechnik GmbH
##OWNER= root
$$ XWIN-NMR		Version 3.5
$$ Mon Jul  8 16:53:27 2024 Russian Standard Time (UT+4h)  she@DPX200
##.OBSERVE FREQUENCY= 81.013821
##.OBSERVE NUCLEUS= ^31P
##.ACQUISITION MODE= SIMULTANEOUS
##.ACQUISITION SCHEME= undefined
##.AVERAGES= 64
##.DIGITISER RES= 17
##SPECTROMETER/DATA SYSTEM= spect
##.PULSE SEQUENCE= zgpg30
##.SOLVENT NAME= CDCl3
##.SHIFT REFERENCE= (INTERNAL, CDCl3, 0, 198.062)
##AUDIT TRAIL= $$ (NUMBER, WHEN, WHO, WHERE, WHAT)
$$ ##TITLE= Audit trail, XWIN-NMR		Version 3.5
$$ ##JCAMPDX= 5.01
$$ ##ORIGIN= Bruker BioSpin GmbH
$$ ##OWNER= she
$$ F:/spectra/data/she/nmr/P31/2/pdata/1/auditp.txt
$$ ##AUDIT TRAIL=  $$ (NUMBER, WHEN, WHO, WHERE, WHAT)
(   1,<2024-07-08 16:52:34.45 +0400>,<she>,<DPX200>,
      <created by zg, POWCHK disabled, PULCHK disabled
       configuration hash MD5:
       00 E9 B6 7A A2 85 ED C7 34 08 36 98 17 FE 4E 26
       data hash MD5: 32K
       9A 5D 72 E5 E9 2A D9 D8 A0 FF ED D5 A4 D4 04 0E>)
(   2,<2024-07-08 16:52:36.62 +0400>,<she>,<DPX200>,
      <Start of raw data processing
       efp BC_mod = 2 LB = 1.5 FT_mod = 6 PKNL = 1 PHC0 = 2598.787 PHC1 = 221.0869 SI = 64K 
       data hash MD5: 64K
       9F 91 DC D3 B5 B9 E8 69 C7 95 FB 76 74 3A 5F 3B>)
(   3,<2024-07-08 16:52:50.26 +0400>,<she>,<DPX200>,
      <pk PHC0 = -17.35808 PHC1 = 0 
       data hash MD5: 64K
       E9 E7 98 33 DF 5A E6 62 60 C8 32 8A 3E 83 69 FA>)
(   4,<2024-07-08 16:52:54.12 +0400>,<she>,<DPX200>,
      <abs ABSG = 5 
       data hash MD5: 64K
       E9 0E 18 8F B1 5C E0 98 98 30 DC CD 4D 58 A4 90>)
$$ ##END=
$$ 
$$ hash MD5
$$ 97 B0 41 45 F3 2C 4B FD 10 7B 6E 6F 6A A6 9A C4
##$RELAX= 
##$RELAX= 
##$RELAX= 
##$RELAX= 
##$RELAX= 
##$RELAX= 
##$RELAX= 
##$RELAX= 
$$ Bruker specific parameters
$$ --------------------------
##$DU= <F:/spectra>
##$EXPNO= 2
##$NAME= <P31>
##$PROCNO= 1
##$TYPE= <nmr>
##$USER= <she>
##$AMP= (0..31)
100 100 100 100 100 100 100 100 100 100 100 100 100 100 100 100 100 100 
100 100 100 100 100 100 100 100 100 100 100 100 100 100 
##$AQSEQ= 0
##$AQ_mod= 1
##$AUNM= <au_zg>
##$AUTOPOS= <>
##$BF1= 81.014009
##$BF2= 200.13
##$BF3= 200.13
##$BF4= 200.13
##$BF5= 200.13
##$BF6= 200.13
##$BF7= 200.13
##$BF8= 200.13
##$BYTORDA= 1
##$CFDGTYP= 0
##$CFRGTYP= 5
##$CHEMSTR= <none>
##$CNST= (0..31)
1 1 145 1 1 1 1 1 1 1 1 1 1 1 1 1 1 1 1 1 1 1 1 1 1 1 1 1 1 1 1 1 
##$CPDPRG= <waltz16>
##$CPDPRG1= <>
##$CPDPRG2= <waltz16>
##$CPDPRG3= <>
##$CPDPRG4= <mlev>
##$CPDPRG5= <mlev>
##$CPDPRG6= <mlev>
##$CPDPRG7= <mlev>
##$CPDPRG8= <mlev>
##$CPDPRGB= <>
##$CPDPRGT= <>
##$D= (0..31)
0 1 0 0 0 0 0 0 0 0.06 0 0.03 2e-05 3e-06 0 0 0.0002 0 0 0 0 0 0 0 0 0 
0 0 0 0 0 0 
##$DATE= 1720443153
##$DBL= (0..7)
120 120 120 11 120 120 24 19 
##$DBP= (0..7)
150 150 150 150 150 150 150 150 
##$DBP07= 0
##$DBPNAM0= <>
##$DBPNAM1= <>
##$DBPNAM2= <>
$$ [...]
##$SUBNAM3= <"">
##$SUBNAM4= <"">
##$SUBNAM5= <"">
##$SUBNAM6= <"">
##$SUBNAM7= <"">
##$SUBNAM8= <"">
##$SUBNAM9= <"">
##$SW= 400.765351723535
##$SWIBOX= (0..15)
0 1 3 0 0 0 0 0 0 0 0 0 0 0 0 0 
##$SW_h= 32467.5324675325
##$TD= 32768
##$TD0= 1
##$TE= 0
##$TE2= 300
##$TE3= 300
##$TEG= 300
##$TL= (0..7)
0 120 53 12 22 120 120 120 
##$TP= (0..7)
150 150 150 150 150 150 150 150 
##$TP07= 0
##$TPNAME0= <>
##$TPNAME1= <>
##$TPNAME2= <>
##$TPNAME3= <>
##$TPNAME4= <>
##$TPNAME5= <>
##$TPNAME6= <>
##$TPNAME7= <>
##$TPOAL= (0..7)
0.5 0.5 0.5 0.5 0.5 0.5 0.5 0.5 
##$TPOFFS= (0..7)
0 0 0 0 0 0 0 0 
##$TUNHIN= 0
##$TUNHOUT= 0
##$TUNXOUT= 0
##$USERA1= <user>
##$USERA2= <user>
##$USERA3= <user>
##$USERA4= <user>
##$USERA5= <user>
##$V9= 5
##$VALIST= <valist>
##$VCLIST= <CCCCCCCCCCCCCCC>
##$VD= 0
##$VDLIST= <DDDDDDDDDDDDDDD>
##$VPLIST= <PPPPPPPPPPPPPPP>
##$VTLIST= <TTTTTTTTTTTTTTT>
##$WBST= 1024
##$WBSW= 4
##$XGAIN= (0..3)
0 0 0 0 
##$XL= 0
##$YL= 0
##$YMAX_a= 29049
##$YMIN_a= -21153
##$ZGOPTNS= <>
##$ZL1= 120
##$ZL2= 120
##$ZL3= 120
##$ZL4= 120
##$ABSF1= 198.0616
##$ABSF2= -202.7028
##$ABSG= 5
##$ABSL= 3
##$ALPHA= 0
##$AQORDER= 0
##$ASSFAC= 0
##$ASSFACI= 0
##$ASSFACX= 0
##$ASSWID= 0
##$AUNMP= <proc_1d>
##$AZFE= 0.1
##$AZFW= 0.5
##$BCFW= 0
##$BC_mod= 2
##$BYTORDP= 0
##$COROFFS= 0
##$CY= -3
##$DATMOD= 1
##$DC= 0
##$DFILT= <>
##$DTYPP= 0
##$F1P= 0
##$F2P= 0
##$FCOR= 1
##$FTSIZE= 65536
##$FT_mod= 6
##$GAMMA= 0
##$GB= 0
##$INTBC= 1
##$INTSCL= 9.790993e-09
##$ISEN= 30
##$LB= 1.5
##$LEV0= 0
##$LPBIN= 0
##$MAXI= 10000
##$MC2= 0
##$MEAN= 0
##$ME_mod= 0
##$MI= 50
##$NCOEF= 0
##$NC_proc= -8
##$NLEV= 6
##$NOISF1= 182.463
##$NOISF2= 159.3651
##$NSP= 0
##$NTH_PI= 0
##$NZP= 0
##$OFFSET= 198.0616
##$PC= 4
##$PHC0= 2581.429
##$PHC1= 221.0869
##$PH_mod= 1
##$PKNL= yes
##$PPARMOD= 0
##$PSCAL= 0
##$PSIGN= 0
##$REVERSE= no
##$SF= 81.0140089999434
##$SI= 65536
##$SIGF1= 159.3651
##$SIGF2= -187.1042
##$SINO= 113.3802
##$SIOLD= 16384
##$SREGLST= <1H.CDCl3>
##$SSB= 0
##$STSI= 65536
##$STSR= 0
##$SW_p= 32467.5324675325
##$SYMM= 0
##$S_DEV= 0
##$TDeff= 32768
##$TDoff= 0
##$TI= <>
##$TILT= no
##$TM1= 0
##$TM2= 0
##$TOPLEV= 0
##$USERP1= <user>
##$USERP2= <user>
##$USERP3= <user>
##$USERP4= <user>
##$USERP5= <user>
##$WDW= 1
##$XDIM= 65536
##$YMAX_p= 280823236
##$YMIN_p= -68756895
$$ End of Bruker specific parameters
$$ ---------------------------------
##NTUPLES= NMR SPECTRUM
##VAR_NAME=  FREQUENCY,     SPECTRUM/REAL,   SPECTRUM/IMAG
##SYMBOL=    X,             R,               I
##VAR_TYPE=  INDEPENDENT,   DEPENDENT,       DEPENDENT
##VAR_FORM=  AFFN,          ASDF,            ASDF
##VAR_DIM=   65536,         65536,           65536
##UNITS=     HZ,            ARBITRARY UNITS, ARBITRARY UNITS
##FACTOR=    0.49542278885378, 1,            1
##FIRST=     16045.7642231865, 0,            0
##LAST=      -16421.768244346, 0,            0
##MIN=       -16421.768244346, -68756895,    0
##MAX=       16045.7642231865, 280823236,    0
$$ Real data points
##PAGE= N=1
##DATA TABLE= (X++(R..R)), XYDATA
$$ [...]
45105D158553l644208k197695O12360L134317L889537K762574R12572m44143r92131
$$ 4158553 514345 -1683350 -1070990 2063327 5952864 8715438 9628010 9183867 8191736
45096H191736j133327j194798j098238p46731m08751m93671j028015j524329j389520
$$ 8191736 7058409 5863611 4765373 4018642 3609891 3116220 2088205 563876 -825644
45087h25644m72486O77657J163077O41525j88020n16047p24424j700033k614106
$$ -825644 -1298130 -620473 542604 1184129 996109 480062 -244362 -1944395 -4558501
45078d558501j083829L129558O173699M272232r10256l907029k406751N36910
$$ -4558501 -5642330 -2512772 3660927 7933159 7022903 3115874 709123 1246033
45070A246033J806205K092801K692237K063311j111063m073214l313605k92285
$$ 1246033 3052238 5145039 7837276 9900587 8789524 4716310 1402705 1110420
45062A110420M23243j872356l292552j796918R5641K18349J84296J751313L273751
$$ 1110420 1533663 -338693 -3631245 -5428163 -5332522 -5114173 -4929877 -3178564 95187
45053I5187K547550N76615k86902J42850Q98961K317693M421491M617743O60994
$$ 95187 2642737 3219352 2932450 3075300 3974261 6291954 10713445 15331188 15992182
45044A5992182m916413o889740l752778J023292M049415N073943M655173K368341
$$ 15992182 11075769 4186029 433251 1456543 5505958 10579901 15235074 17603415
45036A7603415j132361l112956k004239R0736J18202j868278l176564k262161
$$ 17603415 16471054 13358098 11353859 11444595 11562797 9694519 6517955 4255794
45028D255794l78264L76887n29020j741235j587664P3500J620802J634746P24019
$$ 4255794 3877530 4254417 3725397 1984162 396498 469998 2090800 3725546 4449565
45019D449565M71071R47689Q05112k18280q10617n43463o79668j509729j066988
$$ 4449565 4920636 5868325 6673437 6455157 5644540 5101077 4421409 2911680 1844692
45010A844692J729583M460418M064277J171693q74864o84483J8359l08321j169782
$$ 1844692 3574275 8034693 12098970 13270663 12395799 11711316 11729675 11421354 10251572
45001A0251572j906623l001910m494020n000225l612274j369731L70192J786659
$$ 10251572 8344949 5343039 849019 -4151206 -7763480 -9133211 -8763019 -6976360
44993f976360L473572M539454L531090Q35047j391148j730767p82526K07387R18261
$$ -6976360 -3502788 1036666 4567756 5402803 4011655 2280888 1498362 1705749 2624010
44984B624010J720029K594742K938187K308935J026563j13197p16471j191150
$$ 2624010 4344039 6938781 9876968 12185903 13212466 13099269 12382798 11191648
44976A1191648k000626k755736k731481k264671k592728l807394m042208j756585
$$ 11191648 9191022 6435286 3703805 1439134 -1153594 -4960988 -9003196 -10759781
44968a0759781J863080M047637L672184K122006J134544J121772J664081K197186
$$ -10759781 -8896701 -4849064 -1176880 945126 2079670 3201442 4865523 7062709
44960G062709J827723p5056k379167k657880k91308J984709J081053k501617n212767
$$ 7062709 8890432 8815376 6436209 3778329 3487021 5471730 6552783 4051166 -1161601
44951a161601m683020j951910N81396J885171K313773K133060J270722J88990
$$ -1161601 -5844621 -7796531 -7215135 -5329964 -3016191 -883131 387591 576581
44943E76581q8484Q85194K346816L135966K803868J593820k41046k286431l265455
$$ 576581 488097 1373291 3720107 6856073 9659941 11253761 11012715 8726284 5460829
44934E460829j831540J197728K666680O32951k777393l979898k723517j669589
$$ 5460829 3629289 4827017 7493697 8126648 5349255 1369357 -1354160 -3023749
44926c023749j433720L42823L916266N430807K698104m91157K13929K708945J857450
$$ -3023749 -4457469 -4114646 -198380 5232427 7930531 7439374 7653303 10362248 12219698
44917A2219698j770564k623555M48140J999816r99502m053829k536944Q93567
$$ 12219698 10449134 7825579 8273719 10273535 9274033 5220204 2683260 3576827
44909C576827R92374j743965k833360j486142q75711j761840j335457J269956
$$ 3576827 4569201 2825236 -8124 -1494266 -2369977 -4131817 -5467274 -4197318
44901d197318L072899J989835k46509j195982p54206O854M75440J82134p58630
$$ -4197318 -1124419 865416 618907 -577075 -1331281 -1324427 -848987 -666853 -1425483
44892a425483n54669K161498M999357M085845K29245j357618J054535K670811
$$ -1425483 -1980152 181346 5180703 9266548 9495793 8138175 9192710 11863521
44884A1863521j51949l547859j934653K922497M154545q4599m212440l438512
$$ 11863521 11711572 8163713 6229060 9151557 13306102 13221503 9009063 5570551
44876E570551L43786K493974J624972o95433l358901n824260o403431l611623
$$ 5570551 5914337 8408311 10033283 9337850 5978949 154689 -6248742 -9860365
44868i860365R03111L288132K018406k57896l85785J227308J837760Q36754O35988
$$ -9860365 -8957254 -5669122 -3650716 -3908612 -4294397 -3067089 -1229329 -392575 243413
44859B43413K600805M443965L484052Q84223J8873J281884J534259r07024l680073
$$ 243413 2844218 7288183 10772235 11656458 11675331 12957215 14491474 13584450 9904377
44850I904377m036939k562267j387645p09210O38367K425326L103908J991715
$$ 9904377 5867438 3305171 1917526 1208316 1846683 4272009 7375917 9367632
44842I367632l24274k991655m753939l931606n57392K345459J845877j048819
$$ 9367632 9043358 6051703 1297764 -2633842 -3191234 -845775 1000102 -48717
44834d8717k741065j728873L15800J704569K325826K077261N10534j341498j405678
$$ -48717 -2789782 -4518655 -4202855 -2498286 -172460 1904801 2415335 1073837 -331841
44825c31841J13086K52280k401137m998063l942660K97175L887155M287303K328544
$$ -331841 -218755 33525 -2367612 -7365675 -11308335 -11011160 -7124005 -2836702 -508158
44816e08158P2948j473710k203460j968134p71695O40301J275230J085508J055802
$$ -508158 -435210 -1908920 -4112380 -6080514 -6852209 -6211908 -4936678 -3851170 -2795368
44807b795368J689366K009539J037989j77221K56174J708362J226942j707657
$$ -2795368 -1106002 903537 1941526 1764305 2020479 3728841 4955783 3248126
44799C248126l293328p97541K526607J791908j686798j891667K423192N197103
$$ 3248126 -45202 -842743 1683864 3475772 1788974 -102693 2320499 7517602
44791G517602K073321k982246l777766q80903K75179j877319l414672j652169
$$ 7517602 9590923 6608677 2830911 1950008 2225187 347868 -3066804 -4718973
44783d718973J234558K263972J582215Q37182N16395N97597J540259K845326K548314
$$ -4718973 -3484415 -1220443 361772 1198954 1715349 2312946 3853205 6698531 9246845
44774I246845N7135k128777j658685P3039J30694j060732k30879L096617M893351
$$ 9246845 9303980 7175203 5516518 5589557 5720251 4659519 4428640 7525257 12418608
44765A2418608K246546k087270l481978j896045j045581k063591k196374l41784
$$ 12418608 14665154 12577884 9095906 7199861 6154280 4090689 1894315 1552531
44757A552531N31192j357554k829191o96446K524844K231906r01796k135573l13809
$$ 1552531 2083723 726169 -2103022 -2799468 -274624 1957282 1055486 -1080087 -1393896
44748a393896J041751M75791Q44893L319700M494350K179980o06242q38060n04722
$$ -1393896 -352145 123646 968539 4288239 8782589 10962569 10356327 9518267 9013545
44739I013545k431681m752533m247902k208801j753294j657708J262450N067157
$$ 9013545 6581864 1829331 -2418571 -4627372 -6380666 -8038374 -6775924 -1708767
44731a708767M491075j82068k543633K49937L272538J911708j246281j422537
$$ -1708767 2782308 2600240 56607 306544 3579082 5490790 4244509 2821972
44723B821972O67303P66364j817564l656067k692138l97458J316920K141099K052511
$$ 2821972 3489275 4255639 2438075 -1217992 -3910130 -4307588 -2990668 -849569 1202942
44714A202942N92507j738665l118426k378550m63327P42991O23782L63670J218780
$$ 1202942 1795449 56784 -3061642 -5440192 -5903519 -5160528 -4536746 -4173076 -2954296
44705b954296K613885K734721J238519J06371P22236J501220L97978j428960j280967
$$ -2954296 -340411 2394310 3632829 3739200 4461436 5962656 6360634 4931674 3650707
44696C650707M38810P10299r30775j542853N1721J215326K27989q69199m84593
$$ 3650707 4089517 4799816 3869041 2326188 2377909 3593235 3821224 2952025 2467432
44687B467432o40517k753738l848411j087726K753083L009065L30050p49476Q12711
$$ 2467432 1826915 -926823 -4775234 -5862960 -3109877 -100812 229238 -520238 292473
44678B92473J777771Q55302N27799J941451K702397J296189k38961P6717J084734
$$ 292473 2070244 2925546 3453345 5394796 8097193 9393382 9154421 9231138 10315872
44669A0315872R12138j48949r39885j424862j898684k121272k302729k973474
$$ 10315872 11228010 11079061 10139176 8714314 6815630 4694358 2391629 -581845
44661e81845l194373j353606J523114K238564M16810j96829K639179N823907N334593
$$ -581845 -3776218 -5129824 -3606710 -1368146 -951336 -1148165 1491014 7314921 12649514
44652A2649514J928027o22578j068088j207787k041443k565877k096214j305014
$$ 12649514 14577541 13954963 12886875 11679088 9637645 7071768 4975554 3670540
44644C670540r35477j121779j688537j926040q76996J009942J774163Q04164J88837
$$ 3670540 2735063 1613284 -75253 -2001293 -2878289 -1868347 -94184 709980 898817
44635H98817J528532L176496K790849R21091l97700r72124j621906j657202l61259
$$ 898817 2427349 5603845 8394694 9315785 8918085 7945961 6324055 4666853 4305594
44626D305594M81028q54023k206365l96675L021134L613432J331176N50639K255648
$$ 4305594 4786622 3932599 1726234 1329559 4350693 7964125 9295301 9845940 12101588
44617A2101588K082342j754397m425918k106453J364972M47323l165686l406209
$$ 12101588 14183930 12429533 8003615 5897162 7262134 7709457 4543771 1137562
44609A137562M66892L109751J596104r83896j297341k63297k6455m08272n97034
$$ 1137562 1604454 4714205 6310309 5326413 4029072 3765775 3739320 3331048 2734014
44600B734014j215690k284318j752101J195765L415056J530940k743709m228371
$$ 2734014 1518324 -765994 -2518095 -1322330 2092726 3623666 879957 -3348414
44592c348414j053495L047183L759489J081023j852136k840654j963843j57628
$$ -3348414 -4401909 -1354726 2404763 3485786 1633650 -1207004 -3170847 -3328475
44584c328475J709623K742526K458743J355784J94174r65996k096008k179727
$$ -3328475 -1618852 1123674 3582417 4938201 5132375 4166379 2070371 -109356
44576a09356l99415J903685K327572P64480k64971O43393J676670P25627j402365
$$ -109356 -508771 1394914 3722486 4486966 4221995 4865388 6542058 7267685 5865320
44567E865320k435336j826990n36671J070312K849308L504408K142343L89641
$$ 5865320 3429984 1602994 1066323 2136635 4985943 8490351 10632694 11022335
44559A1022335K69059P47152m35630k112570q54554K989648M789354K415711p75497
$$ 11022335 11291394 12038546 11602916 9490346 8635792 11625440 16414794 18830505 18055008
44550A8055008j765011k346045m722288o669141n338817k786183k722753l812057
$$ 18055008 16289997 13943952 9221664 2552523 -2786294 -5572477 -8295230 -12107287
44542a2107287j615424L653808O831244N572073L208775K526776J537823j993939
$$ -12107287 -13722711 -10068903 -3237659 2334414 5543189 8069965 9607788 7613849
44534G613849n634406n312786j196744K494715K620029q6312k723040l114407
$$ 7613849 1979443 -3333343 -4530087 -2035372 584657 498345 -2224695 -5339102
44526e339102j332931O48554J028560J23686l74176J33679O78163N51874L6741
$$ -5339102 -6672033 -6023479 -4994919 -4871233 -5245409 -5111730 -4433567 -3881693 -3844952
44517c844952n59970p68038Q33369M714882P693037N400100j520006o851267o130303
$$ -3844952 -4404922 -5172960 -4339591 375291 8068328 13468428 11948422 5097155 -1033148
44508a033148j697688J493302K135309J899007J162512q51655k986055k841825
$$ -1033148 -2730836 -1237534 897775 2796782 3959294 3107639 121584 -2720241
44500b720241l95046J775349J836262K71639j466600j982870l34265K551127L698466
$$ -2720241 -3115287 -1339938 496324 767963 -698637 -2681507 -3015772 -464645 3233821
44491C233821J591781j071937p76956J534665J832030p02060k452444j124194
$$ 3233821 4825602 3753665 2976709 4511374 6343404 5641344 3188900 2064706
44483B064706Q29106J75620k421561l739691k229357Q75816L434367L965468K368076
$$ 2064706 2893812 3069432 647871 -3091820 -5321177 -4445361 -1010994 2954474 5322550
44474E322550J92305o73311k45444k58589j297662j783156o84363N20539P778
$$ 5322550 5514855 4841544 4596100 4337511 3039849 1256693 572330 1092869 1100647
44465A100647j622892k292585j220926O45451K223121K986205K646281J354293
$$ 1100647 -522245 -2814830 -4035756 -3390305 -1167184 1819021 4465302 5819595
44457E819595r3704j052675j591160j769831j239684k21111J77487m83771j144983
$$ 5819595 5725891 4673216 3082056 1312225 72541 -148570 28917 -454854 -1599837
44448a599837r48717o18485r35500j070730n6357J104170P58596n74428p87916
$$ -1599837 -2548554 -3167039 -4102539 -5173269 -5229626 -4125456 -3366860 -3941288 -4729204
44439d729204N87112J757556J467972N72538L06905N78352O83548M86592J76899
$$ -4729204 -4142092 -2384536 -916564 -344026 -37121 541231 1224779 1711371 1888270
44430A888270j72552k56421L25630J113772R46701m05151j742699k132189k022910
$$ 1888270 1715718 1459297 1784927 2898699 3845400 3440249 1697550 -434639 -2457549
44421b457549j922940j137198Q94817K824909K625492M90796j038765l18830J258655
$$ -2457549 -4380489 -5517687 -4622870 -1797961 827531 1318327 279562 -39268 1219387
44412A219387J277847k95865j001383P20268L106869K957560l59116l812835m084684
$$ 1219387 2497234 2201369 1199986 1920254 5027123 7984683 7625567 3812732 -271952
44403b71952j354179J132146J042543n44622j018903K57966J332432M46269j534780
$$ -271952 -1626131 -493985 548558 3936 -1014967 -757001 575431 1021700 -513080
44394e13080k155127n42710J302053Q67993j677675l559018k766724l83723J158712
$$ -513080 -2668207 -3210917 -1908864 -1040871 -2718546 -6277564 -9044288 -9428011 -8269299
44385h269299J313154J592080K792187L676684K957098J204016k18852j062534
$$ -8269299 -6956145 -5364065 -2571878 1104806 4061904 5265920 5047068 3984534
44377C984534j752877j869455p36051Q03182J056735J46458J31895J756470K872858
$$ 3984534 2231657 362202 -373849 429333 1486068 1632526 1764421 3520891 6393749
44368F393749J435817j410105k981156k690334j929749j051148Q76621L138997
$$ 6393749 7829566 6419461 3438305 747971 -1181778 -2232926 -1356305 1782692
44360A782692L018413l28226l785542l912677j227966J043050J391945J003691
$$ 1782692 4801105 4472879 687337 -3225340 -4453306 -3410256 -2018311 -1014620
44352a014620R24969P36382K89969N20527J607072K056098Q73080n90382m16513
$$ -1014620 -89651 646731 936700 1457227 3064299 5120397 5993477 5403095 4986582
44343D986582R91073J378825j39487j846222j884670p53678k69373o73966l16103
$$ 4986582 5977655 7356480 7216993 5370771 3486101 2732423 2463050 1789084 1472981
44334A472981J485156K790876J585416r31754j535626N84176K655416K310312
$$ 1472981 2958137 5749013 7334429 6402675 4867049 5451225 8106641 10416953
44326A0416953P17642K67581Q08197L03635j694162l432122l459274j852503P24534
$$ 10416953 11134595 11402176 12210373 12514008 10819846 7387724 3928450 2075947 2800481
44317B800481L260872M009761K052333p34534j457781j22003M63043j110297l265936
$$ 2800481 6061353 10071114 12123447 11388913 9931132 9809129 10272172 9161875 5895939
44308E895939m521982n224465n146686k491795K681311O688907O456550L550289
$$ 5895939 1373957 -3850508 -8997194 -11488989 -8807678 -2118771 4337779 7888068
44300G888068J420503N00610r22476k455887j913496M36549J366362r31272m447863
$$ 7888068 9308571 9809181 8886705 6430818 4517322 4953871 6320233 5388961 941098
44291I41098o001102m339320l02427M039615N919469L661632j013957l947343
$$ 941098 -5060004 -9399324 -9701751 -5662136 257333 3918965 2905008 -1042335
44283a042335k806605N43488K552727J926050L95049J57175J168324J169572j267537
$$ -1042335 -3848940 -3305452 -752725 1173325 1568374 1725549 2893873 4063445 2795908
44274B795908m042247l440969P03836L936380K906069k865l97511J668194K553892
$$ 2795908 -1246339 -4687308 -3983472 -47092 2858977 2856112 2458601 4126795 6680687
44265F680687J152379j27393k97972j191474l079997l244402o54544J698696J308452
$$ 6680687 7833066 7705673 7407701 6216227 3136230 -108172 -762716 935980 2244432
44256B244432k42887l84095P50876J952842L213031L955268K202906j585770l088916
$$ 2244432 2001545 1617450 2368326 4321168 7534199 11489467 13692373 12106603 9017687
44247I017687j10394K995733J146905l740316n661171l239948k65815J209663
$$ 9017687 8907293 11903026 13049931 9309615 3648444 408496 142681 1352344
44239A352344K529929L500450J845105j487038k181076N00180J919851m09816
$$ 1352344 3882273 7382723 9227828 7740790 5559714 6059894 7979745 7569929
44231G569929k610192j016642J656955J022331j707165k030252N24008K240390
$$ 7569929 4959737 3943095 5600050 6622381 4915216 2884964 3408972 5649362
44223E649362J266732n10232j244511j146599q59958q35437j984540m174079m782850
$$ 5649362 6916094 6405862 5161351 4014752 3154794 2319357 334817 -3839262 -8622112
44214h622112j849682K125628L083943J462239J164728K680463K252325j022675
$$ -8622112 -10471794 -8346166 -5262223 -3799984 -2635256 45207 2297532 1274857
44206A274857k554801N51652M202380L089655j544715m241017l120097q39589
$$ 1274857 -1279944 -728292 3474088 6563743 5019028 778011 -2342086 -3181675
44198c181675Q08810K532029M106933L821748J964751J001497J293107K44286
$$ -3181675 -2372865 159164 4266097 8087845 10052596 11054093 12347200 12591486
44190A2591486k876082m734989k712013R54085K363134J168524q1751j78686N4211
$$ 12591486 9715404 4980415 2268402 3222487 5585621 6754145 6672394 6493708 6547919
44181F547919L22728J205939K106425J333378j382334m146871m952195l302227
$$ 6547919 6870647 8076586 10183011 11516389 10134055 5987184 1034989 -2267238
44173b267238l7699L146270M363495L167135J242053K32860l78490j658392k610854
$$ -2267238 -2304937 841333 5204828 8371963 9614016 9846876 9468386 7809994 5199140
44164E199140j627905K26451M02072r30128j234480l45742q90775k925141k526668
$$ 5199140 3571235 3797686 4199758 3269630 2035150 1689408 798633 -2126508 -4653176
44155d653176J780426N230691L220779j561376k976212m33395J023468r89442
$$ -4653176 -2872750 2357941 5578720 4017344 1041132 607737 1631205 641763
44147F41763k930248j254152K619173M940989M165141J280957j882851l353611
$$ 641763 -2288485 -3542637 -923464 4017525 8182666 9463623 7580772 4227161
44139D227161k264493m90199p99699k643902k605023J2270J585291O0111j317236
$$ 4227161 1962668 1472469 672770 -1971132 -4576155 -4563885 -2978594 -2918483 -4235719
44130d235719O91062L557214K832083m91341j454110R25790K336042K58815k402232
$$ -4235719 -3544657 12557 2844640 2353299 899189 1824979 4161021 4419836 2017604
44121B017604k361987n55428N95551J169053K141693K368774M95757j660459j100544
$$ 2017604 -344383 -899811 -304260 864793 3006486 5375260 5871017 4210558 3110014
44112C110014J470220J972033j309895m915388m422649J21549M443742N016076
$$ 3110014 4580234 6552267 5242372 326984 -4095665 -3974116 469626 5485702
44104E485702K459955r9312j060548j712089l470812m990024l582971O38272M026432
$$ 5485702 7945657 7846345 6785797 5073708 1602896 -3387128 -6970099 -6331827 -2305395
44095b305395L735519J144182n34062n84475n41387o19656O05995K780370L084081
$$ -2305395 1430124 2574306 2040244 1455769 914382 294726 900721 3681091 6765172
44086F765172L53441k524608k364245j13110Q27110m36462j732954j829208j989736
$$ 6765172 7118613 4594005 2229760 2116650 2943760 2507298 774344 -1054864 -3044600
44077c044600k872070k617848K24283L714648M582312K338658n78190k136584
$$ -3044600 -5916670 -8534518 -8310235 -4595587 -13275 2325383 1747193 -389391
44069c89391k194984j022015J256183L253424K736495j49500j865056L16740M151377
$$ -389391 -2584375 -3606390 -2350207 903217 3639712 3490212 1625156 1941896 6093273
44060F093273M777609R73602l279146m009495j860363j51769p5783p252J028407
$$ 6093273 10870882 11844484 8565338 4555843 2695480 2543711 2467928 2460676 3489083
44051C489083J609947L12141j846099k632118j490887N4182O60814O72474J079470
$$ 3489083 5099030 5411171 3565072 932954 -557933 -503751 157063 829537 1909007
44042A909007J812988J763826L27263j597583k405508j502200M6069Q00409O46181
$$ 1909007 3721995 5485821 5813084 4215501 1809993 307793 353862 1154271 1800452
44033A800452O04755R92745Q55306j33333m55909R62000K091379l7885m269502
$$ 1800452 2405207 3397952 4253258 4119925 3664016 4626016 6717395 6679510 2410008
44024B410008n365776q22289M850589N450155J037514k874126l231776k329527
$$ 2410008 -2955768 -3778057 1072532 6522687 7560201 4686075 1454299 -875228
44016h75228k297333j332047K039102M616348K419704k963212n982096m467613
$$ -875228 -3172561 -4504608 -2465506 2150842 4570546 1607334 -4374762 -8842375
44008h842375j650876o97156p72383L21928K462110L907435L918376L129930K402161
$$ -8842375 -10493251 -11190407 -11962790 -11640862 -9178752 -5271317 -1352941 1776989 4179150
43999D179150K254961K435286J578277j295644m516630m851222j696442J722947
$$ 4179150 6434111 8869397 10447674 9152030 4635400 -215822 -1912264 -189317
43991a89317K520857J569920J181426J303663L46204j475902k221876j243264
$$ -189317 2331540 3901460 5082886 6386549 6732753 5256851 3034975 1791711
43983A791711J06281P66636J112316J588113J715164Q79375p56744k274218k543793
$$ 1791711 1897992 2664628 3776944 5365057 7080221 7959596 7202852 4928634 2384841
43974B384841j278002O0800m58398k323833k582608o1792K322613J581408q43282
$$ 2384841 1106839 1167639 709241 -1614592 -4197200 -4258992 -1936379 -354971 -1198253
43965a198253j458516j41805L95004k48028L30607K480851L289856J354914r01539
$$ -1198253 -2656769 -2798574 -2403570 -2651598 -2320991 159860 3449716 4804630 3903091
43956C903091j258964p34182p94306p14737J10746K28199r04134p47734K378955
$$ 3903091 2644127 1909945 1115639 400902 511648 739847 -164287 -912021 1466934
43947A466934N395216M036015r70563m694525m326816j731762j489j00619r61784
$$ 1466934 6862150 10898165 9927602 5233077 906261 -825501 -826990 -927609 -1889393
43938a889393r28256Q07725K864919K634520j5445j601938L13484L138542K812004
$$ -1889393 -2817649 -2009924 854995 3489515 3474070 1872132 2185616 5324158 8136162
43929H136162k11572k054322j423578n98495q58366j050219r40239j901570l431585
$$ 8136162 7924590 5870268 4446690 3848195 2989829 1939610 999371 -902199 -4333784
43920d333784k854516K13171K619224K355802J162879R12223P84049k9635j35426
$$ -4333784 -7188300 -6975129 -4355905 -2000103 -837224 74999 859048 829413 693987
43911F93987J153326J729453J86515j305744m79480J175356J133351J09951J71447
$$ 693987 1847313 3576766 3763281 2457537 1978057 3153413 4286764 4396715 4568162
43902D568162N88088n28584j924697q03905J965294K584735M00900r45146O07777
$$ 4568162 5156250 4627666 2702969 1899064 3864358 6449093 6849993 5904847 6512624
43893F512624K322505J093498j882671l065212j236507J793330L797471L725525
$$ 6512624 8835129 9928627 8045956 4980744 3744237 5537567 9335038 13060563
43885A3060563J721103q36773j921760q17287Q72857J144585O8309p26986p28922
$$ 13060563 14781666 13944893 12023133 11205846 12078703 13223288 13291597 12564611 11835689
43876A1835689j273381l051071m047685j600831L358789N958696K925538k537871
$$ 11835689 10562308 7511237 3463552 1862721 5221510 11180206 14105744 11567873
43868A1567873l945306K60175M486296L304522j572442l985100j213996L697295
$$ 11567873 7622567 7882742 12369038 15673560 14101118 10116018 8902022 12599317
43860A2599317O546805N872047K420177k274244n948429o424765l578540M75115
$$ 12599317 19146122 25018169 27438346 25164102 19215673 12790908 9212368 9687483
43852I687483L471148M321618K752637o03700l640134m069346j834555R39040
$$ 9687483 13158631 17480249 20232886 19629186 15989052 11919706 10085151 11024191
43844A1024191K511925K848783K559078K034535J594337J118354j08690j715625
$$ 11024191 13536116 16384899 18943977 20978512 22572849 23691203 23582513 21866888
43836B1866888j345524K243932O053496N968881K641283N06300P24017m47236
$$ 21866888 20521364 22765296 28818792 34787673 37428956 37935256 38659273 38212037
43828C8212037m815861q425416p443833l980601k268322k169664r18333R55073
$$ 38212037 33396176 24970760 17526927 13546326 11278004 9108340 8190007 9145080
43820I145080N25201j681657j875508O93853K338538J015802m50611O84738K443473
$$ 9145080 9670281 7988624 6113116 6806969 9145507 10161309 9710698 10395436 12838909
43811A2838909J293286k342974m733587l792079q43254J863095L122595K561987
$$ 12838909 14132195 11789221 7055634 3263555 2420301 4283396 7405991 9967978
43803I967978N87125j184133j066096O12325J678753P31857j387286l012531l449532
$$ 9967978 10555103 9370970 8304874 8917199 10595952 11327809 9940523 6927992 3478460
43794C478460k869784j547235r4499M51424n1203j10670J416109L078263K392622
$$ 3478460 608676 -938559 -1033058 -581634 -632837 -743507 672602 3750865 6143487
43785F143487l37256j914371p18010Q75190O3586k236542k955693j248970J103327
$$ 6143487 5806231 3891860 3173850 4049040 4112626 1876084 -1079609 -2328579 -1225252
43776a225252K723361L438197K757773N41330j146175j91781J476689j83256m537484
$$ -1225252 1498109 4936306 7694079 8235409 7089234 6897453 8374142 8190886 3653402
43767C653402n800762j402146L522390L418055L44465P7070K819321L393815k02368
$$ 3653402 -2147360 -3549506 -27116 3390939 3735404 3812474 6631795 10025610 9823242
43758I823242l985111m304811k155733J44065K240686L717019K604929j298470
$$ 9823242 5838131 1533320 -622413 -478348 1762338 5479357 8084286 6785816
43750F785816m423232l634147m76417J398568J279573J093310J488914J327208
$$ 6785816 2362584 -1271563 -1747980 -349412 930161 2023471 3512385 4839593
43742D839593M43177J0611K38271K17471P4746P71970J573133M61521k139153
$$ 4839593 5282770 5293381 5531652 5749123 5823869 6595839 8168972 8630493 6491340
43733F491340k863899k25062K530370J740498j324423k379513l93811J380795
$$ 6491340 3627441 3402379 5932749 7673247 6348824 3969311 3575500 4956295
43725D956295O63141r61409j479000j665093k744325l258201j168612K279380
$$ 4956295 5619436 4658027 3179027 1513934 -1230391 -4488592 -5657204 -3377824
43717c377824L840846K873632J745018J687968J200670p81668k787647l040656
$$ -3377824 463022 3336654 5081672 6769640 7970310 7188642 4400995 1360339
43709A360339j690593K77154K373087L731179L007452O07824r06364k33189P09531
$$ 1360339 -330254 -53100 2319987 6051166 9058618 9666442 8760078 8526889 9236420
43700I236420l6072j293535r37460M99195R37468J08549p91813j599456k605168
$$ 9236420 9200348 7906813 6969353 7468548 8406016 8514565 7722752 6123296 3518128
43691C518128k605234o13396J267770N8024l273252m544300k068250J590233L821899
$$ 3518128 912894 299498 1567268 1625292 -1647960 -6192260 -8260510 -6670277 -2848378
43682b848378M550554M033273J734572j261287k060948k1838J839551J355068
$$ -2848378 1702176 5735449 7470021 6208734 4147786 4125948 5965499 7320567
43674G320567L28952R95672K061824J033552j621511l560286m198410m334995
$$ 7320567 7649519 8645191 10707015 11740567 10119056 6558770 2360360 -1974635
43666a974635l462111o24821K675339L517004J562386m58850m65054Q91891K042690
$$ -1974635 -5436746 -6061567 -3386228 130776 1693162 1234312 769258 1661149 3703839
43657C703839K410913K127816J501993J162034J404889J311220r6109j842998
$$ 3703839 6114752 8242568 9744561 10906595 12311484 13622704 13526595 11683597
43649A1683597j821070J30009J620489P86958j421439k768309k423271j316640
$$ 11683597 9862527 9992536 11613025 12399983 10978544 8210235 5786964 4470324
43641D470324n66290l02978K25674J581443K868439J988998j753224n564285n375829
$$ 4470324 3904034 3601056 3826730 5408173 8276612 10265610 8512386 2948101 -2427728
43632b427728p16975M146725M997821K379166J42097K55412J068142O44763l88974
$$ -2427728 -3144703 1002022 5999843 8379009 8521106 8776518 9844660 10489423 10100449
43623A0100449m42879J97381K8540q05814m97244J239072K088662N31122j422571
$$ 10100449 9657570 9854951 9883491 9077677 8580433 9819505 11908167 12439289 11016718
43614A1016718r52628J148367J368533j322111l844023l357480q62803R10234
$$ 11016718 10064090 11212457 12580990 11258879 7414856 4057376 3194573 4104807
43606D104807J188535R02048L58287n65241q76547M74419K300485K171997j50061
$$ 4104807 5293342 6195390 6553677 5988436 5111889 5586308 7886793 10058790 9908729
43597I908729k236620k301896j173929m09406k46932l87019j172003k546507k999068
$$ 9908729 7672109 5370213 4196284 3786878 3539946 3152927 1980924 -565583 -3564651
43588c564651j270674J415789K550385J703435J010906J857404K754015J752422
$$ -3564651 -4835325 -3419536 -869151 834284 1845190 3702594 6456609 8209031
43580H209031k56615o03519J092215K067081L72745k144947k371457k21099J586344
$$ 8209031 7952416 7348897 8441112 10508193 10880938 8735991 6364534 6143435 7729779
43571G729779J539995R24894J122061J432514O80047n49076p91674r0590l0934
$$ 7729779 9269774 10194668 11316729 12749243 13429290 12880214 12088540 11997950 11967016
43562A1967016j464011l232949l471580j719628N60556J595507J279617J093885
$$ 11967016 10503005 7270056 3798476 2078848 2639404 4234911 5514528 6608413
43554F608413J838445K235453O96746k084449l631333k662237l04254J700450
$$ 6608413 8446858 10682311 11379057 9294608 5663275 3001038 2696784 4397234
43546D397234K708346K897654K516060J796674P87076p63526k550849l249504
$$ 4397234 7105580 10003234 12519294 14315968 15103044 14339518 11788669 8539165
43538H539165k141780n31716J30958O74304K428743L850074K126467j947701m208258
$$ 8539165 6397385 5865669 5996627 6670931 9099674 12949748 15076215 13128514 8920256
43529H920256k746786J19518K075843L138534K859010k42144m547706n289860
$$ 8920256 6173470 6292988 8368831 11507365 14366375 14124231 9576525 4286665
43521D286665j428379J798401N31064j886651q02277K339700L492280L008012
$$ 4286665 2858286 4656687 5187751 3301100 2498823 4838523 8330803 11338815
43513A1338815L294556K791888j000863m867862l506320J462351L423751J171412
$$ 11338815 14633371 17425259 16424396 11556534 8050214 9512565 12936316 14107728
43505A4107728j47693J246850R87955k813452n607389l954934p09683M89483L57313
$$ 14107728 13960035 15206885 16194840 13381388 7773999 3819065 3109382 3598865 3956178
43496C956178O00223O49341N72981K011946L573806J105872m430690n859589o02539
$$ 3956178 4556401 5205742 5778723 7790669 11364475 12470347 8039657 2180068 1577529
43487A577529M166523K523309p42751J307841N606589M230422k176989n508899
$$ 1577529 5744052 8267361 7524610 8832451 14439040 18669462 16492473 10983574
43479A0983574k986033L6875k23511j584505j892242k104371k073767K66108L938236
$$ 10983574 7997541 8034416 7810905 6226400 4334158 2229787 156020 422128 4360364
43470D360364M934998K652236Q06020O84259o06212l435375l448880J033379N087298
$$ 4360364 9295362 11947598 12753618 13437877 12831665 9396290 5947410 6980789 12068087
43461A2068087M317985J119121j15921K15515p20846k477969k567277j137570
$$ 12068087 16386072 17505193 17389272 17604787 16883941 14405972 11838695 10701125
43453A0701125l18162n66356j095802k205592l905178m019156j132424K130183
$$ 10701125 10382963 9816607 8720805 6515213 2610035 -1409121 -2541545 -411362
43445d11362K344284N35225M83093K695602M015761L026101J908546K248798K468843
$$ -411362 1932922 2468147 2951240 5646842 9662603 12688704 14597250 16846048 19314891
43436A9314891Q62528j449212k339970j694460q97146l95924N25094J807037J905304
$$ 19314891 20177419 18728207 16388237 14693777 13796631 13400707 13925801 15732838 17638142
43427A7638142k63736l201941l831924j202502J809250J875163m10771j624711
$$ 17638142 17374406 14172465 10340541 9138039 10947289 12822452 12411681 10786970
43419A0786970p11779k10464j567270k457782p59401J629409J792125M88858N56884
$$ 10786970 10075191 9864727 8297457 5839675 5080274 6709683 8501808 8990666 9547550
43410I547550K081699K686596J800026J053074P72926k93471j681169j377830
$$ 9547550 11629249 14315845 16115871 17168945 17941871 17648400 15967231 14589401
43402A4589401J02532l45926l120056m350144j793805J205960P13781j657290
$$ 14589401 14691933 14346007 11225951 6875807 5082002 6287962 7001743 5344453
43394E344453j453617J484216K898792Q53270j462872o95643K074948L439055
$$ 5344453 3890836 5375052 8273844 9127114 7664242 6968599 9043547 12482602
43386A2482602K214088J2668j370682j332155q4366J353823J273010q85396k888757
$$ 12482602 14696690 14709358 13338676 12006521 11922155 13275978 14548988 13663592 10774835
43377A0774835j719683K271060M917785L142037r72379k724897o95677K034746
$$ 10774835 9055152 11326212 16243997 19386034 18413655 15688758 14993081 17027827
43369A7027827K504440J188899k52704j974891m414215n604813l289496Q06392
$$ 17027827 19532267 20721166 20468462 18493571 14079356 8474543 5185047 5991439
43361E991439K198756k91548k779469j841919J054680K490145J852035O76045
$$ 5991439 8190195 7898647 5119178 3277259 4331939 6822084 8674119 9350164
43353I350164n89433k067059k253412J60291L068011L119265Q38575o8086J353193
$$ 9350164 8760731 6693672 4440260 4600551 7668562 10787827 11626402 11558316 12911509
43344A2911509K016788K56665j524407j296808n18096n18796K59608K287136K120754
$$ 12911509 14928297 15184962 13660555 12363747 11845651 11326855 11586463 13873599 15994353
43335A5994353k059794n352868k145392M768438P279131L522058j67020L95949
$$ 15994353 13934559 8581691 6436299 11204737 18483868 22005926 21838906 22234855
43327B2234855J592847p09742m146527m308093j880029n98975r59350o30096P01772
$$ 22234855 23827702 23117960 18971433 14663340 12783311 12184336 11224986 10594890 11296662
43318A1296662J346279J382413K295424L380519K354318m68511k104816j393778
$$ 11296662 12642941 14025354 16320778 19701297 22055615 21587104 19482288 18088510
43310A8088510m88614j172665k276407j706230P74867L445084M071275J595359
$$ 18088510 17599896 16427231 14150824 12444594 13219461 16664545 20735820 22331179
43302B2331179k291415l979548k097439K59053j58493j511894N36034N595958
$$ 22331179 20039764 16060216 13962777 14221830 14063337 12551443 13087477 18683435
43294A8683435Q111972M795811j320001n409775n865960l424453R01259M751817
$$ 18683435 26795407 31591218 30271217 24861442 18995482 15571029 16472288 21224105
43286B1224105M702631O00239k900965k064315Q63294J333591q32933k080166
$$ 21224105 25926736 26526975 23626010 21561695 22424989 23758580 22925647 20845481
43278B0845481j070426n1088m93441r53718N4278J811093K950403L244944K978135
$$ 20845481 19775055 19723967 19230526 18276808 18331086 20142179 23092582 26337526 29315661
43269B9315661K087195P13903m57594q91648n14877N49335J675693J624279K6389
$$ 29315661 31402856 32116759 31659165 30767517 30252640 30801975 32477668 34101947 34128336
43260C4128336j444441r79697N64077O57325j052807k008952n74474J369497J077903
$$ 34128336 32683895 31704198 32268275 32925600 31872793 29863841 29289367 30658864 31736767
43251C1736767j116022k281355q90175J302802J762054L92766p32654m75549j41282
$$ 31736767 30620745 28339390 27449215 28752017 30514071 30906837 30174183 29698634 29557352
43242B9557352j244970k814680k461484J02380K444001K794541K214064K250226
$$ 29557352 28312382 25497702 23036218 23138598 25582599 28377140 30591204 32841430
43234C2841430K166272L94965k342195l591786k528827p97037L0007Q6561J25040
$$ 32841430 35007702 35402667 33060472 29468686 26939859 26142822 26172829 26259390 26384430
43225B6384430L88866R28551J649768J697873J67326k126680k945323j373578
$$ 26384430 26773296 27701847 29351615 31049488 31216814 29090134 26144811 24771233
43217B4771233Q52789J470872J75626j653625k682013k269879l96262J933704
$$ 24771233 25624022 27094894 27270520 25616895 22934882 20665003 20268741 22202445
43209B2202445K866068J548038m56608p87059P22937J946506J680980J506628
$$ 22202445 25068513 26616551 26159943 25372884 26095821 28042327 29723307 31229935
43201C1229935L186966N184761L888717j347362o382641o872687l334369J27905
$$ 31229935 34416901 39601662 43490379 42143017 35760376 28887689 25553320 25681225
43193B5681225J144989P82392L17046p80534k802296m194325l504977j299051
$$ 25681225 26826214 27608606 27925652 27145118 24342822 20148497 16643520 15344469
43185A5344469J113868L221367M397089L439573P32536j008384k14236J031987
$$ 15344469 16458337 19679704 24076793 27516366 28248902 27240518 27026282 28058269
43177B8058269K84512j226825p81879R96584R69308j502699l845234m393642l803944
$$ 28058269 28342781 27115956 26334077 27330661 28299969 26797270 22952036 18558394 14754450
43168A4754450k310658O98298L709100L467784k07168l305237l058465j442941
$$ 14754450 12443792 13142090 16851190 20318974 20111806 16806569 13748104 12305163
43160A2305163j264249j788068r69324M69045L99648q81660j360811q95727j135791
$$ 12305163 11040914 9252846 8283522 8752567 9152215 8270555 6909744 6014017 4878226
43151D878226k270766k553815j158254O31086J312752O54697p13122j762927j314937
$$ 4878226 2607460 53645 -1104609 -473523 839229 1493926 780804 -982123 -2297060
43142b297060P18567K534050K318833O71908l65732l58085o64503j557547j267488
$$ -2297060 -1578493 955557 3274390 3946298 3580566 3222481 2557978 1000431 -267057
43133b67057J231845M019878M059713O61312l586307n047927k140005L076261
$$ -267057 964788 4984666 9044379 9705691 6119384 1071457 -1068548 2007713
43125B007713O258704M654276M0855k912229j648496J609466K719625M30418k551379
$$ 2007713 8266417 12920693 12961548 10049319 8400823 10010289 12729914 13160332 10608953
43116A0608953k956556l76052K879874M402353L496589R95487j643908l019887
$$ 10608953 7652397 7276345 10156219 14558572 18055161 19050648 17406740 14386853
43108A4386853k563721j095383L1078N72445J278381J869221P05492k389333m522857
$$ 14386853 11823132 10727749 10758827 11331272 12609653 14478874 15184366 12795033 8272176
43099H272176k961969R21035L160320K190844L0102j224826j429528q18645O96354
$$ 8272176 5310207 6231242 9391562 11582406 11612508 10387682 8958154 8139509 8835863
43090H835863J968756J187228r58169j475663L07335J339797k01973j798505r94906
$$ 8835863 10804619 11991847 11033678 9558015 9865350 11205147 11003174 9204669 8209763
43081H209763K06178j040618k870563j212654L344472N707570L308776r28361
$$ 8209763 8415941 7375323 4504760 3292106 6636578 12344148 15652924 14724563
43073A4724563l203780l033599j958542j002446o02996q79081j028533j93611
$$ 14724563 11520783 8487184 6528642 5526196 4923200 4044119 3015586 2821975
43065B821975P47406K00129j287959j572786m81174r9851r83984r86718J122619
$$ 2821975 3569381 3769510 2481551 908765 427591 327740 -656244 -1642962 -520343
43056e20343L643302M796677M890818M194361J541568k803660n450544l756311
$$ -520343 3122959 7919636 12810454 17004815 18546383 15742723 10292179 6535868
43048F535868L77431L131985L609100L405065K895549J226145p35557q93630M31754
$$ 6535868 6913299 10045284 13654384 17059449 19954998 21181143 20445586 19551956 19983710
43039A9983710M68972j555023k697162n79119K742179L332356O94007j767896
$$ 19983710 20452682 18897659 16200497 15621378 18363557 21695913 22389920 20622024
43031B0622024j512095K9749R6370j177261j161624R11758K304830O72370k157619
$$ 20622024 19109929 19139678 19236048 18058787 16897163 17808921 20113751 20786121 18628502
43022A8628502k495954q1950J552273K17035j986116j955862K05365J875822J442313
$$ 18628502 16132548 16050598 17602871 17819906 15833790 13877928 14083293 15959115 17401428
43013A7401428m63111k342484k981928j866718K55633J670777J537253Q74764
$$ 17401428 16938317 14595833 11613905 9747187 10002820 11673597 13210850 14085614
43005A4085614Q74426J069171L39791r75125j353281k12253J345527J866442R84914
$$ 14085614 14960040 16029211 16369002 15393877 14040596 13828343 15173870 17040312 18025226
42996A8025226k82273m10290R19883J958730Q76337j329813j796116k23009J68226
$$ 18025226 17742953 17332663 18252546 20211276 21087613 19757800 17961684 17738675 17906901
42987A7906901k282807m218419j788531L094615M653583R61730l677773m538550
$$ 17906901 15624094 11405675 9617144 12711759 17365342 18327072 14649299 10110749
42979A0110749j757194J135741J635978j4683j921492k276945r77294J38014l51240
$$ 10110749 8353555 9489296 11125274 11110591 9189099 6912154 5934860 6072874 5721634
42970E721634j211331m22713J172221P87484j473544j902070J300955M771155
$$ 5721634 4510303 4087590 5259811 6047295 4573751 2671681 3972636 8743791
42962H743791M593764J816447L27391Q06020M48265j590881k318712J80085K915521
$$ 8743791 13337555 15154002 15481393 16287413 16735678 15144797 12826085 13006170 15921691
42953A5921691J633039l131963o394226n010898j153381J347821J879830K288105
$$ 15921691 17554730 14422767 8028541 3017643 1864262 3212083 5091913 7380018
42945G380018K791714J751931n46650j227039O87200K064839M06144j635827J6526
$$ 7380018 10171732 11923663 11377013 10149974 10837174 12902013 13308157 11672330 11688856
42936A1688856M060847N015840J220685k670812k495855r465Q79593J55344O06048
$$ 11688856 15749703 20765543 21986228 19315416 16819561 16810096 17689689 17845033 18451081
42927A8451081K489254K961197O16810k370946l344186k419949j666085k114867
$$ 18451081 20940335 23901532 24518342 22147396 18803210 16383261 14717176 12602309
42919A2602309k662252j844151o4030P10076k07381p50253J016912L264372K195286
$$ 12602309 9940057 8095906 8031876 8741952 8534571 7784318 8801230 12065602 14260888
42910A4260888k197810n088212l018843J436499L456910K258824P47684N12960
$$ 14260888 12063078 6974866 3956023 5392522 8849432 11108256 11855940 12368900
42902A2368900O24320P32570J733683K990066K201204q23153k992300k091931
$$ 12368900 12993220 13725790 15459473 18449539 20650743 19827590 16835290 14743359
42894A4743359Q9509O43799k19214j41800J181123J455823l19391j769973l52413
$$ 14743359 14832868 15476667 15257453 15115653 16296776 17752599 17433208 15663235 15310822
42885A5310822K715360L707374J328538j670142k517891j992333k157534k307998
$$ 15310822 18026182 21733556 23062094 21391952 18874061 16881728 14724194 12416196
42877A2416196k98926K725971K865872l59219k211388O55130N077439N971768
$$ 12416196 12117270 14843241 17709113 17349894 15138506 15793636 20871075 26842843
42869B6842843L355276J014510K14317p91290k044750j522153M31128R05432n08297
$$ 26842843 30198119 31212629 31426946 30635656 28590906 27068753 27499881 28405313 27897016
42860B7897016q31576P43020P91561k475484n205249l113561K078530N025795
$$ 27897016 27065440 27808460 28600021 26124537 20919288 17805727 19884257 24910052
42852B4910052L839521J380714M67698Q86178Q78117p67261l939726o795012o695165
$$ 24910052 28749573 30130287 30597985 31484163 32362280 31595019 27655293 20860281 14165116
42843A4165116l251354L90075J166822Q9389L78739K376912L102764R82496j675510
$$ 14165116 10913762 11303837 12470659 12560048 12938787 15315699 18418463 19400959 17725449
42834A7725449j939753p9323J224262M88731j005023j162706R2724N34413j378912
$$ 17725449 15785696 15706373 16930635 17419366 16414343 15251637 15344361 15878774 14499862
42825A4499862l780684l271598J79567K372628L79486l069803l118243O49893
$$ 14499862 10719178 7447580 7627147 9999775 10379261 7309458 4191215 4841108
42817D841108M141738M660032L567492K700532J454950r93978l130685l037621
$$ 4841108 8982846 13642878 17210370 19910902 21365852 20371874 17241189 14203568
42809A4203568j481524q32856j506511j516031L13293K370987K316389J94112
$$ 14203568 12722044 11889188 10382677 8866646 9179939 11550926 13867315 14061427
42801A4061427j589269j264542L77821J570441K103107K948452L800681K973852
$$ 14061427 12472158 11207616 11585437 13155878 15258985 18207437 22008118 24981970
42793B4981970L09769j788980j583206n91354j082541k329383j827146M66513
$$ 24981970 25291739 23502759 21919553 21328199 20245658 17916275 16089129 16555642
42785A6555642J907724J283595M36158R50332J629042P40046j030958j724023
$$ 16555642 18463366 19746961 20183119 21133451 22762493 23502539 22471581 20747558
42777B0747558j128103p30484j010569o73893R09081J978507N01632k426060l084547
$$ 20747558 19619455 18888971 17878402 17204509 18113590 20092097 20593729 18167669 15083122
42768A5083122Q7019L664806L161799q98802l485925j899284R83451J704415J295578
$$ 15083122 15170141 18834947 21996746 21097944 17612019 15712735 16696186 18400601 19696179
42759A9696179K550155M699949M640976K287451Q03999J756989L630578N286071
$$ 19696179 22246334 26946283 31587259 33874710 34678709 36435698 40066276 45352347
42751D5352347P247714Q797577P306450K061376l819367o874895o860568n834973
$$ 45352347 52600061 61397638 68704088 70765464 66946097 60071202 53210634 47375661
42743D7375661n519083o252182o765476m796813j44347L109366O55730n500588
$$ 47375661 41856578 35604396 28838920 24042107 23897760 27007126 27662856 22162268
42735B2162268q410001n081675L3448K026513J599208J611991J922166J351798
$$ 22162268 13752267 8670592 8704040 10730553 12329761 13941752 15863918 17215716
42727A7215716J180301K394245K360376j147542m906698m157055L8742K406139
$$ 17215716 18396017 20790262 23150638 22003096 17096398 12939343 12978085 15384224
42719A5384224J487412Q64687K493731L981083L403247K297690K335798K700243
$$ 15384224 16871636 17736323 20230054 24211137 27614384 29912074 32247872 34948115
42711C4948115K329104J678563R41120n58586k037369j417944P97505R94673k282097
$$ 34948115 37277219 38955782 39896902 39338316 37300947 35883003 36680508 37675181 35393084
42702C5393084n390343m323357j44107K833315K597449O53517j088540k042213
$$ 35393084 30002741 25679384 25535277 28368592 30966041 31619558 30531018 28488805
42694B8488805j997963o74613J464075L140554L257467J628172p79984k029583
$$ 28488805 26490842 25816229 27280304 30420858 33678325 35306497 34526513 32496930
42686C2496930o91602K108638L154666P15016l095745m653901k987834m32371
$$ 32496930 31805328 33913966 37068632 37783648 34687903 30034002 27046168 26613797
42678B6613797N85720Q3368n21394q76167j873890l396814l326069j42646M111006
$$ 26613797 27199517 27282885 26761491 25885324 24011434 20614620 17288551 17145905 21256911
42669B1256911N438535K777657p06566k011855j715334j481127o60841J822190
$$ 21256911 26695446 29473103 28766537 26754682 25039348 23558221 22897380 24719570
42661B4719570M044986L191615L59641m65984J647434L240216J832788o54137
$$ 24719570 28764556 31956171 32315812 31849828 33497262 36737478 38570266 37916129
42653C7916129j240460N2800J142125Q60327m92903j983129k294049o62329J581356
$$ 37916129 36675669 36728469 37870594 38730921 38238018 36254889 33960840 33298511 34879867
42644C4879867K019372M49060n70655P12969K890487L490652J849063q24875k682661
$$ 34879867 36899239 37348299 36777644 37490613 40381100 43871752 45720815 44895940 42213279
42635D2213279k152845N18905K392035P51824k766967l621026m64547L173217
$$ 42213279 40060434 40579339 42971374 43723198 40956231 37335205 36870658 40043875
42627D0043875M184606L514785L019336K156111J59060j396509r22880M57625
$$ 40043875 44228481 47743266 50762602 52918713 53077773 51681264 50758384 51216009
42619E1216009R13165O04712K89446m58396j338195j24283L823768P016956N857843
$$ 51216009 52129174 52733886 53023332 52564936 51226741 51102458 54926226 61943182 67801025
42610F7801025J624150j257813m40434L092663P061241Q837898O640430K381807
$$ 67801025 69425175 68167362 67726928 70819591 77880832 86718730 93359160 95740967
42602I5740967Q72085L421781N203018K310204k035882k855660j544439k675478
$$ 95740967 96613052 100034833 105237851 107548055 105512173 102656513 101112074 98436596
42594I8436596n234125m166128L19107K419729K24740j557732Q5123K105442J775302
$$ 98436596 93202471 89036343 89355450 91775179 91999919 90442187 90527310 92632752 94408054
42585I4408054J184683K082899J939474o85395j756427K290267P901492Q929276
$$ 94408054 95592737 97675636 99615110 98929715 97173288 99463555 107365047 116294323
42577A16294323N334785K357987K626306M018033M707889N633826P407079Q498281
$$ 116294323 121629108 123987095 126613401 130631434 135339323 140973149 148380228 156878509
42569A56878509P700286N962656M816760M727265N621016P489159R772077J1280012
$$ 156878509 164578795 170541451 175358211 180085476 185706492 193195651 202967728 214247740
42561B14247740J1390329J0705497J0159144R864094R055407P042576M187939
$$ 214247740 225638069 236343566 246502710 256366804 265422211 272464787 276652726
42554B76652726J801004Q15183Q20059P34264j47668k296761n964681r789867
$$ 276652726 278453730 279268913 280088972 280823236 280675568 278378807 272414126 262624259
42546B62624259j0762382p821294m491211n032315q470229r916400p951489o635463
$$ 262624259 251861877 244040583 239549372 234517057 226046828 216130428 208178939 201543476
42538B01543476q805630j1321501r702053m737951j448952l008792q082454j2917799
$$ 201543476 192737846 181416345 171714292 166976341 165527389 162518597 154436143 141518344
42530A41518344j4160696j0953194o033550l501607m154562m746410l087064j316199
$$ 141518344 127357648 116404454 110370904 106869297 102714735 97968325 94881261 93565062
42522I3565062k052671l945201m039612k536295j868032k489850k948590l093688
$$ 93565062 91512391 87567190 83527578 80991283 79123251 76633401 73684811 70591123
42514G0591123l828677m360802l139675j283851j661882m230649n354810k594943
$$ 70591123 66762446 62401644 59261969 57978118 56316236 52085587 46730777 44135834
42506D4135834K135698M926969L707921l98945l892507l388332P34337L705102
$$ 44135834 46271532 51198501 54906422 54507477 50614970 47226638 47960975 51666077
42498E1666077J706011k818336m134592j025367K093224K125406J085828J331699
$$ 51666077 53372088 50553752 46419160 45393793 47487017 49612423 50698251 52029950
42490E2029950J145256j757222n189940m915433r29665K253505J592223j063816
$$ 52029950 53175206 51417984 46228044 41312611 40382946 42636451 44228674 43164858
42482D3164858k165449r03428O67301O86240n35095j288067n10151J124348K107291
$$ 43164858 40999409 40095981 40763282 41449522 40914427 39626360 39116209 40240557 42347848
42473D2347848J925180J539208J879594K519232K498287J974883J951592K315833
$$ 42347848 44273028 45812236 47691830 50211062 52709349 54684232 56635824 58951657
42465E8951657J480588j084053k929325j038364L748408O677105M598964m2261
$$ 58951657 60432245 59348192 56418867 55380503 59128911 65806016 70404980 70362719
42457G0362719k553345k021349j336851j811526j287195J527160M198054M152255
$$ 70362719 67809374 65788025 64451174 62639648 61352453 62879613 67077667 71229922
42449G1229922K603109K311222L237511L233035J859264O69297L54333L26650
$$ 71229922 73833031 76144253 79381764 82614799 84474063 85143360 85497693 85824343
42441H5824343P68222K400680M238564M176562K186433O49857J022255K231635
$$ 85824343 86592565 88993245 93231809 97408371 99594804 100244661 101266916 103498551
42433A03498551K903200L121848L222934K681043J219352l15406j030291r23382
$$ 103498551 106401751 109523599 112746533 115427576 116646928 116331522 115301231 114377849
42425A14377849k84911P68171J844942K455341K807553L312218L322776J739646
$$ 114377849 114092938 114861109 116706051 119161392 121968945 125281163 128603939 130343585
42417A30343585j106095l620886n006119n615095n371785l758757j572689o75464
$$ 130343585 129237490 125616604 120610485 114995390 109623605 105864848 104292159 103616695
42409A03616695j473966k431964k533975k415951k676356l104935m034115o122050
$$ 103616695 102142729 99710765 97176790 94760839 92084483 88979548 84945433 78823383
42401G8823383q095265p351022m044096j869508k916797m299215k474480J128135
$$ 78823383 70728118 63377096 59333000 57463492 54546695 50247480 47773000 48901135
42393D8901135J985607j072473m480047m839295k470275K47053J682014J350714
$$ 48901135 50886742 49814269 45334222 40494927 38024652 38271705 39953719 41304433
42385D1304433n33128k690703l129775j088405J776556K925371J569151o06582
$$ 41304433 40771305 38080602 34950827 33862422 35638978 38564349 40133500 39526918
42377C9526918j304177n81J591585J439989n87687k630938k789360p83811K110451
$$ 39526918 38222741 38222160 39813745 41253734 40666047 38035109 35245749 34461938 36572389
42368C6572389M088024L787298J132526k349295m550842m517748k982113j244613
$$ 36572389 40660413 44447711 45580237 43230942 38680100 34162352 31180239 29935626
42360B9935626l4633N22377M47431k60800j491740k709136k867089j328233Q54903
$$ 29935626 29900993 30423370 30870801 30610001 29118261 26409125 23542036 22213803 23068706
42351B3068706J539793N1979j827287k233890j407916n00851L07191J003309O65261
$$ 23068706 24608499 24660478 22833191 20599301 19191385 18690534 18997725 20001034 20666295
42342B0666295p91541j320696M15370K433377K385993J410410J615449J574207
$$ 20666295 19874754 18554058 18969428 21402805 23788798 25199208 26814657 28388864
42334B8388864j108368m069901k682085J975212L776739R87473j413872o58954
$$ 28388864 27280496 23210595 20528510 22503722 26280461 27267934 25854062 25195108
42326B5195108o23608m034138o813974n012824j724192j413980k139750K11532
$$ 25195108 24571500 20537362 13723388 8710564 6986372 5572392 3432642 3644174
42318C644174L807617L893306J127402q7199M09052p03777k813725k032679J156567
$$ 3644174 7451791 11345097 12472499 12385300 12794352 12090575 9276850 7244171 8400738
42309H400738K133937L89281M58469L528910N046039K625750j86325o43026j147054
$$ 8400738 10534675 10923956 11382425 14911335 19957374 22583124 22396799 21753773 20606719
42300B0606719l626761n128347k930038N26797J744723J290002J091295L82647
$$ 20606719 16979958 11851611 8921573 9448370 11193093 12483095 13574390 13957037
42292A3957037j684812k712165n35869K572045L123827J587505P03330Q44122
$$ 13957037 12272225 9560060 9024191 11596236 14720063 16307568 17010898 17855020
42284A7855020P19942O87670J642254K283346R91894j071465j888982j847836
$$ 17855020 18574962 19262632 20904886 23188232 24180126 23108661 21219679 19371843
42276A9371843k016805j400355N57283J183753j419292l847846j910009K082260
$$ 19371843 17355038 15954683 16511966 17695719 16276427 12428581 10518572 12600832
42268A2600832K266169j442262l198604o31994J952923J269096q9447P80281J865036
$$ 12600832 14867001 13424739 10226135 9594141 11547064 12816160 12726713 13506994 15372030
42259A5372030L01850k249103k315868m0361J793837K228362K292276K179223
$$ 15372030 15673880 13424777 11108909 11068548 12862385 15090747 17383023 19562246
42251A9562246J352572M32840K63592o7882j825620l987640m360867k799247j164465
$$ 19562246 20914818 21347658 21611250 21543368 19717748 15730108 11369241 8569994 7405529
42242G405529m93344j91938K68072P08914J123576J625399J796529J467490J569730
$$ 7405529 6912185 6720247 6988319 7697233 8820809 10446208 12242737 13710227 15279957
42233A5279957K639641L163950J355614j880296l855097l736960l065960k681428
$$ 15279957 17919598 21083548 22439162 20558866 16703769 12966809 9900849 7219421
42225G219421j689282m1733M83812p63216j589368j23025J900021J345609j597474
$$ 7219421 5530139 5488406 5972218 5209002 3619634 3496609 5396630 6742239 5144765
42216E144765l310110j491795K009399L873526L284449J998528J359175Q69864
$$ 5144765 1834655 342860 2352259 6225785 9510234 11508762 12867937 13737801
42208A3737801j96750j232820j270914p31194r18604j930674k384395j547488
$$ 13737801 13541051 12308231 11037317 10306123 9387519 7456845 5072450 3524962
42200C524962m56897j97446k96980K9186J34971r42052k330863k172181l85413
$$ 3524962 3068065 2870619 2573639 2602825 2737796 1795744 -535119 -2707300 -3092713
42191c092713J242392J693131J545323J106448p4573j394256j299993j03678j72184
$$ -3092713 -1850321 -157190 1388133 2494581 2420008 1025752 -274241 -377919 -550103
42182e50103j901982k145249J138673N038048N419339K680345M32273j84232r67108
$$ -550103 -2452085 -4597334 -3458661 1579387 6998726 9679071 10111344 9927112 8960004
42173H960004k110780j560440O59070J706942Q05327Q92665L415714N157872L068436
$$ 8960004 6849224 5288784 5947854 7654796 8460123 9352788 12768502 17926374 20994810
42164B0994810q08395k577528k283294k730701m174326m205696k225729j58793
$$ 20994810 20186415 17608887 15325593 12594892 8420566 4214870 1989141 1830348
42156A830348J217315K938602M442199L272798m65732k751379r18417K278634
$$ 1830348 3047663 5986265 10428464 13701262 13235530 10484151 9565734 11844368
42148A1844368K492360j11872j569392j77810J266507q4942k865463l325900l22320
$$ 11844368 14336728 14224856 12655464 12477654 13744161 13659219 10793756 7467856 7145536
42139G145536L325200M406401K709376J79148j966979l724561m537021l224386
$$ 7145536 10470736 14877137 17586513 17765661 15798682 12074121 7537100 4312714
42131D312714k43116J830659J263049p23935j967928k079154j672025m57384J659838
$$ 4312714 4069598 5900257 7163306 6439371 4471443 2392289 720264 262880 1922718
42122A922718K723200P95945k423864k942150J64817L333667L308613R90955p35229
$$ 1922718 4645918 5441863 3017999 75849 240666 3574333 6882946 7873901 7138672
42113G138672r35044o46096l96255L43218J653529K535443J946180J8935j753036
$$ 7138672 6203628 5557532 5161277 5504495 7158024 9693467 11639647 11658582 9905546
42104I905546j783494l31358M08727q35872k302126j702929o3321l22869k236347
$$ 9905546 8122052 7790694 8199421 7363549 5061423 3358494 3295173 2972304 735957
42095G35957k108517J307618M082163K530274j391028l004853j252465J059318
$$ 735957 -1372560 -64942 4017221 6547495 5156467 2151614 899149 1958467
42087A958467J978784J914387J020025j283875l706118l286394L74351L505122
$$ 1958467 3937251 5851638 6871663 5587788 1881670 -1404724 -1030373 2474749
42079B474749K632224q76026k591515m75118L253518N362850M956312L217893
$$ 2474749 5106973 4230947 1639432 1164314 4417832 9780682 14736994 17954887
42071A7954887J337326k14234j152867j462705j802410k595883k807138j172709
$$ 17954887 19292213 19077979 17925112 16462407 14659997 12064114 9256976 8084267
42063H084267J144982J201174j482222l566230k578220o95525j137815k791135
$$ 8084267 9229249 10430423 8948201 5381971 2803751 2108226 970411 -1820724
42055a820724k201754L38411J270274J09953L55087L116028M738245K709516n76198
$$ -1820724 -4022478 -3684067 -2413793 -2303840 -1948753 1167275 5905520 8615036 8038838
42046H038838k410151l692010n152623m082070R01114N461937M869549J031522
$$ 8038838 5628687 1936677 -3215946 -7298016 -6396902 -934965 3934584 4966106
42038D966106p67302J20864L22138o47156P070K391217L287530J811975N79948
$$ 4966106 4198804 4319668 4641806 3994650 4001720 6392937 9680467 11492442 12072390
42029A2072390O35526J11945j248655j132371N51218O48745j778827l413170k078558
$$ 12072390 12707916 12819861 11571206 10438835 10990053 11638798 9859971 6446801 4368243
42020D368243n1072K13493k41999J57935N60808K31154N80217J995334K009906
$$ 4368243 4317171 4530664 4288665 4446600 5007408 5238562 5818779 7814113 9824019
42011I824019m92860k486925j340922Q82165J001030k81513o07206n55056j904659
$$ 9824019 9331159 6844234 5503312 6385477 7386507 7104994 6497788 5942732 4038073
42002D038073l371446k367971L48095J856127J857306K352296L371693K990413
$$ 4038073 666627 -1701344 -1353249 502878 2360184 4712480 8084173 11074586
41994A1074586J206908Q7081J85093J94629r5857J45137J70648j328677k913932
$$ 11074586 12281494 12368575 12553668 12748297 12652440 12797577 12968225 11639548 8725616
41985H725616k020827K21611J53743k068644k129080J136787L054572L23742l471858
$$ 8725616 6704789 6926400 7080143 5011499 2882419 4019206 7073778 7397520 3925662
41976C925662l167272M86990K656295J494801o37357j619370j408350k48665J361639
$$ 3925662 758390 1245380 3901675 5396476 4759119 3139749 1731399 1482734 2844373
41967B844373J371091j570652m586967l044501K684387O525340M388991n94431
$$ 2844373 4215464 2644812 -1942155 -4986656 -2302269 4223071 8612062 8017631
41959H017631k848265j669824n30205p73117j03361K519245M263170K427500j433783
$$ 8017631 5169366 3499542 2969337 2196220 2092859 4612104 8875274 11302774 9868991
41950I868991l601048k944796j383201m75869N0850N28050M48710N902O43992
$$ 9868991 6267943 3323147 1939946 1464077 1514927 2042977 2491687 2497589 3141581
41941C141581K913881M980668M501418J430491j870407k925511j153906J740988
$$ 3141581 6055462 11036130 15537548 16968039 15097632 12172121 11018215 12759203
41933A2759203L008393J306936j609278k511448l93593K522811L888042L809636
$$ 12759203 15767596 17074532 15465254 12953806 12560213 15083024 18971066 22780702
41925B2780702L478936K970449K037579J637614K453993K803466N62561l026239
$$ 22780702 26259638 29230087 31267666 32905280 35359273 38162739 38725300 35699061
41917C5699061m112294j413337J693860J541092j167226k868526k264668j678003
$$ 35699061 31586767 30173430 31867290 33408382 32241156 29372630 27107962 25429959
41909B5429959l108933m993559m426340j657584j24698j499516k934711j169882
$$ 25429959 22321026 17327467 12901127 11243543 11118845 9619329 6684618 5514736
41901E514736K187781K554026p86414l274272j608440J626764K097741j34202
$$ 5514736 7702517 10256543 9470129 6195857 4587417 6214181 8311922 8177720
41893H177720j542178n10659J312371K165226J883251R10251q1575r2671O81675
$$ 8177720 6635542 6124883 7437254 9602480 11485731 12395982 12314407 12221736 12903411
41884A2903411K16421k232404l804295j790558J627913K118814k21110j323422
$$ 12903411 13119832 10887428 7083133 5292575 6920488 9039302 8818192 7494770
41876G494770Q2685R28635l44183j310499n15489j82204j550805j824598J092750
$$ 7494770 7577455 8506090 8161907 6851408 6335919 6153715 4602910 2778312 3871062
41867C871062M452920M738984K862291J746213J463081N80410p8514P86406J308931
$$ 3871062 8323982 13062966 15925257 17671470 19134551 19714961 19636447 20422853 21731784
41858B1731784r58003m052179l730095n9725K470209J476862p47548j649679j597389
$$ 21731784 20773781 16721602 12991507 12931782 15401991 16878853 16131305 14481626 12884237
41849A2884237j727858j870376j687406j252429J52157L146126N768787M957686
$$ 12884237 11156379 9286003 7598597 6346168 6498325 9644451 15413238 20370924
41841B0370924J189750j540451j314948n30094j244836j847103m77399J419531
$$ 20370924 21560674 20020223 18705275 18175181 16930345 15083242 14605843 16025374
41833A6025374J660188Q51384N15785m1931j876547l311938k202966r771N7253
$$ 16025374 17685562 18536946 19052731 19010800 17134253 13822315 11619349 11609578 11666831
41824A1666831j663027j610416J209400L451484K543202L98377J42937J442532
$$ 11666831 10003804 8393388 9602788 13054272 15597474 15995851 16138788 17581320
41816A7581320J457162o97700k671621j965146J141737M020868M376782K327432
$$ 17581320 19038482 18340782 15669161 13704015 14845752 18866620 23243402 25570834
41808B5570834K3449q58456j054659k452473m833574n116420r55288N489348Q916779
$$ 25570834 25594283 24735827 23681168 21228695 16395121 11278701 10323413 15812761 24729540
41799B4729540O533732J360545j076923J005317L868423K993977j560731n639137
$$ 24729540 31263272 32623817 31546894 32552211 36420634 39414611 37853880 32214743
41791C2214743o137388l997952j860577n67404O51541J681638J253876p92661
$$ 32214743 26077355 22079403 20218826 19651422 20302963 21984601 23238477 22445816
41783B2445816k709690l015037k248343j620253r62469M88324J785269P81804
$$ 22445816 19736126 16721089 14472746 12852493 11890024 12378348 14163617 14945421
41775A4945421k444590m530692k832835O54558J654590m66516j876908r1271K328006
$$ 14945421 12500831 7970139 5137304 5791862 7446452 6979936 5103028 5011757 7339763
41766G339763J936195k05083n72106Q22250M71242k655271n190080m468690j946821
$$ 7339763 9275958 9070875 8498769 9321019 9792261 7136990 1946910 -2521780 -4468601
41757d468601J25079J957001L756378L338751l19171l605235k396800J835700
$$ -4468601 -4343522 -2386521 1369857 4708608 4389437 784202 -1612598 223102
41749B23102M114974L130136J991862K289744K159048P69307n8986q5448j770515
$$ 223102 4338076 7468212 9460074 11749818 13908866 14678173 14619187 14533739 12763224
41740A2763224m939437m986846J28936N122408M138603o72435k492229J00798
$$ 12763224 7823787 2836941 2965877 8088285 12226888 11554453 9062224 9163022
41732I163022K072545N25504j398763m59552J808927K547366K049154J905698
$$ 9163022 11235567 11761071 10362308 9902756 11711683 14259049 16308203 18213901
41724A8213901J547304k23553k165236k167539p97402m86630j754996k747787
$$ 18213901 19761205 19537652 17372416 15204877 14407475 13920845 12165849 9418062
41716I418062k367118j645523j782733k547507k949536k244765k05744K485335
$$ 9418062 7050944 5405421 3622688 1075181 -1874355 -4119120 -4324864 -1839529
41708a839529M285298M392701L878444L811698K988970k09365m006313m305599
$$ -1839529 2445769 6838470 10716914 14528612 17517582 17308217 13301904 8996305
41700H996305m36488L147237K732402L11365O3874K002281K686470J192577K59253
$$ 8996305 8559817 11707054 14439456 14750821 14814695 16816976 19503446 20696023 20955276
41691B0955276J214539J793175M73911o30336L06910J024180j256888m418733
$$ 20955276 22169815 23962990 24436901 23806565 24113475 25137655 23880767 19462034
41683A9462034l710425J071142M612322L005960j609436m581088m153655j679137
$$ 19462034 15751609 16822751 21435073 24441033 22831597 18250509 14096854 12417717
41675A2417717J233382L503625L944847K191030j45591q71945L58194J943180
$$ 12417717 13651099 17154724 21099571 23290601 23145010 22273065 22631259 24574439
41667B4574439K273691J115168l43056l93112J278042K337482J53337l985589
$$ 24574439 26848130 27963298 27620242 27227130 28505172 30842654 30995991 27010402
41659B7010402n284199j603635L029105L361486m81863m040911m622505l205133
$$ 27010402 21726203 20122568 23151673 26513159 26031296 21990385 17367880 14162747
41651A4162747j315482M95159J424018J009213Q34871K402377L571106J001792
$$ 14162747 12847265 13342424 14766442 15775655 16610526 19012903 22584009 23585801
41643B3585801l685494m759095o66890L101176J851694j752594k335256L57068
$$ 23585801 19900307 15141212 14474322 17575498 19427192 17674598 15339342 15696410
41635A5696410K345449J918498R51467P37198M01680n47883j084885l85683J270761
$$ 15696410 18041859 19960357 20911824 21649022 22050702 21502819 20417934 20032251 21303012
41626B1303012L212322M509222M115097K339236J046022Q64660q2950k661829
$$ 21303012 24515334 29024556 33139653 35478889 36524911 37389571 37306621 34644792
41618C4644792m086575j779455K005774L069572J398920L56972P41319L44288
$$ 34644792 30558217 28778762 30784536 33854108 35253028 35610000 36351319 36695607
41610C6695607p27048N67244M364052O233948L533136n29451j753819n45378K31551
$$ 36695607 35968559 36535803 40899855 47133803 50666939 50137488 48383669 47838291 48069842
41601D8069842J94931Q94648K127633K119711O66195m78880q4293J404834K780596
$$ 48069842 48264773 49159421 51287054 53406765 54072960 53594080 53509787 54914621 57695217
41592E7695217K911542J403519m92458n91869J512304L488787L060011N93125
$$ 57695217 60606759 62010278 61517820 60925951 62438255 65927042 68987053 69580178
41584F9580178k114195m215715n664221o029955n064391l554346k382526j632240
$$ 69580178 67465983 63250268 57586047 51556092 46491701 42937355 40554829 38922589
41576C8922589j441511k285275l399486k783857k75763J294437j2643k010251
$$ 38922589 37481078 35195803 31796317 29012460 28736697 30031134 30018491 28008240
41568B8008240j479379R63008J900522J26579k231348l195467k859310j902749
$$ 28008240 26528861 27491869 29392391 29518970 27287622 24092155 21232845 19330096
41560A9330096o78744M4746l60109q95703q1661J319908R83791j249489k722272
$$ 19330096 18651352 18696098 18335989 17440286 17358625 18678533 19662324 18412835 15690563
41551A5690563j847359m13214p14671k180722k467713p42627J687235L331727
$$ 15690563 13843204 13429990 12715319 10534597 8066884 7324257 9011492 12343219
41543A2343219L711517K963913J553118M23753L93156R85217N86216j562601l907977
$$ 12343219 16054736 19018649 20571767 20995520 21388676 22373893 22960109 21397508 17489531
41534A7489531m112069k171504p67801j638143k881139j690055J087159J788957
$$ 17489531 13377462 11205958 10438157 8800014 5918875 4228820 5315979 7104936
41526G104936n67892k629517j659377O84440J488915J087427J770584L618861
$$ 7104936 6537044 3907527 2248150 2932590 4421505 5508932 7279516 10898377
41518A0898377M450569L141656O59432j607569k671179k011911o39725q09483
$$ 10898377 15348946 18490602 19150034 17542465 14871286 12859375 12219650 11410167
41510A1410167k713680l224276n01294K205148R46757k503517l182746q33817
$$ 11410167 8696487 5472211 4970917 7176065 8122822 5619305 2436559 1602742
41502A602742J05211j519706j529555J933971M364864J886621k192152k162151
$$ 1602742 1707953 188247 -1341308 592663 4957527 6844148 4651996 2489845
41494B489845J736931M339096L314156J500405J746241L092038K928880P12719
$$ 2489845 4226776 8565872 11880028 13380433 15126674 18218712 21147592 21860311
41486B1860311j505911j476988N74679J663653o38025m465864n070852p92993
$$ 21860311 20354400 18877412 19452091 21115744 20477719 16011855 10941003 10148010
41478A0148010M417268N856560L450580M80075j075622j513644j320750r02799
$$ 10148010 14565278 20421838 23872418 24352493 23276871 21763227 20442477 19539678
41470A9539678j422598l186757l915547j432173K390452L443132J187271o05173
$$ 19539678 18117080 14930323 11014776 9582603 11973055 15416187 16603458 15998285
41462A5998285L05362J387259j03028k149998q44660L075783M382569P09821l576093
$$ 15998285 16303647 17690906 17587878 15437880 14593220 17669003 22051572 22761393 19185300
41453A9185300l149810Q48146K624794K19874k108561j170257o3879k606313n970550
$$ 19185300 16035490 16883636 19508430 19728304 17619743 16449486 16385607 13779294 7808744
41444G808744m296330J739406N050556K421136j294538j338134K86443l8246p79751
$$ 7808744 3512414 5251820 10302376 12723512 11428974 10090840 10377283 10339037 9559286
41435I559286J084496L196948Q44553m725119p093866l726517J096407L056621
$$ 9559286 10643782 13840730 14685283 9960164 2866298 -860219 236188 3292809
41427C292809K619395J784817N90130r38895j056065Q04014K101749P22506j759379
$$ 3292809 5912204 7697021 8287151 7348256 6292191 7096205 9197954 9920460 8161081
41418H161081k777870k677152l104612l155028n93479L542333N110724K573838
$$ 8161081 5383211 2706059 -398553 -3553581 -4147060 -604727 4505997 7079835
41410G079835l24455M37135L376953L558804j26425l056292j548883J529313R13216
$$ 7079835 6755380 7192515 10569468 14128272 14001847 10945555 9396672 10925985 11839201
41401A1839201l025335m680428j704602J545654R22939j391456j051979J460829
$$ 11839201 8813866 4133438 2428836 3974490 4897429 3505973 2453994 3914823
41393C914823K380673J087702K14578L50628m29356j801936q91661K290152L654555
$$ 3914823 6295496 7383198 7597776 7948404 7519048 5717112 4825451 7115603 10770158
41384A0770158J114100k024269k034180J13319J180829N63175k7143J11399K87404
$$ 10770158 11884258 9859989 7825809 7939128 9119957 9683132 9655989 9767388 10054792
41375A0054792J80331m0746l70968l73030O80581J873339P89526k790985n376381
$$ 10054792 10235123 10194377 9823409 9450379 10130960 12004299 12793825 10002840 4626459
41366D626459m027606l80793J824267J606148O93668R9830m72316q03286n21061
$$ 4626459 598853 218060 2042327 3648475 4342143 4441973 3969657 3166371 2645310
41357B645310o28402j993469k886616q87578K963712M868819L375692R64689m2605
$$ 2645310 2016908 23439 -2863177 -3750755 -787043 4081776 7457468 8422157 8379552
41348H379552l25160j145223j688094p21293Q56263J191454J99750p42596j188825
$$ 8379552 8054392 6909169 5221075 4499782 5356045 6547499 6747249 6004653 4815828
41339D815828j825144k404765j382214J599606M143578L430411j03814k713137
$$ 4815828 2990684 585919 -796295 803311 4946889 8377300 8273486 5560349
41331E560349j536622J971008L733593J768987j910154m049708l524706j547902
$$ 5560349 4023727 5994735 9728328 11497315 9587161 5537453 2012747 464845
41323D64845K75491J197240J317790J157397R49782J43763j671888l244460k448098
$$ 464845 740336 1937576 3255366 4412763 5362545 5506308 3834420 589960 -1858138
41314a858138O66536L042048K149532p03873k112962q47370J255074K197957J881733
$$ -1858138 -1191602 1850446 3999978 3296105 1183143 335773 1590847 3788804 5670537
41305E670537J233514Q15882P26017Q89866J021518P38479j87049j771524l465114
$$ 5670537 6904051 7719933 8445950 9335816 10357334 11095813 10908764 9137240 5672126
41296E672126l738910j303446K526924M199209K047859j298101k376780j389008
$$ 5672126 1933216 629770 3156694 7355903 9403762 8105661 5728881 4339873
41288D339873r35147j513164j387971m05302l66789j231165n62015K005392L186755
$$ 4339873 3404726 1891562 503591 98289 -268500 -1499665 -2061680 -56288 3130467
41279C130467R87944j759000j494120Q10240J641880M82886j79562N25627R05867
$$ 3130467 4118411 2359411 865291 1675531 3317411 3800297 3620735 4146362 5052229
41270E052229L67425M67332J479158J112090j754616m592456m451795j831118
$$ 5052229 5419654 5886986 7366144 8478234 6723618 2131162 -2320633 -4151751
41262d151751O55305J936369K603134K538360J022956j101315j776931n70560
$$ -4151751 -3496446 -1560077 1043057 3581417 4604373 3503058 1726127 1155567
41254A155567O85124N14470m97571j003161l97251J342453L769021N471597N067835
$$ 1155567 1840691 2355161 1857590 854429 457178 1799631 5568652 11040249 16108084
41245A6108084L190533J785466J030319p70357l469629m235396k224239r98616
$$ 16108084 19298617 21084083 22114402 21344045 17874416 13639020 11414781 10416165
41237A0416165l258242n820661l938855J185790L989700K803028J283956J434758
$$ 10416165 7157923 1337262 -2601593 -1415803 2573897 5376925 6660881 8095639
41229H095639Q45051j512200k300200K97025K484621O99639k302280j892728Q33330
$$ 8095639 8940690 7428490 5128290 5425315 7909936 8609575 6307295 4414567 5247897
41220E247897J150489j393702k614896p28523J320692J041730m24401j223517
$$ 5247897 6398386 5004684 2389788 1661265 2981957 4023687 3599286 2375769
41212B375769j217509n11945J169245K668790K034570p6845o83391Q35331J534637
$$ 2375769 1158260 646315 1815560 4484350 6518920 6442075 5758684 6594015 8128652
41203H128652k53869k086626j319624R70936K172885J864813J149482L97305j23823
$$ 8128652 7874783 5788157 4468533 5439469 7612354 9477167 10626649 11023954 10900131
41194A0900131N91101K154207J873119j286622l733703j657074K823905L779920
$$ 10900131 11491232 13645439 15518558 14231936 10498233 8841159 11665064 15444984
41186A5444984m05424m822286m846010j802063R5541n0040M67898K921510M701280
$$ 15444984 15039560 10217274 5371264 3569201 3664742 3614702 4082600 7004110 11705390
41177A1705390K851170j514790l983571j984448K097951L701751J307572k162808
$$ 11705390 14556560 13041770 9058199 7073751 9171702 12873453 14181025 12018217
41169A2018217k974208n07918K625546L459038J273908j961652l401293k037237
$$ 12018217 9044009 8536091 11161637 14620675 15894583 13932931 10531638 8494401
41161H494401L24239J252456M57964n57762j111032k010898l600611m756012m294114
$$ 8494401 8818640 10071096 10529060 9971298 8860266 6849368 3248757 -1507255 -5801369
41152e801369k190502P35240L075751L022108J60774k970884l292106j193608
$$ -5801369 -7991871 -7256631 -4180880 -1158772 -997998 -3968882 -7260988 -8454596
41144h454596L48664O66218J988500M450869M645606J205567k106864j919164
$$ -8454596 -8105932 -7439714 -5451214 -1000345 3645261 4850828 2743964 824800
41136H24800l08071n65250j163505J166058M643728M396746L21884k614263k081029
$$ 824800 516729 -48521 -1212026 -45968 4597760 8994506 9316390 6702127 4621098
41127D621098j000479j527141j688962J7180J476190J191594J518900M120029
$$ 4621098 3620619 2093478 404516 421696 1897886 3089480 4608380 8728409
41119H728409N523730J597583n341909q257597m024282L024054O589833M901569
$$ 8728409 14252139 15849722 10507813 2250216 -1774066 1249988 7839821 12741390
41111A2741390R70878j655293k036896j433797r84577m73590N67526J456708J166428
$$ 12741390 13712268 12056975 10020079 8586282 7601705 7128115 7695641 9152349 10318777
41102A0318777Q1784n17518n60625j060137j905770j840029r04334n76891q82569
$$ 10318777 10400561 9883043 9322418 8262281 6356511 4516482 3612148 3035257 2152688
41093B152688j1114K099942K694879N25202j568459r00203Q05978N75106n95267
$$ 2152688 2141574 4241516 6936395 7461597 5893138 4992935 5798913 6374019 5778752
41084E778752L79159K906697L254628N96446j818770k142764k351483l691487
$$ 5778752 6157911 9064608 12319236 12915682 11096912 8954148 6602665 2911178
41076B911178l658722j91401M044515M815653K117405k73795k06633P43440M38264
$$ 2911178 -747544 -938945 3105570 7921223 10038628 9764833 9558200 10301640 10739904
41067A0739904j053999k322281k386173r66067J620202M116099M869000L389147
$$ 10739904 9685905 7363624 4977451 4011384 5631586 9747685 14616685 18005832
41059A8005832Q13873j404423k543808k294919o40546J342335J780498K54754
$$ 18005832 18819705 17415282 14871474 12576555 11936009 13278344 15058842 15313596
41051A5313596j119567l22247J432855J084590j715400l620194k116133R79197
$$ 15313596 14194029 13871782 15304637 16389227 14673827 11053633 8937500 9916697
41043I916697K310404J689023J486203K142566J372673j706100m474040m217465
$$ 9916697 12227101 13916124 15402327 17544893 18917566 17211466 12737426 8519961
41035H519961j598359P99595J722667J461445L53547j089068j770730j538639
$$ 8519961 6921602 7721197 9443864 10905309 11258856 10169788 8399058 6860419
41027F860419j915660l401978l499094m1896M635040O070738L705518J056780
$$ 6860419 4944759 1542781 -1956313 -1998209 2636831 8707569 12413087 13469867
41019A3469867r2758j646032m329963n144449k237838J052947N26914k667872
$$ 13469867 13377109 11731077 7401114 2256665 18827 1071774 1598688 -1069184
41011a069184l811882j421433J340775J758531P36082L89636J124988J990471
$$ -1069184 -4881066 -6302499 -4961724 -3203193 -2467111 -2077475 -952487 1037984
41003A037984K090027R68132r95372k276502j653170K5323R65100J046240J476597
$$ 1037984 3128011 4096143 3100771 824269 -828901 -803578 161522 1207762 2684359
40994B684359K176465J934625J187826J793984L416420L143093j972l060605l449074
$$ 2684359 4860824 6795449 7983275 9777259 13193679 16336772 16334800 13274195 9825121
40985I825121k498645k367297k070699K43698L055540L190959P40721j304820
$$ 9825121 7326476 4959179 2888480 3132178 6187718 9378677 10119398 8814578
40977H814578j783588k192035k965110k594509r33119P5820j60761M4146J121776
$$ 8814578 7030990 4838955 1873845 -720664 -1653783 -1577963 -1738724 -1694578 -572802
40968e72802J179260Q156O66151M553179P807013N788184o21399o087569o928121
$$ -572802 606458 614614 1280765 5833944 13640957 19429141 18807742 12720173 5792052
40959E792052l752181N72566L072305K129512n97516r44721K541567N744591M363686
$$ 5792052 2039871 2612437 5684742 7814254 7216738 6272017 8813584 14558175 18921861
40950A8921861L78871r33416Q18185R68747k258301n003989m279899k197664j389976
$$ 18921861 19300732 18367316 19185501 20154248 17895947 12891958 8612059 6414395 5024419
40941E024419p30323J227805K384728M95889k412225k922947j333431j12109O84284
$$ 5024419 4294096 5521901 7906629 8402518 5990293 3067346 1733915 1621806 2306090
40932B306090K286975L171228Q49351l051662m282149k531996j742943l169928
$$ 2306090 4593065 7764293 8613644 5561982 1279833 -1252163 -2995106 -6165034
40924f165034k985767J319300O411994P741269N464697K843708J286251N8249
$$ -6165034 -9150801 -7831501 -1419507 6321762 11786459 14630167 15916418 15974667
40916A5974667r71564j410367j951514l127587l402590j159990K134277L402366
$$ 15974667 15003103 13592736 11641222 8513635 5111045 3951055 6085332 9487698
40908I487698K191400R19456J059343J562891J238807L31907p31200k020049k857796
$$ 9487698 11679098 12598554 13657897 15220788 16459595 16791502 16060302 14040253 11182457
40899A1182457j889166O47296K354315J521379o00830j342229L81773L239349
$$ 11182457 9293291 9940587 12294902 13816281 13215451 11873222 12254995 15494344
40891A5494344M882311L813624P38654j745053j782006m77056r9450m36456O78370
$$ 15494344 20376655 24190279 24928933 23183880 21401874 20924818 20825368 20388912 21067282
40882B1067282K965701K972362p23454m523641m554168k012865o30837o99233
$$ 21067282 24032983 27005345 26281891 21758250 17204082 15191217 14560380 13861147
40874A3861147M45289K934101L734111J781738l50417r97968j783404l656477
$$ 13861147 14306436 17240537 20974648 22756386 22405969 21408001 19624597 15968120
40866A5968120m101266j008646L315237N022079L755346J961649P92547k16162
$$ 15968120 11866854 10858208 14173445 19195524 22950870 24912519 25705066 25488904
40858B5488904o00405M84808J673324O78956j735357k209730K46834K627991K230934
$$ 25488904 24888499 25373307 27046631 27725587 25990230 23780500 24027334 26655325 28886259
40849B8886259P5801j190267o90308O95490J962212K275791J102087p58003j508587
$$ 28886259 28962060 27771793 27081485 27776975 29739187 32014978 33117065 32359062 30850475
40840C0850475o42741M61638R46030J704702L204370M049830L273191K269692
$$ 30850475 30207734 30669372 31615402 33320104 36524474 40574304 43847495 46117187
40832D6117187K548633L055781J920281k08615q56161P96854L088767M125436
$$ 46117187 48665820 51721601 53641882 53433267 52577106 53373960 56462727 60588163
40824F0588163L221798P62222j630108j575532J323553L829746K440374j935810
$$ 60588163 63809961 64572183 62942075 61366543 62690096 66519842 68960216 67024406
40816F7024406n003980m533737k223307k02877J255007J870612M00561k763050
$$ 67024406 62020426 57486689 55263382 55060505 56315512 58186124 58586685 55823635
40808E5823635m599220l243487r02675p08972k142351k200339l16034P16546j062012
$$ 55823635 51224415 47980928 47078253 46369281 44226930 42026591 41710557 42427103 41365091
40799D1365091m031135n332190m261210k141524J7050K170513L863288L751580
$$ 41365091 37333956 32001766 27740556 25599032 25616082 27786595 31649883 35401463
40791C5401463J203865k397548m871826n518734n328327n027623m095464k151062
$$ 35401463 36605328 34207780 29335954 23817220 18488893 13461270 9365806 7214744
40783G214744j90276M76682j87790j239877j940899j902790r65291J50748J72754
$$ 7214744 7024468 7501150 7313360 6073483 4132584 2229794 1264503 1415251 1588005
40774A588005o03892L5755K771049M581480K629682j012712j878728L81361J935137
$$ 1588005 984113 1019868 3790917 8372397 11002079 9989367 8110639 8492000 10427137
40765A0427137J185909P16622J726309J372982j671448l386269k22913M371846
$$ 10427137 11613046 12329668 14055977 15428959 13757511 10371242 10148329 14520175
40757A4520175M155967q03545m260793k834514j84125r12461m100039n290680
$$ 14520175 18676142 17872597 13611804 10777290 10593165 9680704 5580665 289985
40749B89985k792754N19339J268891k43386o44481J976728N161789N017345J675137
$$ 289985 -2502769 -1983430 -714539 -957925 -1602406 374322 5536111 10553456 12228593
40740A2228593n50838P80459K783944J816400j080996k347955j610348j489933
$$ 12228593 11677755 12458214 15242158 17058558 15977562 13629607 12019259 10529326
40732A0529326k652358k931221j386228K74981P91680Q32747Q94051N39663J81698
$$ 10529326 7876968 4945747 3559519 3834500 4626180 5458927 6352978 6892641 7074339
40723G074339Q07633J541106M54221j711518j875940N39651K441376J845146M73323
$$ 7074339 7881972 9423078 9877299 8165781 6289841 6829492 9270868 11116014 11589337
40714A1589337J93284L02208R6753O41730J807869J085767j938620l429843j027188
$$ 11589337 11782621 12084829 12181582 12823312 14631181 15716948 13778328 10348485 9321297
40705I321297J547566j34026l844481l762879N31643L425981J561713k102583
$$ 9321297 10868863 10734837 6890356 3127477 3659120 7085101 8646814 6544231
40697F544231l474196k479907j421260j323237j791206k337432k208670m38273
$$ 6544231 3070035 590128 -831132 -2154369 -3945575 -6283007 -8491677 -8929950
40689h929950K590160M720517M168393J433059j336152k255052r91310J147288
$$ -8929950 -6339790 -1619273 2549120 3982179 2646027 390975 -600335 546953
40681E46953K530994K959757L292444L108153P86931k916569m095818j021756
$$ 546953 3077947 6037704 9330148 12438301 13225232 10308663 6212845 5191089
40673E191089K313542J601019j064743o30179K291005K276044j385379k686353
$$ 5191089 7504631 9105650 8040907 7410728 9701733 11977777 10592398 7906045
40665G906045J443992N598587L860328j491755m011254k420850p76681j307414
$$ 7906045 9350037 14948624 18808952 17317197 13305943 10885093 10108412 8800998
40657H800998k157552j629159l49615Q82259J987214K190602O74044j200856j012353
$$ 8800998 6643446 5014287 4664672 5546931 7534145 9724747 10398791 9197935 8185582
40648H185582J165392K751446K325130R19000m52275j995034l414891l437581
$$ 8185582 9350974 12102420 14427550 15346550 14894275 12899241 9484350 6046769
40640F046769j871807j59168Q33044J650287K263613J445106p08066j597198Q31448
$$ 6046769 4174962 4015794 4848838 6499125 8762738 10207844 9499778 7902580 8734028
40631H734028N052943P513145O482122L184228j91064k350547l153239l121053
$$ 8734028 13786971 21300116 27782238 30966466 30775402 28424855 25271616 22150563
40623B2150563k754408j923488k48568J681299K311920J112825j27834Q53159
$$ 22150563 19396155 17472667 17224099 18905398 21217318 22330143 22202309 23055468
40615B3055468L817035N952980M991448J579409j760545l264849k945296j662225
$$ 23055468 26872503 32825483 37816931 39396340 37635795 34370946 31425650 29763425
40607B9763425k28985P19004J058966J612508L259211N348079O241190N943012
$$ 29763425 29534440 30253444 31312410 32924918 36184129 41532208 47773398 53716410
40599E3716410O437590Q129216P920280L294552l125593o374489n816976n293581
$$ 53716410 60154000 68283216 76203496 79498048 76372455 69997966 64180990 58887409
40591E8887409o644510p482682o478580o105070p583612p489757l170843J994583
$$ 58887409 52242899 44760217 38281637 32176567 24592955 17103198 13932355 15926938
40583A5926938L208794J387326Q33664J947791J671690j19753n13640M71111k68555
$$ 15926938 19135732 20523058 21356722 23304513 24976203 24856450 24342810 24813921 24545366
40574B4545366k481855j902338K248005M626234J405479m058265o343275m904949
$$ 24545366 22063511 20161173 22409178 27035412 28440891 24382626 18039351 13134402
40566A3134402k654897r57113M54048J150366R48888J238115K651655L342398
$$ 13134402 10479505 9522392 9976440 11126806 12075694 13313809 15965464 19307862
40558A9307862J871341l84918j803512k782716l220249j083238L505885O225107
$$ 19307862 21179203 20794285 18990773 16208057 12987808 11904570 15410455 21635562
40550B1635562M358847J372883J386578K377962K01477l508510l881560j464120
$$ 21635562 25994409 27367292 28753870 31131832 31333309 27824799 23943239 22479119
40542B2479119j257977l600784l368682P00698L028884Q3507l914081l629014
$$ 22479119 21221142 17620358 14251676 14952374 17981258 18064765 14150684 10521670
40534A0521670K4853K908112L904934M186089L526382J433659l30780L5727J390200
$$ 10521670 10546523 13454635 17359569 21545658 25072040 26505699 26174919 26210646 27600846
40525B7600846J819902J880649K681423K681693j45147m175272n540786l228390
$$ 27600846 29420748 31301397 33982820 36664513 36519366 32344094 26803308 23574918
40517B3574918n1850J248069O75547j33694l5576N75144J24090j984301l422655
$$ 23574918 23523068 24771137 25446684 25312990 25277414 25852558 25976648 23992347 20569692
40508B0569692j244991L218229M785938J431616k443060k467156p23680j711684
$$ 20569692 19324701 22542930 27328868 28760484 26317424 23850268 23126588 21414904
40500B1414904m551335m400715m89070K680662K471272J540196K739045M627632
$$ 21414904 16863569 12462854 11973784 14654446 17125718 18665914 21404959 26032591
40492B6032591M163324J083058k292782l714418k265524J172106L865137L567307
$$ 26032591 30195915 31278973 28986191 25271773 23006249 24178355 28043492 31610799
40484C1610799J562535J275501L354000M757182L629730K112909K584152L865149
$$ 31610799 33173334 34448835 37802835 42560017 46189747 48302656 50886808 54751957
40476E4751957L723876L106537M749378Q364746J0097015P116892R13081m535134
$$ 54751957 58475833 61582370 66331748 74696494 84793509 91910401 92823482 88288348
40468H8288348o799214o786131p024789q507126r451643p643149l690091p38411
$$ 88288348 81489134 74703003 67678214 59171088 49719445 42076296 38386205 37647794
40460C7647794o69341j905551j750551K10018K066496K182487P87613o56915q99873
$$ 37647794 36978453 35072902 33322351 33532369 35598865 37781352 38568965 37912050 37012177
40451C7012177J04630J185158J108529j31438j503856k254330k352214j820702
$$ 37012177 37116807 38301965 39410494 39279056 37775200 35520870 33168656 31347954
40443C1347954o38817O23716J067350N22314m23982j269742j542699m89443J642293
$$ 31347954 30709137 31332853 32400203 32922517 32498535 31228793 29686094 29196651 30838944
40434C0838944K590471N61939k440302k465196P50588K912609J126173k154078
$$ 30838944 33429415 33991354 31551052 29085856 29836444 32749053 33875226 31721148
40426C1721148l074624j710361p66614q55474k72888J305993J968559N95699j516260
$$ 31721148 28646524 26936163 26169549 25314075 25041187 26347180 28315739 28911438 27395178
40417B7395178k564953k217413j251138l50935L38273J054309J919543K450106
$$ 27395178 24830225 22612812 21361674 21010739 21349012 22403321 24322864 26772970
40409B6772970K068937J246146J132851J742306J813616R86516M75182P94372
$$ 26772970 28841907 30088053 31220904 32963210 34776826 35763342 36238524 37032896
40401C7032896P24716k73429o87798L41646J024470k00492j669366r64588J170305
$$ 37032896 37757612 37484183 36796385 37138031 38162501 37962009 36292643 35328055 36498360
40392C6498360K194343J772609J458366J436037P22944j80094q2579J22113j052985
$$ 36498360 38692703 40465312 41923678 43359715 44082659 43902565 43819986 43942099 42889114
40383D2889114j969623L50198M626518N800758K135407k127486k763817n90835
$$ 42889114 40919491 41269689 45896207 51696965 53832372 51704886 48941069 48350234
40375D8350234J446339K763154M080134M623053L385386J490234P26053R85273
$$ 48350234 49796573 52559727 56639861 61262914 64648300 66138534 66864587 67849860
40367F7849860J238661J734373L140783M628932M841421L947165L010876K133352
$$ 67849860 69088521 70822894 73963677 78592609 83434030 87381195 90392071 92525423
40359I2525423Q24695n10988r69988m98799K54377Q08485P93150k6574r43478
$$ 92525423 93350118 92839130 91869142 91370343 91624720 92433205 93226355 93199781 92256303
40350I2256303o82124P33430J811777J831957J519449R52329q49782l238416l579402
$$ 92256303 91574179 92307609 94119386 95951343 97470792 98423121 97573339 94334923 90755521
40341I0755521j298748M25813p15145k465453j772105J11068k19241k730911m243639
$$ 90755521 89456773 89882586 89167441 86701988 84929883 85040951 84821710 82090799 77847160
40332G7847160l359691j638145m40695J73535j13111j475147k454859j780134
$$ 77847160 74487469 72849324 72408629 72582164 72469053 70993906 68539047 66758913
40324F6758913q81956j469511j806111N27126L132183J235981m233299o652870
$$ 66758913 65876957 64407446 62601335 63128461 66260644 67496625 63263326 56610456
40316E6610456l255338Q47513Q10849j008612j97719K083657J837184k90054l3109
$$ 56610456 53355118 54202631 55013480 54004868 53807149 55890806 57727990 57437936 57404827
40307E7404827L008787M325920J380883k935867m965664m772807m232841l515531
$$ 57404827 60413614 64739534 66120417 63184550 58218886 53446079 49213238 45697707
40299D5697707j795341K71967J150085Q55092R07405J877572K390770J012229
$$ 45697707 43902366 44174333 45324418 46179510 47086915 48964487 51355257 52367486
40291E2367486j720570l754994l655070j754084N74486K041652J818583j12339
$$ 52367486 50646916 46891922 43236852 41482768 42057254 44098906 45917489 45805150
40283D5805150k272211k331478K68305K919712K652149Q8558j258103J20794J615462
$$ 45805150 43532939 41201461 41469766 44389478 47041627 47130185 45872082 45992876 47608338
40274D7608338L19071k796507m244085k610810L5399J143743N07703l73354o96880
$$ 47608338 47927409 45130902 40886817 38276007 38311406 39455149 39962852 39589498 38892618
40265C8892618j090234k005619k397325j025907J188768J682610k62647k188371
$$ 38892618 37802384 35796765 33399440 32373533 33562301 35244911 34982264 32793893
40257C2793893j970107j019861j780385l345601k640819N07247K840883K508327
$$ 32793893 30823786 29803925 28023540 24677939 22037120 22544367 25385250 27893577
40249B7893577J117749K11005q42570k017505j201777K063489M322658K509220
$$ 27893577 29011326 29222331 28379761 26362256 25160479 27223968 31546626 34055846
40241C4055846j640629m185355m068736k869144j322564P45348K344220K367758
$$ 34055846 32415217 28229862 24161126 21291982 19969418 20714766 23058986 25426744
40233B5426744J855195K294080K552711N67133k629746l863076k547661j248331
$$ 25426744 27281939 29576019 32128730 32695863 30066117 26203041 23655380 22407049
40225B2407049j429618j758696j066483q4486M80625J029428J463714Q52068m98037
$$ 22407049 20977431 19218735 18152252 18067766 18548391 19577819 21041533 21893601 21395564
40216B1395564p99899N26974J825488J618079M03327m70540j57926J627646M178676
$$ 21395564 20595665 21122639 22948127 24566206 24969533 24498993 24341067 25968713 30147389
40207C0147389N484693M377523K780945L412815N505148N826368L972403K967891
$$ 30147389 35632082 40009605 42790550 46203365 51708513 57534881 61507284 64475175
40199F4475175L828489L482457j02912m324409n912502n456234n248472n284846
$$ 64475175 68303664 71786121 71683209 67358800 61446298 55990064 50741592 45456746
40191D5456746m464857l630708m165799n046789m257262j940780M22514K446881
$$ 45456746 40991889 37361181 33195382 28148593 23891331 21950551 22373065 24819946
40183B4819946L659266J778180l979079r048351p544120l76919M882752L460771
$$ 24819946 28479212 30257392 26278313 17229962 9685842 9308923 14191675 17652446
40175A7652446r65995j974534J326325M462376M133881J486567p78979j915846
$$ 17652446 16686451 14711917 16038242 20500618 24634499 26121066 25342087 23426241
40167B3426241k754747l205547j793660J923871N473824N412933J411898k857334
$$ 23426241 20671494 17465947 15672287 17596158 23069982 28482915 29894813 27037479
40159B7037479l717204j364345J184173J910564J139488o9754j073482j443815
$$ 27037479 23320275 21955930 23140103 25050667 26190155 26120401 25046919 23603104
40151B3603104j152069q70710r35182m61593J141402K417127J439726j214955
$$ 23603104 22451035 21580325 20645143 20183550 21324952 23742079 25181805 23966850
40143B3966850l066674l149199k688663k316067j083878J039283K099098R66111
$$ 23966850 20900176 17750977 15062314 12746247 11662369 12701652 14800750 15766861
40135A5766861n86452j76326K057611L993977M186104K765768O48993r58881j119787
$$ 15766861 15180409 15004083 17061694 21055671 25241775 28007543 28656536 27697655 26577868
40126B6577868l71554n41801k231001l456867k220478M64370J867529J307051
$$ 26577868 26206314 25664513 23433512 19976645 17756167 18220537 20088066 21395117
40118B1395117N86619P13628L76909j488246l403475l073998m75377K223717L409345
$$ 21395117 21981736 22695364 23072273 21584027 18180552 15106554 14631177 16854894 20264239
40109B0264239L351127K852502J969469O45323m08410m64646P885j45435j093347
$$ 20264239 23615366 26467868 28437337 29082660 28674250 28209604 28217489 28072054 26978707
40100B6978707j713665j144702R8060R14890R41847O44646N77694J038154K057825
$$ 26978707 25265042 24120340 24218400 25133290 26075137 26719783 27297477 28335631 30393456
40091C0393456L160517L345935J888864p94343l326819m411665l704684j949750
$$ 30393456 33553973 36899908 38788772 37994429 34667610 30255945 26551261 24601511
40083B4601511l09363P38634J717742K892991L143399J344475j181126j374325
$$ 24601511 24292148 25030782 26748524 29641515 32784914 34129389 32948263 31573938
40075C1573938J645581N032214N801825M441604L270497K629506J132050r73783
$$ 31573938 33219519 38251733 44053558 48495162 51765659 54395165 55527215 54553432
40067E4553432j472554L78602K323485J953127m51714k778072l562716k818916
$$ 54553432 53080878 53459480 55782965 57736092 57284378 54506306 50943590 48124674
40059D8124674j423500n63306j112930k752009l964762l393789j196011R27406
$$ 48124674 46701174 46137868 45024938 42272929 38308167 34914378 33718367 34645773
40051C4645773J075171r56534k967192k484616J5616J459017N51951j82568J523015
$$ 34645773 35720944 34764410 31797218 29312602 29328218 30787235 31339186 31156618 32679633
40042C2679633L735248L327039J205432P32374J900920J550969o64833j441627
$$ 32679633 36414881 39741920 40947352 41679726 43580646 45131615 44466782 43025155
$$ [...]
##END NTUPLES=NMR SPECTRUM
##END=
