##TITLE=31Pdec_DE-61rm_2h
 , 64 sc
 8.7.2024
##JCAMPDX= 6.0         $$ Bruker NMR JCAMP-DX V2.0
##DATA TYPE= NMR SPECTRUM
##DATA CLASS= NTUPLES
##ORIGIN= UXNMR, Bruker Analytische Messtechnik GmbH
##OWNER= root
$$ XWIN-NMR		Version 3.5
$$ Mon Jul  8 13:50:19 2024 Russian Standard Time (UT+4h)  she@DPX200
##.OBSERVE FREQUENCY= 81.013821
##.OBSERVE NUCLEUS= ^31P
##.ACQUISITION MODE= SIMULTANEOUS
##.ACQUISITION SCHEME= undefined
##.AVERAGES= 64
##.DIGITISER RES= 17
##SPECTROMETER/DATA SYSTEM= spect
##.PULSE SEQUENCE= zgpg30
##.SOLVENT NAME= DMSO
##.SHIFT REFERENCE= (INTERNAL, DMSO, 0, 198.062)
##AUDIT TRAIL= $$ (NUMBER, WHEN, WHO, WHERE, WHAT)
$$ ##TITLE= Audit trail, XWIN-NMR		Version 3.5
$$ ##JCAMPDX= 5.01
$$ ##ORIGIN= Bruker BioSpin GmbH
$$ ##OWNER= she
$$ F:/spectra/data/she/nmr/P31/2/pdata/1/auditp.txt
$$ ##AUDIT TRAIL=  $$ (NUMBER, WHEN, WHO, WHERE, WHAT)
(   1,<2024-07-08 13:49:04.32 +0400>,<she>,<DPX200>,
      <created by zg, POWCHK disabled, PULCHK disabled
       configuration hash MD5:
       00 E9 B6 7A A2 85 ED C7 34 08 36 98 17 FE 4E 26
       data hash MD5: 32K
       1F CF 3A 06 2A 85 48 B0 B8 37 10 16 4A AC 09 E0>)
(   2,<2024-07-08 13:49:06.89 +0400>,<she>,<DPX200>,
      <Start of raw data processing
       efp BC_mod = 2 LB = 1.5 FT_mod = 6 PKNL = 1 PHC0 = 2383.462 PHC1 = 990.0864 SI = 64K 
       data hash MD5: 64K
       31 33 F2 4C C8 2C FA B2 61 59 25 59 84 AD F3 88>)
(   3,<2024-07-08 13:49:38.40 +0400>,<she>,<DPX200>,
      <pk PHC0 = 215.3251 PHC1 = -768.9996 
       data hash MD5: 64K
       31 AF C4 62 F9 06 6F DC BB 96 0A 0D 27 FA 78 AE>)
(   4,<2024-07-08 13:49:42.59 +0400>,<she>,<DPX200>,
      <abs ABSG = 5 
       data hash MD5: 64K
       1C F3 97 9A 03 8D BF 8F A3 7D FA AC DF 3D 1C 7C>)
$$ ##END=
$$ 
$$ hash MD5
$$ BE 19 9F C1 65 A7 52 67 02 C0 4C E0 FF 21 2E 76
##$RELAX= 
##$RELAX= 
##$RELAX= 
##$RELAX= 
##$RELAX= 
##$RELAX= 
##$RELAX= 
##$RELAX= 
$$ Bruker specific parameters
$$ --------------------------
##$DU= <F:/spectra>
##$EXPNO= 2
##$NAME= <P31>
##$PROCNO= 1
##$TYPE= <nmr>
##$USER= <she>
##$AMP= (0..31)
100 100 100 100 100 100 100 100 100 100 100 100 100 100 100 100 100 100 
100 100 100 100 100 100 100 100 100 100 100 100 100 100 
##$AQSEQ= 0
##$AQ_mod= 1
##$AUNM= <au_zg>
##$AUTOPOS= <>
##$BF1= 81.014009
##$BF2= 200.13
##$BF3= 200.13
##$BF4= 200.13
##$BF5= 200.13
##$BF6= 200.13
##$BF7= 200.13
##$BF8= 200.13
##$BYTORDA= 1
##$CFDGTYP= 0
##$CFRGTYP= 5
##$CHEMSTR= <none>
##$CNST= (0..31)
1 1 145 1 1 1 1 1 1 1 1 1 1 1 1 1 1 1 1 1 1 1 1 1 1 1 1 1 1 1 1 1 
##$CPDPRG= <waltz16>
##$CPDPRG1= <>
##$CPDPRG2= <waltz16>
##$CPDPRG3= <>
##$CPDPRG4= <mlev>
##$CPDPRG5= <mlev>
##$CPDPRG6= <mlev>
##$CPDPRG7= <mlev>
##$CPDPRG8= <mlev>
##$CPDPRGB= <>
##$CPDPRGT= <>
##$D= (0..31)
0 1 0 0 0 0 0 0 0 0.06 0 0.03 2e-05 3e-06 0 0 0.0002 0 0 0 0 0 0 0 0 0 
0 0 0 0 0 0 
##$DATE= 1720432143
##$DBL= (0..7)
120 120 120 11 120 120 24 19 
##$DBP= (0..7)
150 150 150 150 150 150 150 150 
##$DBP07= 0
##$DBPNAM0= <>
##$DBPNAM1= <>
$$ [...]
##$SUBNAM3= <"">
##$SUBNAM4= <"">
##$SUBNAM5= <"">
##$SUBNAM6= <"">
##$SUBNAM7= <"">
##$SUBNAM8= <"">
##$SUBNAM9= <"">
##$SW= 400.765351723535
##$SWIBOX= (0..15)
0 1 3 0 0 0 0 0 0 0 0 0 0 0 0 0 
##$SW_h= 32467.5324675325
##$TD= 32768
##$TD0= 1
##$TE= 0
##$TE2= 300
##$TE3= 300
##$TEG= 300
##$TL= (0..7)
0 120 53 12 22 120 120 120 
##$TP= (0..7)
150 150 150 150 150 150 150 150 
##$TP07= 0
##$TPNAME0= <>
##$TPNAME1= <>
##$TPNAME2= <>
##$TPNAME3= <>
##$TPNAME4= <>
##$TPNAME5= <>
##$TPNAME6= <>
##$TPNAME7= <>
##$TPOAL= (0..7)
0.5 0.5 0.5 0.5 0.5 0.5 0.5 0.5 
##$TPOFFS= (0..7)
0 0 0 0 0 0 0 0 
##$TUNHIN= 0
##$TUNHOUT= 0
##$TUNXOUT= 0
##$USERA1= <user>
##$USERA2= <user>
##$USERA3= <user>
##$USERA4= <user>
##$USERA5= <user>
##$V9= 5
##$VALIST= <valist>
##$VCLIST= <CCCCCCCCCCCCCCC>
##$VD= 0
##$VDLIST= <DDDDDDDDDDDDDDD>
##$VPLIST= <PPPPPPPPPPPPPPP>
##$VTLIST= <TTTTTTTTTTTTTTT>
##$WBST= 1024
##$WBSW= 4
##$XGAIN= (0..3)
0 0 0 0 
##$XL= 0
##$YL= 0
##$YMAX_a= 33615
##$YMIN_a= -22647
##$ZGOPTNS= <>
##$ZL1= 120
##$ZL2= 120
##$ZL3= 120
##$ZL4= 120
##$ABSF1= 198.0616
##$ABSF2= -202.7028
##$ABSG= 5
##$ABSL= 3
##$ALPHA= 0
##$AQORDER= 0
##$ASSFAC= 0
##$ASSFACI= 0
##$ASSFACX= 0
##$ASSWID= 0
##$AUNMP= <proc_1d>
##$AZFE= 0.1
##$AZFW= 0.5
##$BCFW= 0
##$BC_mod= 2
##$BYTORDP= 0
##$COROFFS= 0
##$CY= -3
##$DATMOD= 1
##$DC= 0
##$DFILT= <>
##$DTYPP= 0
##$F1P= 0
##$F2P= 0
##$FCOR= 1
##$FTSIZE= 65536
##$FT_mod= 6
##$GAMMA= 0
##$GB= 0
##$INTBC= 1
##$INTSCL= 9.790993e-09
##$ISEN= 30
##$LB= 1.5
##$LEV0= 0
##$LPBIN= 0
##$MAXI= 10000
##$MC2= 0
##$MEAN= 0
##$ME_mod= 0
##$MI= 50
##$NCOEF= 0
##$NC_proc= -8
##$NLEV= 6
##$NOISF1= 182.463
##$NOISF2= 159.3651
##$NSP= 0
##$NTH_PI= 0
##$NZP= 0
##$OFFSET= 198.0616
##$PC= 4
##$PHC0= 2598.787
##$PHC1= 221.0869
##$PH_mod= 1
##$PKNL= yes
##$PPARMOD= 0
##$PSCAL= 0
##$PSIGN= 0
##$REVERSE= no
##$SF= 81.0140089999434
##$SI= 65536
##$SIGF1= 159.3651
##$SIGF2= -187.1042
##$SINO= 113.3802
##$SIOLD= 16384
##$SREGLST= <1H.CDCl3>
##$SSB= 0
##$STSI= 65536
##$STSR= 0
##$SW_p= 32467.5324675325
##$SYMM= 0
##$S_DEV= 0
##$TDeff= 32768
##$TDoff= 0
##$TI= <>
##$TILT= no
##$TM1= 0
##$TM2= 0
##$TOPLEV= 0
##$USERP1= <user>
##$USERP2= <user>
##$USERP3= <user>
##$USERP4= <user>
##$USERP5= <user>
##$WDW= 1
##$XDIM= 65536
##$YMAX_p= 363199373
##$YMIN_p= -23684951
$$ End of Bruker specific parameters
$$ ---------------------------------
##NTUPLES= NMR SPECTRUM
##VAR_NAME=  FREQUENCY,     SPECTRUM/REAL,   SPECTRUM/IMAG
##SYMBOL=    X,             R,               I
##VAR_TYPE=  INDEPENDENT,   DEPENDENT,       DEPENDENT
##VAR_FORM=  AFFN,          ASDF,            ASDF
##VAR_DIM=   65536,         65536,           65536
##UNITS=     HZ,            ARBITRARY UNITS, ARBITRARY UNITS
##FACTOR=    0.49542278885378, 1,            1
##FIRST=     16045.7642231865, 0,            0
##LAST=      -16421.768244346, 0,            0
##MIN=       -16421.768244346, -23684951,    0
##MAX=       16045.7642231865, 363199373,    0
$$ Real data points
##PAGE= N=1
##DATA TABLE= (X++(R..R)), XYDATA
$$ [...]
45398a532866L212759L154580O81301k368074l807463l290435j638523O63464
45390d925257L002937L766310J872920j093713k186505p96631O32260J33686j230222
45381h24215j380795k56821P63535J366946K164520K546146J075029j629449k752902
45372A071994j115727R33527J040451K86919P74783J448628k80311l368351l577103
45363b785190J06477L270789K299442m46415o11802J445346J687229j080240l665578
45354B20058l530436j868533p56964j39512Q42939J614271J022235p04455k227209
45345e527606k653377j944510m12322J449958L013426L769303L342242J591454
45337B628568o34228j515713l67397Q35561j60520k323333k453298m542J846285
$$ plain form
45398 -1532866 1679893 4834473 5515774 3147700 -659763 -3950198 -5588721 -4925257
45390 -4925257 -1922320 1843990 3716910 2623197 436692 -359939 272321 406007 -824215
45381 -824215 -2205010 -2461831 -1698296 -331350 1833170 4379316 5454345 3824896 1071994
45372 1071994 -43733 889794 1930245 2217164 2991947 4440575 4160264 791913 -2785190
45363 -2785190 -2678713 592076 2891518 2445103 1833301 3278647 4965876 3885636 220058
45354 220058 -3310378 -5178911 -5935875 -6075387 -5232448 -3618177 -2595942 -3300397 -5527606
45345 -5527606 -8180983 -10125493 -10537815 -9087857 -6074431 -2305128 1037114 2628568
45337 2628568 1994340 478627 111230 946791 786271 -1537062 -3990360 -3994902 -2148617
45328b148617Q24419j282536j547142K23916K307140L766828M264339K953931
45320I362278R5135j576443O0264K791801K369249j643857n165947n010191k243618
45311i61329N13009K295295K934611J647051j222840k869494j149120J875216
45303C062399K235255l47051j983481l23168K025430J479439j181474k044297
45295B923052K14024K581329K055545n49217k290086k005305j021633p89293j310276
45286a91860j751701j525951o18356O07839J848930L095643L975549L122839l68635
45277H194297m500366n320352j710013K449378K853555J12251j921793j914447
45269a757490j835723k405191j639132J087131L041920K127876J18773l59975
$$ plain form
45328 -2148617 -1324198 -2606734 -4153876 -3929960 -1622820 2144008 6408347 9362278
45320 9362278 9457413 7880970 7941234 10733035 13102284 11458427 6292480 1282289 -961329
45311 -961329 -448320 1846975 4781586 6428637 5205797 2336303 1187183 3062399
45303 3062399 5297654 4950603 2967122 2643954 4669384 6148823 4967349 2923052
45295 2923052 3137076 5718405 7773950 7224733 4934647 2929342 1907709 1118416 -191860
45286 -191860 -1943561 -3469512 -4087868 -3480029 -1631099 1464544 5440093 8562932 8194297
45277 8194297 3693931 -1626421 -3336434 -887056 1966499 2078750 156957 -1757490
45269 -1757490 -3593213 -5998404 -7637536 -6550405 -3508485 -1380609 -1261836 -1621811
45261a621811J92751j48992q26781K58688K628567L168038N55805k608359l006673
45252a408767n14801J929626J654941j042371l242768k425282P66708L268265
45244a014449L223310J843384J138558J151960O11547q16466k431229l794260
45236h7645m508951l432754k1622L794407M954944K727350n30220k167207j639563
45227i11261k36889L37787p14383k174351j500474J790911M172946J973967l071452
45218c33199n267366k615047M27932k80517k395792j086557L143137N162835L060505
45209a84069M63803J09796k05362k644543m326619j624860K968986L560244j22684
45200b005308j934301J194265M284597K034004k801517l523395N86361L875826
$$ plain form
45261 -1621811 -1429060 -1578052 -2404833 -2146145 482422 3650460 4206265 1597906 -1408767
45252 -1408767 -1923568 6058 1660999 618628 -2624140 -5049422 -4282714 -1014449
45244 -1014449 2208861 4052245 5190803 6342763 6954310 6137844 3706615 -87645
45236 -87645 -4596596 -8029350 -8050972 -4256565 698379 3425729 2895509 728302 -911261
45227 -911261 -1148150 -810363 -1524746 -3699097 -5199571 -3408660 764286 2738253 -333199
45218 -333199 -5600565 -8215612 -7787680 -8068197 -10463989 -11550546 -8407409 -3244574 -184069
45209 -184069 279734 389530 184168 -2460375 -6786994 -8411854 -5442868 -1882624 -2005308
45200 -2005308 -3939609 -2745344 1539253 3573257 771740 -2751655 -2165294 1710532
45192A710532K989817N15944o06098j240282k728677l655523k645941j184374
45184f844602p87623l6932K509483M701811L575129K67441j346409j69952J260671
45175C129017J119207L06234j14928o20508j565822k031762j287366Q9233J195295
45166B18600J741359J706446J161234N67586K72197j70943j211048k273898k655467
45157f43934k804717l342352l532868k395836o60334K43748N21680J339690K447973
45148h826950K721920K492801K795540K776112Q23011j855219k134478Q8238J323032
45139B04007p9374j365627o2719J885215J217361j659161l549682k997198j468526
45130g875704p17990q60172p52173P02776L035068L784405J251552k051660j477816
$$ plain form
45192 1710532 4700349 5216293 4610195 3369913 641236 -3014287 -5660228 -6844602
45184 -6844602 -7632225 -7669157 -5159674 -457863 3117266 3384707 2038298 1868346 3129017
45175 3129017 4248224 4554458 4439530 3819022 2253200 221438 -1065928 -976695 218600
45166 218600 1959959 3666405 4827639 5395225 5667422 5496479 4285431 2011533 -643934
45157 -643934 -3448651 -6791003 -10323871 -12719707 -13380041 -13136293 -12614613 -11274923 -8826950
45148 -8826950 -6105030 -3612229 -816689 1959423 2782434 927215 -1207263 -1119025 204007
45139 204007 124633 -1240994 -1303713 581502 1798863 139702 -3409980 -6407178 -7875704
45130 -7875704 -8593694 -9453866 -10206039 -9503263 -6468195 -2683790 -1432238 -3483898 -4961714
45121d961714K982120N261762J183896n028482o013175j131370L414935L587619
45113g04409J775165J291990J262494n27275k961443l055620m82473K248559L334200
45104B181188K889421J154601j740702l990826k968681P60155K679152j07584
45096H56724m209235l970480N03637L131007M79286l269388k497699J800418L959828
45087c215902J929331o59833m37082J684233L142772L087412K026675P64775N16807
45078H839188J599908J641893j796549o329738o398001j156457L456251K776203
45070B632698n94171j919160j388482j834041k785840j921106j80885j23737o49940
45061h764664J189221L988290L364502m40009k219830r7211J626636j0635j720972
$$ plain form
45121 -4961714 -1979594 3282168 4466064 -562418 -6575593 -7706963 -4292028 -704409
45113 -704409 1070756 2362746 3625240 3097965 136522 -2919098 -3401571 -1153012 2181188
45104 2181188 5070609 6225210 4484508 493682 -2474999 -1714844 964308 856724
45096 856724 -3352511 -7322991 -6819354 -3688347 -3209061 -6478449 -8976148 -7175730 -3215902
45087 -3215902 -1286571 -1946404 -2383486 -699253 2443519 5530931 7557606 8322381 8839188
45078 8839188 10439096 12080989 10284440 3954702 -2443299 -3599756 -143505 2632698
45070 2632698 2038527 119367 -1269115 -3103156 -5888996 -7810102 -7990987 -8114724 -8764664
45061 -8764664 -7575443 -3587153 -222651 -662660 -2882490 -2979701 -1353065 -1363700 -3084672
45052c084672J37722L292784L342269N96400j193187q52400l45336m90459k6463
45043A376658J317981K053729J417534J61293j251776l046583m565734m328973
45035f865871k115370N18950K112554K459110J865853O23894n88499j017309q31329
45026c838017q05930r09161l43710P64849R44887o86996k889856l499252j842070
45017a3105256O47386K160970K420441K591320L416984L985164K897295L40633
45009E354937j978583l001584l186877k829142j109816J929669L868208K448941
45001A495753r13106k415713p64208J437077J767097J087284J101880R73606j071777
44992B697893l884785m184715j371170J262238J184378Q8258Q93527L173144M084674
$$ plain form
45052 -3084672 -2946950 345834 3688103 4284503 3091316 2238916 1893580 1403121 1376658
45043 1376658 2694639 4748368 6165902 6327195 5075419 2028836 -2536898 -6865871
45035 -6865871 -8981241 -8462291 -6349737 -3890627 -2024774 -1400880 -1989379 -3006688 -3838017
45026 -3838017 -4643947 -5553108 -5896818 -5131969 -4187082 -4874078 -7763934 -11263186 -13105256
45017 -13105256 -12457870 -10296900 -7876459 -5285139 -1868155 2117009 5014304 5354937
45009 5354937 3376354 374770 -2812107 -5641249 -6751065 -4821396 -953188 1495753
45001 1495753 582647 -1833066 -2597274 -1160197 606900 1694184 2796064 3769670 2697893
44992 2697893 -1186892 -5371607 -6742777 -5480539 -4296161 -4207903 -3314376 -141232 3943442
44983C943442K852958J470912J001064P1524k039517l394568k249880j06221K71052
44974A820766j145497j854341o59883Q12700O51158r95248k546987k642225p67650
44965g327207K409609M732339L872993L6711l405840l108158O42636M303235M953492
44956G109810L013240Q75493l84663j878630m315895n854469m179352m64875J040248
44947e039093j438795m116368k468935K141150L965780J035245j840735P692M233571
44938c520488M761074M67308l236828j876788K332030L956627J398605j971035
44930B310505k816516j443213j54216r7346p87552j427576j458624n47929Q85338
44921e537129J674373J321656P06365M41791l83471k287492l343372j414191K112719
$$ plain form
44983 3943442 6796400 8267312 9268376 9339900 7300383 3905815 1655935 1549714 1820766
44974 1820766 675269 -1179072 -1838955 -1026255 -375097 -1370345 -3917332 -6559557 -7327207
44965 -7327207 -4917598 -185259 3687734 3724445 318605 -2789553 -2146917 2156318 7109810
44956 7109810 10123050 10998543 10613880 8735250 4419355 -1435114 -5614466 -6079341 -5039093
44947 -5039093 -6477888 -10594256 -13063191 -10922041 -6956261 -5921016 -7761751 -7754059 -3520488
44938 -3520488 1240586 1707894 -1528934 -3405722 -1073692 2882935 4281540 2310505
44930 2310505 -506011 -1949224 -2103440 -2200786 -2988338 -4415914 -5874538 -6422467 -5537129
44921 -5537129 -3862756 -2541100 -1834735 -1392944 -1776415 -4063907 -7407279 -8821470 -6708751
44912f708751L617922K330119J108582J592078J902096N45318p91923n90708n09132
44903B495601k060987k998413o95217K853152L444485Q14277j664010k508062
44895c19174l091735l523249k146885L97403J008634q62479j949460k97235J934788
44886h849392K297473J276163J14094j204506k030737m93027L056342N206590
44878f27000M209011K308127J252495o62397m085675n226224j405677L183200
44870a054140K561088k094540m063152q60543K985391L260510J183553j40618
44862A777549k26594j35047R2370P98941J414422J348972Q23260l378j202384
44853D688111j854078n54956K048307L103548J085455k009949l212170k107910
$$ plain form
44912 -6708751 -3090829 -760710 347872 1939950 3842046 4387364 3595441 3004733 2495601
44903 2495601 434614 -2563799 -3259016 -405864 3038621 3852898 2188888 -319174
44895 -319174 -3410909 -6934158 -9081043 -8683640 -7675006 -8537485 -10486945 -10784180 -8849392
44886 -8849392 -6551919 -5275756 -5161662 -6366168 -8396905 -8889932 -5833590 -627000
44878 -627000 3582011 5890138 7142633 6480236 2394561 -2831663 -4237340 -1054140
44870 -1054140 1506948 -587592 -4650744 -5511287 -2525896 734614 1918167 1777549
44862 1777549 1550955 1415908 1508278 2307219 3721641 5070613 5893873 5890495 4688111
44853 4688111 2834033 2279077 4327384 7430932 8516387 6506438 3294268 1186358
44845A186358n45936K62640P97314J528356J575813q4150k573015l528396k089271
44836c470287k61394j173j47289J372389L146075J751193k073624l114142O27407
44827b170845M273449L204679j76188j016599K12898j26469j563853o57452J890380
44818C870000J752176j462499l390267k301672j234401j561786o32558K094109
44810b866898K650109n93356l167335j410619J618732J335685j362672k690661
44802f487015k038590r33522Q94714L660942M475057J183248k821046k672740
44794d738952O45186K064824L28769j037675j15683J147701J299030J352818J685613
44785B631631R93075p52277j728708j350678q56415n52140L05858Q46794n23140
$$ plain form
44845 1186358 640422 903062 1700376 3228732 4804545 4720395 2147380 -1381016 -3470287
44836 -3470287 -3731681 -3732854 -3880143 -2507754 638321 2389514 315890 -2798252 -2170845
44827 -2170845 2102604 5307283 5131095 4114496 4327394 4200925 2637072 1979620 3870000
44818 3870000 5622176 4159677 769410 -1532262 -2766663 -4328449 -4961007 -2866898
44810 -2866898 -216789 -810145 -3977480 -5388099 -3769367 -2433682 -3796354 -6487015
44802 -6487015 -8525605 -9459127 -8564413 -4903471 -428414 754834 -2066212 -4738952
44794 -4738952 -4093766 -2028942 -1700173 -2737848 -2853531 -1705830 -406800 946018 2631631
44785 2631631 3624706 2872429 1143721 -206957 -1063372 -1615512 -1309654 -462860 -986000
44776i86000k366391j428865J751206K790730K71673j854504p26252R02256l23030
44767a969177k460499j376198K501048M564709K357507j674981l629184k141127
44759c827902J018170K897992K068799O5783n10500N28374R95994Q8783m77443
44750B848050j32963j169213m514388o578856l697177J989560M749320K652159
44742c853508o85459j690680r21448q23052k001940l037473k539174m47109J892517
44733a4107326K686498J562624L51817R91603K944681L947748L068182J601619
44725C047446R67845J044207P27613q17428l363734n275944m582724j517968Q86982
44716h883705L65996j312594q06551J733231K874204J254653l90707L25703J760091
$$ plain form
44776 -986000 -3352391 -4781256 -3030050 -239320 32353 -1822151 -2548403 -1646147 -1969177
44767 -1969177 -4429676 -5805874 -3304826 1259883 3617390 1942409 -1686775 -3827902
44759 -3827902 -2809732 88260 2157059 2222842 1712342 2240716 3236710 3325493 2848050
44750 2848050 2715087 1545874 -2968514 -9547370 -13244547 -11254987 -6505667 -3853508
44742 -3853508 -4538967 -6229647 -7151095 -7974147 -9976087 -13013560 -15552734 -15999843 -14107326
44733 -14107326 -11420828 -9858204 -9506387 -8514784 -5570103 -1622355 1445827 3047446
44725 3047446 4015291 5059498 5787111 4969683 1605949 -3669995 -8252719 -9770687 -8883705
44716 -8883705 -8517709 -9830303 -10636854 -8903623 -6029419 -4774766 -5165473 -4839770 -3079679
44707c079679J018027j488337k675896j147975J243701K126333J250998K7003
44699b725825m77983l09209K55225J469211L345768M500373L147023k05114k529539
44690F469930k019860o24700r40353j945593p16515K309871L363041J040574j573428
44681E362967j769026q88058j167689j818329q78732J139876K188430J777589
44673C947028P34863p59552k563005l334224k270029p92693j91011Q21820L387202
44664a019601N001070K437753k684067n207806l273762j45964J103458J014704
44656b774215R83503O63614l06465q43223l57269R2813q8004Q6325J045793J594290
44646I7162J052924K61216m66207j849739l173063k326831K95102J282150l91199
$$ plain form
44707 -3079679 -2061652 -3549989 -6225885 -7373860 -6130159 -4003826 -2752828 -2725825
44699 -2725825 -3203808 -3513017 -3257792 -1788581 1557187 6057560 9204583 8999469 6469930
44690 6469930 4450070 3825370 2885017 939424 222909 2532780 5895821 6936395 5362967
44681 5362967 3593941 2705883 1538194 -280135 -1158867 -18991 2169439 3947028
44673 3947028 4681891 3922339 1359334 -1974890 -4244919 -5037612 -5228623 -4406803 -1019601
44664 -1019601 3981469 6419222 3735155 -1472651 -4746413 -4892377 -3788919 -2774215
44656 -2774215 -1790712 -1127098 -1433563 -2276786 -2634055 -2541242 -2629246 -2542921 -1497128 97162
44646 97162 1150086 1411302 945095 -904644 -4077707 -6404538 -6109436 -4827286 -5218485
44637e218485r57023K205068N472733L822794j497391m577384k990540m8378Q17301
44628b971305j8047n78961k32888M68875P03053l35371k286811k914777n31972
44619h698204L120526M558765K893531L61467j093352j393814q02990N36610J472966
44610I55505P21238r63265j687353j319875j093612p56805Q39249K459813J340503
44601D95398k095186l832353j697883J868566L639517L225681J700996k53496
44593C051240j306986L06512L607718M715899J910752j728676k696271j390359
44585F469829j8304R10821J432599K82106k692146m601481l247704q00536n20429
44576b785245j717004j461715L35782J313656Q98130M28136m000j107982j586413
$$ plain form
44637 -5218485 -6175508 -3970440 1502293 5325087 3827696 -749688 -3740228 -3788606 -2971305
44628 -2971305 -2989352 -3568313 -3801201 -3332326 -2629273 -2964644 -5251455 -8166232 -8698204
44619 -8698204 -5577678 -1018913 1874618 2236085 1142733 -251081 -1054071 -517461 955505
44610 955505 1676743 713478 -973875 -2293750 -3387362 -4144167 -3304918 -845105 495398
44601 495398 -1599788 -5432141 -7130024 -5261458 -1621941 1603740 3304736 3051240
44593 3051240 1744254 2050766 5658484 10374383 12285135 10556459 7860188 6469829
44585 6469829 6451525 7362346 8794945 9077051 6384905 1783424 -1464280 -2264816 -2785245
44576 -2785245 -4502249 -5963964 -5628182 -4314526 -3416396 -2988260 -2992260 -4100242 -5686655
44567e686655L38916L051227L124334O44538r48177l61520K77720p359M51637
44558H84661J855518J610658j060311k962706j695177N84487O61715j065276j987473
44549c173904j316767k61819L02885K67709l43686q68312k84209P86358K70678
44540d621067j821381k457077j10790K230125J252673j553211k139776J10029
44532i110475K012148J567792J25396m22870J44472J256311K385582K685259J621065
44523B264680R0058o65553r42801j640171k121665j329850l93139j150152k282966
44514h171559n24163L570442M911837R06053m151900m599774q26451K200839K110014
44505d574662J011112Q79810R84440M98725L16411R05456R69478j13565o33042
$$ plain form
44567 -5686655 -5347739 -2296512 827822 1472360 524183 162663 440383 433024 884661
44558 884661 2740179 4350837 3290526 327820 -1367357 -782870 -121155 -1186431 -3173904
44549 -3173904 -4490671 -4752490 -4449605 -4181896 -4525582 -5393894 -5678103 -4891745 -4621067
44540 -4621067 -6442448 -8899525 -9010315 -6780190 -5527517 -7080728 -9220504 -9110475
44532 -9110475 -7098327 -5530535 -5405139 -5828009 -5683537 -4427226 -2041644 643615 2264680
44523 2264680 2354738 1689185 746384 -893787 -3015452 -4345302 -4738441 -5888593 -8171559
44514 -8171559 -8695722 -5125280 -213443 692610 -3459290 -8059064 -8885515 -6684676 -4574662
44505 -4574662 -3563550 -2683740 -1699300 -1200575 -884164 21292 990770 877205 244163
44496B44163Q36714K891092L399751K717790K438196K030936l51789l930609n270027
44487E006217l104961n75850j002033l370940m081080j912645R60660K323241
44479e757391K107633J262587M16810J26769Q21508J793865J567769N5351q81105
44470A513796m1256J066764K75555j836799k472987o48424J194705N62428j593614
44461a979832k374389j046304M41528R16499J509628K834587L049817P67626j871121
44452B248039j792172K86945Q07779j232469l194667l488946l644841m351295
44444a4361627l266392N96171L613098K336601q52632j066551J628845K688080
44436h684407N53562j162606J94024K376005K323164P31128P8980N93669P94331
$$ plain form
44496 244163 1080877 3971969 7371720 10089510 12527706 14558642 14206853 10276244 5006217
44487 5006217 1901256 1325406 323373 -3047567 -7128647 -9041292 -8080632 -5757391
44479 -5757391 -3649758 -2387171 -1970361 -1843592 -1022084 771781 2339550 2394901 1513796
44470 1513796 1472540 2539304 2814859 978060 -1494927 -2143351 -948646 -386218 -1979832
44461 -1979832 -4354221 -5400525 -4958997 -4042498 -2532870 301717 3351534 4119160 2248039
44452 2248039 455867 742812 1550591 318122 -2876545 -6365491 -10010332 -14361627
44444 -14361627 -17628019 -17031848 -13418750 -11082149 -11934781 -13001332 -11372487 -8684407
44436 -8684407 -8130845 -9293451 -9099427 -6723422 -4400258 -3669130 -3590150 -2996481 -2202150
44427b202150M64060O17884J328065J614708J220975J025490J657583K548086
44419H274701K503524J079586n96904q88430J4864j34991k348994m148858k700447
44410A054051P69107K375123Q78417j394751k680567l401573l443071j600474
44402g443738J279521K298400J060203O51938K449040L706922K430990P35587
44394G168863N80518N4718k486151m123015j648446K570158L745518J731967J48908
44385G743038o3785j140684l222156l669557j956934p88257j518449k212334j197713
44376h026831N98654J652140J512987J52015j771985k090528N64915L888745M489187
44367I69299K969296K750349M048951L389618k74206l382981l138817j152824
$$ plain form
44427 -2202150 -1738090 -1120206 207859 1822567 3043542 4069032 5726615 8274701
44419 8274701 10778225 11857811 11260907 10372477 10387341 10252350 7903356 3754498 1054051
44410 1054051 1823158 4198281 5076698 3681947 1001380 -2400193 -5843264 -7443738
44402 -7443738 -6164217 -3865817 -2805614 -2153676 295364 4002286 6433276 7168863
44394 7168863 7749381 7804099 5317948 1194933 -453513 2116645 5862163 7594130 7743038
44385 7743038 7679253 6538569 3316413 -353144 -2310078 -3098335 -4616784 -6829118 -8026831
44376 -8026831 -7428177 -5776037 -4263050 -4111035 -5883020 -7973548 -7408633 -3519888 969299
44367 969299 3938595 6688944 10737895 14127513 13853307 10470326 7331509 6178685
44359F178685q0343j51972p44326k020278l230301k586236n21010J46571j158501
44350d167711j611213j96971J63157j726601k048369J774560N480305L643824
44342A310981j765736l987994j233644J627353J001280r25198q03584Q32219J210486
44333b733837m75553k449426k721867r00096J705869L248013K959776J542614
44325A75493j55196j859021k831153j780159R39973K687818J901068O79833J805410
44316A564066M279676M405606R29972l265547m776097l199293q05555O9413q20441
44307a618200j407858L51102L532274M848761K887861J3198j145343j089969j579364
44298D792462k417815k528269k479234l134551l139413p77961K560899L764354
$$ plain form
44359 6178685 6098342 5946370 5202044 3181766 -48535 -2634771 -3155781 -3009210 -4167711
44350 -4167711 -5778924 -5975895 -5812738 -7539339 -9587708 -7813148 -2332843 1310981
44342 1310981 -454755 -4442749 -5676393 -4049040 -3047760 -3972958 -4776542 -3944323 -2733837
44333 -2733837 -3209390 -5658816 -8380683 -9280779 -7574910 -4326897 -1367121 175493
44325 175493 20297 -1838724 -4669877 -6450036 -5510063 -2822245 -921177 -241344 1564066
44316 1564066 5843742 10249348 11179320 7913773 3137676 -61617 -867172 -797759 -1618200
44307 -1618200 -3026058 -2674956 857318 5706079 8593940 8607138 7461795 6371826 4792462
44298 4792462 2374647 -153622 -2632856 -5767407 -8906820 -9684781 -7123882 -3359528
44290c359528K314786N34832M5653N45988J486488K339831J846349m13447k456097
44281B884855k445388j611490j787281j756728K06520J966342N49719j777759
44273c771210l21864L598362L727167p18416k874097R50842N181695L908635j24991
44264I556123q94917J381603K333467J535656J824874K608886O53581l067026
44256A5932247l722488m72223J706226m06268l668436l791942j343524J44718
44248D378310n89089j886644k215921j575602n25082N61218J353115J441266N01292
44239A442863j177345k147713q14345K077910L260805R68504k063339k036862
44231d89522L79434J080903j122083k792325j420782P97105P91224n21055k6552
$$ plain form
44290 -3359528 -1044742 -509910 -464257 81731 1568219 3908050 5754399 5340952 2884855
44281 2884855 439467 -1172023 -2959304 -4716032 -4509512 -2543170 -1993451 -3771210
44273 -3771210 -4093074 -494712 3232455 2514039 -360058 590784 5772479 9681114 9556123
44264 9556123 8661206 10042809 12376276 13911932 15736806 18345692 18999273 15932247
44256 15932247 12209759 11737536 13443762 13037494 9369058 5577116 4233592 4378310
44248 4378310 3789221 1902577 -313344 -1888946 -2414028 -1852810 -499695 941571 1442863
44239 1442863 265518 -1882195 -2696540 -618630 2642175 3610679 1547340 -489522
44231 -489522 -110088 970815 -151268 -2943593 -4364375 -3567270 -2776046 -3297101 -3323653
44222c323653K473807L850220K012025j501685l513024k443775N22314K595694
44214F71923J854865o88400j946066n06617J234445J18862l108772m203848r39239
44205g512847L664907M966845K350254n60593q98046L16265O28426j41861l27947
44196B485403M05367M38522j058336k537739k082138J54171K396827L261539K443861
44187E907477K68036k274215l492810k209806R01553L755903M541236K802375
44179A0199749l73924k655082j898577J521773M335099L527819l22077l813326
44171A0521454m490695k810633o82635O63604J254016J792451K725199L432348
44163A2405109K677016L98703j682383k190607j965654k449974l044777j994681
$$ plain form
44222 -3323653 -849846 3000374 5012399 3510714 -2310 -2446085 -1923771 671923
44214 671923 2526788 1838388 -107678 -614295 620150 739012 -2369760 -6573608 -7512847
44205 -7512847 -3847940 1118905 3469159 2908566 2010520 2326785 2955211 2813350 2485403
44196 2485403 2890770 3329292 2270956 -266783 -2348921 -2194750 202077 3463616 5907477
44187 5907477 6175513 3901298 408488 -1801318 -899765 2856138 7397374 10199749
44179 10199749 9825825 7170743 5272166 6793939 11129038 14656857 14334780 10521454
44171 10521454 6030759 3220126 2537491 3201095 4455111 6247562 8972761 12405109
44163 12405109 15082125 15480828 13798445 11607838 9642184 7192210 4147433 2152752
44155B152752M67450K008096J416972M480o22759l70263K51765J012017J246889
44146G567399O6822j832180k282089o15273J148354J274106P14606R79694J343429
44137H364868L50282j187547j317999m53086r30531k902274l417316o85610K948478
44128G69265L934744J926245n51354j807350k216860k077458o32235J951724L474947
44119D771668K081010j227438l845176m583643l942590k167762P51871L293787
44111d868273L204686Q82205m19889R32765K521496J679728m96728j425516j373941
44102F36533k221338l098542j145383L389538O477548N612858K797337J148776
44094A3597327J115020J231369L88278j761406m655623o313798n103506k497589
$$ plain form
44155 2152752 2620202 4628298 6045270 6049750 5426991 5056728 5308493 6320510 7567399
44146 7567399 7634221 5802041 3519952 2904679 4053033 5327139 6041745 7021439 8364868
44137 8364868 8715150 7527603 6209604 5756518 4825987 1923713 -1493603 -2179213 769265
44128 769265 4704009 6630254 6078900 4271550 2054690 -22768 -655003 1296721 4771668
44119 4771668 6852678 5625240 1780064 -2803579 -6746169 -8913931 -8162060 -4868273
44111 -4868273 -1663587 -781382 -1201271 -268506 2252990 3932718 3435990 2010474 636533
44102 636533 -1584805 -4683347 -5828730 -2439192 4038356 9651214 12448551 13597327
44094 13597327 14712347 15943716 16331994 14570588 9914965 3601167 -1502339 -3999928
44086c999928j468192j708421J36775M478017P023420N057731J545307Q9383m51915
44077A0702177k574521m669954l578761l29952J401570J021242O39530L62202
44069B973533j174050k538188j011801J922486J925114r94342j955901J013893
44061A60744L859464K955578n1960k107883l099109l729885k956712m63667J551958
44052c881472J729470J594208J929642P29068k374838l460747J18081M765794
44044A149206N404313K487474k1981j129919k431226l228812j341455K076233
44036B963833L437544K135811P41824L11839j09753O9151K126489L866079J687679
44027A7230496k808883l936401p34511J219280j128534l404433j331163K295917
$$ plain form
44086 -3999928 -5468120 -7176541 -7039766 -2561749 4461671 9519402 11064709 11154092 10702177
44077 10702177 8127656 3457702 -121059 -451011 950559 1971801 2611331 2973533
44069 2973533 1799483 -738705 -1750506 171980 2097094 1102752 -853149 160744
44061 160744 4020208 6975786 6923826 4815943 1716834 -2013051 -4969763 -5433430 -3881472
44052 -3881472 -2152002 -557794 1371848 2100916 -273922 -3734669 -3616588 1149206
44044 1149206 6553519 9040993 9019012 7889093 5457867 2229055 887600 2963833
44036 2963833 6401377 8537188 9279012 9590851 9481098 9550249 11676738 15542817 17230496
44027 17230496 14421613 10485212 9750701 10969981 9841447 6437014 5105851 7401768
44019G401768K688349O82640O4144O72930j58831j594063n95846J930612K084523
44010A3176226j32702m52678K356383M069510J668854k087809l198062j776017
44002A3623705p2783J679657M023725N133249K781045j405402l101853q21604
43994B1839739K335666K842332M96103k452720l927109k994289J5131L149088
43986B1303941L832479J541968j253573j915240o58135M44542O65274J008666
43978B4969922J664693J320571k72232j086571L08987K142346J639997j074870
43970B9612843l434299m289126m854863n638598n112177k634505m43664q09262
43962B396349k597775k699820j22085L165099M957362M620910K474920p32354
$$ plain form
44019 7401768 10090117 10772757 10836901 11509831 11351000 9756937 9161091 11091703 13176226
44010 13176226 13043524 12590846 14947229 19016739 20685593 18597784 15399722 13623705
44002 13623705 13550922 15230579 19254304 24387553 27168598 25763196 22661343 21839739
43994 21839739 24175405 27017737 27513840 25061120 21134011 18139722 18154853 21303941
43986 21303941 25136420 26678388 25424815 23509575 22851440 23295982 23961256 24969922
43978 24969922 26634615 27955186 27682954 26596383 26905370 29047716 30687713 29612843
43970 29612843 26178544 21889418 17034555 11395957 6283780 3649275 3205611 2396349
43962 2396349 -201426 -2901246 -3023331 141768 5099130 9720040 12194960 11462606
43954A1462606l495023m284079l145817j522310k82585Q80664J917020J845015
43946C375491N17137l44587Q40507L125683L935777K211894l81907j582736j091769
43937A0605490n48259j268158k534581k375307L8090L067950M016503J923639
43929A2925367j282494k671267j293056R96498J802892Q91458L4311K89709M80690
43920A2174108r83301l644512n466796n229034l209444m6242L312709M821727
43912A729215K921688n64762j648318N29211K173677M87716j805139o42108K688103
43903E869283L165470k39375k788561p98043L447461N334968L641925N45635j921175
43894A6257588l114784k834735j326374L03812J095806J176945R17160J86177
$$ plain form
43954 11462606 7967583 3683504 537687 -984623 -1267208 -386544 1530476 3375491
43946 3375491 3892628 3548041 4388548 7514231 11450008 13661902 13279995 11697259 10605490
43937 10605490 10057231 8789073 6254492 3879185 3917275 6985225 11001728 12925367
43929 12925367 11642873 8971606 7678550 8675048 10477940 11369398 11403709 11693418 12174108
43920 12174108 11190807 7546295 2079499 -3149535 -6358979 -6405221 -3092512 1729215
43912 1729215 4650903 4086141 2437823 2967034 5140711 5628427 3823288 3181180 5869283
43903 5869283 9034753 8795378 6006817 5208774 8656235 13991203 17633128 18178763 16257588
43894 16257588 13142804 10308069 8981695 9285507 10381313 11558258 12475418 12661595
43886A2661595o77894n33049O93640J172800k21916j730321j028966J230589K366726
43877A3933204J580538N81374L46395l04602k129073l516006k610132j99790J191850
43868H873758P56337L52636J540970K941072J950772j227413l082859j161777
43860A0943496K568476M315021L306049J853232J260788N41077o19822p66708
43852B3401609L02929L11602j928643m240622m430532l485732k985361j781329
43844E163921J453246M325481L396917j45879j545461Q20475L467368L008600
43836A9944668L7131k939469m488411m260927k585952r50915p31253j026350k5304
43827B973218J573931J545279N45867J680689M880376N940549K876824q92298
$$ plain form
43886 12661595 11983701 11450652 12144292 13317092 13095176 11364855 10335889 11566478 13933204
43877 13933204 15513742 16095116 16441511 16136909 14007836 10491830 7881698 7681908 8873758
43868 8873758 9630095 9982731 11523701 14464773 16415545 15188132 12105273 10943496
43860 10943496 13511972 17826993 21133042 22986274 24247062 24788139 24168317 23401609
43852 23401609 23704538 24016140 22087497 17846875 13416343 9930611 6945250 5163921
43844 5163921 6617167 10942648 14339565 14193686 12648225 13468700 16936068 19944668
43836 19944668 19981799 17042330 12553919 8292992 5707040 4756125 4024872 2998522 2973218
43827 2973218 4547149 6092428 6638295 8318984 13199360 19139909 22016733 21124435
43819B1124435k092654k259369l661353m392589j817266J915389K544727J34513
43811A1495833j740127j991691k519759l371795k307083M50793J611370J58413
43803A785954o79232J457453M267115M295511J859837J95678R89996K536473J884290
43794A8593075j853819n965330o364077k440055J343280P51689k424080k981825
43786a341142o3047J816555J5417k381433j854044L52795J180369P82926J225795
43777b65809K368629K534970J887187J856679K116484J184141n29288j172869
43769I980124o61405o68032j494719j716427j239220j911754m059189m790930
43761f561552j570342L762330O333917L522291k105629n444312m075409l74222
$$ plain form
43819 21124435 19031781 16772412 13111059 8718470 6901204 8816593 11361320 11495833
43811 11495833 9755706 7764015 5244256 1872461 -434622 16171 1627541 1785954
43803 1785954 1106722 2564175 6831290 11126801 12986638 13182316 14172312 16708785 18593075
43794 18593075 16739256 10773926 4409849 1969794 3313074 4064763 1640683 -1341142
43786 -1341142 -1404189 412366 427783 -1953650 -3807694 -3454899 -2274530 -1491604 -265809
43777 -265809 2102820 4637790 6524977 8381656 10498140 11682281 11152993 9980124
43769 9980124 9318719 8650687 7155968 5439541 4200321 2288567 -1770622 -6561552
43761 -6561552 -8131894 -4369564 1964353 5486644 3381015 -2063297 -6138706 -6512928
43753f512928J718423J193275J36183M9254K21238J49272J015489L230920M705070
43744E906196L693083J611201O39638J47023j630041l650626l231295n83795J261984
43735D163368J045374M28121L26537l51924j502039r45270J673876L300838J834924
43726I973805n60993p64487Q85430J814719J087547k55165j285025j448211n8084
43717I389536K344468L349611J557210j011289j551529m48688k58960j613764
43709A1756595k671154k149696n23227J414657K852855K297583p64486l730405
43701H482722l240290J05941K252014J439851L90356J538701L168005K475725
43693A6613025Q7473j274803j125185j239700k018462j824792k14343Q89249L23591
$$ plain form
43753 -6512928 -4794505 -3601230 -3465047 -3415793 -3194555 -3045283 -2029794 1201126 5906196
43744 5906196 9599279 11210480 11850118 11997141 10367100 6716474 3485179 2901384 4163368
43735 4163368 5208742 5636863 5963400 5611476 4109437 3164167 4838043 8138881 9973805
43726 9973805 9412812 8648325 9533755 11348474 12436021 12180856 10895831 9447620 9389536
43717 9389536 11734004 15083615 16640825 15629536 14078007 13629319 13370359 11756595
43709 11756595 9085441 6935745 6412518 7827175 10680030 12977613 12213127 8482722
43701 8482722 5242432 5348373 7600387 9040238 9430594 10969295 14137300 16613025
43693 16613025 16700498 15425695 14300510 13060810 11042348 9217556 9003213 9892462 10216053
43684A0216053j85910J241234L268741K969701K87070j581301o94482J080331
43676A6601437J339246P99918J346714K054966N99370j872527j389115K332237
43668B1812246M193309J044151k971795k252833J783206K930015m11054l402033
43660B2725212k555882j82390N23705L02601J147469K353281K308528J687665
43652B8310189J864471K098966J152999L2171K47427P85874j59177j548156q04414
43643C1980350J824767L440421K972800K406971L076280L539124K105591p10102
43635E0636202l221318m293018l363571n86665K283937K967000J519348M47612
43627D6389527J097607J828881R82323l45847l35624M50200L89845J05396J577434
$$ plain form
43684 10216053 10030143 11271377 14540118 17509819 17796889 16215588 15521106 16601437
43676 16601437 17940683 18740601 20087315 22142281 22741651 20869124 19480009 21812246
43668 21812246 26005555 27049706 24077911 21825078 23608284 26538299 26127245 22725212
43660 22725212 20169330 19986940 20510645 20813246 21960715 24313996 26622524 28310189
43652 28310189 30174660 32273626 33426625 33458796 33706223 34492097 34332920 32784764 31980350
43643 31980350 33805117 37245538 40218338 42625309 45701589 49240713 51346304 50636202
43635 50636202 47414884 43121866 39758295 39171630 41455567 44422567 45941915 46389527
43627 46389527 47487134 49316015 50298338 49952491 49616867 50067067 50456912 50562308 52139742
43618E2139742M171914M523815J282259k487855l261681j610704p39492j650464
43610E2367534k324813j508953o36816j102177j851189j281491Q9654P47589P09118
43601D5208456P29824J0555k496659m932702m052128m41744J305504q05007k829263
43592C1696836q44744K710479K542617j437033m057114k548902J79863Q71579
43584B9113581N44377J712661L952867M933444M125671K909155J924989P11408
43576D9928153k94636M50535L223370N770383N358744J819571k026893l262420
43568F0966807k002663r43942j510127j661755J058374N172658O351438L173031
43560G0603821n60792n99136K410253M189433K458446p51570k354441k010974
$$ plain form
43618 52139742 56311656 60835471 62117730 59629875 56368194 54757490 54017998 52367534
43610 52367534 50042721 48533768 47896952 46794775 44943586 43662095 43751749 44499338 45208456
43601 45208456 45938280 45948835 43452176 38519474 34467346 34025602 35331106 34526099 31696836
43592 31696836 30852092 33562571 36105188 34668155 30611041 28062139 28242002 29113581
43584 29113581 29657958 31370619 35323486 40256930 44382601 47291756 49216745 49928153
43576 49928153 49633517 50084052 53307422 59077805 64436549 66256120 64229227 60966807
43568 60966807 58964144 58020202 56510075 54848320 55906694 61079352 67430790 70603821
43560 70603821 70043029 69443893 71854146 76043579 78502025 77750455 75396014 73385040
43552G3385040j812602k963928l987733k766515J79448J756122J58342k643048
43544F1305126l599527k640696j965235k027226j122223P86488J027187j547850
43536E0216044m037201l459847j243250j077364l500866n403533m530032j965422
43528B4998529J01744J054631J589021K057730J867232K53226k372766l941068
43520B5608279k586392O03918K175974O25724j561382j768045j262242k752702
43512A9083132n353152n525545k761251n52328q51660j141505J048440L689363
43504G635494L228771K15373j321491L53159K470123J863019r69431l041974k663025
43495G770018o99613J146076J949346J619829N62494l85219n45519m05658j234303
$$ plain form
43552 73385040 71572438 68608510 64620777 61854262 62033710 63789832 63948174 61305126
43544 61305126 57705599 55064903 53099668 51072442 49950219 50736707 51763894 50216044
43536 50216044 46178843 42718996 41475746 40398382 36897516 31493983 26963951 24998529
43528 24998529 25100273 26154904 27743925 29801655 31668887 31922113 29549347 25608279
43520 25608279 23021887 23625805 25801779 26427503 24866121 23098076 21835834 19083132
43512 19083132 13729980 8204435 5443184 4890856 4039196 2897691 3946131 7635494
43504 7635494 10864265 11079638 9758147 10111306 12581429 14444448 13475017 10433043 7770018
43495 7770018 7070405 8216481 10165827 11785656 12348150 11962931 11417412 11011754 9777451
43486I777451k962037l269798j75957M737152P352013N703637K141540O719l84198
43477B2926522j048866k740377l978623l505565j985041p49483M7063J290056
43469A0255686L286338M779522L856047J68874l872381n013034k641856M50603
43461A1269799J285470k42085k066761k544823j417996O62655K369070K400525
43453A1715854J090774K51973L70246l65353k609506l582524j116837J773823
43445G528450L97936m176035n759283j817275K946765L714853K038207J994511
43437F868129L290659K633260J30215n96056J307119J983494j264278n506158
43429H846384n960763k235482J697213K747990J591860O31582J267729L430913
$$ plain form
43486 9777451 6815414 3545616 3369659 8106811 15458824 21162461 23304001 23310720 22926522
43477 22926522 21877656 19137279 15158656 11653091 9668050 8918567 8965630 10255686
43469 10255686 13542024 18321546 22177593 22346467 18474086 13461052 10819196 11269799
43461 11269799 12555269 12313184 10246423 7701600 6283604 6946259 9315329 11715854
43453 11715854 12806628 13058601 13428847 13063494 10453988 6871464 5754627 7528450
43445 7528450 7926386 3750351 -2008932 -3826207 -879442 2835411 4873618 6868129
43437 6868129 10158788 12792048 12922263 12326207 13633326 15616820 14352542 8846384
43429 8846384 2885621 650139 2347352 5095342 6687202 7318784 8586513 12017426
43421A2017426N830031O043035K403475k979168n103551k010553J890177J252736
43413A9343608k741300m155296j153202J595505N46280j536247r08833Q65561
43405A1856076J80070k175495k727141j455318j088945j463418K1161K615064
43397E762054K433776p78069k319371L84801L906389M034854R78667k589090m967739
43388F846272m960648j725207K664624M050563J862818M06113K207019M099321
43380A5450875K844439M46452L8385L84207q68840j823814L58620L218179J921956
43371B1970459k789619n265653l256795l33046K71153o38396j436762k154806
43363F366535k472485j041607J726835L311183K755515J908283K001783J856015
$$ plain form
43421 12017426 17847457 23890492 26293967 23314799 18211248 16200695 18090872 19343608
43413 19343608 16602308 12447012 11293810 12889315 13435595 11899348 10990515 11856076
43405 11856076 12036146 9860651 7133510 5678192 4589247 3125829 3146990 5762054
43397 5762054 8195830 7417761 5098390 5483191 9389580 13424434 14403101 11814011 6846272
43388 6846272 1885624 160417 2825041 6875604 8738422 9144535 11351554 15450875
43380 15450875 18295314 18741766 18780151 19164358 18295518 16471704 16830324 20048503 21970459
43371 21970459 19180840 13915187 10658392 10325346 10596499 9958103 8521341 6366535
43363 6366535 3894050 2852443 4579278 7890461 10645976 12554259 14556042 16412057
43355A6412057O75296q0529Q60777K392952K716025J637644J69197q34688r85101
43346B2963630n05506k86493o45068m20918J155626K447985J416153j001624j993137
43337B3130648q81963N97026J522346K293404K273215L08356k302120k759517
43329B4181395j046459N9482m38461p60379l66634r16573k237093j629646J085625
43320A7931257K062190n79174l105678j615618K084478L494083J822841j78464
43312B1915915j020952j590041k360896k516562j614875j33869J286137J840410
43304A5805267O91137j636405k988896j863756R36593L481715M236883K320188
43296B0982726j573784m213092k572061J768691L960906K362580J16199o44265
$$ plain form
43355 16412057 17087353 17006824 17867601 20260553 22976578 24614222 24783419 23948731 22963630
43346 22963630 22458124 22171631 21526563 21105645 22261271 24709256 26125409 25123785 23130648
43337 23130648 22248685 22845711 24368057 26661461 28934676 29243032 26940912 24181395
43329 24181395 23134936 23194418 22755957 21995578 21628944 20712371 18475278 16845632 17931257
43320 17931257 19993447 19414273 16308595 14692977 16777455 20271538 22094379 21915915
43312 21915915 20894963 19304922 16944026 14427464 12812589 12678720 13964857 15805267
43304 15805267 16496404 14859999 11871103 10007347 10943940 14425655 18662538 20982726
43296 20982726 19408942 15195850 12623789 14392480 18353386 20715966 20832165 20187900
43288B0187900j578873l197598k328302J888216M254682O70592m742832n220365
43280I933420j244478J051335n18643k321101j819038m50097M95822J534966K003848
43271H666034L00892k117043j557722K063530M454612L203995Q14587J43887N95330
43262A6568102M77226j69481p67505j432867j745157r50804j57889j244204k908293
43253G669128j545255K745049N089935K780409o61773j095290J61031n68286k909330
43244A1665618l313983r21807J408130J649368R88453J279356K441096L062588
43236A8258819K258192M92518p77317l84790J113053J686693J590l082669n361523
43227A4204566m999014j558049L406072O680989N890929K214902o46080o32472
$$ plain form
43288 20187900 18609027 15411429 13083127 14971343 19226025 19896617 15153785 9933420
43280 9933420 8688942 9740277 9221634 6900533 5081495 4631398 5127220 6662186 8666034
43271 8666034 8966926 6849883 5292161 7355691 11810303 15014298 15828885 15972772 16568102
43262 16568102 17045328 16875847 16108342 14675475 12930318 11979514 11821625 10577421 7669128
43253 7669128 6123873 8868922 13958857 16739266 16077493 14982203 15143234 14574948 11665618
43244 11665618 8351635 7429828 8837958 10487326 11475779 12755135 15196231 18258819
43236 18258819 20517011 21009529 20232212 19847422 20960475 22647168 22648758 19566089 14204566
43227 14204566 9205552 7647503 11053575 17734564 23625493 25840395 25194315 24561843
43219B4561843P97339J162311j95624k062809k586773l84293L746764O084789
43211C1123547L311349k793348o431519m619400n94683R22030m87740j771363
43203A8658873j103463N21620J392897Q64437n84581j926270k485374k592610
43195A2745529k749554k495134j398053m96541o42569j85751K627284N467825
43187A2873036M228092k59742k612386j147559k98872k367505k822162J668478
43179I261380N845742K991780m041925o311072j796741K491133J733413n16376
43171I657334L58451K510987J357462k857695n444069l732093J34282K640178
43163D624837K854246K271182J798399L07643l012993n859919m762917j91067
$$ plain form
43219 24561843 25359182 26521493 26325869 24263060 21676287 21291994 25038758 31123547
43211 31123547 34434896 31641548 25210029 20590629 19995946 20917976 20430236 18658873
43203 18658873 17555410 18077030 19469927 20334364 19749783 17823513 15338139 12745529
43195 12745529 9995975 7500841 6102788 5606247 4963678 4777927 7405211 12873036
43187 12873036 17101128 16841386 14229000 13081441 12782569 10415064 7592902 9261380
43179 9261380 15107122 18098902 14056977 7745905 5949164 8440297 10173710 9657334
43171 9657334 10015785 12526772 13884234 11026539 5582470 1850377 1984659 4624837
43163 4624837 7479083 9750265 11548664 11856307 8843314 2983395 -1779522 -1970589
43155a970589L174288K674774J056699J309204J612789p49286l510716k663728
43147I33435L17043L82664k617110l487317k26999L005515L032594K086240K630881
43138F056946K934944J124455o79706m2715J396948R73043m68101q25664r46348
43129I523802k479201l555982j101700L483457N285434K665904n49496n51315
43121A2720903J562119J827089j140672m217405l352004J339592M948821L307273
43113A6995716j640172m243771k640242n43120q56631j545696j77771J253653
43105F601966j46193k532215j694154K299557N172329M645465K592087J009488
43097A7948330l62804j762292j989301l59018K193305M553212O004224N397612
$$ plain form
43155 -1970589 1203699 3878473 4935172 6244376 7857165 7107879 3597163 933435
43147 933435 1250478 1633142 -983968 -4471285 -4698284 -1692769 1339825 3426065 6056946
43138 6056946 8991890 10116345 9436639 9393924 10790872 11763915 11295814 10470150 9523802
43129 9523802 7044601 3488619 2386919 5870376 11155810 13821714 13272218 12720903
43121 12720903 14283022 16110111 14969439 10752034 7400030 8739622 13688443 16995716
43113 16995716 15355544 11111773 8471531 7928411 7071780 5526084 5348313 6601966
43105 6601966 6455773 3923558 2229404 4528961 9701290 14346755 16938842 17948330
43097 17948330 17585526 15823234 13833933 13474915 15668220 20221432 26225656 31623268
43089C1623268K243246j161033j327453K046521N478042N877526L194093j145409
43081D6828801n685640q362815p414254l977917j372287q70611o66415K09999
43073A8688861J11752j568550k195930J75026L237025L664389J958215J021384
43065B5092172J312952O80663j550191l332812k908149q24056J257538K058519
43057B1786636J061885r58961j922780n38661J778015K630710J878038J317544
43049B7032426J519658J281658L83214M11057J909398K789479J053753k221802
43041C4158841m102871l263791j050943M56087M20513n54690j426176j718646
43033B2918324j711823j694136j326132j41473J551841K800558K897573J821370
$$ plain form
43089 31623268 33866514 32705481 31378028 33424549 38902591 44780117 47974210 46828801
43081 46828801 41143161 32780346 25366092 21388175 20015888 19145277 18478862 18688861
43073 18688861 18800613 17232063 15036133 15211159 18448184 22112573 24070788 25092172
43065 25092172 26405124 27085787 25535596 22202784 19294635 18470579 19728117 21786636
43057 21786636 22848521 21889560 19966780 19428119 21206134 23836844 25714882 27032426
43049 27032426 28552084 29833742 30216956 30628013 32537411 35326890 36380643 34158841
43041 34158841 30055970 26792179 25741236 26197323 26617836 26063146 24636970 22918324
43033 22918324 21206501 19512365 18186233 18044760 19596601 22397159 25294732 27116102
43025B7116102K78291l51087Q04035K151707M87743m363615p420936m194271K425983
43016A6933952M984734J439868k248332j164863J685083J032044k156202k926922
43008A7579362o70258O40610j78349J44015K695955L615985M17776l397433l401411
42999A7446252o13401Q98920M32702N78521J911929J893205o32291l109774k605793
42990A6200270N54133L571443M362442L129896J524693Q99731J205605J489558
42982C2937771J346508J199580J043294J37687j435528k301145j872547j433578
42974B9622042j818317j691080r2658R61282p48119l313128k527517J979039N686372
42965B8057916M974111J181298k044798k852042j486831R66759K574181J470394
$$ plain form
43025 27116102 27394393 27043306 27847341 29999048 30486791 26123176 18702240 14507969 16933952
43016 16933952 21918686 23358554 21110222 19945359 21630442 22662486 20506284 17579362
43008 17579362 16909104 17549714 17371365 17515380 20211335 23827320 24245096 20847663 17446252
42999 17446252 16832851 17731771 18164473 18742994 20654923 22548128 21915837 18806063 16200270
42990 16200270 16754403 20325846 24688288 27818184 29342877 30242608 31448213 32937771
42982 32937771 34284279 35483859 36527153 36664840 35229312 32928167 31055620 29622042
42974 29622042 27803725 26112645 26019987 26981269 26233150 22920022 20392505 22371544 28057916
42965 28057916 33032027 34213325 32168527 29316485 27829654 28796413 31370594 32840988
42957C2840988j418136k424111K74557L863616M658595K959813J750433J979019
42949D4484774K110385J721972K318283M129312M958803L563673K112784L367666
42941F8767652O401522P129301L325117k264727m779247k716580O73843J765743
42933G8302624Q93247Q44757J988932J545125j747218m867332m313130r51118
42925G1695887J297524P40502n88367n34074N39550J342308J833008K524711K921032
42916H1772081K189583R69828J155143L527738O319617O775037M174257R01290
42908A07784574J52444K676643O095001P356483N552953K561253J432295L822878
42900A37434524Q222057J1005336J0221089P942012P524238R040837R554519P866139
$$ plain form
42957 32840988 31422852 28998741 29273298 33136914 37795509 40755322 42505755 44484774
42949 44484774 46595159 48317131 50635414 54764726 59723529 63287202 65399986 68767652
42941 68767652 75169174 82298475 85623592 83358865 78579618 75863038 76536881 78302624
42933 78302624 79195871 80040628 82029560 83574685 81827467 76960135 72647005 71695887
42925 71695887 72993411 73733913 73145546 72611472 73151022 74493330 76326338 78851049 81772081
42916 81772081 83961664 84931492 86086635 89614373 95933990 102709027 106883284 107784574
42908 107784574 107937018 110613661 116708662 124065145 129618098 132179351 133611646 137434524
42900 137434524 145656581 156661917 166883006 174825018 182349256 191390093 200944612 208810751
42892B08810751O230387O504493P466315P665566Q236727J0368356J2210991J1440125
42884B78933711R402565R356334J1408362J2538933J1340256R457081Q167484
42877C50604726O647387M235303J711957l99373k461152m145969m643549m906090
42869C46643240p061057j0894856j3615877j4008387j4014651j5011124j5480998
42862B56556290j4131621j2506451j2210240j1942521r919005p336269o642535
42855A81867648p746913q661888q863794r322723r880135r222204p251830n299655
42847A15618506m094076l338231k993622l202654l316889k785665k540121l584062
42839H9763186m716385l863131j418650Q5224l31671j153909j431424k223164
$$ plain form
42892 208810751 215041138 221545631 229011946 236677512 244914239 255282595 267493586 278933711
42884 278933711 288336276 297692610 309100972 321639905 332980161 342437242 350604726
42877 350604726 357252113 361487416 363199373 362800000 360338848 356192879 351549330 346643240
42869 346643240 339582183 328687327 315071450 301063063 287048412 272037288 256556290
42862 256556290 242424669 229918218 217707978 205765457 195846452 188510183 181867648
42855 181867648 174120735 165458847 156595053 147272330 137392195 128169991 120918161 115618506
42847 115618506 111524430 108186199 105192577 101989923 98673034 95887369 93347248 89763186
42839 89763186 85046801 81183670 79765020 79850244 79518573 78364664 76933240 74710076
42831G4710076m039284n164834m090298j970536r77774j287592j368618o61817
42823E5149323k90081r75824j527879j95590K800027M908575L984546J045376
42815F4898473p44941n9204R73600M0601j826202j728538Q37877L197202K879058
42806F8467926J16381l002022m281224k461845J634825M914824M837680K588172
42798G2814717J472778K133561J950490k80634k147638j576052q2121K00753K94807
42789G4780661K287602N242177O367841N174592L334345J262970j666393l841960
42781I2941835k312671K218083M977612L402608P20411J007479L340172L867715
42773A10163244J937416O82973K005836M173016M905716M299268L609918L027171
$$ plain form
42831 74710076 70670792 65505958 61415660 59445124 58467350 57179758 55811140 55149323
42823 55149323 54859242 53883418 52355539 52159949 54959976 59868551 63853097 64898473
42815 64898473 64153532 64094328 65067928 65108529 63282327 61553789 62391666 65588868 68467926
42806 68467926 68584307 65582285 61301061 58839216 60474041 65388865 70226545 72814717
42798 72814717 74287495 76421056 78371546 78090912 75943274 74367222 74285101 74485854 74780661
42789 74780661 77068263 82310440 88678281 93852873 97187218 98450188 96783795 92941835
42781 92941835 90629164 92847247 97824859 101227467 101947878 102955357 106295529 110163244
42773 110163244 112100660 112783633 114789469 118962485 123868201 128167469 131777387 134804558
42765A34804558K100470J347227J985894M184433O383460O614220M485745J906536
42757A63812543J463096L599286N776574N211732K185419l51315l55920J252244
42749A82593659K207344J321104j100241m034040o174957o487736n164292l539985
42741A59620856k634992k411634k623113l230623l580527k683731j167481j284943
42733A40003812l594026n311286m053319j807175k357847n461147o864296m453586
42725A06101130j160067n08517k098600l435617l939040m569333m950548l736277
42717H1703131j395850p2257m67141j003844n96472l20196j375360k972936l619914
42708F9879161l451416l641638l984940k954104n03110J014494k8024j812353
$$ plain form
42765 134804558 136905028 138252255 140238149 144422582 150806042 157420262 161906007 163812543
42757 163812543 165275639 168874925 174651499 179863231 182048650 181697335 181341415 182593659
42749 182593659 184801003 186122107 185021866 180987826 174812869 168325133 163160841 159620856
42741 159620856 156985864 154574230 151951117 148720494 145139967 142456236 141288755 140003812
42733 140003812 136409786 131098500 127045181 125238006 122880159 117419012 110554716 106101130
42725 106101130 104941063 104432546 102333946 98898329 94959289 90389956 85439408 81703131
42717 81703131 80307281 80235024 79767883 78764039 78167567 77847371 76472011 73499075 69879161
42708 69879161 66427745 62786107 58801167 55847063 55343953 56358447 56330423 54518070
42700E4518070j406158Q24882J559394m83838k583454k368670j593885l150313
42692D5316028o158133p126063n016583j892743J002961M181086O675394N814829
42684D2796776J662903j680525j242115J043818J709224L10040j616333l560211
42676C9423577n195105m674782j001272L273627M701443L268846J486980M47717
42668D1731031l93270q11728l84114m34751k132042l585625k382864j62833o12697
42659C0831107l344135m270328k343891j158522k644781l778339j693222J870413
42651A3468302L784429L925489L727608L193576K035755J339748J473775N79821
42643C3528503k306683m828508m610040k837735j813860j158167M04584J565290
$$ plain form
42700 54518070 53111912 53936794 55496188 55012350 52428896 50060226 48466341 45316028
42692 45316028 39157895 32031832 27015249 25122506 26125467 30306553 36981947 42796776
42684 42796776 44459679 42779154 41537039 42580857 44290081 44600121 42983788 39423577
42676 39423577 34228472 29553690 28552418 31826045 36527488 39796334 41283314 41731031
42668 41731031 41337761 40526033 40141919 39707168 37575126 33989501 31606637 31443804 30831107
42659 30831107 27486972 23216644 20872753 19714231 17069450 13291111 11597889 13468302
42651 13468302 17252731 21178220 24905828 28099404 30135159 31474907 32948682 33528503
42643 33528503 31221820 26393312 21783272 18945537 17131677 15973510 16378094 17943384
42635A7943384M92072j134145k24003K330719K496460o14889l145981j966485
42627A6177132J443071L640416L170456Q02797k004488l799457l930176l362260
42619A2137491l362632l354064j927085J66535O27285l97894J06246L205645N602849
42610A2804376M146241N28929j204436m16233o6088j529254k394933m68261K422438
42601A3822779K660433j48102k583081j974288L10006J135481k02156j680657
42593A1340415j745806q34402K64645J496216K398199J873487K18653l74104J211342
42584A5848645L043597K761927Q01715q03727j562387k319834k898495k322909
42576A2548532r40697j43350k21370l54699k78923r3128Q61817K728167L524498
$$ plain form
42635 17943384 18435456 17301311 17077308 19408027 21904487 21289598 18143617 16177132
42627 16177132 17620203 21260619 24431075 25233872 23229384 19429927 15499751 12137491
42619 12137491 8774859 5420795 3493710 3660245 4287530 3889636 3995882 7201527 12804376
42610 12804376 16950617 17479546 16275110 15858877 15792789 14263535 11868602 11400341 13822779
42601 13822779 16483212 16335110 13752029 11777741 12087747 13223228 13021072 11340415
42593 11340415 9594609 8760207 9024852 10521068 12919267 14792754 15011407 14637303 15848645
42584 15848645 18892242 21654169 22455884 21652157 20089770 17769936 14871441 12548532
42576 12548532 11607835 11464485 11243115 10888416 10609493 10516365 11378182 14106349 17630847
42567A7630847J467611j671057k487574q76807K18132j50208N2935J283939J046696
42558A6514514j417910l053186j917468o20424j858870l611237k467673M86239
42550B053985J244094p65850j961197k42041K203314K610466J447721J049906
42542G640398J999132K410467O07873k258564k882328L75601M796127N897595
42534A8586301K798522r32752k298651k282717k890701l429261k255448k97912
42526F997381K24257m72617k81493J068299J677710P68239k49407j61031P30922
42517A0302260J757459K443660K041347M19567q43780k73122J004523P85796p23699
42508A6914011j596138j839399l052782m431138k978165J269079L979948K404195
$$ plain form
42567 17630847 19098458 17427401 14939827 14063020 14281152 14130944 14183879 15467818 16514514
42558 16514514 15096604 12043418 10125950 9505526 7646656 4035419 1567746 2053985
42550 2053985 3298079 2532229 571032 328991 2532305 5142771 6590492 7640398
42542 7640398 9639530 12049997 12657870 10399306 7516978 7892579 12688706 18586301
42534 18586301 21384823 20452071 18153420 15870703 12980002 9550741 7295293 6997381
42526 6997381 7221638 6749021 6467528 7535827 9213537 9981776 9732369 9571338 10302260
42517 10302260 12059719 14503379 16544726 16964293 16120513 15847391 16851914 17637710 16914011
42508 16914011 15317873 13478474 10425692 5994554 3016389 4285468 8265416 10669611
42500A0669611o72705j170784P95051K271638K006603P26977j294527l791534
42492I540330m814131k684850Q78826K475048J577523O42201Q40377P82864J0926
42483I249114N60415L412867N874279M815220J046609j977855l038994m019942
42475A5921713n721593n711823k158759K180668K793935j68295j584804J393476
42467F944518M835270L387288k010161n447979m190709j302035K22257J451465
42459C889914L705063M822910K700527k64884l18270J703197J725285j028699
42451A6935043l075079k334152o83224k0174L51210Q76128q5059k911030m580463
42442D473200k812040m4108k4338k075064k346902O0821K030236J619719O91215
$$ plain form
42500 10669611 9996906 8826122 9621173 11892811 13899414 14626391 13331864 9540330
42492 9540330 4726199 2041349 2920175 5395223 6972746 7614947 8455324 9238188 9249114
42483 9249114 9809529 13222396 19096675 23911895 24958504 22980649 19941655 15921713
42475 15921713 10200120 4488297 2329538 4510206 7304141 7135846 5551042 6944518
42467 6944518 11779788 15167076 13156915 7708936 3518227 2216192 2438449 3889914
42459 3889914 7594977 12417887 15118414 14853530 14535260 16238457 17963742 16935043
42451 16935043 13859964 11525812 10842588 10822414 11173624 12049752 11964693 9053663 4473200
42442 4473200 1661160 1617052 1592714 -482350 -2829252 -2768431 -738195 881524 1572739
42433A572739J218053K087578J503722K52053K05424J007119O73673j132889k615207
42424D772265k482698j242962J75055J331051J584324L24232j446324j466250
42416A548693P27246K505051J367304j568518k978633j602085P05291J915373
42408B619722J853432J027792n52867k413899l030918j610604M41782J134264
42400e31296M04083j44391L95973J298606J487069P63024k74353q43252n76855
42391A978608o268j42083j079767j607972r02829J81235N62808P77411J773314
42382A534457K580131J393516j086675j876071L1741J949070J372460m29188n65626
42373D903815J214133K573311K049949L43923j422443k665946k667827r80592
$$ plain form
42433 1572739 2790792 4878370 6382092 6634145 6839569 7846688 8520361 7387472 4772265
42424 4772265 2289567 1046605 1221660 2552711 4137035 4461267 3014943 1548693
42416 1548693 2275939 4780990 6148294 4579776 1601143 -942 704349 2619722
42408 2619722 4473154 5500946 4948079 2534180 -496738 -2107342 -1665560 -531296
42400 -531296 -127213 -271604 124369 1422975 2910044 3673068 3398715 2555463 1978608
42391 1978608 1972340 1830257 750490 -857482 -1760311 -1579076 -1016268 -238857 1534457
42382 1534457 4114588 5508104 4421429 2545358 2577099 4526169 5898629 5469441 4903815
42373 4903815 6117948 8691259 10741208 11085131 9662688 6996742 4328915 3348323
42365C348323J162190J659139L69024m37868P88863K703171L002539J419560l57405
42356A3657536r97283o71684l37790p62816j942374k856783k275598m28630P59799
42347D144377n7695j765395k238381j172115j06350J46331M47850J321838J563260
42338B283720n8126k643263l947998k956666o58007J531760L050176L780270L398924
42329C780790J772091m61302k268663l053168k829763j843998m26537R16099J732481
42320b681970K029402K162575K292464K242080J951760J730575J850115K104889
42312A3681890J979429J146130k44913j541927j867870r12108L45188L03933j326490
42303A1563262k790891k314460n76288r6113k022196m549651n024537k841936
$$ plain form
42365 3348323 4510513 6169652 6538676 6100808 6889671 9592842 12595381 14014941 13657536
42356 13657536 12660253 11988569 11650779 10887963 8945589 6088806 3813208 3384578 4144377
42347 4144377 4086682 2321287 82906 -1089209 -1195559 -1049228 -601378 720460 2283720
42338 2283720 2225594 -417669 -4365667 -7322333 -7980340 -6448580 -3398404 381866 3780790
42329 3780790 5552881 5091579 2822916 -230252 -3060015 -4904013 -5330550 -4414451 -2681970
42320 -2681970 -652568 1510007 3802471 6044551 7996311 9726886 11577001 13681890
42312 13681890 15661319 16807449 16562536 15020609 13152739 12240631 12585819 12889752 11563262
42303 11563262 8772371 6457911 5881623 5785510 3763314 -786337 -5810874 -8652810
42295h652810L61560K749301L698214L535162K800527J960241J347527J098281
42287H898003J169506J375127J417998J118567O29490J45680m72369j261123j536747
42278A1484132o72468M83628K81674j225258k012451j234022q60510k434011l847098
42269c6384k124116J451704K450433j00030j755200J041220N685003P110024M713059
42260A8435713K339883K298176K836295J902639L10635k71896k87855j234940
42252B6328650k774988k976947j316214K78137o0349j704929k551462j883938
42244A3337960j055874j239223j660722q46759J117411K611893K403364N53060
42236A5221110k146766m296153l884185k64542L620876L505627n10271l014197
$$ plain form
42295 -8652810 -8291250 -5541949 -1843735 1691427 4491954 6452195 7799722 8898003
42287 8898003 10067509 11442636 12860634 13979201 14608691 14754371 14282002 13020879 11484132
42278 11484132 10811664 11295292 11576966 10351708 8339257 7105235 6244725 3810714 -36384
42269 -36384 -2160500 -708796 1741637 1641607 -113593 927627 6612630 13722654 18435713
42260 18435713 20775596 23073772 25910067 27812706 28123341 27851445 27563590 26328650
42252 26328650 23553662 20576715 19260501 19538638 19478289 17773360 15221898 13337960
42244 13337960 12282086 11042863 9382141 8535382 9652793 12264686 14668050 15221110
42236 15221110 13074344 8778191 4894006 4629464 8250340 11755967 11245696 8231499
42228H231499j87715M498876M708398O7516l454982k158890N95985O2469k883013
42219I480143l644545r17225J945065K339940J725624K267043K776810M84856
42211A6457711m081377o663502m441264K08101K632146J569789j1361N50995K449939
42202H671177L383192K604287O87134j978959m621114n392019l433199p14175
42194g93676L71133L53166J152746K137841J037414j462170j887583N07207K255204
42185C671282J273658J43443J280775K347196J36547l487806l877133o24102J971509
42176B835369J373537j12685M88562K716277M048330L190535P44110j883021l250258
42167A0150756k655025p84956J027200K065247J984820K31191k668307m172061
$$ plain form
42228 8231499 8043784 12542660 17251058 17318574 13863592 11704702 12300687 12363156 9480143
42219 9480143 5835598 4918373 6863438 9203378 10929002 13196045 15972855 16457711
42211 16457711 12376334 5712832 1271568 1479669 4111815 5681604 5670243 6221238 8671177
42202 8671177 12054369 14658656 15345790 13366831 8745717 3353698 -79501 -793676
42194 -793676 -422543 -69377 1083369 3221210 4258624 2796454 908871 1416078 3671282
42185 3671282 4944940 5088383 6369158 8716354 8852901 5365095 1487962 863860 2835369
42176 2835369 4208906 4096221 4584783 7301060 11349390 14539925 15284035 13401014 10150756
42167 10150756 7495731 6710775 7737975 9803222 11788042 12019233 9350926 5178865
42159E178865k473872L41846P01733j036440q87602K385194M786360K840489j210874
42150A0625699k705965j025635L02883r42003k956033k780007L8598L179447M088389
42141G825373K627217J354077K554936M992518N110976K001284q30360m0478L065467
42132B8661010M688161L734280K274198J545570L54555k232790m942422n924288
42124B8158274m848322k657609m06203R98895Q68204o57573k449054l266919k693596
42115A3046097j284673p5613K55045k4573k41056m21117j029326j568135r05097
42106G751552M68797L55152j735529k974492j003906K234166K958501P64313j323201
42097G495353j316710J511J362600K125874J419474p18160j579774J168898M591907
$$ plain form
42159 5178865 2704993 3046839 3748572 2712132 1824530 4209724 8996084 11836573 10625699
42150 10625699 7919734 6894099 7196982 6254979 3298946 518939 557537 3736984 7825373
42141 7825373 10452590 11806667 14361603 19354121 24465097 26466381 25636021 25595543 28661010
42132 28661010 33349171 37083451 39357649 40903219 41257774 39024984 34082562 28158274
42124 28158274 23309952 20652343 20246140 21245035 22113239 21455666 19006612 15739693 13046097
42115 13046097 11761424 11685811 11940856 11916283 11675227 11254110 10224784 8656649 7751552
42106 7751552 8220349 8575501 6839972 3865480 2861574 5095740 8054241 8818554 7495353
42097 7495353 6178643 6180154 7542754 9668628 11088102 10369942 8790168 9959066 14550973
42088A4550973L046796l298667p355561m873695n29777n12561l327147l310303
42080e609942l33178M74017k223147l684358r18213K817392L611728K479146K344996
42071a041559K910937K003433j65450j472338j413512j281457j538928j491002
42063c489876j075195p37090J18248K362130M923953N417293L217205J64472k009615
42054H891525l218740l683726k962718j113159P72789K127780L544035M813481
42046I171267L978653R9823m217251n308719l038394o45074k9185K44302J451868
42037A707290J938829n3297k705574k700256k33350J156369J7032q36962J120736
42028e89183M037146M362570J875296n50789j268738j280310j514685j254033
$$ plain form
42088 14550973 17597769 14299102 6943541 2069846 1540069 1027508 -2299639 -5609942
42080 -5609942 -5943120 -5469103 -7692250 -11376608 -12294821 -9477429 -5865701 -3386555 -1041559
42071 -1041559 1869378 3872811 3707361 2235023 821511 -459946 -1998874 -3489876
42063 -3489876 -4565071 -5302161 -5183913 -2821783 2102170 7519463 10736668 10901140 8891525
42054 8891525 5672785 1989059 -973659 -2086818 -1314029 813751 4357786 9171267
42046 9171267 13149920 13249743 9032492 3723773 685379 40305 11120 255422 1707290
42037 1707290 3646119 3592822 887248 -1813008 -2046358 -889989 -872957 -1709919 -589183
42028 -589183 3447963 7810533 9685829 9135040 7866302 6585992 5071307 3817274
42020C817274R7624J614579K075302J244097n95552k938163m320525k951713Q48655
42011a108422M169389M691626L333726K545322K986839L379139K942277K268894
42003B5208790J840519J150474k47088j667477j793369n1565K581401M145213
41995C1166898L379229R14138j599879l345362m446924m483339k544607P48196
41987A9788350K985803K713853R78999p71333k485116l890759l322805m37978
41979A5559014J803025P84081j581785j646700J14859O1857k156560k668818J70059
41970A0439032K791505J943245m69822p99165R17324J895564R57714q32213k346470
41961A4496714k751532j141308J835227L406003K075041J24696K80997J469990
$$ plain form
42020 3817274 3914898 5529477 7604779 8848876 8253324 5315161 994636 -1957077 -1108422
42011 -1108422 3060967 7752593 11086319 13631641 16618480 19997619 22939896 25208790
42003 25208790 27049309 28199783 27952695 26285218 24491849 24440284 27021685 31166898
41995 31166898 34546127 35460265 33860386 30515024 26068100 21584761 19040154 19788350
41987 19788350 22774153 25488006 26467005 25695672 23210556 19319797 15996992 15559014
41979 15559014 17362039 18146120 16564335 14917635 15032494 15094351 12937791 10268973 10439032
41970 10439032 13230537 15173782 14703960 13904795 14822119 16717683 17675397 16843184 14496714
41961 14496714 11745182 10603874 12439101 15845104 17920145 18044841 18325838 19795828
41953A9795828P88195j655224l141898k734113j948387j505249o37549N55605
41945I517208J145250J592240K867015L677774K059234m64633l65699J906309
41937B1934698J947216j426571l774556k064903M46334k27755k268913j479634
41929A3085916J498805K315457r0160k353213k277967j303652r02378k87936J114432
41920A0799304J960390J305335L85261M96442P70948l18252k322058l227177k048154
41911G802039J85721J961632K871320L285372K990738J163423j815879l496244
41903A4948122j866426J448907K437683k58328l424152l483405q64475J365750
41895A0303676J680090R80837L75951J5446m13698j453332l398189m989075l996513
$$ plain form
41953 19795828 20584023 18928799 15786901 13052788 11104401 9599152 8961603 9517208
41945 9517208 10662458 12254698 15121713 18799487 20858721 20394088 20028389 21934698
41937 21934698 23881914 22455343 18680787 16615884 17062218 16834463 14565550 13085916
41929 13085916 14584721 16900178 16810018 14456805 12178838 10875186 9972808 9684872 10799304
41920 10799304 12759694 14065029 14450290 14946732 15717680 15399428 13077370 9850193 7802039
41911 7802039 7987760 9949392 12820712 16106084 19096822 20260245 18444366 14948122
41903 14948122 13081696 14530603 16968286 16709958 13285806 9802401 8937926 10303676
41895 10303676 11983766 12964603 13340554 13356000 12942302 11488970 8090781 3101706 -894807
41886h94807n10746K177093J935922J014786K283047M319904L801532J200183
41878A5326914j38974K53580j98019j619472r73134K176882L893692J709165j822246
41869A8608388l485374l521137l074363j356389J589561K635685k36701l884887
41861G274783l779793j16698L162423L975305L478778L001368K737746K774890
41853B2508802K795108J604986o93349j366138J378471M718157M198651l89111
41845C4755577m966291o242812m151328l13265K848024K559234j220749l978526
41837A9289864j595872L576329N590442L220168P55119O37920O80135m51940n55899
41828C1146266J177644J785238P4336l02467K837885N204923K231020l108349
$$ plain form
41886 -894807 -1405553 771540 2707462 3722248 6005295 10325199 14126731 15326914
41878 15326914 15187940 15441520 15243501 13624029 12650895 14827777 18721469 20430634 18608388
41869 18608388 15123014 11601877 8527514 7171125 8760686 11396371 11159670 7274783
41861 7274783 3494990 3378292 6540715 10516020 13994798 16996166 19733912 22508802
41853 22508802 25303910 26908896 26215547 24849409 26227880 30946037 35144688 34755577
41845 34755577 29789286 23546474 19395146 19081881 21929905 24489139 23268390 19289864
41837 19289864 17693992 21270321 26860763 30080931 30836050 31473970 32154105 31702165 31146266
41828 31146266 32323910 34109148 34183484 33881017 36718902 41923825 44154845 41046496
41820D1046496m276399q96288J387541J5215j407598O4626K048440J210218j458807
41811C7733444k500047r04461J248717J901311J016204J08564P89212L169511
41803D2562455N203041M456892R78664k460179l305120j526780J117913K911051
41795D9937937K919973J258752o10463q05863Q93894K532026K245772N34621m79838
41786E8426811J94803J130556K06322k593383m649604l580826m21557J261954
41778D9975076j69717k309937k142001j18765J086415P74760N39193P63028j56134
41769D8241918k420166l550948k047725j1054p9258j488228j540061J42454J376086
41760C8623018R80880J07989j72164l84845j059072j438321q19788J31361M86587
$$ plain form
41820 41046496 36770097 35873809 37261350 37276565 35868967 35933593 37982033 39192251 37733444
41811 37733444 35233397 34328936 35577653 37478964 38495168 38603732 39392944 42562455
41803 42562455 47765496 52222388 53201052 50740873 47435753 45908973 47026886 49937937
41795 49937937 52857910 54116662 53506199 52700336 53594230 56126256 58372028 58906649 58426811
41786 58426811 58621614 59752170 59958492 57365109 52715505 49134679 48713122 49975076
41778 49975076 49805359 47495422 45353421 45234656 46321071 47095831 47635024 48398052 48241918
41769 48241918 45821752 42270804 40223079 40212025 40132767 38644539 37104478 37246932 38623018
41760 38623018 39603898 39711887 39539723 39154878 38095806 36657485 35837697 35969058 36455645
41751C6455645M52823N62602L65820p10711j798365j495941k13188J52963o78389
41742C3093259m36854K235117M876301L945368m3117k593224j014419K061043
41734D2123474K345323n45973l122526k735581k28936J946255K416946J319383
41726D3518365n69030k471828l984029m969007m872297l004691m03154l0147l033418
41717B0180764n818587l871566J649486M631760K128833j885915k697237j159012
41709A3158526q24381j868212j986772j309952j679772j947454R38889N806714
41701A0287586P219336L154127j722311k848203j807802k266518l311820j402355
41693G302040K868609M785302K171018j954953l975792l579457k119874j55698
$$ plain form
41751 36455645 36908468 37471070 37836890 37126179 35327814 33831873 33618685 33771648 33093259
41742 33093259 32656405 34891522 39767823 43713191 43670074 41076850 40062431 42123474
41734 42123474 44468797 43922824 40800298 38064717 37835781 39782036 42198982 43518365
41726 43518365 42949335 40477507 36493478 31524471 26652174 23647483 23244329 23214182 20180764
41717 20180764 14362177 10490611 12140097 16771857 18900690 17014775 14317538 13158526
41709 13158526 12334145 10465933 8479161 7169209 5489437 3541983 4480872 10287586
41701 10287586 17506922 20661049 18938738 16090535 14282733 12016215 8704395 7302040
41693 7302040 10170649 14955951 17126969 15172016 11196224 7616767 5496893 5341195
41685E341195J754462K154866N40229j361394j774327j162829r03245q92139k16025
41676C480793O79091M74660o47486j026017j53080M24837m09745j330578l28904
41667A163571K175166L507607K238816J85502n8985J251222J510261j13526j091798
41658A0767836O43804K968730K053195k016897m910139l854227j080047m5520
41650D526735n98812k42381J390432K231859J429109M91041M90351N29437k21135
41641A0026636r38965o73243P8237M27140M97590O82400N88329r2978n44437Q3016
41631A0133725J123318J141868q9527j356149j536100o23920N27511R11649K20520
41622A0452895n23511J25386J881024K420706K66659k891865m116659k866946
$$ plain form
41685 5341195 7095657 9250523 9790752 8429358 6655031 5492202 4588957 3696818 3480793
41676 3480793 4159884 4634544 3987058 2961041 2807961 3232798 2823053 1492475 1163571
41667 1163571 3338737 6846344 9085160 9270662 9211677 10462899 11973160 11859634 10767836
41658 10767836 11411640 14380370 16433565 14416668 9506529 5652302 4572255 4526735
41650 4526735 3927923 3685542 5075974 7307833 8736942 9227983 9718334 10247771 10026636
41641 10026636 9087671 8414428 8492665 8919805 9417395 10099795 10688124 10595146 10050709 10133725
41631 10133725 11257043 12398911 12309384 10953235 9417135 8793215 9320726 10232375 10452895
41622 10452895 9929384 10054770 11935794 14356500 14623159 11731294 7614635 4747689
41614D747689j255631j018944j726171j892191n72898J937801L774936K509625
41606F504216j695035m578535k072375L856126O648915L296687j984596l719601
41598F255802j718366P53551K375774L660954L496909M28368l133253k684911
41590I434828J576062M038096J509315k140924j892645J194342K412113Q18923
41582A6950110k96348L43873k0667k899966n131596l173739J525383M121799K288497
41573A3707346j691626m265519m084677k147565j46617Q40843J025839J619310
41565D857334L152848M155636K700151m80774j926219M10692M014217M402505
41557B1286390N29282m067139n697290m380462k432316q68521Q99346K543002
$$ plain form
41614 4747689 3492058 2473114 746943 -1145248 -1718146 219655 3994591 6504216
41606 6504216 4809181 230646 -1841729 2014397 8663312 11959999 9975403 6255802
41598 6255802 4537436 5290987 7666761 11327715 14824624 15252992 12119739 9434828
41590 9434828 11010890 15048986 16558301 14417377 12524732 13719074 16131187 16950110
41582 16950110 16653762 16997635 16976968 14077002 8945406 5771667 7297050 11418849 13707346
41573 13707346 12015720 7750201 3665524 1517959 1371342 2212185 3238024 4857334
41565 4857334 8010182 12165818 14865969 14385195 12458976 12869668 16883885 21286390
41557 21286390 21815672 17748533 12051243 7670781 5238465 4369944 5269290 7812292
41549G812292K368747k9927k435183k489877m91507J431796K163670K338365K649377
41540A3317753K742386J880331j66953k874316m858500m353169r68080L041921
41532G761373M525092K764919M4969j305646j198105p51512m25926r9914P3831
41523A1389081r3263m65656j115215k194029k664279p69469K935301M760073K261411
41514A4043955j809062k672259k2467J739377m2548k816145k964972n81195J762684
41505F637368K809854K956689K335681R06938l93201o38896m54013q28119j157754
41496A2174547m11103M73276k66300j882730j516419J513938M085476L103124
41488A7273809n96848l382913k869135J19439K827282L066636J092333n40653
$$ plain form
41549 7812292 10181039 10151112 7715929 5226052 4734545 6166341 8330011 10668376 13317753
41540 13317753 16060139 17940470 17773517 14899201 10040701 5687532 4719452 7761373
41532 7761373 12286465 15051384 15096353 13790707 12592602 11841090 11415164 11315250 11389081
41523 11389081 11295818 10830162 9714947 7520918 4856639 4087170 7022471 11782544 14043955
41514 14043955 12234893 9562634 9540167 11279544 11236996 8420851 5455879 4874684 6637368
41505 6637368 9447222 12403911 14739592 15646530 15253329 14614433 14160420 13332301 12174547
41496 12174547 11763444 12236720 11970420 10087690 8571271 10085209 14170685 17273809
41488 17273809 16676961 13294048 10424913 10544352 13371634 16438270 17530603 16989950
41480A6989950K89947K461422K657647l14908l617826l750773p38772K254681
41472A6231368K753777J149403n41364r16326k38208k4208j492927l906145m847151
41463H168219k827226P59890L042331K728293R99794l33752n98928j72779M27458
41454A2193300R38586J249572J260605Q59973J32751l81575q764J196186K178322
41445A9618956J791937j32651k662227m400414m369990k872129j438515j176950
41437D358017j257953j19406J908594K803931J988084J226833J421636P11928
41429A3041664k332030n443095n130197j391973K516997M303875M172283K848462
41421A2585986Q85186l78554o4585J16735k000451m795186m295253l60867K480818
$$ plain form
41480 16989950 17279897 19741319 22398966 22084058 18466232 14715459 13976687 16231368
41472 16231368 18985145 20134548 19593184 18676858 18438650 18414442 16921515 13015370 8168219
41463 8168219 5340993 6100883 9143214 11871507 12871301 12537549 11938621 11765842 12193300
41454 12193300 13131886 14381458 15642063 16502036 16634787 16253212 16244448 17440634 19618956
41445 19618956 21410893 21278242 18616015 14215601 9845611 6973482 5534967 4358017
41437 4358017 3100064 2980658 4889252 7693183 9681267 10908100 12329736 13041664
41429 13041664 10709634 5266539 136342 -1255631 1261366 5565241 9737524 12585986
41421 12585986 13471172 13092618 13028033 13144768 11144317 6349131 2053878 1693011 4173829
41412D173829J615135l04874n18414m04076j553011j708658J090490L651175K116057
41403H157653j012370j84261M047330N468198J960873j512322j253864j42021
41395A5529216j599390l427798j899917J668099L031818J448638k51216n59217
41387A3940233l31980J63474J596924L267891L510389K283315R07413k89944j672673
41378B3375042k485492k071874j961710l574141m750981k436773J697643K858910
41370A0650624O15917l19201J824486K472514j524533n672268m156113J091311
41362D982737L242263O35300j823258r78096N29995j92584j556819q18913J312552
41353E333177K324101J970760J920565K593493K782262J806675J45928j672896
$$ plain form
41412 4173829 5788964 5484090 4965676 4561600 3008589 1299931 2390421 6041596 8157653
41403 8157653 7145283 6961022 11008352 16476550 18437423 16925101 15671237 15529216
41395 15529216 13929826 10502028 8602111 10270210 13302028 14750666 14499450 13940233
41387 13940233 13608253 13771727 15368651 18636542 22146931 24430246 25337659 25047715 23375042
41378 23375042 20889550 18817676 16855966 13281825 8530844 6094071 7791714 10650624
41370 10650624 11266541 10947340 12771826 15244340 13719807 8047539 3891426 4982737
41362 4982737 8225000 8860300 7037042 6058946 6588941 6396357 4839538 4020625 5333177
41353 5333177 7657278 9628038 11548603 14142096 16924358 18731033 18876961 17204065
41345A7204065l255121l761332k631869p61209L38121N39337J107134K588774
41337A1367900L846432L649108K332872J139054M16488n73916k048075k883006
41329A7246857k129154p07441l49245r11897l68284J816300L019607Q95267k726690
41320A5785320l794307j552587N40594p4740j629703j104733J324581K890703
41312A2385128K048175k60178k457469l671225l515804k065754j07116J477176
41304C832933K343143K155393L87924k267144l444314j808925O00885Q33800o71641
41295A962054p41457J506777L106724J766786n99746q21932Q54773J529214K61113
41286H824306o55193P37471L343463M795414M468288L433094K285358O00989j491103
$$ plain form
41345 17204065 13948944 10187612 7555743 6794534 7132655 7671992 8779126 11367900
41337 11367900 15214332 18863440 21196312 22335366 22751854 22177938 20129863 17246857
41329 17246857 15117703 14410262 14061017 13149120 12780836 14597136 17616743 18512010 15785320
41320 15785320 11991013 10438426 10979020 10904280 9274577 8169844 9494425 12385128
41312 12385128 14433303 14173125 11715656 8044431 4528627 2462873 2355757 3832933
41304 3832933 6176076 8331469 8719393 6452249 3007935 1199010 1799895 2633695 1962054
41295 1962054 1220597 2727374 5834098 7600884 7001138 6179206 7033979 8563193 8824306
41286 8824306 8169113 8906584 12250047 17045461 21513749 24946843 27232201 27833190 26342087
41277B6342087k676695k151004j039010j056221k156908k696357j936013j128842
41269A1501037j582000k631322k380749K6140L420968N457855M270978K34847
41261A8317754l556642l859889j102705P72244o42740l040297l027712j145485
41253B714528m57516j308182j071407R60331K200284J252328L07972J301094K650237
41244H549669K145211O42190K20214N72323J45064n15426L49773K253899K942783
41235A7305700K088188J614003K169141K017015O4652k379992l703270l775722
41227A5399715k806233m55644K709020M594237L823581J434200p27908k077577
41219B1893391k736350k347633q96709M30131P90207J156207K553739L671719
$$ plain form
41277 26342087 23665392 21514388 20475378 19419157 17262249 14565892 12629879 11501037
41269 11501037 9919037 7287715 4906966 4933106 8354074 13811929 18082907 18317754
41261 18317754 14761112 10901223 9798518 10570762 9928022 6887725 3860013 2714528
41253 2714528 2257012 948830 -122577 837754 3038038 4290366 4598338 5899432 8549669
41244 8549669 10694880 11337070 11557284 12129607 12274671 11759245 12109018 14362917 17305700
41235 17305700 19393888 21007891 23177032 25194047 25258699 22878707 19175437 15399715
41227 15399715 12593482 12137838 14846858 19441095 23264676 24698876 23970968 21893391
41219 21893391 19157041 16809408 15912699 16342830 17133037 18289244 20842983 24514702
41211B4514702K365141p17918k273106n73928K357442L658754L010272J857715
41203C4199074P14653q22206j968573q53843K677355N863474N775321K697365
41195D8282620j71804k31254K023188M033108M083609K799232J956659K323076
41187F5098434L115716L505873L790044M351969M212594K172606o44217j371873
41179H4231146N79872K002213J16521l236740m098229k094616n85520j255280
41171G5659367j988387j107058l91340j757942l580544l193276j372220j186490
41163F1082110l141254m505789l525710j644577r12078j303591j580647j338227
41155D3130237j160753j514547k167037k384228j635795m42188j32859j195273
$$ plain form
41211 24514702 26879843 26161925 23888819 23314891 25672333 29331087 32341359 34199074
41203 34199074 34913727 34091521 32122948 31269105 33946460 39809934 45585255 48282620
41195 48282620 48110816 47879562 49902750 53935858 58019467 60818699 62775358 65098434
41187 65098434 68214150 71720023 75510067 79862036 84074630 86247236 85603019 84231146
41179 84231146 84811018 86813231 86929752 83693012 79594783 77500167 76914647 75659367
41171 75659367 73670980 72563922 72172582 70414640 66834096 63640820 62268600 61082110
41163 61082110 57940856 53435067 49909357 48264780 47352702 46049111 44468464 43130237
41155 43130237 41969484 40454937 38287900 35903672 34267877 33825689 33692830 32497557
41147C2497557k478769k780283k356636j855162q82853P97098J726970N19657
41139B5187579j521693j858002m38943M15460k53131r28299m35504O13077J601257
41130B2381801K647960K974744J140424k081076l504148j587515J306174K012266
41122B5290630J94308k183975l251748k187910L32290J861682M34480k295878
41114A8193879k746415q31189k81616k346503l323080q08153J803802P87849j649813
41105H798761j316960O58794L8338k779539l236236m24228J477750L44239p21672
41096B839247R69107L506726M042993K843452J415132j30793j539245j167274
41088A2779345J264857L099553K243790J05722j110972j813188l256237m385974
$$ plain form
41147 32497557 30018788 27238505 24881869 23026707 22143854 22940952 24667922 25187579
41139 25187579 23665886 21807884 21368941 21784401 21531270 20602971 20167467 20780544 22381801
41130 22381801 25029761 28004505 29144929 27063853 23559705 21972190 23278364 25290630
41122 25290630 25484938 23300963 20049215 17861305 18193595 20055277 20489757 18193879
41114 18193879 15447464 14616275 14334659 11988156 8665076 7856923 9660725 10448574 8798761
41105 8798761 7481801 8140595 8178933 5399394 2163158 1738930 3216680 3560919 2839247
41096 2839247 3808354 7315080 11358073 14201525 15616657 15485864 13946619 12779345
41088 12779345 14044202 17143755 19387545 19493267 18382295 16569107 13312870 8926896
41080H926896l347626q97540M95140L09778K67957J243292K078473J687676O79101
41071A1443147L52582R40630J320636M43593r77483q86419J124656K183633m61929
41062A5483046m878993o091844k626004J617409K915947J888834O27255p57540
41054H178110k206267j706202J283118L087187N80268l282625l159786P12218
41046C486021L018240J400915r19121j075316k91610j72594L67473K047712K649742
41037A0511462M59754k294472k432143l71059J158310J437915J802453K308637
41029A2580857J495566n93646j870390j180336K94316J198055J662639K002544
41021A5589605J519279j32538j693468j898025j464925j888185k737642j997325
$$ plain form
41080 8926896 5579270 4681730 5176870 5486648 5754605 6997897 9076370 10764046 11443147
41071 11443147 11795729 12736359 14056995 14500588 13523105 12636686 13761342 15944975 15483046
41062 15483046 10604053 4512209 1886205 3503614 6419561 8308395 8935650 8178110
41054 8178110 5971843 4265641 5548759 8635946 9216214 5933589 2773803 3486021
41046 3486021 6504261 7905176 6986055 5910739 5619129 5446535 5814008 7861720 10511462
41037 10511462 10971216 8676744 6244601 5873542 7031852 8469767 10272220 12580857
41029 12580857 14076423 13482777 11612387 10432051 10726367 11924422 13587061 15589605
41021 15589605 17108884 16976346 15282878 13384853 11919928 10031743 7294101 5296776
41013E296776P93595L519623M224071L273215J906605L17687j352173j718296
41005A6261103q7541J398216K43636k312609k701825m94671R18344j71175j204097
40996A1849381R9032K043180K236698J501880J508106J202123q25512k644292
40988A6970596j732317K13173l58231k680554k587120O41583L128987K643568
40980A6239685J393066J416758J516497N12186l33597j77754m11740j534740j559052
40971A7061309J97799J026881q10758k671798j471641J566299L163802K662098
40963B0723991J378192m15682k510854k852079l14238K244816J476745j276657
40955A8454234k195819j180745j423659l254607l079555Q12671N352590O851023
$$ plain form
41013 5296776 6090371 9609994 13834065 17107280 19013885 19331572 17979399 16261103
41005 16261103 16173562 17571778 17815414 15502805 12800980 12306309 13224653 13053478 11849381
40996 11849381 11948413 13991593 16228291 17730171 19238277 20440400 19614888 16970596
40988 16970596 15238279 15451452 15093221 12412667 9825547 10467130 13596117 16239685
40980 16239685 17632751 19049509 20566006 21078192 20744595 20566841 20155101 18620361 17061309
40971 17061309 17259108 18285989 17475231 14803433 13331792 14898091 18061893 20723991
40963 20723991 22102183 21686501 19175647 16323568 16009330 18254146 19730891 18454234
40955 18454234 16258415 15077670 13654011 10399404 7319849 8132520 13485110 20336133
40947B0336133M960848J438273k156894m392651m229303k602388j635362j480261
40939A0238395j76191K712504M913239M883101L897705L510192L361105K864107
40931C6204157K644091K668414J265786k024511m653103m299197k237654j201600
40923B8366383j339313q54504L35334M32021q86192j556498k91861J236813N38370
40914B5980553k337428m690156m240547j547720R31520J702465J323832O94497
40906A7817016l17597j605402j631962N76007L109217L178304J049469n50287
40898B1624765q10160j612524l517610m293888k683032m52989R84723K768721
40890A2008006N115881N012882Q32656l388817k569096J978752M049732R53327
$$ plain form
40947 20336133 25296981 26735254 24578360 20185709 15956406 13354018 11718656 10238395
40939 10238395 10062204 12774708 17687947 22571048 26468753 29978945 33340050 36204157
40931 36204157 38848248 41516662 42782448 40757937 36104834 31805637 29567983 28366383
40923 28366383 27027070 26172566 26507900 26939921 26053729 24497231 24205370 25442183 25980553
40914 25980553 23643125 18952969 14712422 13164702 14096222 15798687 17122519 17817016
40906 17817016 17499419 15894017 14262055 14838062 17947279 21125583 22175052 21624765
40898 21624765 20814605 19202081 15684471 11390583 8707551 8254562 9239285 12008006
40890 12008006 17123887 22136769 22969425 19580608 17011512 18990264 23039996 23993323
40882B3993323l694878n653571m570298k142482M76534K017465J016567j704858
40874I737802k845364p72054J974117K033529m69454k636783k518184n25207J825434
40865E803836L050132K378877O80544P4368J437007K998406K674287J103228P68811
40856B0969496K318959L451399K007451j034158k698314j749655k09335p31347
40848B2324496l175222m787389l710400j078420R36714J915492K775463L467648
40840A8668382K901823J081957l72247k98606O25655J077940P16265J24300j40818
40831B4384651j4462J28370j33941o16057n59768K27884Q99759R34974J084796
40822B6336206J916958K533684K204245J958338K508365K069948p51163l125310
$$ plain form
40882 23993323 20298445 14644874 10074576 7932094 8408628 10426093 11442660 9737802
40874 9737802 6892438 6120384 8094501 10128030 9658576 7021793 4503609 3978402 5803836
40865 5803836 8853968 11232845 11913389 11987757 13424764 16423170 19097457 20200685 20969496
40856 20969496 23288455 26739854 28747305 27713147 25014833 23265178 23055843 22324496
40848 22324496 19149274 14361885 10651485 9573065 10509779 12425271 15200734 18668382
40840 18668382 21570205 22652162 22279915 21981309 22606964 23684904 24401169 24525469 24384651
40831 24384651 24370189 24498559 24364618 23748561 23188793 23416677 24316436 25251410 26336206
40822 26336206 28253164 30786848 32991093 34949431 37457796 39527744 38776581 35651271
40814C5651271j124974L627303N171462J939457o74165J481803N429133O639375
40806E8140665N918999O103572N608529J179090m992273p130491m392853j758159
40798E8677079k064226k789282j999430j882095l741084m366284j158129K768796
40790D3445345K886846K29129m18224J995027L667023K365395P41736J762279
40782E6674556M000983L912598J115540j201511q41004P13810R97514L26716J063474
40773F6762676L564385N034849L337314K41325q52538O09731K269494K806068
40765H3773304L434665N000217N977467M743503K231700P54265J125463K294141
40757A09334725L114896L183318K382228R28463j07298O21590L134492N452274
$$ plain form
40814 35651271 34526297 38153600 43325062 45264519 44590354 46072157 51501290 58140665
40806 58140665 64059664 70163236 75771765 76950855 71958582 64828091 60435238 58677079
40798 58677079 56612853 53823571 51824141 49942046 46200962 41834678 40676549 43445345
40790 43445345 46332191 46561320 46143096 48138123 51805146 54170541 54912277 56674556
40782 56674556 60675539 64588137 65703677 64502166 63661162 64374972 65372486 65699202 66762676
40773 66762676 70327061 75361910 78699224 78940549 78088011 78697742 80967236 83773304
40765 83773304 87207969 92208186 98185653 102929156 105160856 105915121 107040584 109334725
40757 109334725 112449621 115632939 118015167 118943630 118836332 119457922 122592414 128044688
40749A28044688N125249J896875j344331j272119J841336M115618L024927O38541
40741A42070784r071J14337j859749m698491l862418R91162M078324J364321l712802
40732A34476397n589810m170740l048360k860528j332177J331542K080589J81739
40724A21068652j470873r64573K04338K40831m94547j260801k466039m106979
40716A10750009m830958l813055k003998p68328o94671j885098l653122m094508
40708H9006271k200993j40990o48862k414382j729235J040243J176216k732384
40700H1355884n656446l583141K08804M63749j876508j883915J055540K638266
40692G2722233Q30416j433752j443979l59470k93250j076706j557186j675717
$$ plain form
40749 128044688 133169937 135066812 133722481 132450362 134291698 138407316 141432243 142070784
40741 142070784 142061713 142176050 140316301 135617810 131755392 132746554 136824878 138189199 134476397
40732 134476397 128886587 124715847 121667487 118806959 117474782 118806324 120886913 121068652
40724 121068652 119597779 118633206 118837544 119078375 118583828 117323027 114856988 110750009
40716 110750009 105919051 102105996 100101998 99333670 98638999 96753901 93100779 89006271
40708 89006271 86805278 86664288 86015426 83601044 81871809 82912052 84088268 81355884
40700 81355884 75699438 72116297 72325101 72788850 70912342 69028427 70083967 72722233
40692 72722233 73552649 72118897 70674918 70315448 70022198 68945492 67388306 65712589
40684F5712589j756958j501343p69058L6549Q61771J757394J675266m61452l314593
40675F2240165m120846k582567j258378j380719j096695Q32341K410138J540729
40667E6584168n18469j248147o66693n59861j285427j890721k355762l081224
40659D4977864k926400o26335K133403K070371q91835l040174k043234l0917R6785
40650C9719528r13352m08793J430499J560670j265063m384604m675162k263759
40642B8799964M58785K086862K743193K327012N49799j197992m29347K804017
40634C8142293M762966K385700k463224n338637n004678m148310m381051l762853
40626B0192206o85848K498130K270573r90870l294879k052645J190589L098480
$$ plain form
40684 65712589 63955631 62454288 61685230 61721779 62583550 64340944 66016210 65554758 62240165
40675 62240165 58119319 55536752 54278374 52897655 51800960 52633301 55043439 56584168
40667 56584168 56065699 54817552 54150859 53590998 52305571 50414850 48059088 44977864
40659 44977864 42051464 41425129 43558532 45628903 44737068 41696894 39653660 39622743 39719528
40650 39719528 38806176 38397383 39827882 41388552 40123489 35738885 31063723 28799964
40642 28799964 29258749 31345611 34088804 36415816 36965615 35767623 35338276 38142293
40634 38142293 42905259 45290959 42827735 37489098 32484420 28336110 23955059 20192206
40626 20192206 19506358 22004488 24275061 23284191 19989312 17936667 19127256 22225736
40618B2225736K073111p56073k889455k567629l29132J475957J236370k20764
40610B0248121j038341o62458J89137J035013J740907J796088J023321M53940
40602B4785728Q25183Q33224r86270l073391k287116J142788L029887Q69563k434130
40593B2705466k389312J286652M708108M551999J032426k937512m058636j083188
40585B3816003L527719N278870K465515j622694k803498j044948N45757M69865
40577C0632589j19916l79861p09703p51878M71483J881444P95723k865090n593440
40568B3361351m950236k571487p62347J138325M299249O636811N193670J223787
40560C3569123q55060M21411J945564J170109m51054o41817p2689o36345j891813
$$ plain form
40618 22225736 24298847 23542774 20653319 18085690 17756558 19232515 20468885 20248121
40610 20248121 19209780 18547322 18736459 19771472 21512379 23308467 24331788 24785728
40602 24785728 25610911 26444135 25457865 22384474 20097358 21240146 24270033 25139596 22705466
40593 22705466 20316154 21602806 26310914 30862913 31895339 28957827 24899191 23816003
40585 23816003 27343722 32622592 35088107 33465413 30661915 29616967 30162724 30632589
40577 30632589 30512673 30132812 29423109 28671231 29142714 31024158 31819881 28954791 23361351
40568 23361351 18411115 15839628 15077281 16215606 20514855 27151666 32345336 33569123
40560 33569123 32714063 33135474 35081038 36251147 35800093 35158276 35085587 34449242 32557429
40551C2557429j908148o81999n5921m24738o2882J681622K774371J487133n55599
40542C4811268l06601K325729M151505L095823R81020P27832K296882L344191
40534E1427649L040911K689675K479614N44861l426351o291410n526449l188406
40526D1750094k757916l488240j825218J984921L309676K82319k881293k175990
40518C4198353M34446J021830K11887J097965K750691J269759l085966n213218
40510C2685747k650921R76690J810404P82858L34192M2465j093330j214191J436168
40501C3110082M210376L049546j273045l989288l001095q34956Q5175K94232Q06533
40492C2457560J314990J864057L121495L922094J828802k465171m695037k928072
$$ plain form
40551 32557429 30649281 29967282 29911361 29486623 29423741 31105363 33879734 35366867 34811268
40542 34811268 34504667 36830396 40981901 44077724 45058744 45786576 48083458 51427649
40534 51427649 54468560 57158235 59637849 60182710 56756359 50464949 44938500 41750094
40526 41750094 38992178 35503938 33678720 35663641 38973317 39255636 36374343 34198353
40518 34198353 34632799 35654629 35866516 36964481 39715172 40984931 37898965 32685747
40510 32685747 30034826 31011516 32821920 33604778 33938970 33981435 32888105 31673914 33110082
40501 33110082 37320458 40370004 39096959 35107671 32106576 31271620 31356795 31651027 32457560
40492 32457560 33772550 35636607 38758102 42680196 44508998 42043827 37348790 34420718
40484C4420718n81383j065197k748219k579968j598920k345286l054763N8739
40476B0505721N417087O709105J914925l354624l588196j90189K061104J687537
40468C1162470L38736j169390k819950l194422j079602J684665K352475J536118
40460B8811100J900850L101566J946096j928931m465638k859464L88285J298173
40452B8192037j85778j219540p71713m19149j071667j531835o43360R12616J620454
40443B4882065J019144J25439K53018J428613K097367J069218l88251J16961K299732
40434C2903306K810313N5293k637702j198322L075442M659760R35474m665467
40426C5938097p183692n370248j575472J403516K178688J170017L15705J145159
$$ plain form
40484 34420718 33839335 32774138 30025919 27445951 25847031 23501745 20446982 20505721
40476 20505721 25922808 32631913 34546838 31192214 27604018 27413829 29474933 31162470
40468 31162470 31501206 30331816 27511866 24317444 23237842 24922507 27274982 28811100
40460 28811100 30711950 33813516 35759612 33830681 29365043 26505579 26893864 28192037
40452 28192037 28006259 26786719 26015006 25595857 24524190 22992355 22348995 23261611 24882065
40443 24882065 25901209 26026648 26279666 27708279 29805646 30874864 30486613 30603574 32903306
40434 32903306 35713619 35768912 33131210 31932888 35008330 39668090 40603564 35938097
40426 35938097 28754405 23384157 21808685 23212201 25390889 26560906 26876611 28021770
40418B8021770K558461K154733J53566n21795Q57243R50148k182317m586386j369770
40409B6035653N340890Q095221M043245j297173j920327Q47630J535175r78314
40401D1702000k310101L95279M104446M201471P95156j833058j377389l59929
40393D5317875j822770m281507l496893J183436N072802L850533j085822m778062
40385C9959592m711928k424533j07150J601205K382957J498974p10095k453840
40377C5035182k741871k605346l061696l186817j527739J384811L255537K624360
$$ plain form
40418 28021770 30580231 32734964 32888530 32366735 33223978 34174126 31991809 27405423 26035653
40409 26035653 31376543 39471764 43515009 42217836 40297509 41145139 42680314 41702000
40401 41702000 39391899 39787178 43891624 48093095 48888251 47055193 45677804 45317875
40393 45317875 43495105 39213598 35716705 36900141 41972943 45823476 44737654 39959592
40385 39959592 35247664 32823131 32715981 34317186 36700143 38199117 37489022 35035182
40377 35035182 32293311 29687965 26626269 23439452 21911713 23296524 26552061 29176421
$$ [...]
##END NTUPLES=NMR SPECTRUM
##END=
