##TITLE=31Pdec_DE-61_NaOH
 D2O, 64 sc
 11.7.2024
##JCAMPDX= 6.0         $$ Bruker NMR JCAMP-DX V2.0
##DATA TYPE= NMR SPECTRUM
##DATA CLASS= NTUPLES
##ORIGIN= UXNMR, Bruker Analytische Messtechnik GmbH
##OWNER= root
$$ XWIN-NMR		Version 3.5
$$ Thu Jul 11 13:56:34 2024 Russian Standard Time (UT+4h)  she@DPX200
##.OBSERVE FREQUENCY= 81.013821
##.OBSERVE NUCLEUS= ^31P
##.ACQUISITION MODE= SIMULTANEOUS
##.ACQUISITION SCHEME= undefined
##.AVERAGES= 64
##.DIGITISER RES= 17
##SPECTROMETER/DATA SYSTEM= spect
##.PULSE SEQUENCE= zgpg30
##.SOLVENT NAME= CDCl3
##.SHIFT REFERENCE= (INTERNAL, CDCl3, 0, 198.062)
##AUDIT TRAIL= $$ (NUMBER, WHEN, WHO, WHERE, WHAT)
$$ ##TITLE= Audit trail, XWIN-NMR		Version 3.5
$$ ##JCAMPDX= 5.01
$$ ##ORIGIN= Bruker BioSpin GmbH
$$ ##OWNER= she
$$ F:/spectra/data/she/nmr/P31/2/pdata/1/auditp.txt
$$ ##AUDIT TRAIL=  $$ (NUMBER, WHEN, WHO, WHERE, WHAT)
(   1,<2024-07-11 13:55:29.03 +0400>,<she>,<DPX200>,
      <created by zg, POWCHK disabled, PULCHK disabled
       configuration hash MD5:
       00 E9 B6 7A A2 85 ED C7 34 08 36 98 17 FE 4E 26
       data hash MD5: 32K
       50 3C E1 05 25 D4 D6 27 CE 03 76 B0 6F 99 0B CB>)
(   2,<2024-07-11 13:55:31.53 +0400>,<she>,<DPX200>,
      <Start of raw data processing
       efp BC_mod = 2 LB = 1.5 FT_mod = 6 PKNL = 1 PHC0 = 2686.388 PHC1 = -102.5128 SI = 64K 
       data hash MD5: 64K
       20 95 C3 0B 1C ED BB BE 40 24 4C 99 D1 DA E4 54>)
(   3,<2024-07-11 13:55:59.45 +0400>,<she>,<DPX200>,
      <pk PHC0 = -81.84696 PHC1 = 204.3999 
       data hash MD5: 64K
       93 CE E6 96 29 FB EA 9D A0 80 0F 95 FD 7D BE C4>)
(   4,<2024-07-11 13:56:07.60 +0400>,<she>,<DPX200>,
      <abs ABSG = 5 
       data hash MD5: 64K
       72 48 62 00 3F A8 56 C7 81 68 F8 51 CE CB 30 B5>)
$$ ##END=
$$ 
$$ hash MD5
$$ 5D C3 34 A0 ED 70 1D E8 53 4E 94 F3 86 44 8B 45
##$RELAX= 
##$RELAX= 
##$RELAX= 
##$RELAX= 
##$RELAX= 
##$RELAX= 
##$RELAX= 
##$RELAX= 
$$ Bruker specific parameters
$$ --------------------------
##$DU= <F:/spectra>
##$EXPNO= 2
##$NAME= <P31>
##$PROCNO= 1
##$TYPE= <nmr>
##$USER= <she>
##$AMP= (0..31)
100 100 100 100 100 100 100 100 100 100 100 100 100 100 100 100 100 100 
100 100 100 100 100 100 100 100 100 100 100 100 100 100 
##$AQSEQ= 0
##$AQ_mod= 1
##$AUNM= <au_zg>
##$AUTOPOS= <>
##$BF1= 81.014009
##$BF2= 200.13
##$BF3= 200.13
##$BF4= 200.13
##$BF5= 200.13
##$BF6= 200.13
##$BF7= 200.13
##$BF8= 200.13
##$BYTORDA= 1
##$CFDGTYP= 0
##$CFRGTYP= 5
##$CHEMSTR= <none>
##$CNST= (0..31)
1 1 145 1 1 1 1 1 1 1 1 1 1 1 1 1 1 1 1 1 1 1 1 1 1 1 1 1 1 1 1 1 
##$CPDPRG= <waltz16>
##$CPDPRG1= <>
##$CPDPRG2= <waltz16>
##$CPDPRG3= <>
##$CPDPRG4= <mlev>
##$CPDPRG5= <mlev>
##$CPDPRG6= <mlev>
##$CPDPRG7= <mlev>
##$CPDPRG8= <mlev>
##$CPDPRGB= <>
##$CPDPRGT= <>
##$D= (0..31)
0 1 0 0 0 0 0 0 0 0.06 0 0.03 2e-05 3e-06 0 0 0.0002 0 0 0 0 0 0 0 0 0 
0 0 0 0 0 0 
##$DATE= 1720691728
##$DBL= (0..7)
120 120 120 11 120 120 24 19 
##$DBP= (0..7)
150 150 150 150 150 150 150 150 
##$DBP07= 0
##$DBPNAM0= <>
##$DBPNAM1= <>
$$ [...]
##$SUBNAM3= <"">
##$SUBNAM4= <"">
##$SUBNAM5= <"">
##$SUBNAM6= <"">
##$SUBNAM7= <"">
##$SUBNAM8= <"">
##$SUBNAM9= <"">
##$SW= 400.765351723535
##$SWIBOX= (0..15)
0 1 3 0 0 0 0 0 0 0 0 0 0 0 0 0 
##$SW_h= 32467.5324675325
##$TD= 32768
##$TD0= 1
##$TE= 0
##$TE2= 300
##$TE3= 300
##$TEG= 300
##$TL= (0..7)
0 120 53 12 22 120 120 120 
##$TP= (0..7)
150 150 150 150 150 150 150 150 
##$TP07= 0
##$TPNAME0= <>
##$TPNAME1= <>
##$TPNAME2= <>
##$TPNAME3= <>
##$TPNAME4= <>
##$TPNAME5= <>
##$TPNAME6= <>
##$TPNAME7= <>
##$TPOAL= (0..7)
0.5 0.5 0.5 0.5 0.5 0.5 0.5 0.5 
##$TPOFFS= (0..7)
0 0 0 0 0 0 0 0 
##$TUNHIN= 0
##$TUNHOUT= 0
##$TUNXOUT= 0
##$USERA1= <user>
##$USERA2= <user>
##$USERA3= <user>
##$USERA4= <user>
##$USERA5= <user>
##$V9= 5
##$VALIST= <valist>
##$VCLIST= <CCCCCCCCCCCCCCC>
##$VD= 0
##$VDLIST= <DDDDDDDDDDDDDDD>
##$VPLIST= <PPPPPPPPPPPPPPP>
##$VTLIST= <TTTTTTTTTTTTTTT>
##$WBST= 1024
##$WBSW= 4
##$XGAIN= (0..3)
0 0 0 0 
##$XL= 0
##$YL= 0
##$YMAX_a= 3553
##$YMIN_a= -13786
##$ZGOPTNS= <>
##$ZL1= 120
##$ZL2= 120
##$ZL3= 120
##$ZL4= 120
##$ABSF1= 198.0616
##$ABSF2= -202.7028
##$ABSG= 5
##$ABSL= 3
##$ALPHA= 0
##$AQORDER= 0
##$ASSFAC= 0
##$ASSFACI= 0
##$ASSFACX= 0
##$ASSWID= 0
##$AUNMP= <proc_1d>
##$AZFE= 0.1
##$AZFW= 0.5
##$BCFW= 0
##$BC_mod= 2
##$BYTORDP= 0
##$COROFFS= 0
##$CY= -3
##$DATMOD= 1
##$DC= 0
##$DFILT= <>
##$DTYPP= 0
##$F1P= 0
##$F2P= 0
##$FCOR= 1
##$FTSIZE= 65536
##$FT_mod= 6
##$GAMMA= 0
##$GB= 0
##$INTBC= 1
##$INTSCL= 9.790993e-09
##$ISEN= 30
##$LB= 1.5
##$LEV0= 0
##$LPBIN= 0
##$MAXI= 10000
##$MC2= 0
##$MEAN= 0
##$ME_mod= 0
##$MI= 50
##$NCOEF= 0
##$NC_proc= -10
##$NLEV= 6
##$NOISF1= 182.463
##$NOISF2= 159.3651
##$NSP= 0
##$NTH_PI= 0
##$NZP= 0
##$OFFSET= 198.0616
##$PC= 4
##$PHC0= 2604.541
##$PHC1= 101.8871
##$PH_mod= 1
##$PKNL= yes
##$PPARMOD= 0
##$PSCAL= 0
##$PSIGN= 0
##$REVERSE= no
##$SF= 81.0140089999434
##$SI= 65536
##$SIGF1= 159.3651
##$SIGF2= -187.1042
##$SINO= 113.3802
##$SIOLD= 16384
##$SREGLST= <1H.CDCl3>
##$SSB= 0
##$STSI= 65536
##$STSR= 0
##$SW_p= 32467.5324675325
##$SYMM= 0
##$S_DEV= 0
##$TDeff= 32768
##$TDoff= 0
##$TI= <>
##$TILT= no
##$TM1= 0
##$TM2= 0
##$TOPLEV= 0
##$USERP1= <user>
##$USERP2= <user>
##$USERP3= <user>
##$USERP4= <user>
##$USERP5= <user>
##$WDW= 1
##$XDIM= 65536
##$YMAX_p= 273950603
##$YMIN_p= -251513185
$$ End of Bruker specific parameters
$$ ---------------------------------
##NTUPLES= NMR SPECTRUM
##VAR_NAME=  FREQUENCY,     SPECTRUM/REAL,   SPECTRUM/IMAG
##SYMBOL=    X,             R,               I
##VAR_TYPE=  INDEPENDENT,   DEPENDENT,       DEPENDENT
##VAR_FORM=  AFFN,          ASDF,            ASDF
##VAR_DIM=   65536,         65536,           65536
##UNITS=     HZ,            ARBITRARY UNITS, ARBITRARY UNITS
##FACTOR=    0.49542278885378, 1,            1
##FIRST=     16045.7642231865, 0,            0
##LAST=      -16421.768244346, 0,            0
##MIN=       -16421.768244346, -251513185,   0
##MAX=       16045.7642231865, 273950603,    0
$$ Real data points
##PAGE= N=1
##DATA TABLE= (X++(R..R)), XYDATA
$$ [...]
$$ plain form
41038 32200886 15877243 1591065 -591607 1709880 338791 -1929489 604772 7299014
41030 7299014 14269367 19695511 22401033 21076079 17752593 16318760 15486597 9846258
41022 9846258 261430 -4423670 93989 6601727 6646881 1126713 -4556418 -9549879
41014 -9549879 -15751049 -22069690 -26017105 -26555054 -21374202 -7593479 10247277 20576958
41006 20576958 19421529 16515690 19009385 18077833 3053835 -18468836 -28553451 -22800534
40998 -22800534 -12330128 -4503029 3230573 10245517 9312992 353100 -5626149 -1835896
40990 -1835896 6141355 12729754 21413814 33865452 39983520 28897653 4635913 -17233121
40982 -17233121 -25045167 -17790723 -1645848 13718142 19463701 15019757 9484541 11764447
$$ packed form
41038C2200886j6323643j4286178k182672K301487j371089k268280K534261O694242
41030G299014O970353N426144K705522j324954l323486j433833q32163n640339
41022I846258r584828m685100M517659O507738M5154n520168n683131m993461
41014i549879o201170o318641l947415n37949N180852J3780723J7840756J0329681
41006B0576958j155429k905839K493695r31552j5023998k1522671j0084615N752917
40998b2800534J0470406P827099P733602P014944r32525q959892n979249L790253
40990a835896P977251O588399Q684060J2451638O118068j1085867k4261740k1869034
40982a7233121p812046P254444J6144875J5363990N745559m443944n535216K279906
$$ plain form
40974 11764447 22005744 34835532 45335881 48272001 38638085 19397898 3021757
40967 3021757 -1391516 2515914 7843351 15897527 28815928 37607677 31044518 14024167
40959 14024167 3359029 4628270 6420227 555708 -5170260 -1092621 8369025 12042307
40951 12042307 7950890 2409739 -1885171 -6879262 -10362356 -5893905 6933406 18937342
40943 18937342 20757560 12212297 971332 -5196104 -4337379 -1398044 -3838510 -13681172
40935 -13681172 -24179395 -27355480 -24151259 -22675184 -26135751 -28377826 -24414630 -19919145
40927 -19919145 -23879041 -34062064 -37434556 -27104649 -12843309 -9639271 -18575123 -25306125
40919 -25306125 -18271763 -2740812 7225832 7284203 7099265 16173093 31800885 44564322
$$ packed form
40974A1764447J0241297J2829788J0500349K936120r633916j9240187j6376141
40967C021757m413273L907430N327437Q054176J2918401Q791749o563159j7020351
40959A4024167j0665138J269241J791957n864519n725968M077639R461646L673282
40951A2042307m091417n541151m294910m994091l483094M468451J2827311J2003936
40943A8937342J820218q545263j1240965o167436Q58725K939335k440466r842662
40935a3681172j0498223l176085L204221J476075l460567k242075L963196M495485
40927a9919145l959896j0183023l372492J0329907J4261340L204038q935852o731002
40919b5306125P034362J5530951R966644N8371j84938R073828J5627792J2763437
$$ plain form
40911 44564322 50801740 53583192 53944392 48962490 39271474 30798854 25682392 18561057
40903 18561057 7460627 1528819 8736490 20343894 20036326 8563970 5656671 22061582
40895 22061582 42165910 44786801 32137183 24260141 29023161 33136314 24200496 7263989
40887 7263989 -6222750 -14106875 -19597401 -20405256 -12434242 438586 10625303 18688222
40879 18688222 30984392 45529240 50220269 38760076 21154094 13198025 19249089
40872 19249089 29463564 31705015 22938405 10446434 4366760 8162263 15157816 15803212
40864 15803212 8970714 3483802 6825278 14961860 16285817 4501532 -14986905 -31151585
40856 -31151585 -37806445 -37970272 -39158759 -44878943 -51008254 -51109996 -44393846 -36165184
$$ packed form
40911D4564322O237418K781452L61200m981902r691016q472620n116462p121335
40903A8561057j1100430n931808P207671J1607404l07568j1472356k907299J6404911
40895B2061582K0104328K620891j2649618p877042M763020M113153q935818j6936507
40887G263989j3486739p884125n490526q07855P971014J2872828J0186717Q062919
40879A8688222J2296170J4544848M691029j1460193j7605982p956069O051064
40872A9249089J0214475K241451q766610j2491971o079674L795503O995553O45396
40864A5803212o832498n486912L341476Q136582J323957j1784285j9488437j6164680
40856c1151585o654860j63827j188487n720184o129311j01742O716150Q228662
$$ plain form
40848 -36165184 -30673541 -26995747 -23086438 -19802440 -17813123 -13987198 -5724187 2777463
40840 2777463 4117054 -1887282 -6185106 -1114444 10075953 16900635 13285033 3438263
40832 3438263 -3498099 -3461528 -1502746 -4824990 -11753997 -10937011 5166134 28480870
40824 28480870 42425346 40292141 30627883 23837362 20849879 18207257 16561162 17062506
40816 17062506 14465501 2804665 -13435813 -21825220 -16341728 -3008587 9366875
40809 9366875 17672544 22283045 23089404 21481411 21666616 25785558 30120509 29090758
40801 29090758 21301881 10161181 867637 -2205579 1656761 7861795 10721185 10132822
40793 10132822 10270215 11395529 9227928 4702219 6993041 21148090 37996284 43092398
$$ packed form
40848c6165184N491643L677794L909309L283998J989317L825925Q263011Q501650
40840B777463J339591o004336m297824N070662J1190397O824682l615602r846770
40832C438263o936362L6571J958782l322244o929007Q16986J6103145K3314736
40824B8480870J3944476k133205r664258o790521k987483k642622j646095N01344
40816A7062506k597005j1660836j6240478q389407N483492J3333141J2375462
40809I366875Q305669M610501Q06359j607993J85205M118942M334951j029751
40801B9090758p788877j1140700r293544l073216L862340O205034K859390n88363
40793A0132822J37393J125314k167601m525709K290822J4155049J6848194N096114
$$ plain form
40785 43092398 32534532 14015715 -4523113 -20427785 -32648115 -39635864 -40904787
40778 -40904787 -36245495 -25213173 -11725065 -4971896 -8595323 -12866567 -7166279 2466021
40770 2466021 74846 -16161288 -29873951 -29582541 -22319105 -17457235 -9777657 9659254
40762 9659254 34069691 46013802 39440587 25720816 18059014 18732491 22137455 22458142
40754 22458142 16246739 3109458 -13492421 -28407930 -37873594 -39257188 -31333460 -18791011
40746 -18791011 -12427401 -18237232 -28449833 -30222188 -21789209 -12753524 -9270883 -7420912
40738 -7420912 -2559957 2858103 4228163 1610316 -1926266 -4423718 -4804247 -2342195
40730 -2342195 1535774 4321812 6369414 10084786 15206384 19882805 26047650 36673644
$$ packed form
40785D3092398j0557866j8518817j8538828j5904672j2220330o987749j268923
40778d0904787M659292J1032322J3488108O753169l623427m271244N700288R632300
40770B466021k391175j6236134j3712663K91410P263436M861870P679578J9436911
40762I659254K4410437J1944111o573215j3719771p661802O73477L404964L20687
40754B2458142o211403j3137281j6601879j4915509r465664j383594P923728J2542449
40746a8791011O363610n809831j0212601j772355Q432979R035685L482641J849971
40738g420912M860955N418060J370060k617847l536582k497452l80529K462052
40730b342195L877969K786038K047602L715372N121598M676421O164845J0625994
$$ plain form
40722 36673644 46886435 46170446 32179098 14166329 -640902 -14624566 -28640388
40715 -28640388 -34338796 -27218275 -18111533 -18696496 -21635987 -10329679 13336511 26581450
40707 26581450 14158743 -13484809 -35302458 -42195921 -38559155 -30709160 -21831437 -12993400
40699 -12993400 -2859545 9584752 18620232 15192256 2043988 -2729708 13666009
40692 13666009 40139158 54003971 48359526 36442640 30765248 30576088 31798823 36455686
40684 36455686 45014068 48402078 37582511 17810975 5214766 9307637 23840979
40677 23840979 34536649 31680821 15528817 -6099363 -23815327 -32384542 -31987740 -24302461
40669 -24302461 -9625861 9888671 26247579 29611118 17891239 120452 -11436294
$$ packed form
40722C6673644J0212791p15989j3991348j8012769j4807231j3983664j4015822
40715b8640388n698408P120521R106742n84963k939491J1306308K3666190J3244939
40707B6581450j2422707k7643552k1817649o893463L636766P849995Q877723Q838037
40699a2993400J0133855J2444297R035480l427976j3148268m773696J6395717
40692A3666009K6473149J3864813n644445j1916886n677392j89160J222735M656863
40684C6455686Q558382L388010j0819567j9771536j2596209M092871J4533342
40677B3840979J0695670k855828j6152004k1628180j7715964q569215L96802P685279
40669b4302461J4676600J9514532J6358908L363539j1719879j7770787j1556746
$$ plain form
40662 -11436294 -11880467 -5992177 -1145274 710278 3254437 8127633 9457880 81685
40654 81685 -16271942 -24674116 -15867040 37531 4068829 -7920780 -20342516 -19236083
40646 -19236083 -10213119 -8564126 -17722348 -27211850 -29640415 -29039875 -30522396 -31372275
40638 -31372275 -27518166 -21478726 -17335901 -13418936 -7363742 -3630144 -6510252 -8446001
40630 -8446001 2986760 25012235 37915584 28642460 7241410 -7041757 -8596898
40623 -8596898 -5908501 -5153123 -4220917 -1126997 1990402 4295199 7590245 10935287
40615 10935287 11107732 9521688 11102388 14580158 12213467 2590674 -4367348 -421588
40607 -421588 9705932 16061985 16826318 17449235 21009630 26068155 30489600 31351646 25320225
$$ packed form
40662a1436294m44173N888290M846903J855552K544159M873196J330247r376195
40654H1685j6353627q402174Q807076J5904571M031298j1989609j2421736J106433
40646a9236083R022964J648993r158222r489502k428565O00540j482521q49879
40638c1372275L854109O039440M142825L916965O055194L733598k880108j935749
40630h446001J1432761K2025475J2903349r273124k1401050j4283167j555141
40623h596898K688397P55378R32206L093920L117399K304797L295046L345042
40615A0935287J72445j586044J580700L477770k366691r622793o958022L945760
40607d21588J0127520O356053P64333O22917L560395N058525M421445Q62046o031421
$$ plain form
40598 25320225 16078137 16612669 34369936 56511299 60724110 41450634 15917088 2386000
40590 2386000 1775565 4272269 5032569 6590890 11088222 16932718 21421575 23056493
40582 23056493 23209371 27213256 39832172 56857783 65449820 57174301 38315418 23696724
40574 23696724 22144453 30601993 39710757 41422121 32976484 17566058 1401345 -11595216
40566 -11595216 -21667701 -29101892 -30349723 -20488984 911250 27063112 46627198
40559 46627198 50648800 40168609 26663840 21135901 22471281 20357664 9369241 -5042866
40551 -5042866 -14747403 -16758615 -11709310 -1625563 8292511 12769623 14224916 19650406
40543 19650406 26673084 23313173 8145785 -850426 10953394 32339981 40885151 33704215
$$ packed form
40598B5320225r242088N34532J7757267K2141363M212811j9273476k5533546j3531088
40590B386000o10435K496704P60300J558321M497332N844496M488857J634918
40582B3056493J52878M003885J2618916J7025611Q592037q275519j8858883j4618694
40574B3696724j552271Q457540R108764J711364q445637j5410426j6164713j2996561
40566a1595216j0072485p434191j247831R860739K1400234K6151862J9564086
40559D6627198M021602j0480191j3504769n527939J335380k113617j0988423j4412107
40551e042866r704537k011212N049305J0083747R918074M477112J455293N425490
40543A9650406P022678l359911j5167388q996211J1803820K1386587Q545170p180936
$$ plain form
40535 33704215 26681611 26037746 20412303 4788813 -6555335 -958392 12477154 15780564
40527 15780564 6079244 -5302683 -11162119 -13258620 -12395997 -6529121 827061 1431638
40519 1431638 -5173904 -8353377 42045 14932680 25600608 28995181 29382505 27989759
40511 27989759 21071061 9189752 840090 1811686 5627873 1436580 -10599521 -19586622
40503 -19586622 -19546943 -15435057 -10404733 2109309 24671685 42698139 38861202 18021961
40495 18021961 3546684 7114680 15762325 13950176 5505552 4072279 11290382 16735017
40487 16735017 14938580 10682925 8525029 7369655 6532832 8639769 13939869 18108448
40479 18108448 18251068 16056721 13182594 8958937 5064606 6469959 13234644 16379595
$$ packed form
40535C3704215p022604o43865n625443j5623490j1344148N596943J3435546L303410
40527A5780564r701320j1381927n859436k096501Q62623N866876P356182O04577
40519A431638o605542l179473Q395422J4890635J0667928L394573L87324j392746
40511B7989759o918698j1881309q349662R71596L816187m191293j2036101q987101
40503a9586622L9679M111886N030324J2514042K2562376J8026454l836937k0839241
40495A8021961j4475277L567996Q647645j812149q444624j433273P218103N444635
40487A6735017j796437m255655k157896j155374q36823K106937N300100M168579
40479A8108448J42620k194347k874127m223657l894331J405353O764685L144951
$$ plain form
40471 16379595 8474923 -4205935 -7387304 3262756 16801266 21657541 18780620 15601374
40463 15601374 13237826 8034624 2452484 3534075 9346763 8043319 -3993957 -12580518
40455 -12580518 -3454544 16776375 28259417 23160563 11863400 4672025 -656771 -10292192
40447 -10292192 -23769844 -37272735 -49504621 -58563724 -59169082 -49049123 -34160283
40440 -34160283 -22970743 -18535538 -18367850 -17330269 -8845210 9740241 29454404 34933589
40432 34933589 22640615 6857274 1612993 4064877 3229558 -2562233 -7320689 -10642076
40424 -10642076 -16866101 -23229338 -20697005 -7052000 10405562 25464375 37047896
40417 37047896 42395419 36545034 21541059 7743250 2416638 3373642 5995477 9484464
$$ packed form
40471A6379595p904672j2680858l181369J0650060J3538510M856275k876921l179246
40463A5601374k363548n203202n582140J081591N812688j303444j2037276q586561
40455a2580518R125974K0230919J1483042n098854j1297163p191375n328796r635421
40447a0292192j3477652j3502891j2231886r059103o05358J0119959J4888840
40440c4160283J1189540M435205J67688J037581Q485059J8585451J9714163N479185
40432C4933589j2292974j5783341n244281K451884q35319n791791m758456l321387
40424a0642076o224025o363237K532333J3645005J7457562J5058813J1583521
40417C7047896N347523n850385j5003975j3797809n326612R57004K621835L488987
$$ plain form
40409 9484464 13576227 16104551 17317163 20709886 26486946 29792020 28229500 25518499
40401 25518499 25019663 25503900 26084838 28999548 34024732 36331378 33822290 30752990
40393 30752990 30214201 29137184 24717486 18931972 12139269 336692 -14730276 -21607952
40385 -21607952 -15099484 -8614669 -17606873 -35082000 -38307825 -19558488 4320754 15959916
40377 15959916 17270193 18765354 20994563 16694197 4115092 -12071080 -29071232 -45906273
40369 -45906273 -57659385 -59034406 -53227128 -49031828 -48305550 -43757463 -30900220 -15006147
40361 -15006147 -3062422 4637931 10258476 11387929 4893300 -4991192 -9228518 -4667250
40353 -4667250 2584684 4772956 -175559 -8581132 -14112738 -10957673 1505807 16181203
$$ packed form
40409I484464M091763K528324J212612L392723N777060L305074j562520k711001
40401B5518499m98836M84237N80938K914710N025184K306646k509088l069300
40393C0752990n38789j077017m419698n785514o792703j1802577j5066968o877676
40385b1607952O508468O484815q992204j7475127l225825J8749337K3879242J1639162
40377A5959916J310277J495161K229209m300366j2579105j6186172j7000152j6835041
40369d5906273j1753112j375021N807278M195300P26278M548087J2857243J5894073
40361a5006147J1943725P700353N620545J129453o494629r884492m237326M561268
40353d667250P251934K188272m948515q405573n531606L155065J2463480J4675396
$$ plain form
40345 16181203 24493647 26191012 28451917 33871211 35085173 25178910 8620280 -3727395
40337 -3727395 -7571600 -7239645 -6416398 -3670069 1619993 4767598 1102750 -6692859
40329 -6692859 -10308129 -5127053 4155791 8653116 5479096 313224 -1733256 -4299944
40321 -4299944 -13355310 -24295333 -24366220 -10886301 2010787 1753115 -5237253 -4714581
40313 -4714581 2216654 719433 -13580992 -26318427 -24919900 -15479971 -11483075 -14910112
40305 -14910112 -18201668 -18686740 -19974470 -21650125 -18700820 -12272839 -11334263 -19332208
40297 -19332208 -25919747 -17993262 4086740 26689061 38232888 39390183 37562874 36395865
40289 36395865 34397461 30858085 27576840 24555362 18976006 10307400 2134482 -3673081
$$ packed form
40345A6181203Q312444J697365K260905N419294J213962r906263j6558630j2347675
40337c727395l844205L31955Q23247K746329N290062L147605l664848p795609
40329f692859l615270N181076R282844M497325l174020n165872k046480k566688
40321d299944r055366j0940023p0887J3479919J2897088k57672o990368N22672
40313d714581O931235j497221j4300425j2737435J398527R439929L996896l427037
40305a4910112l291556m85072j287730j675655K949305O427981R38576p997945
40297a9332208o587539P926485K2080002K2602321J1543827J157295j827309j167009
40289C6395865j998404l539376l281245l021478n579356q668606q172918n807563
$$ plain form
40281 -3673081 -10212007 -19205559 -25930008 -26037078 -23502373 -24306590 -24931652 -16751279 -1844727
40272 -1844727 6238043 1183674 -6201388 -3558898 4694898 3360702 -12703610 -32260886
40264 -32260886 -41646147 -37787771 -25884140 -10200657 8285302 26640008 36549498
40257 36549498 29378078 5867538 -20899830 -35505312 -34273861 -27937963 -30015637 -43892853
40249 -43892853 -60691107 -67512414 -58387473 -39877934 -25291579 -20715800 -18688750 -9830843
40241 -9830843 2066508 3938085 -8222915 -23586060 -31040654 -31286715 -30596413 -30008478
40233 -30008478 -26313458 -18478891 -7750123 4612371 15258885 18277568 10946119 -3085738
40225 -3085738 -18635106 -32527485 -40627615 -38175142 -26810013 -14866557 -6778040 1150131
$$ packed form
40281c673081o538926q993552o724449j07070K534705q04217o25062Q180373J4906552
40272a844727Q082770n054369p385062K642490Q253796j334196j6064312j9557276
40264c2260886r385261L858376J1903631J5683483J8485959J8354706R909490
40257C6549498p171420k3510540k6767368j4605482J231451O335898k077674j3877216
40249d3892853j6798254o821307R124941J8509539J4586355M575779K027050Q857907
40241i830843J1897351J871577j2161000j5363145p454594k46061O90302N87935
40233c0008478L695020P834567J0728768J2362494J0646514L018683p331449j4031857
40225c085738j5549368j3892379q100130K452473J1365129J1943456Q088517P928171
$$ plain form
40217 1150131 10998210 18210743 21606935 28153593 39355878 42737624 28353512 6175922
40209 6175922 -5735822 -4778114 -2392189 -3857135 -4296345 -2781640 -5086559 -10949799
40201 -10949799 -12005906 -5548321 676496 559234 -2912997 -4740788 -3922866 -1073221
40193 -1073221 1312163 -3923873 -20817887 -39130219 -42640418 -30842036 -20697942 -23443311
40185 -23443311 -31241606 -31212813 -21150366 -5850844 10813325 23337083 24644004 16614402
40177 16614402 11598533 15881699 20424464 15855436 7548835 6367093 12423194 18524718
40169 18524718 23389135 30635268 39249578 45186585 48677923 50503426 45041773 27696107
40161 27696107 6881231 -2389410 2676470 9022184 4151990 -10540156 -23734709 -25994609
$$ packed form
40217A150131R848079P212533L396192O546658J1202285L381746j4384112k2177590
40209F175922j1911744R57708K385925j464946m39210J514705k304919n863240
40201a0949799j056107O457585O224817j17262l472231j827791Q17922K849645
40193a073221K385384n236036j6894014j8312332l510199J1798382J0144094k745369
40185b3443311p798295K8793J0062447J5299522J6664169J2523758J306921q029602
40177A6614402n015869M283166M542765m569028q306601j181742O056101O101524
40169A8524718M864417P246133Q614310N937007L491338J825503n461653j7345666
40161B7696107k0814876r270641N065880O345714m870194j4692146j3194553k259900
$$ plain form
40153 -25994609 -16950083 -4864312 690290 -2067746 -6976706 -9694815 -12020138 -13596052
40145 -13596052 -7425766 9257171 26627162 34131895 35375902 40553814 48078425 46285631
40137 46285631 32801685 20117565 19401725 28163829 37001649 41003697 41434717 42013693
40129 42013693 45733648 50672942 48673198 33994322 13644700 2692533 7805466 20460902
40121 20460902 27167029 21718383 7610320 -6334833 -12685278 -12248049 -13058220 -18410365
40113 -18410365 -19848982 -8958455 8273211 18501303 19028867 17296501 14751645 5057813
40105 5057813 -11157871 -24168242 -30668488 -37605778 -46555824 -48747942 -41490055 -34468007
40097 -34468007 -31158199 -19164486 8592759 36444663 45373364 39956557 38756533 44424649
$$ packed form
40153b5994609R044526J2085771N554602k758036m908960k718109k325323j575914
40145a3596052O170286J6682937J7369991P504733J244007N177912P524611j792794
40137D6285631j3483946j2684120p15840Q762104Q837820M002048M31020N78976
40129D2013693L719955M939294j999744j4678876k0349622j0952167N112933J2655436
40121B0460902O706127n448646j4108063j3945153o350445M37229q10171n352145
40113a8410365j438617J0890527J7231666J0228092N27564j732366k544856r693832
40105E057813j6215684j3010371o500246o937290q950046k192118P257887P022048
40097c4468007L309808J1993713K7757245K7851904Q928701n416807j200024N668116
$$ plain form
40089 44424649 42000138 25178685 6620553 -521911 2666208 8381549 12816513 14760093
40081 14760093 12396690 6189291 -613388 -6207947 -9859684 -8157866 1195846 12864378
40073 12864378 19324118 21404967 23544060 20330666 1671518 -26572069 -42176319 -33707411
40065 -33707411 -15688381 -8277609 -12978246 -18467775 -19913347 -19123171 -12916996 3121331
40057 3121331 21614835 28339308 21430890 14312922 17157737 24903047 26636886 19008369
40049 19008369 7155373 -1348109 -934164 7808189 16329930 15687127 6986506 -1348588
40041 -1348588 -6554009 -13519685 -22606159 -25713391 -19259165 -11732434 -11324212 -13994375
40033 -13994375 -12356187 -9711722 -14787696 -26520227 -34846422 -34943187 -30562715 -23822442
$$ packed form
40089D4424649k424511j6821453j8558132p142464L188119N715341M434964J943580
40081A4760093k363403o207399o802679n594559l651737J701818R353712J1668532
40073A2864378O459740K080849K139093l213394j8659148k8243587j5604250Q468908
40065c3707411J8019030P410772m700637n489529j445572P90176O206175J6038327
40057C121331J8493504O724473o908418p117968K844815P745310J733839p628517
40049A9008369j1852996q503482M13945Q742353Q521741o42803q700621q335094
40041a348588n205421o965676r086474l107232O454226P526731M08222k670163
40033a3994375J638188K644465n075974j1732531q326195r6765M380472O740273
$$ plain form
40025 -23822442 -12092891 3520259 16162744 22492172 25714446 26713136 21084133 9432260
40017 9432260 1883883 5354171 12684521 11995374 2269322 -7809950 -12763272 -13856720
40009 -13856720 -11960218 -5758437 2164329 4825144 -999053 -10764153 -18138044 -21052532
40001 -21052532 -20200599 -15405658 -6314184 5081080 14710648 19089856 17917713 14889608
39993 14889608 14811224 18076424 19035567 11874867 -3050561 -20638946 -36441098 -47368763
39985 -47368763 -49654790 -41693575 -28544017 -18288595 -13144956 -8815800 -3364769 -1230846
39977 -1230846 -5781037 -12254646 -11964230 -1671356 13467935 24670812 26073774 18967387
39969 18967387 11011607 9054517 11572913 10613812 2054069 -9323753 -16558338 -18940506
$$ packed form
40025b3822442J1729551J5613150J2642485O329428L222274R98690n629003j1651873
40017I432260p548377L470288P330350o89147r726052j0079272m953322j093448
40009a3856720J896502O201781P922766K660815n824197r765100p373891k914488
40001b1052532Q51933M794941R091474J1395264R629568M379208j172143l028105
39993A4889608p8384L265200R59143p160700j4925428j7588385j5802152j0927665
39985d7368763k286027P961215J3149558J0255422N143639M329156N451031K133923
39977a230846m550191o473609K90416J0292874J5139291J1202877J402962p106387
39969A8967387p955780j957090K518396r59101q559743j1377822p234585k382168
$$ plain form
39961 -18940506 -21117174 -26100027 -31779442 -33229918 -27196288 -15828020 -6463965 -5281641
39953 -5281641 -10748177 -16374231 -19706822 -23404179 -26389555 -21071022 -4093352 15479066
39945 15479066 24893091 21577775 12972937 5629195 571085 -2871891 -5555430 -10194460
39937 -10194460 -18264611 -25086470 -23564617 -13291901 -1211948 6572767 8814430 6052464
39929 6052464 -62095 -4761507 -4778808 -5376645 -14425125 -27738177 -29794952 -13458331
39921 -13458331 9890005 25826809 33714594 39961524 42998585 36953090 25275993 17346947
39913 17346947 13101883 4401454 -7521343 -10054122 839816 11719517 10739832 4944231
39905 4944231 8135208 19624792 27581271 28878893 31822381 39188104 41450395 31201181
$$ packed form
39961a8940506k176668m982853n679415j450476O033630J1368268R364055J182324
39953e281641n466536n626054l332591l697357k985376N318533J6977670J9572418
39945A5479066R414025l315316q604838p343742n058110l442976k683539m639030
39937a0194460q070151o821859J521853J0272716J2079953P784715K241663k761966
39929F052464o114559m699412j7301n97837r048480j3313052k056775J6336621
39921a3458331K3348336J5936804P887785O246930L037061o045495j1677097p929046
39913A7346947m245064q700429j1922797k532779J0893938J0879701r79685n795601
39905D944231L190977J1489584P956479J297622K943488P365723K262291j0249214
$$ plain form
39897 31201181 15043183 5357479 6065265 11629145 15789850 16298705 13823908 10783508
39889 10783508 10253398 13215895 17553933 20701956 21382202 18384099 11203797 3158142
39881 3158142 -403621 548577 -601610 -7590375 -14348663 -12307488 -1801333 9048778
39873 9048778 15133954 18572796 22523921 26041471 26424458 23264455 18881825 16784945
39865 16784945 19810291 27513661 35322318 38200940 34961642 27809675 19742756 15003883
39857 15003883 19151884 33195004 48349346 52657857 44506324 34909844 34143345 40209932
39849 40209932 43657421 40406103 35204705 33345755 33566827 31229288 26253965 24298436
39841 24298436 28864838 34856646 33388679 22162602 6836556 -7881644 -22298786
$$ packed form
39897C1201181j6157998r685704P07786N563880M160705N08855k474797l040400
39889A0783508n30110K962497M338038L148023O80246k998103p180302q045655
39881C158142l561763R52198j150187o988765o758288K041175J0506155J0850111
39873I048778O085176L438842L951125L517550L82987l160003m382630k096880
39865A6784945L025346P703370P808657K878622l239298p151967q066919m738873
39857A5003883M148001J4043120J5154342M308511q151533r596480p66499O066587
39849D0209932L447489l251318n201398j858950K21072k337539m975323j955529
39841B4298436M566402N991808j467967j1226077j5326046j4718200j4417142
$$ plain form
39834 -22298786 -34501158 -36667662 -25687161 -12354014 -10649328 -19827411 -26587818 -24589794
39826 -24589794 -21186973 -22326353 -21655955 -11406341 3610379 11315027 7627961 -1140892
39818 -1140892 -8802913 -14892269 -20126764 -22751508 -21388558 -17866399 -15214043 -14319834
39810 -14319834 -13301627 -9354578 -1455987 7832923 13724802 13405270 8872365 5226885
39802 5226885 5892067 8690066 6638360 -4913407 -20590300 -28127318 -22899110 -15573112
39794 -15573112 -19124588 -31050413 -36905386 -30494806 -20131574 -12754794 -3248267 13682444
39786 13682444 30024370 32696526 21057312 7686094 3895716 11253323 24997370
39779 24997370 38157405 42907127 35325371 20917402 10941641 11310696 17477974 20868573
$$ packed form
39834b2298786j2202372k166504J0980501J3333147J704686r178083o760407J998024
39826b4589794L402821j139380O70398J0249614J5016720P704648l687066q768853
39818a140892p662021o089356n234495k624744J362950L522159K652356Q94209
39810a4319834J018207L947049P898591R288910N891879l19532m532905l645480
39802E226885O65182K797999k051706j1551767j5676893p537018N228208P325998
39794a5573112l551476j1925825n854973O410580J0363232P376780R506527J6930711
39786A3682444J6341926K672156j1639214j3371218l790378P357607J3744047
39779B4997370J3160035M749722p581756j4407969r975761L69055O167278L390599
$$ plain form
39771 20868573 18195089 13668731 12856261 14801731 11650934 -1685794 -18954898 -28006506
39763 -28006506 -24445549 -14773705 -6367068 -1176935 427513 -1271498 -18323 12368628
39755 12368628 31651345 41295711 34308651 25079789 30060955 45772396 57248337 59825292
39747 59825292 58566685 52462783 35724216 12871517 -2967606 -7675790 -9028966 -11461831
39739 -11461831 -11175188 -7856259 -7767008 -11748942 -12259862 -6257656 122795 3375455 7553340
39730 7553340 12983392 11858626 1328082 -9476706 -12350418 -10778982 -11202430 -12370662
39722 -12370662 -10347622 -5909834 -142533 9051976 18837145 18485782 3627393 -13301155
39714 -13301155 -16090978 -3457873 12644645 21727001 20289101 9007322 -6443733
$$ packed form
39771B0868573k673484m526358q12470J945470l150797j3336728j7269104r051608
39763b8006506L560957R671844Q406637N190133J604448j699011J253175J2386951
39755A2368628J9282717R644366o987060r228862M981166J5711441J1475941K576955
39747E9825292j258607o103902j6738567k2852699j5839123m708184j353176k432865
39739a1461831K86643L318929Q9251l981934n10920O002206O380451L252660M177885
39730G553340N430052j124766j0530544j0804788k873712J571436m23448j168232
39722a2370662K023040M437788N767301R194509R785169l51363j4858389j6928548
39714a3301155k789823J2633105J6102518R082356j437900j1281779j5451055
$$ plain form
39707 -6443733 -16358920 -17356551 -17832472 -25769328 -36540784 -41324701 -41712755 -45249147
39699 -45249147 -50818720 -50214676 -42003728 -32646235 -25204123 -17918773 -12944456 -14379813
39691 -14379813 -16774728 -8175870 11437634 25546344 20736322 2891222 -12029145
39684 -12029145 -16637699 -15208658 -13315040 -11819403 -9735176 -7413404 -5788941 -4692875
39676 -4692875 -3039725 -1114373 -2448064 -10604199 -21898229 -25020276 -13264466 4903677
39668 4903677 14033932 9925653 2579215 297932 -449551 -4776261 -6507758 5552677
39660 5552677 30188642 50825300 53150551 41379196 32621729 36562850 45813192 47916730
39652 47916730 41630791 35754664 34678196 33136937 26287950 17459770 12817243 14570151
$$ packed form
39707f443733r915187r97631m75921p936856j0771456m783917l88054l536392
39699d5249147n569573O04044Q210948R357493P442112P285350M974317j435357
39691a4379813k394915Q598858J9613504J4108710m810022j7845100j4920367
39684a2029145m608554J429041J893618J495637K084227K321772J624463J096066
39676d692875J653150J925352j333691q156135j1294030l122047J1755810J8168143
39668D903677R130255m108279p346438k281283p47483m326710j731497J2060435
39660E552677K4635965K0636658K325251j1771355q757467L941121R250342K103538
39652D7916730o285939n876127j076468j541259o848987q828180m642527J752908
$$ plain form
39644 14570151 22257092 33356037 38919772 28074938 4144921 -12558849 -7939613
39637 -7939613 7384167 14032121 10598675 9509182 12260751 8514175 -531257 918477
39629 918477 16966469 30047540 27750797 22769658 31548187 46401933 47164822 32780337
39621 32780337 21550528 21466506 18969947 1723549 -22117162 -35392913 -33098421 -23379999
39613 -23379999 -13259925 -2675200 8292229 13881116 7832884 -8093316 -23574945
39606 -23574945 -28419691 -21092837 -8025313 4192996 13468778 19720070 22390318 23048516
39598 23048516 26771871 36211803 45479317 44545691 30445929 10929868 -3902745 -10730764
39590 -10730764 -12286593 -10318801 -3182892 8964214 19975642 22625552 17607644 13370578
$$ packed form
39644A4570151P686941J1098945N563735j0844834k3930017j6703770M619236
39637g939613J5323780O647954l433446j089493K751569l746576r045432J449734
39629I18477J6047992J3081071k296743m981139Q778529J4853746P62889j4384485
39621C2780337j1229809q4022k496559j7246398k3840711j3275751K294492R718422
39613b3379999J0120074J0584725J0967429N588887o048232j5926200j5481629
39606b3574945m844746P326854J3067524J2218309R275782O251292K670248O58198
39598B3048516L723355R439932R267514r33626j4099762j9516061j4832613o828019
39590a0730764j555829J967792P135909J2147106J1011428K649910n017908m237066
$$ plain form
39582 13370578 14644400 15256155 7387698 -4897181 -9165377 -2276493 3675706 -2586923
39574 -2586923 -15847503 -21226296 -13022184 284785 8429929 9758516 8437098 7659888
39566 7659888 8953986 14190553 23817322 34139800 39753191 39018319 34994887 30631433
39558 30631433 25454505 18376013 11349818 7355084 6511439 8378975 16622347 34042492
39550 34042492 51289679 49912242 24304566 -5801713 -15138227 -2053505 13059837
39543 13059837 16512522 14641995 16324304 17572527 12163887 5556249 6127863 10134424
39535 10134424 7793674 -668342 -7689064 -13686920 -25557967 -39847851 -42054732 -27475381
39527 -27475381 -10674801 -6678183 -11673940 -11108903 -509275 11679280 18733535 22795934
$$ packed form
39582A3370578J273822O11755p868457j2284879m268196O888884N952199o262629
39574b586923j3260580n378793Q204112J3306969Q145144J328587j321418p77210
39566G659888J294098N236567R626769J0322478N613391p34872m023432m363454
39558C0631433n176928p078492p026195l994734q43645J867536Q243372J7420145
39550C4042492J7247187j377437k5607676l0106279r336514J3084722J5113342
39543A3059837L452685j870527J682309J248223n408640o607638N71614M006561
39535A0134424k340750q462016p020722n997856j1871047j4289884k206881J4579351
39527b7475381J6800580L996618m995757N65037J0599628J2188555P054255M062399
$$ plain form
39519 22795934 26671329 27246542 21302266 12856275 9612093 13464681 18099851 16037218
39511 16037218 5776930 -8144807 -19649936 -24231209 -19808111 -8109186 4143539
39504 4143539 8584198 2810374 -5639178 -5081349 9585298 32266122 51565861 60604377
39496 60604377 61083604 58574403 55026725 47335714 33636293 18614709 9382121 6644361
39488 6644361 4034432 -2545691 -9040255 -9729602 -6317045 -5902031 -11155791 -17233181
39480 -17233181 -18730595 -15300236 -8719626 1537251 15833530 28969719 31948806 21442703
39472 21442703 5662293 -2093460 3841268 16859251 26227860 27293987 22512512 15927079
39464 15927079 10465610 8691425 11221740 14332948 13347848 8595715 3668840 -2137852
$$ packed form
39519B2795934L875395N75213n944276q445991l244182L852588M635170k062633
39511A6037218j0260288j3921737j1505129m581273M423098J1698925J2252725
39504D143539M440659n773824q449552N57829J4666647K2680824J9299739R038516
39496F0604377M79227k509201l547678p691011j3699421j5021584r232588k737760
39488F644361k609929o580123o494564o89347L412557M15014n253760o077390
39480a7233181j497414L430359O580610J0256877J4296279J3136189K979087j0506103
39472B1442703j5780410p755753N934728J3017983R368609J066127m781475o585433
39464A5927079n461469j774185K530315L111208r85100m752133m926875n806692
$$ plain form
39456 -2137852 -13391851 -28394781 -35863827 -26756130 -5949905 12356982 18900591 16169130
39448 16169130 13717211 19278957 31311088 38025811 28312520 6667925 -8543595 -6732242
39440 -6732242 1077061 -2489490 -16989327 -24843046 -13821660 10741545 35148502 48749667
39432 48749667 46119324 29389656 12328038 12162939 30807374 50646044 54638175 44914796
39424 44914796 35886141 34808417 36596272 33924034 24392684 9430747 -6215845 -13977108
39416 -13977108 -7700990 7703448 19525565 21731101 21376932 27134251 35803019 36066648
39408 36066648 23977223 7969017 -2994604 -9662979 -15957202 -17361790 -4852589
39401 -4852589 19725573 41229033 47841551 43031806 36186200 28802613 18048996 8218981
$$ packed form
39456b137852j1253999j5002930p469046R107697K0806225J8306887O543609k731461
39448A6169130k451919N561746J2032131O714723r713291k1644595j5211520J811353
39440f732242P809303l566551j4499837p853719J1021386K4563205K4406957J3601165
39432D8749667k630343j6729668j7061618j65099J8644435J9838670L992131r723379
39424D4914796r028655j077724J787855k672238r531350j4961937j5646592p761263
39416a3977108O276118J5404438J1822117K205536l54169N757319Q668768K63629
39408C6066648j2089425j6008206j0963621o668375o294223j404588J2509201
39401d852589K4578162K1503460O612518m809745o845606p383587j0753617r830015
$$ plain form
39393 8218981 7351624 13778648 16603084 10565564 1156204 -6299091 -12494260 -16297295
39385 -16297295 -12172344 -1627511 2594914 -7351664 -21245664 -23348178 -12678150 -404856
39377 -404856 8799829 20274758 34585205 41820369 35113766 21061455 11086269 8223699
39369 8223699 7657061 6035312 4824334 6445181 11212142 17280011 21475116 21618974
39361 21618974 19361410 18270603 17765799 12592730 906741 -11197367 -17535075 -20538880
39353 -20538880 -25800668 -30230608 -24409566 -8278876 4278889 2079702 -8457320 -12588265
39345 -12588265 -7244308 -2175160 -2269762 -112564 9808489 19587227 19159924 12745199
39337 12745199 13397175 23663950 33207351 37071479 44502493 62765944 80814572 79797148
$$ packed form
39393H218981q67357O427024K824436o037520r409360p455295o195169l803035
39385a6297295M124951J0544833M222425r946578j3894000k102514J0670028J2273294
39377d04856R204685J1474929J4310447P235164o706603j4052311r975186k862570
39369H223699n66638j621749j210978J620847M766961O067869M195105J43858
39361B1618974k257564j090807n04804n173069j1685989j2104108o337708l003805
39353b0538880n261788m429940N821042J6130690J2557765k199187j0537022m130945
39345a2588265N343957N069148r4602K157198R921053R778738m27303o414725
39337A2745199O51976J0266775R543401L864128P431014J8263451J8048628j017424
$$ plain form
39329 79797148 57274922 31051736 17589130 14717587 9572891 -2750226 -15104189
39322 -15104189 -20082541 -18570918 -15169287 -10658048 -2943410 7227184 15948302 21221687
39314 21221687 24711927 27641981 27882450 22934984 14275890 7120165 6209752 11899330
39306 11899330 19416494 22572502 20099678 17486482 19701573 23393456 21277452 13915162
39298 13915162 10044143 13080924 15290958 10457859 4539625 5339650 7596403 -441396
39290 -441396 -17906748 -30176720 -27350751 -13498245 3987651 22842008 38936942
39283 38936942 41559900 25141411 591046 -13902586 -12153253 -4230062 -2284687 -7120366
39275 -7120366 -9632785 -2715843 10025125 18028877 16079519 9933625 7081341 5935245
$$ packed form
39329G9797148k2522226k6223186j3462606k871543n144696j2323117j2353963
39322a5104189m978352J511623L401631M511239P714638J0170594Q721118N273385
39314B1221687L490240K930054K40469m947466q659094p155725r10413N689578
39306A1899330P517164L156008k472824k613196K215091L691883k116004p362290
39298A3915162l871019L036781K210034m833099n918234Q00025K256753q037799
39290d41396j7465352j2269972K825969J3852506J7485896J8854357J6094934
39283C8936942K622958j6418489k4550365j4493632J749333P923191J945375m835679
39275g120366k512419O916942J2740968Q003752j949358o145894k852284j146096
$$ plain form
39267 5935245 565519 -6626681 -6354177 3094367 12619418 16074993 17661350 21569382
39259 21569382 24142779 22615165 22459268 27703607 31510434 25994536 15864575 12493390
39251 12493390 18267434 25939333 30148793 30571017 26820211 19923987 16596012 21916527
39243 21916527 28710231 24215941 7790336 -6977632 -8550113 2348093 18875062
39236 18875062 35174502 45935721 47880446 44335089 40852985 34898384 18748242 -5181271
39228 -5181271 -22311455 -24426073 -21018987 -24930261 -34107548 -36413077 -27502669 -14239030
39220 -14239030 -2298720 10118479 24577246 35661748 36405901 27783166 19121823 18756152
39212 18756152 25578483 30594831 26623865 15662690 6553471 6422335 14338407 21248864
$$ packed form
39267E935245n369726p192200K72504R448544R525051L455575J586357L908032
39259B1569382K573397j527614j55897N244339L806827n515898j0129961l371185
39251A2493390N774044P671899M209460M22224l750806o896224l327975N320515
39243B1916527O793704m494290j6425605j4767968j572481J0898206J6526969
39236A8875062J6299440J0761219J944725l545357l482104n954601j6150142k3929513
39228e181271j7130184k114618L407086l911274r177287k305529Q910408J3263639
39220a4239030J1940310J2417199J4458767J1084502P44153q622735q661343l65671
39212A8756152O822331N016348l970966j0961175r109219j31136P916072O910457
$$ plain form
39204 21248864 15999008 -4599251 -29558846 -41768059 -35802550 -23733969 -19211736
39197 -19211736 -21154324 -19835776 -13631716 -9261808 -7786879 -2292703 9123063 18947486
39189 18947486 22405158 24661753 31012851 37561300 37235445 29437964 18818143 9035861
39181 9035861 1755559 -2229261 -4015035 -5206541 -4326254 740396 6934647 9739741
39173 9739741 12567976 22740092 36753598 41541076 34679914 30404641 37757335 45325504
39165 45325504 39119830 25177405 20198829 26690192 32414756 30648552 26131768 22344366
39157 22344366 17499437 14640063 22494960 42106282 62325954 72537963 72383321 66586877
39149 66586877 58103940 49331926 42893322 37712891 29633624 17913180 6021386 -4385811
$$ packed form
39204B1248864n249856k0598259k4959595j2209213N965509J2068581M522233
39197a9211736j942588J318548O204060M369908J474929N494176J1415766R824423
39189A8947486L457672K256595O351098O548449l25855p797481j0619821r782282
39181I035861p280302l984820j785774j191506Q80287N066650O194251K805094
39173I739741K828235J0172116J4013506M787478o861162m275273P352694P568169
39165D5325504o205674j3942425m978576O491363N724564j766204m516784l787402
39157B2344366m844929k859374P854897J9611322K0219672J0212009j54642n796444
39149F6586877q482937q772014o438604n180431q079267j1720444j1891794j0407197
$$ plain form
39141 -4385811 -13680237 -18134083 -11970279 2132815 12692712 13318891 9999052 10615550
39133 10615550 13959237 13923059 8603696 -103479 -10749435 -20229258 -21603015 -10801461
39125 -10801461 6075156 17572793 18716265 14594664 12836770 15593945 19103975 19530243
39117 19530243 18635951 22430816 32249854 39087535 31935485 12316432 -4785717 -6705986
39109 -6705986 4335945 16333158 20575457 16982915 10829342 7998778 10888098 16335127
39101 16335127 19832296 22497501 29196247 38197085 39227749 26241361 6500400 -8863887
39093 -8863887 -18526617 -27931264 -36222633 -35714977 -24667444 -11785304 -4405538 1454226
39085 1454226 13881516 31468377 43381443 43240273 37294066 35304822 37114176 34859070
$$ packed form
39141d385811r294426m453846O163804J4103094J0559897O26179l319839O16498
39133A0615550L343687l6178n319363q707175j0645956r479823j373757J0801554
39125a0801461J6876617J1497637J143472m121601j757894K757175L510030M26268
39117A9530243q94292L794865R819038O837681p152050j9619053j7102149j920269
39109f705986J1041931J1997213M242299l592542o153573k830564K889320N447029
39101A6335127L497169K665205O698746R000838J030664j2986388j9740961j5364287
39093h863887r662730r404647q291369N07656J1047533J2882140P379766N859764
39085A454226J2427290J7586861J1913066j41170n946207j989244J809354k255106
$$ plain form
39077 34859070 28228170 28766632 43394546 60319437 61113777 44565602 28354877 26644256
39069 26644256 36109871 46073595 51239844 49468905 38056609 20773473 10152809 13300139
39061 13300139 22056720 26388590 29965017 40496720 51240766 47858428 31452746 18470203
39053 18470203 16204387 14345723 5672661 -161483 7597483 23377698 34479877 38723555
39045 38723555 41400409 41508690 34042641 22721453 17639990 20267072 22078193 19825500
39037 19825500 21449393 32471608 45561929 50350764 47427940 44876181 44456080 39761939
39029 39761939 28166611 17107107 15281753 22135604 29874645 33286347 33766541 34990754
39021 34990754 38338086 42354520 43740670 39379917 30905006 26730150 34528636 50557420
$$ packed form
39077C4859070o630900N38462J4627914J6924891P94340j6548175j6210725j710621
39069B6644256R465615R963724N166249j770939j1412296j7283136j0620664L147330
39061A3300139Q756581M331870L576427J0531703J0744046l382338j6405682j2982543
39053A8470203k265816j858664q673062n834144P758966J5780215J1102179M243678
39045C8723555K676854J08281p466049j1321188n081463K627082J811121k252693
39037A9825500J623893J1022215J3090321M788835k922824k551759m20101m694141
39029C9761939j1595328j1059504j825354O853851P739041L411702M80194J224213
39021C4990754L347332M016434J386150m360753q474911m174856P798486J6028784
$$ plain form
39013 50557420 61592095 59660752 49643879 39699393 31286190 24236892 24060615 33932074
39005 33932074 43760456 39609962 23681825 12992796 16274845 24041982 25606252 23797645
38997 23797645 25524963 28789236 29611545 33549128 47773625 66435971 76614805 77050880
38989 77050880 79263618 90350374 106078843 122090422 139910318 157532842 164721726
38982 164721726 155197557 136969966 123483233 118672772 116651859 112468207 106807587 101930995
38974 101930995 98765663 97976179 99892685 102866551 103953376 101335488 95159508 87104308
38966 87104308 79923500 75588405 73007178 69821050 67082006 68716927 74893943 80028299
38958 80028299 80172706 78409182 78922116 79290481 74164614 64620650 57744363 56842208 57485216
$$ packed form
39013E0557420J1034675j931343j0016873r944486q413203p049298j76277R871459
39005C3932074R828382m150494j5928137j0689029L282049P767137J564270j808607
38997B3797645J727318L264273Q22309L937583J4224497J8662346J0178834M36075
38989G7050880K212738J1086756J5728469J6011579J7819896J7622524P188884
38982A64721726r524169j8227591j3486733m810461k020913m183652n660620m876592
38974A01930995l165332p89484J916506K973866J086825k617888o175980q055200
38966H7104308p180808m335095k581227l186128k739044J634921O177016N134356
38958H0028299J44407j763524N12934L68365n125867r543964o876287r02155O43008
$$ plain form
38949 57485216 54662217 49409255 45985829 45577530 45576576 43695949 40748483 39751858 42919796
38940 42919796 48719318 52020240 49284739 44279470 45578054 55349480 62590556 53022546
38932 53022546 27709998 6786585 8574897 26612120 35345774 21163229 -254647
38925 -254647 -4291452 11329047 26717065 28971586 27155362 33699108 43570736 42605682
38917 42605682 29398480 16610371 12563631 12735648 10770638 8371686 10276415 15932716
38909 15932716 20980082 23658439 26169132 31208306 38567791 43627961 39800332 26183380
38901 26183380 12834070 13264970 29236871 46726026 49904395 36728266 18621832
38894 18621832 7660806 7088598 12239580 16535728 15948872 10329909 2897318 -1020461
$$ packed form
38949E7485216k822999n252962l423426m08299r54j880627k947466r96625L167938
38940D2919796N799522L300922k735501n005269J298584R771426P241076r568010
38932E3022546k5312548k0923413J788312J8037223Q733654j4182545k1417876
38925b54647m036805J5620499J5388018K254521j816224O543746R871628r65054
38917D2605682j3207202j2788109m046740J72017j965010k398952J904729N656301
38909A5932716N047366K678357K510693N039174P359485N060170l827629j3616952
38901B6183380j3349310M30900J5971901J7489155L178369j3176129j8106434
38894A8621832j0961026n72208N150982M296148n86856n618963p432591l917779
$$ plain form
38886 -1020461 3452227 16229087 29661807 34350539 30413737 29108955 38269277 49594174
38878 49594174 48387245 35184687 28087027 39949673 61271514 72369250 67639418
38871 67639418 59908371 61885233 70375049 71563669 58806697 41645985 35735687 44549855
38863 44549855 54525792 51207236 36883743 26026632 24893714 24938215 18859362 13291191
38855 13291191 18343903 31731856 42991734 49437917 56781530 64149304 60229782 39878159
38847 39878159 16818992 11274124 26689080 45676932 50523348 42654817 37993140 46000515
38839 46000515 59537960 66474630 64890901 61612346 60026259 57370821 53448281 53714133
38831 53714133 61013020 70474059 76147431 78246794 81081817 88100198 101022545 118730852
$$ packed form
38886a020461M472688J2776860J3432720M688732l936802j304782R160322J1324897
38878D9594174j206929j3202558p097660J1862646K1321841J1097736m729832
38871F7639418p731047J976862Q489816J188620j2756972j7160712n910298Q814168
38863D4549855R975937l318556j4323493j0857111j132918M4501o078853n568171
38855A3291191N052712J3387953J1259878O446183P343613P367774l919522k0351623
38847C9878159k3059167n544868J5414956J8987852M846416p868531m661677Q007375
38839D6000515J3537445O936670j583729l278555j586087k655438l922540K65852
38831E3714133P298887R461039N673372K099363K835023P018381J2922347J7708307
$$ plain form
38823 118730852 134632951 140788622 137377815 132016644 127236810 116845619 99173044
38816 99173044 84820173 83865698 92914333 102452007 108992240 111113246 102961261 84658904
38808 84658904 71394835 76074826 87574115 83875635 65072449 54110056 62455663
38801 62455663 74573822 73473761 63755338 58258429 56738387 51914188 46036573 46011366
38793 46011366 48240509 43477150 34780010 37103690 57040816 82473550 95594473 90832379
38785 90832379 78074554 71719175 77267035 86559685 86856534 75578143 62983605 58517393
38777 58517393 59403683 56861935 49121549 42167222 39662804 38031627 32065194 22509453
38769 22509453 17550072 26215371 47434103 66452204 68108055 54685586 43385109
$$ packed form
38823A18730852J5902099O155671l410807n361171m779834j0391191j7672575
38816I9173044j4352871r54475R048635R537674O540233K121006q151985j8302357
38808H4658904j3264069M679991J1499289l698480j8803186j0962393Q345607
38801F2455663J2118159j100061r718423n496909j520042m824199n877615k5207
38793D6011366K229143m763359q697140K323680J9937126K5432734J3120923m762094
38785I0832379j2757825o355379N547860R292650K96849j1278391j2594538m466212
38777E8517393Q86290k541748p740386o954327k504418j631177n966433r555741
38769B2509453m959381Q665299K1218732J9018101J655851j3422469j1300477
$$ plain form
38762 43385109 43917117 47794724 44873551 40331813 45420096 58372745 66239453 62647573
38754 62647573 53342190 45690905 42223193 43769340 49873616 55700477 56109337 52658459
38746 52658459 49547448 44278483 31625612 16511997 12045368 21707017 33084586 34717225
38738 34717225 32140550 40605029 65170605 93212131 106165804 97073200 77243795
38731 77243795 64749970 64610037 63567278 48867359 27759654 19554050 30340120 46917951
38723 46917951 57491894 66237201 80880118 95805099 97932409 84943159 67996491
38716 67996491 57297519 52767030 49917107 48343213 50556859 55263304 56295091 49796511
38708 49796511 40511881 37450546 42700163 48806804 50245455 52843482 65661696 86648610
$$ packed form
38762D3385109N32008L877607k921173m541738N088283J2952649P866708l591880
38754F2647573r305383p651285l467712J546147O104276N826861M08860l450878
38746E2658459l111011n268965j2652871j5113615m466629R661649J1377569J632639
38738C4717225k576675Q464479K4565576K8041526J2953673r092604j9829405
38731G7243795j2493825j39933j042759j4699919k1107705q205604J0786070J6577831
38723D6917951J0573943Q745307J4642917J4924981K127310j2989250j6946668
38716F7996491j0698972m530489k849923j573894K213646M706445J031787o498580
38708D9796511r284630l061335N249617O106641J438651K598027J2818214K0986914
$$ plain form
38700 86648610 104788968 116053497 128052072 146521357 165918482 178542490 186517557
38693 186517557 198411477 217585573 239304718 257278980 268744266 273950603 273070288
38686 273070288 263274084 239819990 203506532 165818910 140268558 127846147 117902253
38679 117902253 104482008 92728288 85811694 76312737 58561233 40901254 35107483
38672 35107483 39022114 40546534 35405554 29930359 28123552 27404606 27258208 30694250
38664 30694250 35043652 32418081 23684483 21791335 34336062 50831661 55721643 48643795
38656 48643795 42794032 46375888 55274625 63746453 72660827 83575490 91997245 92879542
38648 92879542 89579365 91114358 100460663 109736706 107944857 91026323 64330291 38576874
$$ packed form
38700H6648610J8140358J1264529J1998575J8469285J9397125J2624008P975067
38693A86517557J1893920J9174096K1719145J7974262J1465286N206337q80315
38686B73070288r796204k3454094l6313458l7687622k5550352j2422411r943894
38679A17902253j3420245j1753720o916594r498957j7751504j7659979n793771
38672C5107483L914631J524420n140980n475195j806807p18946j46398L436042
38664C0694250M349402k625571q733598j893148J2544727J6495599M889982p077848
38656D8643795n849763L581856Q898737Q471828Q914374J0914663Q421755Q82297
38648I2879542l300177J534993R346305R276043j791849j6918534k6696032k5753417
$$ plain form
38640 38576874 24140525 25103075 35704227 44674278 45681180 41886449 38739529 36356562
38632 36356562 33123428 32703848 40117303 52188684 59983127 61767565 65579335 75913574
38624 75913574 85418225 84968197 75999578 66642013 60204898 54522867 49684465 48622852
38616 48622852 50392821 49434844 42883181 34483895 30502879 34658885 46439401 60830910
38608 60830910 70384311 71459302 68012424 65551089 62701686 54233130 42104016 36336438
38600 36336438 41750250 49362714 46218270 31312811 16887802 14344953 22671235 31480771
38592 31480771 32618762 26997909 21321368 20169800 21919152 21719231 17650714 13550745
38584 13550745 15522660 25393157 37772988 44122777 39707211 26254594 9200090 -5125334
$$ packed form
38640C8576874j4436349R62550J0601152Q970051J006902l794731l146920k382967
38632C6356562l233134m19580P413455J2071381P794443J784438L811770J0334239
38624G5913574R504651m50028q968619r357565o437115n682031m838402j061613
38616D8622852J769969r57977o551663q399286l981016M156006J1780516J4391509
38608F0830910R553401J074991l446878k461335k849403q468556j2129114n767578
38600C6336438N413812P612464l144444j4905459j4425009k542849Q326282Q809536
38592C1480771J137991n620853n676541j151568J749352j99921m068517m099969
38584A3550745J971915R870497J2379831O349789m415566j3452617j7054504j4325424
$$ plain form
38576 -5125334 -10412980 -3672970 9768864 18871671 18649182 16137591 20444050 30987472
38568 30987472 41567892 51410552 62868207 71072072 67728094 55666324 47559865 47475506
38560 47475506 45672188 35866264 24768052 17805022 8934613 -4755020 -10725194 1940486
38552 1940486 21453586 25469746 10241308 -7133376 -12941159 -8836520 -1108262 6811537
38544 6811537 9812979 3149107 -7631829 -10354969 -2730956 5382657 7932541 8896857
38536 8896857 10081677 6175485 -2539193 -4999661 5425030 20443538 29054638 31358273
38528 31358273 32726342 32793385 28813352 23119721 18923025 14229892 7132810 1408467
38520 1408467 -87618 -1235067 -3968917 -139501 18004807 42953057 57326528 52992206
$$ packed form
38576e125334n287646O740010J3441834R102807k22489k511591M306459J0543422
38568C0987472J0580420R842660J1457655Q203865l343978j2061770q106459q4359
38560D7475506j803318r805924j1098212o963030q870409j3689633n970174J2665680
38552A940486J9513100M016160j5228438j7374684n807783M104639P728258P919799
38544F811537L001442o663872j0780936k723140P624013Q113613K549884R64316
38536H896857J184820l906192q714678k460468J0424691J5018508Q611100K303635
38528C1358273J368069O7043l980033n693631m196696m693133p097082n724343
38520A408467j496085j147449k733850L829416J8144308K4948250J4373471m334322
$$ plain form
38512 52992206 37594418 23683083 18099057 20631467 26225645 28047295 22889214 14167122
38504 14167122 8054949 8272542 14841856 23589788 26669613 20489302 14140616 20768637
38496 20768637 38302497 50469363 51432160 54812319 69049585 79409333 69990956 50816196
38488 50816196 42957600 45061036 37460422 16641094 2047422 5582006 15404034 16683460
38480 16683460 10600913 4712802 318580 -1091696 7552221 27270624 46476899 55252402
38472 55252402 56734593 56507997 51570941 39380528 27407787 22422753 19067491 10784596
38464 10784596 3865195 7115796 13759857 8668896 -8684859 -22164504 -19912676 -6094907
38456 -6094907 8343838 15715316 11407779 -5382655 -26989819 -41083922 -42707815 -37459390
$$ packed form
38512E2992206j5397788j3911335n584026K532410N594178J821650n158081q722092
38504A4167122o112173K17593O569314Q747932L079825o180311o348686O628021
38496B0768637J7533860J2166866R62797L380159J4237266J0359748r418377j9174760
38488E0816196p858596K103436p600614k0819328j4593672L534584R822028J279426
38480A6683460o082547n888111m394222j410276Q643917J9718403J9206275Q775503
38472E5252402J482191k26596m937056j2190413j1972741m985034l355262q282895
38464A0784596o919401L250601O644061n090961j7353755j3479645K251828J3817769
38456f094907J4438745P371478m307537j6790434k1607164j4094103j623893N248425
$$ plain form
38448 -37459390 -31833279 -26789203 -22094121 -19987615 -21404599 -23407433 -22796875 -18555033
38440 -18555033 -9884236 3497225 17980930 27789764 31786982 34652351 40111308 46840444
38432 46840444 51836720 53594912 51065594 43979234 35563674 30609458 29116750 25805676
38424 25805676 17945220 10423407 10921761 21777337 37013907 45660415 39456474 20843161
38416 20843161 2179693 -6580387 -7101691 -5102552 1506566 17261184 34618723 38336821
38408 38336821 27148011 18263624 24189900 36609776 41800326 41478480 46462236 56829335
38400 56829335 61595130 54907111 40940482 24697111 8882926 -1438080 -2217446 1594793
38392 1594793 1727573 -100683 4283489 12883128 14259498 7709351 7661752 20582350
$$ packed form
38448c7459390N626111N044076M695082K106506j416984k002834O10558M241842
38440a8555033Q670797J3381461J4483705R808834L997218K865369N458957O729136
38432D6840444M996276J758192k529318p086360q415560m954216j492708l311074
38424B5805676p860456p521813M98354J0855576J5236570Q646508o203941j8613313
38416B0843161j8663468q760080n21304J999139O609118J5754618J7357539L718098
38408C8336821j1188810q884387N926276J2419876N190550l21846M983756J0367099
38400E6829335M765795o688019j3966629j6243371j5814185j0321006p79366L812239
38392A594793J32780j828256M384172Q599639J376370o550147m7599J2920598
$$ plain form
38384 20582350 31326356 24055789 6308034 -1532786 6105677 17538509 25232268 33663315
38376 33663315 44550048 48978933 40505476 26218701 17799808 18034557 22228992 27492393
38368 27492393 33591212 37541344 34344330 23684985 12104279 7410473 11830295 20022860
38360 20022860 23428534 18325649 10191573 7936441 13442389 19980150 21793293 20844743
38352 20844743 21445716 22536086 19949220 13603580 6879905 -324487 -12162390 -28898053
38344 -28898053 -42768187 -45007171 -35367775 -22158391 -13304216 -9333337 -5702500 -622571
38336 -622571 1503730 -4491784 -16735967 -26094838 -24422180 -11914392 3822830 14320773
38328 14320773 15825503 11381501 9086678 15582332 28308582 35788167 28855245 11042480
$$ packed form
38384B0582350J0744006p270567j7747755p840820P638463J1432832P693759Q431047
38376C3663315J0886733M428885q473457j4286775q418893K34749M194435N263401
38368B7492393O098819L950132l197014j0659345j1580706m693806M419822Q192565
38360B0022860L405674n102885q134076k255132N505948O537761J813143r48550
38352B0844743O00973J090370k586866o345640o723675p204392j1837903j6735663
38344b8898053j3870134k238984R639396J3209384Q854175L970879L630837N079929
38336f22571K126301n995514j2244183r358871J672658J2507788J5737222J0497943
38328A4320773J504730m444002k294823O495654J2726250P479585o932922j7812765
$$ plain form
38320 11042480 -4952706 -10374271 -6566114 1430127 12058811 25027747 35697020
38313 35697020 37302411 29322611 19737263 16845887 21197234 28207898 36650762 49593748
38305 49593748 66106725 77465353 76198654 66186884 58300601 56954191 56850919 53204258
38297 53204258 47862206 42179872 31004824 10496923 -12128313 -24134233 -21081174
38290 -21081174 -8775730 6895947 23890033 37229879 37884992 24089637 8038149
38283 8038149 4574221 15558439 30663688 41430262 48146840 53010969 53600566 47109454
38275 47109454 37217384 31629857 33281667 38048641 42238188 48689316 62120267 80257080
38267 80257080 94485036 100637702 104876294 115188627 129733468 138796498 137696866 131750017
$$ packed form
38320A1042480j5995186n421565L808157P996241J0628684J2968936J0669273
38313C5697020J605391p979800r585348k891376M351347P010664Q442864J2942986
38305D9593748J6512977J1358628j266699j0011770p886283j346410j03272l646661
38297E3204258n342052n682334j1175048k0507901k2625236j2005920L053059
38290b1081174J2305444J5671677J6994086J3339846O55113j3795355j6051488
38283H038149l463928J0984218J5105249J0766574O716578M864129N89597o491112
38275D7109454r892070n587527J651810M766974M189547O451128J3430951J8136813
38267H0257080J4227956O152666M238592J0312333J4544841R063030j099632n946849
$$ plain form
38259 131750017 126444452 118642270 102844903 82537104 67888474 62301282 58628557
38252 58628557 51395580 45674777 47861288 53084387 50967496 41956741 37176173 40151062
38244 40151062 40068178 29720123 19816480 24070997 36704940 39167520 27456660 17757712
38236 17757712 22213946 33059205 37010135 33405975 29613163 28282196 28767424 33014457
38228 33014457 39800152 40360858 30937931 23198480 29437649 42524077 44963359 35006118
38220 35006118 28168264 32747225 39417212 38157276 31295390 25071461 21091321 21565175
38212 21565175 30750849 44607518 50257332 42964669 33485145 31721866 33900945 33648686
38204 33648686 34018359 38110309 38384815 27733877 12826886 3960755 -706894 -7584704
$$ packed form
38259A31750017n305565p802182j5797367k0307799j4648630n587192l672725
38252E8628557p232977n720803K186511N223099k116891r010755m780568K974889
38244D0151062q2884j0348055r903643M254517J2633943K462580j1710860r698948
38236A7757712M456234J0845259L950930l604160l792812j330967M85228M247033
38228C3014457O785695N60706r422927p739451O239169J3086428K439282r957241
38220C5006118o837854M578961O669987j259936o861886o223929l980140M73854
38212B1565175R185674J3856669N649814p292663r479524j763279K179079k52259
38204C3648686L69673M091950K74506j0650938j4906991q866131m667649o877810
$$ plain form
38196 -7584704 -11634274 -3305693 13121358 23503176 23409506 19396073 14026439 5706454
38188 5706454 1023451 8366633 18011135 8277638 -22778981 -49812908 -52501590 -39007477
38180 -39007477 -27059207 -17620052 -1998802 16835250 27278998 27522417 25724844 24638459
38172 24638459 19128913 7667214 -5143245 -16894541 -27917553 -33920535 -28688929
38165 -28688929 -15837344 -8745610 -15442886 -29520761 -38024064 -33392863 -17289483 1279021
38157 1279021 10879901 7293479 159095 4211896 21812768 39606565 44516432 37128634
38149 37128634 26470791 18277953 13946303 15831427 25369387 36660025 38843346 27290407
38141 27290407 9032051 -4866375 -10160608 -11109888 -13269823 -17219976 -19508234 -17818133
$$ packed form
38196g584704m049570Q328581J6427051J0381818r3670m013433n369634q319985
38188E706454m683003P343182R644502r733497l1056619k7033927k688682J3494113
38180c9007477J1948270R439155J5621250J8834052J0443748K43419j797573j086385
38172B4638459n509546j1461699j2810459j1751296j1023012o002982N231606
38165b8688929J2851585P091734o697276j4077875q503303M631201J6103380J8568504
38157A279021R600880l586422p134384M052801J7600872J7793797M909867p387798
38149C7128634j0657843q192838m331650J885124R537960J1290638K183321j1552939
38141B7290407j8258356j3898426n294233r49280k159935l950153k288258J690101
$$ plain form
38133 -17818133 -13627360 -9940617 -7684115 -5168715 -697815 5278103 11080450 16538656
38125 16538656 23848802 34615588 46080077 52131784 49804268 43953441 43384658 52405995
38117 52405995 68031720 84995625 100307342 112105044 117947806 117812814 117390229 124866125
38109 124866125 143688382 169922888 196554124 218473568 232891013 237431951 230967126
38102 230967126 216649561 200974783 186812436 168970692 141195338 107539159 80768663
38095 80768663 67079212 59160664 49618675 43906306 50081946 60768548 59230086 43834386
38087 43834386 32467088 37862137 50898335 55654441 49980269 41488040 32657852 22325795
38079 22325795 15871056 20762073 34406369 47629501 58371903 71271007 85454751
$$ packed form
38133a7818133M190773L686743K256502K515400M470900N975918N802347N458206
38125A6538656P310146J0766786J1464489O051707k327516n850827n68783R021337
38117E2405995J5625725J6963905J5311717J1797702N842762j34992m22585P475896
38109A24866125J8822257K6234506K6631236K1919444J4417445M540938o464825
38102B30967126j4317565j5674778j4162347j7841744k7775354l3656179k6770496
38095H0768663j3689451p918548r541989n712369O175640J0686602j538462j5395700
38087D3834386j1367298N395049J3036198M756106n674172q492229q830188j0332057
38079B2325795o454739M891017J3644296J3223132J0742402J2899104J4183744
$$ plain form
38072 85454751 94321097 97020785 98520580 97796537 88348249 72792685 64491710 69925308
38064 69925308 80253158 85491183 86322071 85604782 79317652 65327801 52476779 50208782
38056 50208782 54738723 55251269 49230062 42124315 35762195 27289758 17740022 12542521
38048 12542521 14289655 22007009 35051002 49919477 56803303 49799132 38597204 38281525
38040 38281525 47740510 51100486 42597597 35715365 41374301 50630459 49849900 42628793
38032 42628793 42472864 49310281 48754178 34775998 19303839 14844754 17864254 15950661
38024 15950661 4867638 -8164237 -14227180 -9957353 2248892 15767352 22861824
38017 22861824 21243473 17359166 19474843 27895463 35453191 36796393 32790507 25888348
$$ packed form
38072H5454751Q866346K699688J499795p24043r448288j5555564q300975N433598
38064F9925308J0327850N238025Q30888p17289o287130j3989851j2851022k267997
38056E0208782M529941N12546o021207p105747o362120q472437r549736n197501
38048A2542521J747134P717354J3043993J4868475O883826p004171j1201928l15679
38040C8281525R458985L359976q502889o882232N658936R256158p80559p221107
38032D2628793j55929O837417n56103j3978180j5472159m459085L019500j913593
38024A5950661j1083023j3031875o062943M269827J2206245J3518460P094472
38017B2861824j618351l884307K115677Q420620P557728J343202m005886o902159
$$ plain form
38009 25888348 16425433 5275486 -4173245 -9172413 -9481851 -4446883 7345114 22676472
38001 22676472 32820239 32742898 27490027 24321535 22234338 15878298 6880489 2957978
37993 2957978 6544174 12491820 17422280 23209472 30247233 35878161 41010108 48544171
37985 48544171 52739637 42162272 19306973 4915450 12334962 27885567 30103877
37978 30103877 20585623 19308983 32989758 45744172 42814870 28042660 13279407
37971 13279407 3439509 -2215016 -4743639 -7343146 -13427896 -18496355 -13716458 -1641840
37963 -1641840 3642285 -1938767 -4225994 6341000 17004822 11507738 -4371828 -12968691
37955 -12968691 -12804470 -17471796 -29759834 -36595480 -31209132 -22218212 -16248728 -8074718
$$ packed form
38009B5888348r462915j1149947r448731m999168l09438N034968J1791997J5331358
38001B2676472J0143767p7341n252871l168492k087197o356040q997809l922511
37993B957978L586196N947646M930460N787192P037761N630928N131947P534063
37985D8544171M195466j0577365k2855299j4391523P419512J5550605K218310
37978C0103877r518254j276640J3680775J2754414k929302j4772210j4763253
37971A3279407r839898n654525k528623k599507o084750n068459M779897J2074618
37963a641840N284125n581052k287227J0566994J0663822n497084j5879566q596863
37955a2968691J64221m667326j2288038o835646N386348Q990920N969484Q174010
$$ plain form
37947 -8074718 5068095 14106464 12209581 6488102 6255998 9559746 10512292 10377078
37939 10377078 11162733 7118085 -5599156 -17881562 -18805044 -12499462 -11379192 -16990806
37931 -16990806 -21073213 -22550782 -28482535 -38284582 -41847271 -35710057 -27427974 -20586437
37923 -20586437 -9675495 4665795 10022738 1375314 -6582689 1210797 17625176 23906183
37915 23906183 16601226 8960948 8251008 7524558 2094155 -326563 7140839 17489268
37907 17489268 19251597 13510150 12226097 20705597 29448316 26014776 10560545 -4678897
37899 -4678897 -10203253 -8606113 -6833860 -4053842 5472748 18759119 23399462 14512104
37891 14512104 3259065 1115122 3584904 -107760 -7656673 -7944189 -1607778 -995193
$$ packed form
37947h074718J3142813R038369j896883n721479k32104L303748R52546j35214
37939A0377078P85655m044648j2717241j2282406r23482O305582J120270n611614
37931a6990806m082407j477569n931753r802047l562689O137214Q282083O841537
37923b0586437J0910942J4341290N356943q647424p958003P793486J6414379O281007
37915B3906183p304957p640278p09940p26450n430403k420718P467402J0348429
37907A7489268J762329n741447j284053Q479500Q742719l433540j5454231j5239442
37899d678897n524356J597140J772253K780018R526590J3286371M640343q887358
37891A4512104j1253039k143943K469782l692664p548913k87516O336411O12585
$$ plain form
37883 -995193 -7845108 -7859146 5653290 18212271 15690287 6976424 10012061 23139380
37875 23139380 27896255 18463917 11125534 19945506 36108333 39458674 23327300 429756
37867 429756 -12547580 -10778576 -3289845 -3050030 -15263478 -33941673 -48779474 -53369113
37859 -53369113 -46679696 -31854801 -17700548 -15876065 -28414844 -40680456 -36233285
37852 -36233285 -18558227 -8256613 -16904487 -33766546 -42479073 -40945612 -37628485 -36355206
37844 -36355206 -34458004 -31234506 -28233140 -22735336 -9957646 7552825 19829877 20518615
37836 20518615 12919061 3881974 -3347555 -8411452 -10629642 -9919413 -8677914 -9840485
37828 -9840485 -13604684 -17374237 -18279231 -15084770 -8943731 -3802185 -5166050 -15528805
$$ packed form
37883i95193o849915j4038J3512436J2558981k521984q713863L035637J3127319
37875B3139380M756875r432338p338383Q819972J6162827L350341j6131374k2897544
37867D29756j2977336J769004P488731K39815j2213448j8678195j4837801m589639
37859e3369113O689417J4824895J4154253J824483j2538779j2265612M447171
37852c6233285J7675058J0301614q647874j6862059q712527J533461L317127J273279
37844c6355206J897202L223498L001366N497804J2777690J7510471J2277052O88738
37836B0518615p599554r037087p229529n063897k218190P10229J241499j162571
37828i840485l764199l769553r04994L194461O141039N141546j363865j0362755
$$ plain form
37820 -15528805 -29394010 -35315863 -27229620 -13596082 -9500376 -17093987 -20629554 -7456044
37812 -7456044 11866177 14964025 -3193634 -24648087 -32525471 -27496402 -16773629 -1885884
37804 -1885884 13302597 15871327 -369774 -20569367 -25293969 -16221471 -10823236 -15725679
37796 -15725679 -22092153 -25856256 -33556500 -44410247 -44794581 -29295844 -12805653 -10768826
37788 -10768826 -18245169 -19936217 -12494487 -4880457 -2474752 -2962938 -5026692 -10156072
37780 -10156072 -16502381 -19610613 -19134749 -18059572 -16269554 -11677245 -6876438 -7670573
37772 -7670573 -14546975 -21207661 -22005101 -16512596 -7496737 870291 3662323 -823229
37764 -823229 -8146033 -13303438 -18152284 -28022282 -41690901 -50658358 -49070007 -39460732
$$ packed form
37820a5528805j3865205n921853Q086243J3633538M095706p593611l535567J3173510
37812g456044J9322221L097848j8157659k1454453p877384N029069J0722773J4887745
37804a885884J5188481K568730j6241101k0199593m724602R072498N398235m902443
37796a5725679o366474l764103p700244j0853747l84334J5498737J6490191K036827
37788a0768826p476343j691048P441730P614030K405705m88186k063754n129380
37780a0156072o346309l108232M75864J075177J790018M592309M800807p94135
37772g670573o876402o660686p97440N492505R015859Q367028K792032m485552
37764h23229p322804n157405m848846r869998j3668619q967457J588351R609275
$$ plain form
37756 -39460732 -27958139 -18319992 -11593096 -7524020 -4875642 -2834777 -2254782 -3607123
37748 -3607123 -5366409 -6912378 -9660640 -11182185 -3139174 16766885 33802762 28090816
37740 28090816 -1025732 -31881060 -44744130 -40732072 -32711875 -26432890 -18457178 -7447746
37732 -7447746 1439065 3246336 -800640 -4622709 -2615909 5576733 14496145 18297114
37724 18297114 16551858 12242243 5524837 -5057780 -15314666 -16615749 -7028031 4979222
37716 4979222 11291545 12742874 13372903 12727863 9501816 7293480 9790392 13731471
37708 13731471 13253463 8929423 6646094 9244203 14252625 18096842 18200811 13317475
37700 13317475 6097525 2433261 3841646 4167577 -1202734 -7580635 -8951751 -8495298
$$ packed form
37756c9460732J1502593R638147O726896M069076K648378K040865N79995j352341
37748c607123j759286j545969k748262j521545Q043011J9906059J7035877n711946
37740B8090816k9116548l0855328j2863070M012058Q020197O278985P975712J1009432
37732g447746Q886811J807271m046976l822069K006800Q192642Q919412L800969
37724A8297114j745256m309615o717406j0582617j0256886j301083R587718J2007253
37716D979222O312323J451329O30029o45040l226047k208336K496912L941079
37708A3731471m78008m324040k283329K598109N008422L844217J03969m883336
37700A3317475p219950l664264J408385L25931n370311o377901j371116M56453
$$ plain form
37692 -8495298 -12041696 -15246381 -9034786 3483355 8357206 1167067 -5991757 -2569415
37684 -2569415 6195157 9898582 8610558 8914033 10840453 8937481 3232711 -627024
37676 -627024 -1705482 -5437821 -13156706 -17578367 -13270958 -6789761 -10238259 -25797327
37668 -25797327 -42333055 -49111934 -47956291 -47166518 -46887219 -38719304 -20728502 -3933162
37660 -3933162 1236805 -2401986 -6795419 -12377855 -23320328 -33912062 -33147665 -22130891
37652 -22130891 -13239547 -10221469 -3411312 10700154 20187202 16810868 10693027 13221279
37644 13221279 16766994 8189523 -4457600 1527479 29779623 55329101 54690507 32597874
37636 32597874 11075603 1479117 -2858387 -10610851 -18696171 -16779589 -2342510 12084221
$$ packed form
37692h495298l546398l204685O211595J2518141M873851p190139p158824L422342
37684b569415Q764572L703425j288024L03475J926420j902972n704770l859735
37676f27024j078458l732339p718885m421661M307409O481197l448498j5559068
37668b5797327j6535728o778879J155643P89773K79299Q167915J7990802J6795340
37660c933162N169967l638791m393433n582436j0942473j0591734P64397J1016774
37652b2130891Q891344L018078O810157J4111466R487048l376334o117841K528252
37644A3221279L545715q577471j2647123N985079K8252144K5549478o38594k2092633
37636C2597874k1522271r596486m337504p752464q085320J916582J4437079J4426731
$$ plain form
37628 12084221 10240045 -8144225 -23979803 -19986515 -478241 17133690 25347132
37621 25347132 29358708 29492164 17027145 -7442985 -25466097 -20496665 2104825 23511341
37613 23511341 32563783 29791051 18227231 2594555 -6404329 -288249 13883177 18486130
37605 18486130 5461927 -16164345 -33226738 -39933812 -34985215 -17763851 6325977
37598 6325977 23874664 25014324 14729639 6934569 8345165 12752196 11005576 2586427
37590 2586427 -4540230 -4203207 -226694 -2718530 -15664073 -30510462 -34777317 -25458326
37582 -25458326 -10284138 2589812 10305275 11005635 1996466 -13539929 -24198703 -21306283
37574 -21306283 -9258423 804665 5132029 8765311 14393438 17592347 14635361 8431746
$$ packed form
37628A2084221j844176j8384270j5835578L993288J9508274J7611931Q213442
37621B5347132M011576J33456j2465019k4470130j8023112M969432K2601490K1406516
37613B3511341R052442k772732j1563820j5632676q998884O116080J4171426M602953
37605A8486130j3024203k1626272j7062393o707074M948597J7221364K4089828
37598F325977J7548687J139660j0284685p795070J410596M407031j746620q419149
37590B586427p126657L37023L976513k491836j2945543j4846389m266855R318991
37582b5458326J5174188J2873950P715463P00360r009169j5536395j0658774K892420
37574b1306283J2047860J0063088M327364L633282N628127L198909k956986o203615
$$ plain form
37566 8431746 3652822 1148630 713586 4475321 12389943 17832655 14013068 3648902
37558 3648902 -3809394 -4902158 -6205224 -13848111 -24506741 -30345048 -28502345 -21155862
37550 -21155862 -9943665 3346564 12496084 11038115 2072651 -2956173 1290861 6399884
37542 6399884 1764385 -10630887 -19149000 -17504184 -9648988 -255955 11720782 26996075
37534 26996075 39733514 42992914 37854365 32010711 29656786 26921350 18441257 5436924
37526 5436924 -5290372 -9550653 -10344557 -13144710 -18537374 -22484107 -23522243 -25515266
37518 -25515266 -31115543 -36303634 -35391946 -28617586 -19827125 -9160373 5146959 18959156
37510 18959156 24992308 24686948 27752098 35528553 34487054 14624261 -12993443 -27877916
$$ packed form
37566H431746m778924k504192m35044L761735P914622N442712l819587j0364166
37558C648902p458296j092764j303066p642887j0658630n838307J842703P346483
37550b1155862J1212197J3290229R149520j457969q965464n028824M247034N109023
37542F399884m635499j2395272q518113J644816P855196R393033J1976737J5275293
37534B6996075J2737439L259400n138549n843654k353925k735436q480093j3004333
37526E436924j0727296m260281p93904k800153n392664l946733j038136j993023
37518b5515266n600277n188091R11688O774360Q790461J0666752J4307332J3812197
37510A8959156O033152l05360L065150P776455j041499j9862793k7617704j4884473
$$ plain form
37502 -27877916 -25226020 -17940358 -15500970 -13770345 -7857154 -2378894 -2365050 -3437978
37494 -3437978 592810 6768550 8133278 5186853 3183601 1102720 -6411206 -16226667
37486 -16226667 -16492774 -3332842 10436261 10014988 -2722130 -12788288 -12393421 -9583492
37478 -9583492 -14627892 -24733272 -28303550 -21487937 -13199659 -12146898 -14846810 -11360562
37470 -11360562 29685 10034436 10889298 6747724 8439323 19696086 31288955 29445569
37462 29445569 10259476 -14032094 -24923540 -16156795 -928427 2954958 -6163190
37455 -6163190 -13246882 -6759547 7677612 16553788 14323758 4791998 -6947147 -16124184
37447 -16124184 -16426948 -6617489 2180512 -3790353 -22039442 -34091359 -28340850 -13840560
$$ packed form
37502b7877916K651896P285662K439388J730625N913191N478260J3844j072928
37494c437978M030788O175740J364728k946425k003252k080881p513926r815461
37486a6226667k66107J3159932J3769103m21273j2737118j0066158L94867K809929
37478i583492n044400j0105380l570278O815613Q288278J052761k699912L486248
37470a1360562J1390247J0004751Q54862m141574J691599J1256763J1592869j843386
37462B9445569j9186093k4291570j0891446Q766745J5228368L883385r118148
37455f163190p083692O487335J4437159Q876176k230030r531760j1739145r177037
37447a6124184l02764R809459Q798001n970865j8249089j2051917N750509J4500290
$$ plain form
37439 -13840560 -5793145 -6219496 -8328565 -13082388 -27398891 -46334357 -51333377 -32800486
37431 -32800486 -5123533 9276557 5367411 -3324111 -4583888 1707219 10929180 19474351
37423 19474351 19641420 383152 -37598264 -73688747 -84419148 -67444903 -42031209
37416 -42031209 -28115754 -31641861 -46786338 -62002385 -64380867 -49700415 -31194487
37409 -31194487 -28242112 -42430701 -54768731 -51184994 -39148964 -31258088 -24608973 -9541654
37401 -9541654 9945989 20488821 19827932 17175077 14763216 5491227 -9306588 -16094307
37393 -16094307 -9037718 -283952 -2919110 -14403360 -24212691 -28077798 -27092737 -22098663
37385 -22098663 -17051095 -18880655 -25488907 -23682727 -9435390 76369 -11293532 -32779980
$$ packed form
37439a3840560Q047415m26351k109069m753823j4316503j8935466m999020J8532891
37431c2800486K7676953J4400090l909146q691522j259777O291107R221961Q545171
37423A9474351J67069j9258268l7981416l6090483j0730401J6974245K5413694
37416d2031209J3915455l526107j5144477j5216047k378482J4680452J8505928
37409c1194487K952375j4188589j2338030L583737J2036030P890876O649115J5067319
37401i541654J9487643J0542832o60889k652855k411861r271989j4797815o787719
37393a6094307P056589Q753766k635158j1484250r809331l865107R85061M994074
37385b2098663N047568j829560o608252J806180J4247337R511759j1369901k1486448
$$ plain form
37377 -32779980 -40268843 -30800396 -24217993 -30987876 -38851501 -36612818 -32075592 -35779607
37369 -35779607 -41908672 -38867602 -28624724 -21685854 -19684802 -16575607 -12570533 -12995327
37361 -12995327 -15163020 -10130660 1509397 8261294 5153748 943391 3183827 7029411
37353 7029411 5962605 3919340 6973579 10356746 5823079 -1961139 406264 14136892
37345 14136892 23707190 16896564 -677883 -16109847 -25285751 -31502924 -35460456 -35391972
37337 -35391972 -32647846 -28918450 -21490413 -9419839 -762988 -3837760 -13453092 -16576000
37329 -16576000 -10943115 -6267821 -6252170 -3337886 4024481 3287154 -13125711 -31995943
37321 -31995943 -35796724 -28239479 -29375237 -47742616 -70233823 -79976426 -73137520 -56008087
$$ packed form
37377c2779980p488863R468447O582403o769883p863625K238683M537226l704015
37369c5779607o129065L041070J0242878O938870K001052L109195M005074m24794
37361a2995327k167693N032360J1640057O751897l107546m210357K240436L845584
37353G029411j066806k043265L054239L383167m533667p784218K367403J3730628
37345A4136892R570298o810626j7574447j5431964r175904o217173l957532O8484
37337c5391972K744126L729396P428037J2070574Q656851l074772r615332l122908
37329a6576000N632885M675294J5651K914284P362367p37327j6412865j8870232
37321c1995943l800781P557245j135758j8367379k2491207r742603O838906J7129433
$$ plain form
37313 -56008087 -35446866 -16789278 -4768391 -1720933 -7001527 -18558190 -31961868
37306 -31961868 -39654732 -37014189 -28684697 -23094587 -21312185 -17684273 -10657616 -5014517
37298 -5014517 -2783768 -121886 5124711 10819415 17476596 28778279 41371938 43271380
37290 43271380 28902113 8984722 -1351430 778806 7205105 11285229 12464028 12421144
37282 12421144 13759913 19738610 29044665 33539474 27259104 14692557 3441788 -8220180
37274 -8220180 -27684159 -52721004 -69429891 -68541825 -56907620 -48362498 -47553041 -47709604
37266 -47709604 -42591443 -35614055 -34978716 -41494607 -45054999 -35970491 -17868615 -4475131
37258 -4475131 -3469388 -9378590 -14176801 -17553588 -21653220 -22660155 -16267335 -7518233
$$ packed form
37313e6008087K0561221J8657588J2020887L047458n280594j1556663j3403678
37306c1961868p692864K640543Q329492N590110J782402L627912P026657N643099
37298e014517K230749K661882N246597N694704O657181J1301683J2593659J899442
37290D3271380j4369267j9917391j0336152K130236O426299M080124J178799m2884
37282A2421144J338769N978697R306055M494809o280370j2566547j1250769j1661968
37274h220180j9463979k5036845j6708887Q88066J1634205Q545122Q09457j56563
37266d7709604N118161O977388O35339o515891l560392R084508J8101876J3393484
37258d475131J005743n909202m798211l376787m099632j006935O392820Q749102
$$ plain form
37250 -7518233 -5470615 -9321751 -9454195 -2914671 1874728 -987128 -5011611 -992239
37242 -992239 9613036 17403166 17377253 12385499 6391306 342794 -5364266 -9287275
37234 -9287275 -11146684 -12461686 -13640224 -13022347 -10752151 -11510254 -19747173 -31705864
37226 -31705864 -35949921 -25504141 -8099694 438969 -5871416 -16116030 -15637618 -2027017
37218 -2027017 15726362 29862793 39338874 44597022 44355753 39355176 33845830 30340443
37210 30340443 26098566 17433581 5540133 -3884698 -5701994 701933 11148435 20026453
37202 20026453 25005182 27832067 29457837 27045183 19290442 12082056 12669594 18404292
37194 18404292 18067869 6616143 -7395976 -12930616 -10256480 -8591171 -12933790 -19112214
$$ packed form
37250g518233K047618l851136j32444O539524M789399k861856m024483M019372
37242i92239J0605275P790130k5913m991754n994193o048512n707060l923009
37234i287275j859409j315002j178538O17877K270196p58103q236919j1958691
37226c1705864m244057J0445780J7404447Q538663o310385j0244614M78412J3610601
37218b027017J7753379J4136431R476081N258148k41269n000577n509346l505387
37210C0340443m241877q664985j1893448r424831j817296O403927J0446502Q878018
37202B0026453M978729K826885J625770k412654p754741p208386N87538N734698
37194A8404292l36423j1451726j4012119n534640K674136J665309m342619o178424
$$ plain form
37186 -19112214 -21881796 -23018986 -28373703 -38020660 -42593186 -32713785 -12353721 1889135
37178 1889135 -909788 -12073043 -14779952 -7361823 -4661902 -13937954 -21353306 -11090513
37170 -11090513 10648791 22848219 16931740 3966362 -5045548 -12532462 -23434840
37163 -23434840 -32714838 -32736112 -25712787 -18845389 -11560552 1527767 16544809 21053068
37155 21053068 11517577 -230878 -3572666 -3487587 -10067864 -19929762 -19152910 -3245766
37147 -3245766 16192477 26352090 26215700 22040155 17773710 14248510 11463797 6856407
37139 6856407 -3380275 -16811834 -24308882 -22111672 -17961208 -18372947 -16267615 -1045983
37131 -1045983 23265483 41132710 45147908 41438122 35794573 26766911 15420104 9859651
$$ packed form
37186a9112214k769582j137190n354717r646957m572526R879401K0360064J4242856
37178A889135k798923j1163255k706909P418129K699921r276052p415352J0262793
37170a1090513K1739304J2199428n916479j2965378r011910p486914j0902378
37163b3434840r279998k1274P023325O867398P284837J3088319J5017042M508259
37155B1053068r535491j1748455l341788Q5079o580277r861898P76852J5907144
37147c245766J9438243J0159613j36390m175545m266445l525200k784713m607390
37139F856407j0236682j3431559p497048K197210M150464m11739K105332J5221632
37131a045983K4311466J7867227M015198l709786n643549r027662j1346807n560453
$$ plain form
37123 9859651 13437251 17573733 14062040 7634353 7850300 13259059 12844208 1808627
37115 1808627 -11958148 -18014837 -14090737 -4443637 8517538 26573036 48835310 65874762
37107 65874762 66573076 53026073 42314487 46623821 56288282 52867053 36912232 29379637
37099 29379637 42882456 65103805 77461447 77997368 75780476 72788682 64315773 51249168
37091 51249168 39036721 27983814 16488904 10740443 17879064 30419627 31507797
37084 31507797 18121894 6207548 7996848 15767540 15141758 4812806 -6121455 -13446121
37076 -13446121 -19514350 -22779599 -17274839 -5023638 -339413 -15395802 -44484098 -68013660
37068 -68013660 -71831964 -58439129 -39129110 -21277836 -7355972 -772444 -4005783
$$ packed form
37123I859651L577600M136482l511693o427687K15947N408759m14851j1035581
37115A808627j3766775o056689L924100R647100J2961175J8055498K2262274J7039452
37107F5874762O98314j3547003j0711586M309334R664461l421229j5954821p532595
37099B9379637J3502819K2221349J2357642N35921k216892k991794q472909j3066605
37091E1249168j2212447j1052907j1494910n748461P138621J2540563J088170
37084C1507797j3385903j1914346J789300P770692o25782j0328952j0934261p324666
37076a3446121o068229l265249N504760J2251201M684225j5056389k9088296k3529562
37068f8013660l818304J3392835J9310019J7851274J3921864O583528l233339
$$ plain form
37061 -4005783 -12094025 -16767292 -18039279 -22651854 -28836158 -23895924 -3474071 17339009
37053 17339009 22522068 16901995 17056210 25629527 28776958 18205872 2789216 -3766646
37045 -3766646 3131459 18896768 34538801 40232370 33067757 22789074 21643218 28107708
37037 28107708 29910451 23269514 17756708 20117204 25279644 27366779 27990022 28404970
37029 28404970 24873511 18371028 17660418 24411739 25810779 12342354 -5791737 -11735299
37021 -11735299 -5107594 165243 -2627219 -5809657 -1297272 8113538 13308909 9176562
37013 9176562 -271093 -4538990 2938817 14792722 15900887 3535849 -6370757 54049
37005 54049 15488691 22676600 18232999 13252461 14292520 16726642 15793064 11913845
$$ packed form
37061d005783q088242m673267j271987m612575o184304M940234K0421853K0813080
37053A7339009N183059n620073J54215Q573317L147431j0571086j5416656o555862
37045c766646O898105J5765309J5642033N693569p164613j0278683j145856O464490
37037B8107708J802743o640937n512806K360496N162440K087135O23243M14948
37029B8404970l531459o502483p10610O751321J399040j3468425j8134091n943562
37021a1735299O627705N272837k792462l182438M512385R410810N195371m132347
37013I176562r447655m267897P477807J1853905J108165j2365038r906606O424806
37005E4049J5434642P187909m443601m980538J040059K434122r33578l879219
$$ plain form
36997 11913845 4471812 -8003189 -19266333 -17874356 -2597880 12861494 14992583
36990 14992583 4539142 -7303983 -11022331 -4542782 7796420 19022542 25474878
36983 25474878 29944580 36112711 41475284 40493487 32770421 22322801 11263584 1375137
36975 1375137 -1138946 7556856 18719304 18865492 8609768 2330266 6979268 13206556
36967 13206556 11769073 6858246 6297946 8838930 9803775 11406754 18309308 28300922
36959 28300922 35497455 38787953 40477809 40458797 37570643 32895252 26934937 18364996
36951 18364996 9991163 9278264 16920831 21932142 15895584 5576054 2134160 3633852
36943 3633852 -515069 -11281134 -18244060 -15587383 -9062260 -5607314 -4876133 -3118900
$$ packed form
36997A1913845p442033j2475001j1263144J391977J5276476J5459374K131089
36990A4992583j0453441j1843125l718348O479549J2339202J1226122O452336
36983B5474878M469702O168131N362573r81797p723066j0447620j1059217r888447
36975A375137k514083Q695802J1162448J46188j0255724o279502M649002O227288
36967A3206556j437483m910827n60300K540984R64845J602979O902554R991614
36959B8300922P196533L290498J689856j9012k888154m675391n960315q569941
36951A8364996q373833p12899P642567N011311o036558j0319530l441894J499692
36943C633852m148921j0766065o962926K656677O525123L454946P31181J757233
$$ plain form
36935 -3118900 1388627 8092632 13517540 11179692 -1076718 -14080488 -15467237 -5330397
36927 -5330397 4077531 5094709 2468739 2355372 2708073 -666429 -6067860 -9971776
36919 -9971776 -13636362 -19343960 -23741970 -21196244 -12328547 -4396028 -3344638 -8159777
36911 -8159777 -12502560 -10255202 -489023 11786177 20656464 25043636 27615485 28789924
36903 28789924 25539094 16671985 5590178 -3451184 -8845549 -10752046 -10052699 -8886433
36895 -8886433 -8921780 -8758756 -6501889 -4342163 -5751610 -8719473 -8247078 -5804936 -8265778
36886 -8265778 -15330497 -16822774 -7096479 5809913 11241206 8800848 3472892 -4441488
36878 -4441488 -15215092 -21677444 -16783933 -6362560 -3384167 -10752914 -20017295 -25961200
$$ packed form
36935c118900M507527O704005N424908k337848j2256410j3003770j386749J0136840
36927e330397R407928J017178k625970j13367L52701l374502n401431l903916
36919i971776l664586n707598m398010K545726Q867697P932519J051390m815139
36911h159777m342783K247358R766179J2275200Q870287M387172K571849J174439
36903B8789924l250830q867109j1081807r041362n394365j906497O99347J166266
36895h886433l5347J63024K256867K159726j409447k967863M72395K442142k460842
36886h265778p064719j492277R726295J2906392N431293k440358n327956p914380
36878d441488j0773604o462352M893511J0421373K978393p368747r264381n943905
$$ plain form
36870 -25961200 -30725165 -32940379 -26205725 -12999093 -7790727 -18011572 -30799131 -28080655
36862 -28080655 -8996102 11651917 22779598 25334864 23671920 18456085 9399917 -1578287
36854 -1578287 -11424271 -16123472 -10824309 4700642 21503195 28990195 27591055 27304790
36846 27304790 32237083 33963330 24110570 7177595 -5062960 -8009001 -6972919 -7769939
36838 -7769939 -10875634 -14722315 -19046442 -23062137 -24084767 -20579241 -14920429 -11141568
36830 -11141568 -10392628 -9834389 -6446547 -1718005 -1469070 -9596280 -22640371 -32904880
36822 -32904880 -36397944 -33833585 -24080461 -3851902 22343128 39669585 38938228 30340791
36814 30340791 30511135 38125149 35440612 15841231 -4509016 -9786917 -6767012 -12044383
$$ packed form
36870b5961200m763965k215214O734654J3206632N208366j0220845j2787559K718476
36862b8080655J9084553K0648019J1127681K555266j662944n215835r056168j0978204
36854a578287r845984m699201N299163J5524951J6802553P487000j399140k86265
36846B7304790M932293J726247r852760j6932975j2240555k946041J036082p97020
36838g769939l105695l846681m324127m015695j022630L505526N658812L778861
36830a1141568P48940N58239L387842M728542K48935q127210j3044091j0264509
36822c2904880l493064K564359R753124K0228559K6195030J7326457p31357q597437
36814C0340791J70344P614014k684537j9599381k0350247n277901L019905n277371
$$ plain form
36806 -12044383 -25518248 -31350741 -22279668 -8589863 -1758017 -1651757 -3540554 -7044811
36798 -7044811 -12249316 -14741287 -10891963 -3222353 3992197 9792275 13596197 12729823
36790 12729823 7367487 2752446 1685713 65590 -4488025 -5081018 5463418 21390495
36782 21390495 28464865 21176722 8435901 1801546 4224537 11313072 18023746 21864344
36774 21864344 22884671 21970091 17605635 6026988 -11783804 -25440172 -23716327 -8236145
36766 -8236145 6835141 10220022 4322529 -551229 1655404 8177874 11326872 5016865
36758 5016865 -9835097 -24991967 -32002998 -29838085 -23368106 -15926784 -7822017 -1003989
36750 -1003989 1202237 17260 868460 5158834 7721572 4633222 -1618075 -6877210
$$ packed form
36806a2044383j3473865n832493R071073J3689805O831846J06260j888797l504257
36798g044811n204505k491971L849324P669610P214550N800078L803922q66374
36790A2729823n362336m615041j066733j620123m553615n92993J0544436J5927077
36782B1390495P074370p288143j2740821o634355K422991P088535O710674L840598
36774B1864344J020327r14580m364456j1578647j7810792j3656368J723845J5480182
36766h236145J5071286L384881n897493m873758K206633O522470L148998o310007
36758E016865j4851962j5156870p011031K164913O469979P441322Q104767O818028
36750a003989K206226j184977Q51200M290374K562738l088350o251297n259135
$$ plain form
36742 -6877210 -9653317 -8389954 -978209 9203167 13324289 8457665 3089211 5256354
36734 5256354 10785581 10914413 6977833 8058536 15864849 21294552 16789854 4611910
36726 4611910 -8455399 -18073286 -22327157 -20678091 -15574557 -11136745 -8533070 -5776329
36718 -5776329 -2139088 1433640 6061508 13673425 21642277 24963109 25305288 30845064
36710 30845064 43310927 51628541 44625983 26188121 11150642 7718058 10101787 8692267
36702 8692267 1823829 -4969259 -7747817 -8614442 -12118489 -19919722 -29851497 -38598952
36694 -38598952 -43408856 -41717469 -31915030 -15940433 670946 12895925 18853014 17447862
36686 17447862 7015565 -10200897 -25107398 -28512613 -20237282 -7740464 2477982
$$ packed form
36742f877210k776107J263363P411745J0181376M121122m866624n368454K167143
36734E256354N529227J28832l936580J080703P806313N429703m504698j2177944
36726D611910j3067309r617887m253871J649066N103534M437812K603675K756741
36718e776329L637241L572728M627868P611917P968852L320832L42179N539776
36710C0845064J2465863Q317614p002558j8437862j5037479l432584K383729j409520
36702H692267o868438o793088k778558q66625l504047p801233r931775q747455
36694c8598952m809904J691387R802439J5974597J6611379J2224979N957089j405152
36686A7447862j0432297j7216462j4906501l405215Q275331J2496818J0218446
$$ plain form
36679 2477982 7164163 2698300 -12187035 -29217993 -34873942 -25749659 -12777248 -5862160
36671 -5862160 -1359636 8717166 21017774 23613016 12580853 -2572144 -10992724 -11606932
36663 -11606932 -10150285 -9938164 -8936121 -4126417 3778575 10416122 12410051 11329968
36655 11329968 11413230 13351757 13245234 8970409 4228417 3460719 5196003 3746151 -3713571
36646 -3713571 -14129400 -21357336 -20457616 -11548293 -1289885 2113608 -2555652 -8894190
36638 -8894190 -12299521 -15220698 -19912027 -21677811 -14994735 -1964204 11488571 23479866
36630 23479866 32952411 33285070 19626257 944963 -6594235 123836 7576087 5021648
36622 5021648 -2320665 -4295993 -1039020 221442 -2324097 -3774821 -1285866 2230816
$$ packed form
36679B477982M686181m465863j4885335j7030958n655949R124283J2972411O915088
36671e862160M502524J0076802J2300608K595242j1032163j5152997q420580o14208
36663a1606932J456647K12121J002043M809704P904992O637547J993929j080083
36655A1329968Q3262J938527j06523m274825m741992p67698J735284j449852p459722
36646c713571j0415829p227936Q99720Q909323J0258408L403493m669260o338538
36638h894190l405331k921177m691329j765784O683076J3030531J3452775J1991295
36630B3479866R472545L32659j3658813j8681294p539198O718071P452251k554439
36622E021648p342313j975328L256973J260462k545539j450724K488955L516682
$$ plain form
36614 2230816 2681240 -702506 -5055255 -6523000 -4742631 -4980121 -12516305 -24722619
36606 -24722619 -33607605 -36901503 -40050791 -45040977 -44988351 -34757933 -20209139 -10447387
36598 -10447387 -6179680 -2473767 1837943 5294702 10442822 20618522 32074733 37577184
36590 37577184 36929442 36296067 37792232 37580566 34142085 30226297 25736964 17085947
36582 17085947 5918110 466111 4292092 10147420 9400997 2391056 -4723792 -8535968
36574 -8535968 -9072268 -5774767 2009800 12283785 21571870 27197476 26613175 18118679
36566 18118679 5432458 -2061777 1708285 11875631 17509968 12757679 577122 -12103045
36558 -12103045 -19306130 -18146259 -10382756 -1309184 5900701 13560765 24074465 32850338
$$ packed form
36614B230816M50424l383746m352749j467745J780369k37490p536184j2206314
36606b4722619q884986l293898l149288m990186N2626J0230418J4548794R761752
36598a0447387M267707L705913M311710L456759N148120J0175700J1456211N502451
36590C7577184o47742o33375J496165k11666l438481l915788m489333q651017
36582A7085947j1167837n451999L825981N855328p46423p009941p114848l812176
36574h535968n36300L297501P784567J0273985R288085N625606n84301q494496
36566A8118679j2686221p494235L770062J0167346N634337m752289j2180557j2680167
36558a2103045p203085J159871P763503R073572P209885P660064J0513700Q775873
$$ plain form
36550 32850338 31303322 17467419 182687 -8626805 -4486960 6521569 13527033 10432421
36542 10432421 1611563 -2564805 2826790 11992714 16209558 13831815 8992674 3278012
36534 3278012 -5392988 -16115182 -23367286 -23999488 -21649935 -21855705 -25463134 -28642442
36526 -28642442 -27394597 -20923794 -12305492 -6359878 -5477212 -8225060 -13607901 -23691011
36518 -23691011 -37560262 -45840134 -39308336 -22824487 -11662194 -11490563 -11075498 248730
36510 248730 16604152 24664038 21827475 16178541 13216310 12489971 14061578 17579107
36502 17579107 16506202 4739601 -10308177 -12743294 500351 13992430 14595997 8399447
36494 8399447 9648801 20290806 29355412 28423306 19449312 9166995 2412414 86741
$$ packed form
36550C2850338j547016j3835903j7284732q809492M139845J1008529P005464l094612
36542A0432421q820858m176368N391595R165924M216844k377743m839141n714662
36534C278012q671000j0722194p252104o32202K349553k05770l607429l179308
36526b8642442J247845O470803Q618302N945614Q82666k747848n382841j0083110
36518b3691011j3869251q279872O531798J6483849J1162293J71631M15065J1324228
36510B48730J6355422Q059886k836563n648934k962231p26339J571607L517529
36502A7579107j072905j1766601j5047778k435117J3243645J3492079O03567o196550
36494H399447J249354J0642005R064606r32106q973994j0282317o754581k325673
$$ plain form
36486 86741 -1285493 -7089018 -18053291 -27853994 -30333982 -26436891 -21035215 -16937484
36478 -16937484 -15855475 -20177236 -28136236 -32178205 -29064652 -26784333 -32890097 -40315136
36470 -40315136 -35543676 -18584268 -3082807 3112403 5223364 7823178 6708070 -807172
36462 -807172 -8719057 -11656012 -11896697 -11207258 -5782805 3133648 3653727 -11537607 -32231640
36453 -32231640 -43851478 -46902567 -51451081 -57875916 -57122744 -47725098 -38580034 -34363877
36445 -34363877 -30864982 -26548176 -26781643 -33383399 -40597579 -44970269 -49337032 -53915346
36437 -53915346 -54331977 -52429445 -56635394 -65083818 -61500335 -38558927 -13954283 -8982385
36429 -8982385 -19071582 -21893989 -10460824 -234037 -2673847 -9367444 -8581169 -3238753
$$ packed form
36486H6741j372234n803525j0964273r800703k479988L897091N401676M097731
36478a6937484J082009m321761p959000m041969L113553K280319o105764p425039
36470d0315136M771460J6959408J5501461O195210K110961K599814j115108p515242
36462h07172p911885k936955k40685O89439N424453Q916453N20079j5191334k0694033
36453c2231640j1619838l051089m548514o424835P53172R397646R145064M216157
36445c4363877L498895M316806k33467o601756p214180m372690m366763m578314
36437e3915346m16631J902532m205949q448424L583483K2941408K4604644M971898
36429h982385j0089197k822407J1433165J0226787k439810o693597P86275N342416
$$ plain form
36421 -3238753 -3110655 -9240664 -16021967 -21508829 -25826252 -24762606 -15247317 -3960005
36413 -3960005 -321561 -2368778 406068 10031522 16054573 11067649 908600 -5250100
36405 -5250100 -6994894 -8506832 -8716131 -3812321 3855945 7653477 6374430 4675614
36397 4675614 3688597 -1437203 -12621209 -24034835 -29935537 -32406956 -36662523 -41983030
36389 -41983030 -42699561 -37087205 -30318875 -27604593 -27750405 -25481045 -18676442 -11283530
36381 -11283530 -8534800 -10052352 -9330851 -1304860 10794998 18824994 19883218 19531831
36373 19531831 23186310 27768387 25821080 16371995 7042095 4581598 7441865 10478958
36365 10478958 13830354 21541957 30893083 29606906 9772472 -18195394 -33952380 -31273259
$$ packed form
36421c238753J28098o130009o781303n486862m317423J063646R515289J1287312
36413c960005L638444k047217K774846R625454O023051m986924j0159049o158700
36405e250100j744794j511938k09299M903810P668266L797532j279047j698816
36397D675614r87017n125800j1184006j1413626n900702k471419m255567n320507
36389d1983030p16531N612356O768330K714282j45812K269360O804603P392912
36381a1283530K748730j517552P21501Q025991J2099858Q029996J058224l51387
36373A9531831L654479M582077j947307r449085r329900k460497K860267L037093
36365A0478958L351396P711603R351126j286177j9834434k7967866j5756986K679121
$$ plain form
36357 -31273259 -25329719 -30912891 -41693367 -40729681 -25734923 -10597924 -3360862 2231830
36349 2231830 10002705 11445687 1245829 -9717179 -9010585 -1789691 -2071256 -10412615
36341 -10412615 -14332785 -8804937 -2740661 -4234374 -10972277 -17228129 -20139855 -16774944
36333 -16774944 -4834196 10296350 17734391 14091811 7373228 5533519 8533008 13698146
36325 13698146 20192343 24664414 20757871 7307223 -9676214 -25487687 -38685088
36318 -38685088 -42817540 -28625711 -485657 21485668 24712408 18997813 18373164 19740302
$$ packed form
36357c1273259N943540n583172j0780476R63686J4994758J5136999P237062N592692
36349B231830P770875J442982j0199858j0963008P06594P220894k81565q341359
36341a0412615l920170N527848O064276j493713o737903o255852k911726L364911
36333a6774944J1940748J5130546P438041l642580o718583j839709K999489N165138
36325A3698146O494197M472071l906543j3450648j6983437j5811473j3197401
36318c8685088m132452J4191829K8140054K1971325L226740n714595o24649J367138
$$ [...]
##END NTUPLES=NMR SPECTRUM
##END=
