##TITLE=31Pdec_DE-61K_d6
 D2O, 64 sc
 10.7.2024
##JCAMPDX= 6.0         $$ Bruker NMR JCAMP-DX V2.0
##DATA TYPE= NMR SPECTRUM
##DATA CLASS= NTUPLES
##ORIGIN= UXNMR, Bruker Analytische Messtechnik GmbH
##OWNER= root
$$ XWIN-NMR		Version 3.5
$$ Wed Jul 10 14:03:55 2024 Russian Standard Time (UT+4h)  she@DPX200
##.OBSERVE FREQUENCY= 81.013821
##.OBSERVE NUCLEUS= ^31P
##.ACQUISITION MODE= SIMULTANEOUS
##.ACQUISITION SCHEME= undefined
##.AVERAGES= 64
##.DIGITISER RES= 17
##SPECTROMETER/DATA SYSTEM= spect
##.PULSE SEQUENCE= zgpg30
##.SOLVENT NAME= CDCl3
##.SHIFT REFERENCE= (INTERNAL, CDCl3, 0, 198.062)
##AUDIT TRAIL= $$ (NUMBER, WHEN, WHO, WHERE, WHAT)
$$ ##TITLE= Audit trail, XWIN-NMR		Version 3.5
$$ ##JCAMPDX= 5.01
$$ ##ORIGIN= Bruker BioSpin GmbH
$$ ##OWNER= she
$$ F:/spectra/data/she/nmr/P31/2/pdata/1/auditp.txt
$$ ##AUDIT TRAIL=  $$ (NUMBER, WHEN, WHO, WHERE, WHAT)
(   1,<2024-07-10 14:02:57.93 +0400>,<she>,<DPX200>,
      <created by zg, POWCHK disabled, PULCHK disabled
       configuration hash MD5:
       00 E9 B6 7A A2 85 ED C7 34 08 36 98 17 FE 4E 26
       data hash MD5: 32K
       EA 95 4A 22 AC 12 32 04 7F 1C 77 26 A4 75 8B F2>)
(   2,<2024-07-10 14:03:00.18 +0400>,<she>,<DPX200>,
      <Start of raw data processing
       efp BC_mod = 2 LB = 1.5 FT_mod = 6 PKNL = 1 PHC0 = 2650.191 PHC1 = 39.68691 SI = 64K 
       data hash MD5: 64K
       79 CB 24 EE 86 52 E0 38 A0 4D 81 4E F6 68 6A 07>)
(   3,<2024-07-10 14:03:22.73 +0400>,<she>,<DPX200>,
      <pk PHC0 = -34.42642 PHC1 = -144.3999 
       data hash MD5: 64K
       A0 08 D9 A5 0B 8E 3F BE 8A 7C C6 D5 7A DE CB D5>)
$$ ##END=
$$ 
$$ hash MD5
$$ 84 87 06 FA 10 BD D8 89 1D 1A CD 69 C7 A6 10 D2
##$RELAX= 
##$RELAX= 
##$RELAX= 
##$RELAX= 
##$RELAX= 
##$RELAX= 
##$RELAX= 
##$RELAX= 
$$ Bruker specific parameters
$$ --------------------------
##$DU= <F:/spectra>
##$EXPNO= 2
##$NAME= <P31>
##$PROCNO= 1
##$TYPE= <nmr>
##$USER= <she>
##$AMP= (0..31)
100 100 100 100 100 100 100 100 100 100 100 100 100 100 100 100 100 100 
100 100 100 100 100 100 100 100 100 100 100 100 100 100 
##$AQSEQ= 0
##$AQ_mod= 1
##$AUNM= <au_zg>
##$AUTOPOS= <>
##$BF1= 81.014009
##$BF2= 200.13
##$BF3= 200.13
##$BF4= 200.13
##$BF5= 200.13
##$BF6= 200.13
##$BF7= 200.13
##$BF8= 200.13
##$BYTORDA= 1
##$CFDGTYP= 0
##$CFRGTYP= 5
##$CHEMSTR= <none>
##$CNST= (0..31)
1 1 145 1 1 1 1 1 1 1 1 1 1 1 1 1 1 1 1 1 1 1 1 1 1 1 1 1 1 1 1 1 
##$CPDPRG= <waltz16>
##$CPDPRG1= <>
##$CPDPRG2= <waltz16>
##$CPDPRG3= <>
##$CPDPRG4= <mlev>
##$CPDPRG5= <mlev>
##$CPDPRG6= <mlev>
##$CPDPRG7= <mlev>
##$CPDPRG8= <mlev>
##$CPDPRGB= <>
##$CPDPRGT= <>
##$D= (0..31)
0 1 0 0 0 0 0 0 0 0.06 0 0.03 2e-05 3e-06 0 0 0.0002 0 0 0 0 0 0 0 0 0 
0 0 0 0 0 0 
##$DATE= 1720605777
##$DBL= (0..7)
120 120 120 11 120 120 24 19 
##$DBP= (0..7)
150 150 150 150 150 150 150 150 
##$DBP07= 0
##$DBPNAM0= <>
##$DBPNAM1= <>
##$DBPNAM2= <>
##$DBPNAM3= <>
##$DBPNAM4= <>
##$DBPNAM5= <>
##$DBPNAM6= <>
##$DBPNAM7= <>
##$DBPOAL= (0..7)
0.5 0.5 0.5 0.5 0.5 0.5 0.5 0.5 
##$DBPOFFS= (0..7)
$$ [...]
##$SUBNAM3= <"">
##$SUBNAM4= <"">
##$SUBNAM5= <"">
##$SUBNAM6= <"">
##$SUBNAM7= <"">
##$SUBNAM8= <"">
##$SUBNAM9= <"">
##$SW= 400.765351723535
##$SWIBOX= (0..15)
0 1 3 0 0 0 0 0 0 0 0 0 0 0 0 0 
##$SW_h= 32467.5324675325
##$TD= 32768
##$TD0= 1
##$TE= 0
##$TE2= 300
##$TE3= 300
##$TEG= 300
##$TL= (0..7)
0 120 53 12 22 120 120 120 
##$TP= (0..7)
150 150 150 150 150 150 150 150 
##$TP07= 0
##$TPNAME0= <>
##$TPNAME1= <>
##$TPNAME2= <>
##$TPNAME3= <>
##$TPNAME4= <>
##$TPNAME5= <>
##$TPNAME6= <>
##$TPNAME7= <>
##$TPOAL= (0..7)
0.5 0.5 0.5 0.5 0.5 0.5 0.5 0.5 
##$TPOFFS= (0..7)
0 0 0 0 0 0 0 0 
##$TUNHIN= 0
##$TUNHOUT= 0
##$TUNXOUT= 0
##$USERA1= <user>
##$USERA2= <user>
##$USERA3= <user>
##$USERA4= <user>
##$USERA5= <user>
##$V9= 5
##$VALIST= <valist>
##$VCLIST= <CCCCCCCCCCCCCCC>
##$VD= 0
##$VDLIST= <DDDDDDDDDDDDDDD>
##$VPLIST= <PPPPPPPPPPPPPPP>
##$VTLIST= <TTTTTTTTTTTTTTT>
##$WBST= 1024
##$WBSW= 4
##$XGAIN= (0..3)
0 0 0 0 
##$XL= 0
##$YL= 0
##$YMAX_a= 3144
##$YMIN_a= -9249
##$ZGOPTNS= <>
##$ZL1= 120
##$ZL2= 120
##$ZL3= 120
##$ZL4= 120
##$ABSF1= 0
##$ABSF2= 0
##$ABSG= 0
##$ABSL= 0
##$ALPHA= 0
##$AQORDER= 0
##$ASSFAC= 0
##$ASSFACI= 0
##$ASSFACX= 0
##$ASSWID= 0
##$AUNMP= <proc_1d>
##$AZFE= 0.1
##$AZFW= 0.5
##$BCFW= 0
##$BC_mod= 2
##$BYTORDP= 0
##$COROFFS= 0
##$CY= -3
##$DATMOD= 1
##$DC= 0
##$DFILT= <>
##$DTYPP= 0
##$F1P= 0
##$F2P= 0
##$FCOR= 1
##$FTSIZE= 65536
##$FT_mod= 6
##$GAMMA= 0
##$GB= 0
##$INTBC= 1
##$INTSCL= 9.790993e-09
##$ISEN= 30
##$LB= 1.5
##$LEV0= 0
##$LPBIN= 0
##$MAXI= 10000
##$MC2= 0
##$MEAN= 0
##$ME_mod= 0
##$MI= 50
##$NCOEF= 0
##$NC_proc= -11
##$NLEV= 6
##$NOISF1= 182.463
##$NOISF2= 159.3651
##$NSP= 0
##$NTH_PI= 0
##$NZP= 0
##$OFFSET= 198.0616
##$PC= 4
##$PHC0= 2615.764
##$PHC1= -104.713
##$PH_mod= 1
##$PKNL= yes
##$PPARMOD= 0
##$PSCAL= 0
##$PSIGN= 0
##$REVERSE= no
##$SF= 81.0140089999434
##$SI= 65536
##$SIGF1= 159.3651
##$SIGF2= -187.1042
##$SINO= 113.3802
##$SIOLD= 16384
##$SREGLST= <1H.CDCl3>
##$SSB= 0
##$STSI= 65536
##$STSR= 0
##$SW_p= 32467.5324675325
##$SYMM= 0
##$S_DEV= 0
##$TDeff= 32768
##$TDoff= 0
##$TI= <>
##$TILT= no
##$TM1= 0
##$TM2= 0
##$TOPLEV= 0
##$USERP1= <user>
##$USERP2= <user>
##$USERP3= <user>
##$USERP4= <user>
##$USERP5= <user>
##$WDW= 1
##$XDIM= 65536
##$YMAX_p= 539275334
##$YMIN_p= -360638322
$$ End of Bruker specific parameters
$$ ---------------------------------
##NTUPLES= NMR SPECTRUM
##VAR_NAME=  FREQUENCY,     SPECTRUM/REAL,   SPECTRUM/IMAG
##SYMBOL=    X,             R,               I
##VAR_TYPE=  INDEPENDENT,   DEPENDENT,       DEPENDENT
##VAR_FORM=  AFFN,          ASDF,            ASDF
##VAR_DIM=   65536,         65536,           65536
##UNITS=     HZ,            ARBITRARY UNITS, ARBITRARY UNITS
##FACTOR=    0.49542278885378, 1,            1
##FIRST=     16045.7642231865, 0,            0
##LAST=      -16421.768244346, 0,            0
##MIN=       -16421.768244346, -360638322,   0
##MAX=       16045.7642231865, 539275334,    0
$$ Real data points
##PAGE= N=1
##DATA TABLE= (X++(R..R)), XYDATA
$$ [...]
7145F116432K3157245Q825916j5037289k7999193k2030897j1102261j2959468
$$ 6116432 29273677 38099593 23062304 -4936889 -26967786 -38070047 -51029515
7138e1029515k5475046k9684997j4219580J2322541L2708978L6690040K6173782
$$ -51029515 -76504561 -106189558 -120409138 -108086597 -75377619 -38687579 -12513797
7131a2513797J2744347Q979425J4762904J4919048m34322j6946894j0720171J8232256
$$ -12513797 230550 9209975 23972879 38891927 38457605 21510711 10790540 29022796
7123B9022796M1291566L3833559J043409l2852702m9571936m5273470k5683024
$$ 29022796 70314362 104147921 105191330 72338628 22766692 -22506778 -48189802
7116d8189802k617073J1393794J4287529J6335284K3733686K5695202Q459564
$$ -48189802 -50806875 -39413081 -25125552 -8790268 14943418 40638620 49098184
7109D9098184j9778979l1178129j1587466J7737193K3260488J104651j8001380
$$ 49098184 29319205 -1858924 -13446390 4290803 27551291 28655942 10654562
7102A0654562r742962J2009595J6323654k994282k4977111l4787787l6108676
$$ 10654562 911600 12921195 29244849 26250567 1273456 -33514331 -69623007
7095f9623007k9523745n471097L0350614M9040372L4396999Q233694m51968M710211
$$ -69623007 -99146752 -104617849 -74267235 -25226863 9170136 17403830 16951862 21662073
7087B1662073J940222q489733p361202P109365J5475275R396113J357065o70721
$$ 21662073 23602295 15112562 7751360 14860725 30336000 39732113 41089178 40418457
7079D0418457m203510j3011386j8435633j5883581j1412185p124048K213457J4362043
$$ 40418457 36214947 23203561 4767928 -11115653 -22527838 -29651886 -27438429 -13076386
7071a3076386J9509831J7846784J8515470J9391191R521298n693878o303160R437250
$$ -13076386 6433445 24280229 42795699 62186890 71708188 66014310 59711150 69148400
7063F9148400J8956807R639843o074409j8204131l3398369m9021492m3172612
$$ 69148400 88105207 97745050 91670641 73466510 40068141 -8953351 -52125963
7056e2125963j0021764K1515389K6828646J9700243K3739285L2544390K5504613
$$ -52125963 -62147727 -40632338 -13803692 5896551 29635836 62180226 87684839
7049H7684839M112551j5624547l0295131m0616118l3021462j301157K7880900
$$ 87684839 91797390 76172843 45877712 5261594 -27759868 -29061025 -1180125
7042a180125K5307482M087835j071648R559684M092598k4144038m3842041l4844573
$$ -1180125 24127357 28215192 27143544 36703228 40795826 16651788 -27190253 -62034826
7034f2034826j3437888K85320P738447J4371970J6683386J6902302K2398475K1976402
$$ -62034826 -75472714 -75187394 -67448947 -53076977 -36393591 -19491289 2907186 24883588
7026B4883588n255537m5733058n2032100q431520L6918537L3448683m894862k6562752
$$ 24883588 19628051 -26105007 -78137107 -86568627 -49650090 -16201407 -21096269 -47659021
7018d7659021j5572911l61249R3211K05908J4389041L0208131K6663450K372961
$$ -47659021 -63231932 -63593181 -63499970 -63294062 -48905021 -18696890 7966560 10339521
7010A0339521k3658837l0736077j3490273J2248895K2197961J0131279l514333
$$ 10339521 -13319316 -44055393 -57545666 -45296771 -23098810 -12967531 -16481864
7003a6481864p4726Q267462m288379l4254757m5779097j7286044K7188895M5970874
$$ -16481864 -16556590 -8289128 -12577507 -46832264 -92611361 -109897405 -82708510 -36737636
6995c6737636K7276587n050055k5157790k7327560j6135020N713601K9867524
$$ -36737636 -9461049 -14511104 -39668894 -66996454 -83131474 -77417873 -47550349
6988d7550349L7021155J6849280j1574002j8024035r31155J0677529J074333q825703
$$ -47550349 -10529194 6320086 -5253916 -23277951 -24209106 -13531577 -12457244 -21282947
6980b1282947K762501K0626719J5669298q500051k2743226j9077188j6607530
$$ -21282947 -18520446 2106273 17775571 9275520 -13467706 -32544894 -49152424
6973d9152424k1004815j3796449R496853K4702793J7632061O822557R055715J1335536
$$ -49152424 -70157239 -83953688 -74456835 -49754042 -32121981 -25299424 -16243709 -4908173
6965d908173O48507n839681R631235K7683062J8145674j0560843k3922064j4699374
$$ -4908173 -4259666 -10099347 -468112 27214950 45360624 34799781 10877717 -3821657
6957c821657q149382j6056024k0031613o095372J2683873J7476703P385683n300742
$$ -3821657 -11971039 -28027063 -48058676 -54154048 -41470175 -23993472 -16607789 -21908531
6949b1908531q736594J604734J6408554J6535530j441144j2915505P45515J8081466
$$ -21908531 -30645125 -29040391 -12631837 3903693 2462549 -10452956 -9707441 8374025
6941H374025P201975k0598405k5527126m074391N890349r112164j5307091P862776
$$ 8374025 15576000 -5022405 -30549531 -34623922 -28733573 -37845737 -53152828 -45290052
6933d5290052L0645554K4271178Q194706J0366610J5603189l127022k8580909
$$ -45290052 -14644498 9626680 17821386 28187996 43791185 40664163 12083254
6926A2083254k3145094O115803J4796423j1230755l9483618m2565901k5712309
$$ 12083254 -11061840 -4946037 9850386 -1380369 -40863987 -83429888 -109142197
6919a09142197M16080L3967094O0069812N3421112J8458079n471488L074787J8074363
$$ -109142197 -108726117 -74759023 -14689211 38731901 57189980 51718492 54793279 72867642
6911G2867642Q622133j5287468k3365131j0976363J273190O76048q609715k1095268
$$ 72867642 81489775 66202307 42837176 31860813 33134003 33810051 25200336 4105068
6903D105068l3110494l5390891k0668911L348854K1214633K6468279K2039465
$$ 4105068 -29005426 -64396317 -85065228 -81716374 -60501741 -34033462 -11993997
6896a1993997J1522758L76964k856102K356987N254299J628160K009363R394940
$$ -11993997 -471239 -94275 -2950377 -593390 4660909 6289069 8298432 17693372
6888A7693372O004655j7282773l4471716j5968150K3442512M0557377K3959802
$$ 17693372 23698027 6415254 -28056462 -44024612 -20582100 19975277 43935079
6881D3935079L848665N1537k131817j3756829j8052663n437756P09387j7606462
$$ 43935079 47783744 47835281 45703464 31946635 13893972 8456216 9165603 -8440859
6873h440859l5584932k1412092R734818J6610498l661678j3496995L797697K1806863
$$ -8440859 -44025791 -65437883 -55703065 -39092567 -42754245 -56251240 -52453543 -30646680
6865c0646680J8779379R388356J1506755J4171714K801324r611641n145989L752916
$$ -30646680 -11867301 -2478945 9027810 23199524 26000848 16389207 11243218 14996134
6857A4996134p034073k9905637l2992388q937273J3395317J0561630p273374j8008190
$$ 14996134 7962061 -21943576 -54935964 -63873237 -50477920 -39916290 -47189664 -65197854
6849f5197854j5932825p159999N482112J9127609K5033251J9648395J2665706
$$ -65197854 -81130679 -88290678 -82808566 -63680957 -38647706 -18999311 -6333605
6842f333605J2278928J0793383k440121k0545699k5699789j3178981L989335J3416597
$$ -6333605 5945323 16738706 14298585 -6247114 -31946903 -45125884 -41136549 -27719952
6834b7719952J4665349J1754442N668810k399358q508863r885525n803179N646283
$$ -27719952 -13054603 -1300161 4368649 1969291 -6539572 -16425097 -22228276 -16581993
6826a6581993K3780727L7646617L2612840R444095j2273007j6696170j0133133
$$ -16581993 7198734 44845351 77458191 86902286 74629279 57933109 47799976
6819D7799976q360077j2506493j0250830J362667R007922L210079o952109q087748
$$ 47799976 39439899 26933406 16682576 18045243 27053165 30263244 23311135 15223387
6811A5223387k757211l693761j2205778j6101042r997941m032983o297129q310502
$$ 15223387 12466176 8772415 -3433363 -19534405 -29532346 -33565329 -39862458 -48172960
6803d8172960J464504J7426014K3059677J3973499J811285m135569o054215o712721
$$ -48172960 -46708456 -29282442 -6222765 7750734 9562019 5426450 -627765 -7340486
6795g340486l451451J647302r98692j2356803j7672719o703320R000824J2382986
$$ -7340486 -10791937 -9144635 -10143327 -22500130 -40172849 -46876169 -37875345 -25492359
6787b5492359N730430L108486M846286l69068j0531220j0217508J618911P596778
$$ -25492359 -19761929 -16653443 -11807157 -12176225 -22707445 -32924953 -31306042 -23709264
6779b3709264M077669J2057818L8828059N2630225K3978963k2780963l4663754
$$ -23709264 -19631595 -7573777 31254282 83884507 107863470 85082507 50418753
6772E0418753l882239K0552419M136276k5725889k5569352o15599R321048o893518
$$ 50418753 46536514 67088933 71225209 45499320 19929968 19314369 28635417 21741899
6764B1741899j9995975j0562117M140448L558694m670965l803406K931937L246233
$$ 21741899 1745924 -8816193 -4675745 -1117051 -5788016 -9591422 -6659485 -3413252
6756c413252J072406P965347J7255223J0139615j3480484l0805968k6104264q118505
$$ -3413252 -2340846 5624501 22879724 33019339 19538855 -11267113 -37371377 -45489882
6748d5489882P215927J6230148K2196355K2953507J4261171m15827j1255083j1379360
$$ -45489882 -38273955 -22043807 152548 23106055 37367226 36951399 25696316 14316956
6740A4316956l006027K654351n769943k3921492k9137341o732782K3878830K7492687
$$ 14316956 11310929 13965280 8195337 -15726155 -44863496 -51596278 -27717448 -224761
6732b24761k64866k5019283j9909040J129486R664824L042819q38174N075550
$$ -224761 -489627 -25508910 -45417950 -44288464 -34623640 -31580821 -32418995 -27343445
6724b7343445J2231429J4755259J3399346Q006548K783962R811464K8777255L4945228
$$ -27343445 -15112016 -356757 13042589 21049137 23833099 33644563 62421818 97367046
6716I7367046J1517159j6881130j4151807J0019981J0324627k3865389m8823553
$$ 97367046 108884205 92003075 77851268 87871249 98195876 74330487 25506934
6709B5506934l2227144j463987l4082k3822034l3620417j5075549O991858R452455
$$ 25506934 -6720210 -8184197 -8218279 -32040313 -65660730 -80736279 -73744421 -64291966
6701f4291966j436903o048301L063027J5891458J6487662N26491j4603588o094165
$$ -64291966 -65728869 -71777170 -68714143 -52822685 -36335023 -35808532 -50412120 -56506285
6693e6506285K2085169L7837131K2888069p16127l525917Q060540O100245j2328777
$$ -56506285 -34421116 3416015 26304084 25587957 22062040 30122580 36222825 23894048
6685B3894048k2397837j3117039k491785n017456q507391M418626K7644537L7350454
$$ 23894048 1496211 -11620828 -14112613 -19130069 -27637460 -23218834 4425703 41776157
6677D1776157J9750821j3996632l7490531l3319798j1165752K903143m4093n8796
$$ 41776157 61526978 47530346 10039815 -23279983 -34445735 -31542592 -31586685 -31645481
6669c1645481J9009741L9563903L3828167P405982p149935K624014J5353060J1219001
$$ -31645481 -12635740 26928163 60756330 68162312 61012377 63636391 78989451 90208452
6661I0208452m372330j7754762k3965077k0027224l985579J1272775N060436k0907345
$$ 90208452 85836122 68081360 44116283 24089059 20103480 31376255 36436691 15529346
6653A5529346l9513923l3870270j5244225J992879J8617020L2654733K9564714
$$ 15529346 -23984577 -57854847 -73099072 -71106193 -52489173 -19834440 9730274
6646I730274P168180j2395379j3301668p229122o936930l004290J1814765J9841176
$$ 9730274 16898454 4503075 -8798593 -16027715 -22964645 -25968935 -14154170 5687006
6638E687006O989168p671562q65636J5225735J4436889R08359l120736Q03367
$$ 5687006 12676174 5004612 4138976 19364711 33801600 34709959 31589223 32392590
6630C2392590l811048r385396L036764J9180806P204745k1694796j9410718K1269518
$$ 32392590 28581542 19196146 22232910 41413716 48618461 26923665 7512947 28782465
6622B8782465M5371046J4998360l4171073m6541250k1148388K729741P051068
$$ 28782465 74153511 89151871 54980798 8439548 -12708840 -9979099 -2928031
6615b928031L875827P07040n747576j0642948p890549r095299k6476463m3485767
$$ -2928031 947796 1654836 -4092740 -14735688 -22626237 -31721536 -58197999 -101683766
6607a01683766l2914753j001907J8013360J3073680J0600525K9151116M8324790
$$ -101683766 -134598519 -135600426 -117587066 -104513386 -93912861 -64761745 -16436955
6600a6436955L8869596L721679k8308109l6918099k3486692j07279J9475387K4069668
$$ -16436955 22432641 26154320 -2153789 -39071888 -62558580 -62665859 -43190472 -19120804
6592a9120804J4094101M346265P179787J4535578P009514j8423078l9202125l0531394
$$ -19120804 -5026703 -680438 6499349 21034927 28044441 9621363 -29580762 -60112156
6584f0112156O373714M3487536N2086407K7956501p339662k7423839k3610569
$$ -60112156 -53738442 -10250906 41835501 69792002 62452340 35028501 11417932
6577A1417932r014426j942841o310812j0426633m954810L886285M909028P32107
$$ 11417932 2403506 460665 -5850147 -16276780 -21231590 -17345305 -12436277 -11704170
6569a1704170L719521J2586485R000927j3485907l2010030k2783186K601484J0488476
$$ -11704170 -7984649 4601836 13602763 116856 -31893174 -54676360 -52074876 -41586400
6561d1586400q379132k8219848k6213766q483081R037683K3543309L6323099L9514032
$$ -41586400 -49965532 -78185380 -104399146 -112882227 -103844544 -80301235 -43978136 -4464104
6553d464104K8460016J3939983O604117J271245q368189j2997908l966555O182480
$$ -4464104 23995912 37935895 44540012 45811257 37443068 24445160 20478605 26661085
6545B6661085J369539r473022n838734Q986406J2856080K579264k139550M271033
$$ 26661085 28030624 18557602 12718868 21705274 34561354 37140618 35001068 39272101
6537C9272101J910050j8506343l4957507k6022747k831125R117341M092875n973457
$$ 39272101 41182151 22675808 -12281699 -38304446 -41135571 -32018230 -27925355 -33898812
6529c3898812j3644315j6212927n425677K0363486M0422076L1585512K712129
$$ -33898812 -47543127 -63756054 -69181731 -48818245 -8396169 23189343 25901472
6522B5901472j3210129l875541P738709J129577j1263092p076299Q795960J2162774
$$ 25901472 12691343 8815802 16554511 17684088 6420996 -655303 8140657 20303431
6514B0303431k125687j3357994q740886j745834n893736q990385O897321L0627480
$$ 20303431 18177744 4819750 -3921136 -5666970 -11560706 -20551091 -13653770 16973710
6506A6973710L2122709O827675j5045862j1656780J505337R80617p685970o145551
$$ 16973710 49096419 55924094 40878232 29221452 30726789 31707406 24021436 17875885
6498A7875885p02863j1855200l1943122k8547067L182138K4572947O690064k6950507
$$ 17875885 17173022 5317822 -26625300 -55172367 -51990229 -27417282 -20727218 -47677725
6490d7677725l3917667r745792J4996167K1575847J8109421J2995471K984083
$$ -47677725 -81595392 -91341184 -76345017 -54769170 -36659749 -23664278 -20680195
6483b0680195q495503p083833Q050451J5519926J111174j8605405j7374257N116920
$$ -20680195 -29175698 -36259531 -28209080 -12689154 -11577980 -30183385 -47557642 -42440722
6475d2440722K4345668K3637669J0738120R09580k890460o361225r675479p819181
$$ -42440722 -18095054 5542615 16280735 17190315 14299855 7938630 -1736849 -9556030
6467i556030k783464l982963j2287482j3270542L510710K3917972K2262893m013822
$$ -9556030 -12339494 -16322457 -28609939 -41880481 -38369771 -14451799 7811094 3797272
6459C797272k7594373k5627658o775603O856451J1307015J6959528K2362610J4715098
$$ 3797272 -23797101 -49424759 -56200362 -49343911 -38036896 -21077368 1285242 16000340
6451A6000340l982701j3818467o632825L91872q322075k1999589k0237917l647286
$$ 16000340 12017639 -1800828 -8433653 -8041781 -16363856 -38363445 -58601362 -62248648
6443f2248648Q193163L804779r875216k1600515k6187381k0133385J78159L0173484
$$ -62248648 -54055485 -50250706 -60125922 -81726437 -107913818 -128047203 -127869044 -97695560
6435i7695560N3612104N3061950K4233563j7962107m5771578l7578315O27227
$$ -97695560 -44083456 8978494 33212057 15249950 -30521628 -68099943 -67472716
6428f7472716L5180047L5616704O088987k1401427k3909137p799215P803996J4112335
$$ -67472716 -32292669 3324035 9413022 -11988405 -35897542 -43696757 -35892761 -21780426
6420b1780426J2596878L525132j2716662k6940032k5932209p914143J3919837
$$ -21780426 -9183548 -5658416 -18375078 -45315110 -71247319 -79161462 -65241625
6413f5241625K5623748K5254914J9205962J0750308k300991j8919815k9097374
$$ -65241625 -39617877 -14362963 4842999 15593307 13292316 -5627499 -34724873
6406c4724873k1806899P56500K1213944K3198601Q073928p958284j1861961m477692
$$ -34724873 -56531772 -55775272 -34561328 -11362727 -3288799 -11247083 -23109044 -27586736
6398b7586736N126391R425743O097842j308879m719002k13305L328387o517897
$$ -27586736 -22460345 -13034602 -6936760 -8245639 -12964641 -13177946 -9849559 -16367456
6390a6367456k4406899k7148919m101793K3171748K6235706Q236216r41397J2704423
$$ -16367456 -40774355 -67923274 -72025067 -48853319 -22617613 -14381397 -15322794 -2618371
6382b618371K8554057K1776081l332570k1884200k0029213n352979Q558567J4919602
$$ -2618371 25935686 47711767 44379197 22494997 2465784 -2887195 5671372 20590974
6374B0590974J2006435M4038j5920348k5667888k1290433n392476R110455R452003
$$ 20590974 32597409 32641447 16721099 -8946789 -30237222 -35629698 -26519243 -17067240
6366a7067240l844466j5426793j1244707M702837J6185652J6441436J3940107
$$ -17067240 -20911706 -36338499 -47583206 -42880369 -26694717 -10253281 3686826
6359C686826J4421080J0134734m896041j9870830j9485565m503704J1482531K0119328
$$ 3686826 18107906 28242640 23346599 3475769 -16009796 -20513500 -9030969 11088359
6351A1088359K1081747J2783340m153510j6770326j0475881P646793J1939839
$$ 11088359 32170106 44953446 40799936 24029610 13553729 21200522 33140361
6344C3140361r357344l7005509m3214253k2101680Q219009K5884074K2110613
$$ 33140361 23783017 -13222492 -56436745 -78538425 -70319416 -44435342 -22324729
6337b2324729N105445p480170n308750L119641K187685p980075j1626262j997528
$$ -22324729 -17219284 -24699454 -30008204 -26888563 -24700878 -32680953 -44307215 -46304743
6329d6304743Q253800O989025j069027o414598r893674j4625003j4538428m316223
$$ -46304743 -38050943 -31061918 -32130945 -38545543 -48439217 -63064220 -77602648 -81918871
6321h1918871Q039226J1570189P785627L855516n73200n990122k136877J7565096
$$ -81918871 -73879645 -62309456 -54523829 -50668313 -51241513 -57231635 -59368512 -41803416
6313d1803416L7118412L3104725O583066j7860069k3405981j3952857K320980
$$ -41803416 -4685004 28419721 35002787 17142718 -6263263 -20216120 -17895140
6306a7895140K2138013L7920363L8902870K6551335J3236053K858016j0703579
$$ -17895140 4242873 42163236 81066106 107617441 120853494 123711510 113007931
6299A13007931k4806634k8091429k2226044k0698976k1008756n115751K2387240
$$ 113007931 88201297 60109868 37883824 17184848 -3823908 -8939659 13447581
6292A3447581K7365260k911830l0679675j8190391J5360017K2265162l099327
$$ 13447581 40812841 37901011 7221336 -10969055 4390962 26656124 23556797
6285B3556797k0817834p586195J6183464K5693374K3428641K0187107J3427097
$$ 23556797 2738963 -4847232 11336232 37029606 60458247 80645354 94072451
6278I4072451L31354r234466q886280q535246j6840156k4692105j9609538n134137
$$ 94072451 94403805 85169339 76283059 67747813 50907657 26215552 6606014 1471877
6270A471877O230160R590479O882195p06530r635647j2130201o017845J562405
$$ 1471877 7702037 17292516 24174711 23468181 13832534 1702333 -4315512 -2753107
6262b753107N756974Q596528P745587m041834k1138323k4243625p890433R278451
$$ -2753107 3003867 11600395 19345982 15304148 -5834175 -30077800 -37968233 -28689782
6254b8689782J4191218J8405948K9750818K7779774m706957m2950477m7170689
$$ -28689782 -14498564 3907384 33658202 61437976 56731019 13780542 -33390147
6247c3390147j9534734Q37687l040939q445218J337953J0384462K802446r091856
$$ -33390147 -52924881 -52087194 -55128133 -63573351 -62235398 -51850936 -49048490 -58140346
6239e8140346q128963K71551L425007L986590P513851N406181q159172j6952892
$$ -58140346 -66269309 -65997758 -62572751 -58586161 -51072310 -45666129 -53825301 -70778193
6231g0778193l389152K1995752L4257634K9126863K1540304J5334103J27372k1681310
$$ -70778193 -74167345 -52171593 -17913959 11212904 32753208 48087311 48214683 26533373
6223B6533373l0494817j9299583o706142q826163j4763169n410918J3983304J8644262
$$ 26533373 -3961444 -23261027 -29967169 -38793332 -53556501 -58967419 -44984115 -26339853
6215b6339853P04084j5957926o032589K1475051L2203554J1755004j2873785p854637
$$ -26339853 -25635769 -41593695 -47626284 -26151233 6052321 17807325 4933540 -2921097
6207b921097K1646385L7544595J8103491j7865427l9396462l7078978k0271113
$$ -2921097 18725288 56269883 74373374 56507947 17111485 -19967493 -40238606
6200d0238606R26416J7010347J6999940K002897q631593m31578J5059748J7523160
$$ -40238606 -39312190 -22301843 -5301903 -3299006 -11930599 -12362177 2697571 20220731
6192B0220731P671014K095137M893830M322722m424211j1920443j1216233o495371
$$ 20220731 27891745 29986882 34880712 39203434 34779223 22858780 11642547 5147176
6184E147176l516475l736626p300736j0321700k898529J6205781K7810145J3120602
$$ 5147176 1630701 -2105925 -9406661 -19728361 -22626890 -6421109 21389036 34509638
6176C4509638j6342075k9578588j7598043l936501r611309k6256902l1537475
$$ 34509638 18167563 -11411025 -29009068 -32945569 -42556878 -68813780 -100351255
6169a00351255j6920607P143640K3632523K2775110J1717592R270856K2015884
$$ -100351255 -117271862 -110128222 -86495699 -63720589 -52002997 -42732141 -20716257
6162b0716257L2266984K3441093P286980M954564J0812429L584828j2405024j1530656
$$ -20716257 11550727 34991820 42278800 47233364 58045793 61630621 49225597 37694941
6154C7694941O770006J2604909n518006k2092340j7668620o974130q247086j5860742
$$ 37694941 44464947 57069856 51551850 29459510 11790890 4816760 -3430326 -19291068
6146a9291068k0233312k4200083k2795839P314L4993024M3497000J2997376j8704315
$$ -19291068 -39524380 -63724463 -86520302 -86512988 -51519964 -8022964 4974412 -13729903
6138a3729903k0370125r130834n223503R631198M5339205N9399223J7695188l5528496
$$ -13729903 -34100028 -43230862 -48454365 -38823167 6516038 65915261 83610449 48081953
6130D8081953l4489071O247270J7452853j3694586l4605215k3888375j6913995
$$ 48081953 13592882 19840152 37293005 23598419 -11006796 -34895171 -51809166
6123e1809166k6734612j8902891J3361430K3599184o236993k6320388n70753L3259293
$$ -51809166 -78543778 -97446669 -84085239 -60486055 -66723048 -93043436 -93614189 -60354896
6115f0354896K9959688P904905L361949L677323j6814310l5657761j8753207J3610587
$$ -60354896 -30395208 -22490303 -19128354 -15451031 -32265341 -67923102 -86676309 -73065722
6107g3065722J9218772P246113J5443177L3586081J8412164k3485292l7910124
$$ -73065722 -53846950 -46600837 -31157660 2428421 20840585 -2644707 -40554831
6100d0554831j2602493K485875j9584282l8742614j6642415K1882358L1688505
$$ -40554831 -53157324 -50671449 -70255731 -108998345 -125640760 -103758402 -72069897
6093g2069897J4023443L108662J1441915K3223863K6385101K1201583O926197
$$ -72069897 -58046454 -54937792 -43495877 -20272014 6113087 27314670 34240867
6086C4240867j5052774l0591530k5484355n279934J2246990J9431409K0334454
$$ 34240867 19188093 -11403437 -36887792 -42167726 -29920736 -10489327 9845127
6079I845127J6180791M803447p346883p987542K214482M813566j3716228l8729164
$$ 9845127 26025918 30829365 23482482 15494940 17709422 22522988 8806760 -29922404
6071b9922404l8194251k017843L8294248M2875044J3517626q643250O2951J4695117
$$ -29922404 -68116655 -70134498 -31840250 11034794 24552420 15909170 15972121 30667238
6063C0667238K814330k5359325l4530571j7867240o89107M236599J1179112K7206085
$$ 30667238 33481568 8122243 -26408328 -44275568 -44964675 -40728076 -29548964 -2342879
6055b342879L4894934K0791431l561611k1659725l1926349l4984550k2006730
$$ -2342879 32552055 53343486 49781875 28122150 -3804199 -38788749 -60795479
6048f0795479P411401L1984414L1665429J3688375M85432j9612J943005k420189
$$ -60795479 -53384078 -21399664 10265765 23954140 24439572 24419960 26362965 23942776
6040B3942776j0522670j5572625j4715633j0887272r685117j1516440q584628
$$ 23942776 13420106 -2152519 -16868152 -27755424 -37440541 -48956981 -57541609
6033e7541609K518432R296121j313164j8920977k0800374p291665j500103q476270
$$ -57541609 -55023177 -45727056 -47040220 -65961197 -86761571 -94053236 -95553339 -104029609
6025a04029609l897067K2557586M2133792K8971954K227663m061373O067364L733039
$$ -104029609 -107926676 -85369090 -43235298 -14263344 -12035681 -16097054 -10029690 -6296651
6017f296651j0547212p291611J7246746K8073976N688820k1489572j9625896K345763
$$ -6296651 -16843863 -24135474 -6888728 21185248 26874068 5384496 -14241400 -11895637
6009a1895637J2589473N437956R91086N164206J850519j2562256j5568037O929035
$$ -11895637 693836 6131792 7122878 12287084 14137603 1575347 -13992690 -7063655
6001g063655L2718923K9895296J148514j9698254j2891849O585626J7523488K0418315
$$ -7063655 25655268 55550564 56699078 37000824 24108975 30694601 48218089 68636404
5993F8636404K4193758K2405457L613741k2375172l0676881j4247698O711034
$$ 68636404 92830162 115235619 118849360 96474188 65797307 51549609 58260643
5986E8260643J0578841m749610k7431235m2439141l5688043n623442K5290773
$$ 58260643 68839484 64089874 36658639 -5780502 -41468545 -47091987 -21801214
5979b1801214K9159418Q391907o497296j428127K365965j3480314l2271167k9384333
$$ -21801214 7358204 15750111 9252815 7824688 10190653 -3289661 -35560828 -64945161
5971f4945161j1148789j27950L609637J6573571L5507132L8545209K2369744R103439
$$ -64945161 -76093950 -76221900 -72612263 -56038692 -20531560 18013649 40383393 49486832
5963D9486832J0882769J2969788J056691j6121625k2914714j8806751j2786736
$$ 49486832 60369601 73339389 74396080 58274455 35359741 16552990 3766254
5956C766254q694730o810082r253080j3820502j1366831J504000J4647112J7417635
$$ 3766254 -4928476 -11738558 -20991638 -34812140 -46178971 -44674971 -30027859 -12610224
5948a2610224J2469129Q459292N641625j513832j0944729j2425206j980837R387941
$$ -12610224 -141095 8318197 13959822 12445990 1501261 -10923945 -12904782 -3516841
5940c516841O051384j3116294k9320830k2507999M163840K5333461K2548356M878491
$$ -3516841 2534543 -10581751 -39902581 -62410580 -58246740 -32913279 -10364923 -5486432
5932e486432n524195J22303J4161393K6343942K7497809Q566095k5081158m3900130
$$ -5486432 -11010627 -10888324 3273069 29617011 57114820 65680915 40599757 -3300373
5924c300373k2141817K3267351M5413131K5249481o068448j3238946k198821j247492
$$ -3300373 -25442190 -2174839 43238292 68487773 62419325 49180379 46981558 45734066
5916D5734066j5058097k2664339j4049652m344959q769487k0689815k1975742
$$ 45734066 30675969 8011630 -6038022 -10382981 -19152468 -39842283 -61818025
5909f1818025o775127J1365903J4916296L439943l794858P843903K4837872K0906299
$$ -61818025 -68593152 -57227249 -42310953 -38871010 -42665868 -34821965 -9984093 10922206
5901A0922206k121895j0051210J3868297L5849116J3993325l8311005o4064045
$$ 10922206 8800311 -1250899 12617398 48466514 62459839 24148834 -39915211
5894c9915211l8011327K442198J3047907j26820j870610J4820824K3425501R429096
$$ -39915211 -77926538 -75484340 -62436433 -62563253 -64433863 -49613039 -26187538 -16758442
5886a6758442q913695j1172915k874710q39476o353328q071652k541270L401852
$$ -16758442 -25672137 -36845052 -39719762 -40559238 -46912566 -54984218 -57525488 -54123636
5878e4123636O768474J0984538J4797868J1236059J83685q284699o984846Q401
$$ -54123636 -47355162 -36370624 -21572756 -10336697 -10153012 -18437711 -25422557 -25414156
5870b5414156N198644N905220K063601m566535n504178P822326K5623151K2340023
$$ -25414156 -20215512 -14310292 -12246691 -16813226 -22317404 -14495078 11128073 33468096
5862C3468096q656002l5336090k2389891J9441698M2760578K4084715q052463
$$ 33468096 24812094 -10523996 -32913887 -13472189 29288389 53373104 45320641
5855D5320641j4740758M016069J8188284J2007414k143042j0305864j6406147
$$ 45320641 30579883 34595952 52784236 64791650 62648608 52342744 35936597
5848C5936597k8713431m1132210m0040661k4641672q617438j56127Q897194K6291829
$$ 35936597 7223166 -33909044 -73949705 -98591377 -107208815 -107364942 -98467748 -72175919
5840g2175919M0056929L1173886N206500p217635R151874K9724898K2714610o258229
$$ -72175919 -32118990 -945104 4261396 -2956239 6195635 35920533 58635143 52376914
5832E2376914k4808250k1820727j6651347j8948167j0706536J7354638L8183665
$$ 52376914 27568664 5747937 -10903410 -29851577 -40558113 -23203475 14980190
5825A4980190K1783218j8935708m2050896l0684848q853953k568735p636458n199968
$$ 14980190 36763408 17827700 -24223196 -54908044 -63761997 -66330732 -73967190 -79167158
5817g9167158O505109J0509318l228978k2334617k5753813p930237J6629294L2591096
$$ -79167158 -72662049 -62152731 -65381709 -87716326 -113470139 -121400376 -104771082 -72179986
5809g2179986L9500371M2556446L6482426J3233221j6594020k8451258j5328641
$$ -72179986 -32679615 9876831 46359257 59592478 42998458 14547200 -781441
5802g81441J962782M674818j72443J068872K072062j0548006k7730709k5570565
$$ -781441 1181341 5856159 5683716 6752588 8824650 -1723356 -29454065 -55024630
5794e5024630j606195J7814827J1305081j2581280l0175244k9251554j3761695
$$ -55024630 -56630825 -38815998 -27510917 -40092197 -70267441 -99518995 -113280690
5787a13280690O652339K2242350K4732586J3219457j871851o356402L988203J8003669
$$ -113280690 -106628351 -84386001 -59653415 -46433958 -48305809 -54662211 -50674008 -32670339
5779c2670339J9115191L112678j4509217j3562352P408669K8369229L0464212
$$ -32670339 -13555148 -10442470 -24951687 -38514039 -31105370 -2736141 27728071
5772B7728071J4688733m564979j5516859j3845657k092754P743505Q93522k0758707
$$ 27728071 42416804 37851825 22334966 8489309 6396555 14140060 15033582 -5725125
5764e725125l4624201k3780330Q17347J6024016J5545992R918331O305473M171508
$$ -5725125 -40349326 -64129656 -63312309 -47288293 -31742301 -21823970 -15518497 -11346989
5756a1346989M044198M493787k509371j6611149j8961597J928111K4009351J8614095
$$ -11346989 -7302791 -2809004 -5318375 -21929524 -40891121 -38963010 -14953659 3660436
5748C660436l288556n299108J4653271J8033246j0396451l2427675j4116645J9273578
$$ 3660436 371880 -4927228 9726043 27759289 17362838 -15064837 -29181482 -9907904
5740i907904J9939233j1551728k9425248r341662K2549879L0422832J1573688
$$ -9907904 10031329 -1520399 -30945647 -40287309 -17737430 12685402 24259090
5733B4259090j1051288k0784377j9495250j6467208j5242593j1804888k955166
$$ 24259090 13207802 -7576575 -27071825 -43539033 -58781626 -70586514 -73541680
5726g3541680O695718J0315144R475154J0976534J4086780J3074524J2602167
$$ -73541680 -66845962 -56530818 -47055664 -36079130 -21992350 -8917826 3684341
5719C684341K2939680L5064388K2535986j8492439n2107033m6163723j6529715
$$ 3684341 26624021 61688409 84224395 65731956 13624923 -32538800 -49068515
5712d9068515k676141j1006427j2487569P023426K5498051K0338316k10540j3170802
$$ -49068515 -51744656 -62751083 -75238652 -68215226 -42717175 -22378859 -22589399 -35760201
5704c5760201j0482015k04048R498760J6078119J9557457K1526351K2314975J6540684
$$ -35760201 -46242216 -46446264 -36947504 -20869385 -1311928 20214423 42529398 59070082
5696E9070082r69811k2762978l1665653k0164316M64670J3208528J0941067j363312
$$ 59070082 58100271 35337293 3671640 -16492676 -16028006 -2819478 8121589 6758277
5688F758277j1645399q224876P598443J6883185L818834j8278862j8264329J0404620
$$ 6758277 -4887122 -13111998 -5513555 11369630 15188464 -3090398 -21354727 -10950107
5680a0950107L6216113K9841301K583113j1753576l002446P435911J849617j1108499
$$ -10950107 25266006 55107307 57690420 45936844 42934398 50370309 52219926 41111427
5672D1111427j4907271j0639697j1839883k1019139k4716248j2989287N926714
$$ 41111427 26204156 15564459 3724576 -17294563 -42010811 -55000098 -49073384
5665d9073384J5694520J0725982j756330j4216862k3405755k3252864o004760
$$ -49073384 -33378864 -22652882 -24409212 -38626074 -62031829 -85284693 -91289453
5658i1289453K3457560M4354315M0180564J6379992r035357k5018177k9504514
$$ -91289453 -67831893 -23477578 16702986 33082978 24047621 -970556 -30475070
5651c0475070k1460982l931790J1438344J6332759J6323147J6232980M802577
$$ -30475070 -51936052 -55867842 -44429498 -28096739 -11773592 4459388 9261965
5644I261965k5244449m9680859l4682427J1872201M1431072K7293313k314682
$$ 9261965 -15982484 -65663343 -100345770 -88473569 -47042497 -19749184 -22063866
5637b2063866r958249p79247l472326j9676355k4027459o767373J3095920J7626090
$$ -22063866 -32022115 -32801362 -36273688 -55950043 -79977502 -86744875 -73648955 -56022865
5629e6022865R829938R43598l311517o66300P210982R538938k799253j8976875
$$ -56022865 -46192927 -45249329 -48560846 -49227146 -42016164 -32477226 -35276479 -54253354
5621e4253354j7128094M501313K2286997J9773241Q410010N113820N235630n136125
$$ -54253354 -71381448 -66880135 -44593138 -24819897 -16409887 -11296067 -6060437 -11196562
5613a1196562k0147949j8366531M498050K5172905K1588961l82406j8330747k3226086
$$ -11196562 -31344511 -49711042 -45212992 -20040087 1548874 1166468 -17164279 -40390365
5605d0390365k5022052k9758836k5528984k51520L4294808M9987976L5416057
$$ -40390365 -65412417 -95171253 -120700237 -120951757 -86656949 -36668973 -1252916
5598a252916R920354j826575k48835m689767k0814798k8975254j1378640J8577739
$$ -1252916 8667438 6840863 6592028 1902261 -18912537 -47887791 -59266431 -40688692
5590d0688692K6688084r85252l7189851m2308455j0865845K2179686K4593197
$$ -40688692 -14000608 -14985860 -52175711 -94484166 -105350011 -83170325 -58577128
5583e8577128L627070j0793389q134889k715373j190331R290628L1642724M1436794
$$ -58577128 -54950058 -65743447 -73878336 -76593709 -77784040 -68493412 -36850688 4586106
5575D586106J8810871j6799209k7325758n791578J6872438J4840668l082242j2264465
$$ 4586106 23396977 6597768 -20727990 -26519568 -9647130 5193538 2111296 -10153169
5567a0153169m208016R188857J3085911L168508j2686854k0988171j4583185l5663
$$ -10153169 -14361185 -5172328 7913583 11082091 -1604763 -22592934 -37176119 -37211782
5559c7211782J0361848J2370020R936858N310391j015905k957989N258087J4794806
$$ -37211782 -26849934 -14479914 -4543056 767335 -248570 -3206559 2051528 16846334
5551A6846334Q146408j5380715l2994578k5585569j692916J5355152J7087324
$$ 16846334 24992742 9612027 -23382551 -48968120 -50661036 -35305884 -18218560
5544a8218560J5608424K2237975L0688418K5076936J044390k5330955l2533730
$$ -18218560 -2610136 19627839 50316257 75393193 76437583 51106628 18572898
5537A8572898j6968775M169419J5397960J9335778K3593924K2444816O919951
$$ 18572898 1604123 5773542 21171502 40507280 64101204 86546020 93465971
5530I3465971j3721264k0320817j2125251o478510r110293p273843K272058L143848
$$ 93465971 79744707 59423890 47298639 40820129 31709836 24435993 26708051 29851899
5522B9851899j0957794j9794295p718153Q275032L548766j5776727k3349350j1649516
$$ 29851899 18894105 -900190 -8618343 -343311 3205455 -12571272 -35920622 -47570138
5514d7570138L811259J3413821K1808414K8486492K3301238N112344j3596568
$$ -47570138 -43758879 -30345058 -8536644 19949848 43251086 48363430 34766862
5507C4766862k4635683l0643829l0819863j7159354Q688208K8896195K8340638
$$ 34766862 10131179 -20512650 -51332513 -68491867 -59803659 -30907464 -2566826
5500b566826J1790369l266387n295541J980440M663923n292979j5968946o270584
$$ -2566826 9223543 5957156 661615 2642055 7305978 2012999 -13955947 -20226531
5492b0226531K1613405L5315135J4674524j4217966j3960469O885953P737649
$$ -20226531 1386874 36702009 51376533 37158567 23198098 30084051 37821700
5485C7821700j6257329k4694804r24725J5035485j0169264m4750224l5772542
$$ 37821700 21564371 -3130433 -4055158 10980327 811063 -43939161 -79711703
5478g9711703J2504444M6769306L8870638J0769802j0218729k0492773k0250947
$$ -79711703 -67207259 -20437953 18432685 29202487 18983758 -1509015 -21759962
5471b1759962k739530K2737598K7502417J809264k5428233k3706937q56392J2520039
$$ -21759962 -24499492 -1761894 25740523 27549787 2121554 -21585383 -22441775 -9921736
5463i921736N249428p603301j2476956j2011797j2106039r513736K031426J9452440
$$ -9921736 -4672308 -12275609 -24752565 -36764362 -48870401 -58384137 -56352711 -36900271
5455c6900271K8783094J7905251p110174k2653305j3844608K329120m070910l0822532
$$ -36900271 -8117177 9788074 2677900 -19975405 -33820013 -31490893 -35561803 -66384335
5447f6384335l8031498j716069M5253176N0232350J0759610k0730746n617028
$$ -66384335 -104415833 -106131902 -60878726 -10646376 113234 -20617512 -26234540
5440b6234540L3394128M6859721K1457375j2081883k4777671k0758248k0093244
$$ -26234540 7159588 54019309 75476684 63394801 38617130 17858882 -2234362
5433b234362k7332876k8229846j1969735J3358207K9784921L0077880K4575539
$$ -2234362 -29567238 -57797084 -69766819 -56408612 -26623691 3454189 28029728
5426B8029728K5095205K6183485J1811177j6998357l3760318j8008577J2492597
$$ 28029728 53124933 79308418 91119595 74121238 40360920 22352343 34844940
5419C4844940J9361184o381109l1591124k5647563J034151J7153134J2987643
$$ 34844940 54206124 47825015 16233891 -9413672 -8379521 8773613 21761256
5412B1761256K237119p587196k0962719l3082328k8670720p123879J2700840J9294088
$$ 21761256 23998375 16411179 -4551540 -37633868 -66304588 -73428467 -60727627 -41433539
5404d1433539J9617614J6762744R04764k4235182l0688307l908660K7823321K7692358
$$ -41433539 -21815925 -5053181 -4148417 -28383599 -59071906 -62980566 -35157245 -7464887
5396g464887J117818j5214168o815379N086650J292487j1895858k0082292j8146010
$$ -7464887 -6347069 -21561237 -28376616 -23289966 -21997479 -33893337 -53975629 -72121639
5388g2121639n913840J3122601K5626297K0515426Q399893P715122J2421849R75091
$$ -72121639 -78035479 -64912878 -39286581 -18771155 -10371262 -2656140 9765709 10740800
5380A0740800k0582500j8507964J4532946L9251199K3370161j3602431l2266050
$$ 10740800 -9841700 -28349664 -13816718 25434481 48804642 35202211 2936161
5373B936161k3814700l266327K1986552M5471230M5307666J1173188k6912096
$$ 2936161 -20878539 -24144866 -2158314 43312916 88620582 99793770 72881674
5366G2881674l3112984j7614868j6334697k9091699k2288627Q842327K8128192
$$ 72881674 39768690 22153822 5819125 -23272574 -45561201 -36718874 -8590682
5359h590682J7530351M109890J1202101K2317964J6343906L954177J414935k745317
$$ -8590682 8939669 13049559 24251660 46569624 62913530 66867707 68282642 65537325
5351F5537325k3294854m2661984l3493404l102014J6502713J4965812J0684460
$$ 65537325 42242471 -419513 -33912917 -37014931 -20512218 -5546406 5138054
5344E138054J5708393K1009194J7562161Q999458k65512j1456054k2285982k5364256
$$ 5138054 20846447 41855641 59417802 68417260 68151748 56695694 34409712 9045456
5336I045456j8580809p307711K883970P156316L34967j3770113j8032843p42291
$$ 9045456 -9535353 -16843064 -13959094 -6802778 -6467811 -20237924 -38270767 -39013058
5328c9013058K5629526L7263041K6084078K812153j8724414k6718091j2113987
$$ -39013058 -13383532 23879509 49963587 52775740 34051326 7333235 -4780752
5321d780752J6664702K9844222J0150259j7691802j7191760P396541J9501652
$$ -4780752 11883950 41728172 51878431 34186629 16994869 24391410 43893062
5314D3893062O847855o781145q328025j3216793k5240270k0815242M849212J5061327
$$ 43893062 50740917 43959772 35631747 22414954 -2825316 -23640558 -18791346 -3730019
5306c730019j3244012m4598105l4071297M146787K1715117J2436769J3367829
$$ -3730019 -16974031 -61572136 -95643433 -91496646 -69781529 -57344760 -43976931
5299d3976931L4764683M1308773J3755874j6615630j6610580J295968N823728
$$ -43976931 -9212248 32096525 45852399 29236769 12626189 13922157 19745885
5292A9745885n161747j1186601n235606L700018J2198849K1929920K5499451J4965042
$$ 19745885 14584138 3397537 -1838069 1861949 14060798 35990718 61490169 76455211
5284G6455211r69827q070370r349106j6651526k4994291j8744145j815441L464998
$$ 76455211 75485384 67415014 58065908 41414382 16420091 -2324054 -4139495 -674497
5276f74497q508938j6962185q526958K202238j478980j2554870j6527288j5401061
$$ -674497 -9183435 -26145620 -34672578 -32470340 -33949320 -46504190 -63031478 -78432539
5268g8432539j5963549r933996J0440777K9070100K5937397J2837436J7647362
$$ -78432539 -94396088 -104330084 -93889307 -64819207 -38881810 -26044374 -8397012
5261h397012L4463347K5764515j6455530m8308638l4024654K773547J8022807
$$ -8397012 26066335 51830850 35375320 -12933318 -46957972 -44184425 -26161618
5254b6161618J2867824K0737919M2058865L8620299j767282l7756778l1793195
$$ -26161618 -13293794 7444125 49502990 88123289 86356007 48599229 16806034
5247A6806034l602244J360981k2396890l7237438j8691388J3488987K5791772
$$ 16806034 13203790 14564771 -7832119 -45069557 -63760945 -50271958 -24480186
5240b4480186J2024021p225466j4293165r744690j066097J0118107K3033186K8727346
$$ -24480186 -12456165 -19681631 -33974796 -43719486 -44785583 -34667476 -11634290 17093056
5232A7093056J8802621J680739m329019K370783L448289p833359j1936218L198217
$$ 17093056 35895677 37576416 33247397 35618180 39066469 31233110 19296892 22495109
5224B2495109J4656978p40453k0677110n659370L3508993M3281331Q842896k1009312
$$ 22495109 37152087 36411634 15734524 10075154 43584147 86865478 95708374 74699062
5216G4699062j0464452R313972l014117k8574011k1443247J3922983K9193063
$$ 74699062 64234610 73548582 70534465 41960454 20517207 34440190 63633253
5209F3633253M452038l1957025n0892542m8180953k5906748J0819841L7466722
$$ 63633253 68085291 36128266 -14764276 -62945229 -88851977 -78032136 -40565414
5202d0565414L0239599O402926O399267L1594654M0126528J2407295k1309092
$$ -40565414 -10325815 -3922889 2476378 34071032 74197560 86604855 65295763
5195F5295763l1840062k8008054k4701635j4573941M443925J0251219o859988
$$ 65295763 33455701 5447647 -19253988 -33827929 -29384004 -19132785 -25992773
5188b5992773k0691131j0327924N655070N376997K793118J6923570L1913064K6907262
$$ -25992773 -46683904 -57011828 -51356758 -45979761 -43186643 -26263073 5649991 32557253
5180C2557253J8881389L1014917M0586200R352034m6975898p2166449m9114235
$$ 32557253 51438642 82453559 123039759 132391793 85415895 13249446 -35864789
5173c5864789j6679943m903572j434315Q854047J5820030J1135657O439663Q566095
$$ -35864789 -52544732 -57448304 -58882619 -50028572 -34208542 -23072885 -16633222 -8067127
5165h067127P808592L182492P930954J8486956J1729027j3031969k4250446p455536
$$ -8067127 -258535 2923957 10854911 29341867 41070894 28038925 3788479 -3667057
5157c667057J0936445J0036705Q296159K2782670K9064658p80806m5127088n8054113
$$ -3667057 7269388 17306093 25602252 48384922 77449580 76668774 31541686 -26512427
5149b6512427l2156331J138225K1824347L4140277L6960566K0693725n538315
$$ -26512427 -58668758 -57530533 -35706186 -1565909 35394657 56088382 50550067
5142E0550067j8423189j6879368k3207179m1419165m4377543j4805445K5261421
$$ 50550067 32126878 15247510 -7959669 -49378834 -93756377 -108561822 -83300401
5135h3300401M1514441K7372451L747896q663363n468066M096647P157506j65985
$$ -83300401 -41785960 -14413509 -10665613 -19328976 -24797042 -20700395 -13542889 -13708874
5127a3708874p697520n670125j536966r012204k2250124j9846842K054512K0767266
$$ -13708874 -21406394 -27076519 -28613485 -37625689 -59875813 -79722655 -77668143 -56900877
5119e6900877J9569877J0251352J0657261J6809663J4456447N547076L216605
$$ -56900877 -37331000 -27079648 -16422387 387276 14843723 20390799 23607404
5112B3607404P769412Q300817N714718J3117602K9817251L4465048J4285283j3331087
$$ 23607404 31376816 39677633 45392351 58509953 88327204 122792252 137077535 123746448
5104A23746448k2689334j4680304j3090503k7825806l9424549k6991464K356663
$$ 123746448 101057114 86376810 73286307 45460501 6035952 -20955512 -18598849
5097a8598849K4578111L0435376K9672107K6812923J2983859j2536358l1694764
$$ -18598849 5979262 36414638 66086745 92899668 105883527 93347169 61652405
5090F1652405l2107261k7723071l6850188m9460542l9567041p744898J4084554
$$ 61652405 29545144 1822073 -35028115 -84488657 -124055698 -131800596 -117716042
5083a17716042P251814o994192Q1565K2881687L2194280J8509885K734028M105821
$$ -117716042 -110464228 -117458420 -117376855 -94495168 -62300888 -43791003 -41056975 -36951154
5075c6951154J6438989K1664591J2591528n497397k4511582l5134397k7714619
$$ -36951154 -20512165 1152426 13743954 8246557 -16265025 -51399422 -79114041
5068g9114041m249117J4897501J0210786j0015170j4860673J1212343M5355551
$$ -79114041 -83363158 -68465657 -58254871 -68270041 -83130714 -71918371 -26562820
5061b6562820N0469083J7424119k5300839m1735500k1102467J7113223M2577587
$$ -26562820 23906263 41330382 16029543 -25705957 -46808424 -29695201 12882386
5054A2882386L8674921J4427555o952464j3901860j6418714k5311668l1312588
$$ 12882386 51557307 65984862 59032398 45130538 28711824 3400156 -27912432
5047b7912432j9341422K468971R049576m294760j2709234J035615K0120637J9209895
$$ -27912432 -47253854 -44784883 -35735307 -40030067 -52739301 -51703686 -31583049 -12373154
5039a2373154O54591j2909088j1308672l457535J713613K793329j213697q553436
$$ -12373154 -11718563 -24627651 -35936323 -39393858 -37680245 -34886916 -36100613 -44654049
5031d4654049q490011O389419K4301634K6602927J3473562J379496j669073m82852
$$ -44654049 -53144060 -46754641 -22453007 4149920 17623482 19002978 17333905 16851053
5023A6851053L786452J2517312J3485452p964486l7384594l8709525m694275K6099578
$$ 16851053 20637505 33154817 46640269 38675783 1291189 -37418336 -42112611 -16013033
5015a6013033K0029553o646061j6012494l334338M808460k387917n730868Q539818
$$ -16013033 4016520 -2629541 -18642035 -21976373 -17167913 -19555830 -25286698 -16746880
5007a6746880K4817429K0923160n71416j6656554j3055671J274442Q536915M093620
$$ -16746880 8070549 28993709 28422293 11765739 -1289932 -15490 8521425 12615045
4999A2615045j343396p05737k129167j2212390j5823334P211920M3974548N1979979
$$ 12615045 11271649 10565912 8436745 -3775645 -19598979 -12387059 31587489 83567468
4991H3567468J4379091l0374553l6282343j0506025K545273j2138017k4659249
$$ 83567468 97946559 67572006 31289663 20783638 23328911 11190894 -13468355
4984a3468355j3151038L636891J279125j2179109j5511501j0503071j2164543
$$ -13468355 -26619393 -22982502 -21703377 -33882486 -49393987 -59897058 -72061601
4977g2061601j6239826n891704J3957369J8423113K345243q711489K742209J9974935
$$ -72061601 -88301427 -94193131 -80235762 -61812649 -59467406 -68178895 -65436686 -45461751
4969d5461751K0578964J1142321J1236761J6856711P458536j5539069k6370143
$$ -45461751 -24882787 -13740466 -2503705 14353006 21811542 6272473 -20097670
4962b0097670j4971657k501258o584050j5646672j3610523p749095r991197q961890
$$ -20097670 -35069327 -37570585 -44154635 -59801307 -73411830 -81160925 -91152122 -100114012
4954a00114012J1233741L5999106L5376180R961495r858762j1516247j4178479
$$ -100114012 -88880271 -52881165 -17504985 -7543490 -17402252 -28918499 -43096978
4947d3096978k7454462k9823471n984210K2191257K6173017J2873253J1088424
$$ -43096978 -70551440 -100374911 -106359121 -84167864 -57994847 -45121594 -34033170
4940c4033170K8248819M4078584M0054485J6013384j5954497l7710762l3382868
$$ -34033170 -5784351 38294233 78348718 94362102 78407605 40696843 7313975
4933G313975q093533J0241977M186872q889473m114187J2336434J6273571O155995
$$ 7313975 -779558 9462419 13649291 4759818 645631 12982065 29255636 35411631
4925C5411631J443728O309902O469048R28004M192047J3460697P157913j5153965
$$ 35411631 36855359 43165261 49634309 50562313 54754360 68215057 75372970 60219005
4917F0219005k4545539q456829O821139j478513j6827399j4235164j343401N24332
$$ 60219005 35673466 27216637 34037776 32559263 15731864 1496700 153299 677631
4909F77631l793826M356480J8289810J4169237o639929j6980589p264145J371823
$$ 677631 -3116195 1240285 19530095 33699332 27059403 10078814 2814669 4186492
4901D186492n695947j3471010l972887J4896000K2069440J1681217l895365j0800629
$$ 4186492 -1509455 -14980465 -18953352 -4057352 18012088 29693305 25797940 14997311
4893A4997311m952401O259218Q871236k808555j4829046r587125N370629K850352
$$ 14997311 10044910 16304128 25175364 22366809 7537763 -2049362 3321267 6171619
4885F171619k2686562l9831095k1233693J6943834L6083762K3528585q55026j6760470
$$ 6171619 -16514943 -56346038 -77579731 -60635897 -24552135 -1023550 -1878576 -18639046
4877a8639046j9090994r657649m28686j9253611p6902455j25279484r1386397
$$ -18639046 -37730040 -47387689 -47816375 -67069986 -143972441 -269251925 -360638322
4870c60638322K5405000J27578068J26903158N1469819J890021J7672468M1733263
$$ -360638322 -335233322 -207655254 -80752096 -29282277 -27392256 -9719788 32013475
4863C2013475J9556546k4483794l6173105j2203537Q185201O433654j995011n511015
$$ 32013475 51570021 27086227 -9086878 -21290415 -13105214 -6671560 -8666571 -14177586
4855a4177586r242245j2070231l344587J4101097K3485854K0018348J4531330
$$ -14177586 -23419831 -35490062 -38834649 -24733552 -1247698 18770650 33301980
4848C3301980R522184l751651k0478577k1067016l375884Q871087J916461p593068
$$ 33301980 42824164 39072513 18593936 -2473080 -5848964 3022123 4938584 -2654484
4840b654484l491860J429818j0923289k9970269l1266136j3900951K372850J0953916
$$ -2654484 -6146344 -4716526 -15639815 -45610084 -76876220 -90777171 -88404321 -77450405
4832g7450405K3071244L8605774L7731811J0859815k0756594k7147470m290256
$$ -77450405 -54379161 -15773387 21958424 32818239 12061645 -15085825 -19376081
4825a9376081K2835425K8204105R386822j4402446k4084647j7885934p159306
$$ -19376081 3459344 31663449 41050271 26647825 2563178 -15322756 -22482062
4818b2482062j61896L445508M446612J364021k101195J613144J0922919J5323646
$$ -22482062 -22643958 -19198450 -14751838 -13387817 -15489012 -13875868 -2952949 12370697
4810A2370697J3368674J5084913J8696761M922874k9233804n0725462l0513125
$$ 12370697 25739371 40824284 59521045 64443919 35210115 -15515347 -46028472
4803d6028472R808847K2910305J578189j4955919l119163J3035705N704204j3497485
$$ -46028472 -36219625 -13309320 -11731131 -26687050 -29806213 -16770508 -11066304 -24563789
4795b4563789j7534141o875521o45023q17407N241773J4674902J1004735m432327
$$ -24563789 -42097930 -48973451 -49618474 -50435881 -45194108 -30519206 -19514471 -23946798
4787b3946798r613631M281159J8798179J7086377P580248O111375R579066M036668
$$ -23946798 -33560429 -29279270 -10481091 6605286 14185534 20296909 29875975 33912643
4779C3912643r443019j4569373m790237N624784j397j9127175l1923481k2199213
$$ 33912643 24469624 9900251 5110014 10734798 10733401 -8393774 -40317255 -62516468
4771f2516468N734308K9940576L1266611J2897043k667872L25910J1552224R043442
$$ -62516468 -56782160 -26841584 4425027 17322070 14654198 14980108 26532332 35575774
4763C5575774q864674j8235111j293252K7656062L9162274K4910647L295786r095635
$$ 35575774 26711100 8475989 7182737 34838799 74001073 98911720 102207506 93111871
4755I3111871j5590329k4696413l2216855k9222766j8919826j2591042j2188242
$$ 93111871 77521542 52825129 20608274 -8614492 -27534318 -40125360 -52313602
4748e2313602q659016K477367J3364564J3347255K12609j8050707k7445684j6939163
$$ -52313602 -60972618 -58495251 -45130687 -31783432 -31570823 -49621530 -77067214 -94006377
4740i4006377Q154817K4531254J4752701p715979j2497704N556780J7135696K378252
$$ -94006377 -85851560 -61320306 -46567605 -54283584 -66781288 -61224508 -44088812 -41710560
4732d1710560j5529134l321105K7907980L2762340j898132l2357435j6225947
$$ -41710560 -57239694 -60560799 -32652819 109521 -1788611 -34146046 -50371993
4725e0371993K9279754N2064391L3019935L0985j9592430k8200859l3654933k6597543
$$ -50371993 -21092239 30972152 63992087 64023072 44430642 16229783 -17425150 -44022693
4717d4022693R897K8314353L3645089J5309272p091796j9227454j8511230m973680
$$ -44022693 -44012796 -15698443 17946646 33255918 26164122 6936668 -11574562 -16548242
4709a6548242J5374482K4945913J2746877n554511n973695P987817J0078266q083588
$$ -16548242 -1173760 23772153 36519030 30964519 24990824 32978641 43056907 34973319
4701C4973319k5098498k2910304q362686N678714J7208323K2328897R165882j9397944
$$ 34973319 9874821 -13035483 -21398169 -15719455 1488868 23817765 32983647 13585703
4693A3585703l6763815k4877050L86922J3588925J3377847J2321171R408808k482932
$$ 13585703 -23178112 -48055162 -47668240 -34079315 -20701468 -8380297 1028511 -1454421
4685a454421j3138880o211632J1208910J5632627K551135q219534l902358N008657
$$ -1454421 -14593301 -20804933 -9596023 6036604 8587739 368205 -3534153 1474504
4677A474504L534634q822728k1207015k2137563p977333R539552J0529857o536681
$$ 1474504 5009138 -3813590 -25020605 -47158168 -55135501 -45595949 -35066092 -41602773
4669d1602773j6499384k212289J6242731J0888282q685934j0643195O814087J5394487
$$ -41602773 -58102157 -60314446 -44071715 -33183433 -41869367 -52512562 -45698475 -30303988
4661c0303988O918590L516140J2438947J1800213n737936j4767721j927439Q201450
$$ -30303988 -23385398 -19869258 -7430311 4369902 -1368034 -16135755 -18063194 -9861744
4653i861744l314187j4578179j794018J6588270J0898460p521205m942029J7919629
$$ -9861744 -13175931 -27754110 -29548128 -12959858 -2061398 -9582603 -14524632 3394997
4645C394997K7354421R522511j3602570k0880996j4172893k126529J1278190J8550640
$$ 3394997 30749418 40271929 26669359 5788363 -8384530 -10511059 767131 19317771
4637A9317771J2157334j00699k638741L223590R47434j3647654k5274247k2003309
$$ 19317771 31475105 31374406 28735665 31959255 32906689 19259035 -6015212 -28018521
4629b8018521q530490N132487J3221296J2420973N093475K600908J0622994J5588190
$$ -28018521 -36549011 -31416524 -18195228 -5774255 -680780 1920128 12543122 28131312
4621B8131312L515353j3087311r840859J0423471J8844958L610393j3250196r505344
$$ 28131312 31646665 18559354 8718495 19141966 37986924 41597317 28347121 18841777
4613A8841777Q855031K2302308K2214369J0952003o300593k0255194k1595088
$$ 18841777 27696808 49999116 72213485 83165488 76864895 56609701 35014613
4606C5014613j3985629j0922711j5037098j4389996l371537Q013044J0216699
$$ 35014613 21028984 10106273 -4930825 -19320821 -22692358 -14679314 -4462615
4599d462615M131853q341111k5933637l5958737k0976903J4148209M0241945L8053035
$$ -4462615 -330762 -8671873 -34605510 -70564247 -91541150 -77392941 -37150996 902039
4591I02039J8080058n59955j1698415j4460787n970737N788204K034973j9551545
$$ 902039 18982097 18422142 6723727 -7737060 -13707797 -7919593 -5884620 -25436165
4583b5436165l5782809k9793955j3150364k386730N272722J5795189K0337865
$$ -25436165 -61218974 -91012929 -104163293 -106550023 -101277301 -85482112 -65144247
4576f5144247J5129655J8425176M1397936N9587842M2671556O5179l2483102m1639955
$$ -65144247 -50014592 -31589416 9808520 69396362 112067918 112133097 79649995 38010040
4568C8010040m1638091l8679312k3366776K225499K0313876K3631573K1134665
$$ 38010040 -3628051 -42307363 -65674139 -63448640 -43134764 -19503191 1631474
4561A631474J6184962L784923r258085p726570M520831N830292q904381j9564681
$$ 1631474 17816436 21601359 12343274 4616704 9137535 14967827 6063446 -13501235
4553a3501235j3118598o95019N480546Q355013R555450L85666j7785852k5583527
$$ -13501235 -26619833 -27314852 -21834306 -13479293 -3923843 -3538177 -21324029 -46907556
4545d6907556j2932501L753875N770268l438304j1316347j5612836j5646075k741173
$$ -46907556 -59840057 -56086182 -50315914 -53754218 -65070565 -80683401 -96329476 -99070649
4537i9070649K1522979L3703733J7376001q293966j1928166O592560J9818876
$$ -99070649 -77547670 -43843937 -26467936 -34761902 -46690068 -40097508 -20278632
4530b0278632J4789384O031016N631281N197605l582197j0159533j601043J3247753
$$ -20278632 -5489248 541768 6173049 11370654 7788457 -2371076 -3972119 9275634
4522I275634J2305930q879687k8105829k3431833q75739J4330977J1302803N070641
$$ 9275634 21581564 12701877 -15403952 -38835785 -39711524 -25380547 -14077744 -9007103
4514i007103J0088526J6697734P746377j1704491k0905880j5266855r886551j0668045
$$ -9007103 1081423 17779157 25525534 13821043 -7084837 -22351692 -32238243 -42906288
4506d2906288m741015J4470834L3733806L9732091L2999900J5063143j5584048
$$ -42906288 -47647303 -33176469 557337 40289428 73289328 88352471 72768423
4499G2768423m4572382m4658703j4580778Q954800j286732k5807499l1307003
$$ 72768423 28196041 -16462662 -31043440 -22088640 -23375372 -49182871 -80489874
4492h0489874j7822631m865595P232809K6627496L8079086K2706799j084969l435
$$ -80489874 -98312505 -103178100 -95945291 -69317795 -31238709 -8531910 -9616879 -9620314
4484i620314J6195401O918433k6586010l2841709Q827816M7369362L0313588k2095232
$$ -9620314 6575087 13493520 -13092490 -45934199 -37106383 10262979 40576567 18481335
4476A8481335m9421722l2431334m280800N167405k8413l494106L09108P777137
$$ 18481335 -30940387 -63371721 -67652521 -62485116 -62513529 -66007635 -65698527 -57921390
4468e7921390J2481722P824284m636959j1813790m704275P331749R047722J085022
$$ -57921390 -45439668 -37615384 -42252343 -54066133 -58770408 -51438659 -42390937 -41305915
4460d1305915k253572O392856J9009778K2441408J0960399q266743j9591257j4663310
$$ -41305915 -43559487 -37166631 -18156853 4284555 15244954 6978211 -12613046 -27276356
4452b7276356l832524j999551n718385j448818N177381n643411k8297397k8029133
$$ -27276356 -31108880 -33108431 -38826816 -40275634 -35098253 -40741664 -69039061 -97068194
4444i7068194P862108M4381277M6038534K2787204L519540q588137k1267208j9432915
$$ -97068194 -89206086 -44824809 1213725 24000929 27520469 18932332 -2334876 -21767791
4436b1767791J0859410M1323462L1059984j0111498l3789644k5232130j5133446
$$ -21767791 -10908381 30415081 61475065 51363567 17573923 -7658207 -22791653
4429b2791653j6893673n502199K5819996L9461151J2348121k0794563j8054207
$$ -22791653 -39685326 -45187525 -19367529 20093622 32441743 11647180 -6407027
4422f407027P617793J4163544n380064k2717745k2794273j4954792l836206J5495755
$$ -6407027 1210766 15374310 9994246 -12723499 -35517772 -50472564 -54308770 -38813015
4414c8813015L4514092L4227635J4944801j650320m542694n804549j5572610k4854809
$$ -38813015 -4298923 29928712 44873513 43223193 38680499 32875950 17303340 -7551469
4406g551469k2322687j2268435m769723P38074R828209J7293392J0388926j0414534
$$ -7551469 -29874156 -42142591 -46912314 -46174240 -36346031 -19052639 -8663713 -19078247
4398a9078247k4290725j2867384J2880367K1405305J614202j8283947p323969
$$ -19078247 -43368972 -56236356 -43355989 -21950684 -20336482 -38620429 -45944398
4391d5944398K2915568L2033859P480096j8789487j7125628J794952J0476813
$$ -45944398 -23028830 9005029 16485125 -2304362 -19429990 -17635038 -7158225
4384g158225M836936L45793J905232l34982j0615523k0048173j7440402J549964
$$ -7158225 -2321289 -1975496 -70264 -405246 -11020769 -31068942 -48509344 -46959380
4376d6959380K9518831M4540116K5067155k0653274n2855938m2450690m054473
$$ -46959380 -17440549 27099567 52166722 31513448 -21342490 -63793180 -67847653
4369f7847653K6548985L4107374K6059387Q193539j6871349l4256653k5429292
$$ -67847653 -41298668 -7191294 18868093 27061632 10190283 -24066370 -49495662
4362d9495662O455947L6746919M4682429K7236182n352153l3655009l7481296
$$ -49495662 -43039715 -6292796 38389633 65625815 60273662 26618653 -10862643
4355a0862643j6951621L088400N284709L507640J4747677K3995758O958572k3767667
$$ -10862643 -27814264 -24725864 -19441155 -15933515 -1185838 22809920 29768492 6000825
4347F000825l0937908p999032J2996249J1247447J430740J357715O155640M617053
$$ 6000825 -24937083 -32936115 -19939866 -8692419 -7261679 -5903964 251676 4868729
4339D868729m214922j8552705l4312637l4888352q516758K1297978J6811195j5200247
$$ 4868729 653807 -17898898 -52211535 -87099887 -95616645 -74318667 -57507472 -72707719
4331g2707719k3923152J1503726M7734110M0806631Q307909l959471J0430944
$$ -72707719 -96630871 -85127145 -37393035 3413596 11721505 7762034 18192978
4324A8192978K0583712J0330864o617845j4739415j1558214J8771J2573197J3878924
$$ 18192978 38776690 49107554 42489709 27750294 16192080 16210851 28784048 42662972
4316D2662972K726071m686674J105221O670736m50743r657090q221384m837583
$$ 42662972 45389043 40702369 41807590 48478326 48027583 38370493 30149109 25311526
4308B5311526r440141r392211P275330K3525799J8313807K697689j783736l819657
$$ 25311526 15871385 6479174 13754504 37280303 55594110 58291799 56508063 52688406
4300E2688406k3017672m3582939l1813247N576803K6072941J5778878M814064
$$ 52688406 29670734 -13912205 -45725452 -40148649 -14075708 1703170 6517234
4293F517234J1575038J5783661J410047j3900448j2649678p187767j3516702k3192978
$$ 6517234 18092272 33875933 35285980 21385532 8735854 1548087 -11968615 -35161593
4285c5161593k2805382j7104847j2236276R46011K5308977M0152912K8320585
$$ -35161593 -57966975 -75071822 -87308098 -86362087 -61053110 -20900198 7420387
4278G420387L798170q811357p099585l364580J03711O763703R949560L170993
$$ 7420387 11218557 2407200 -4692385 -8056965 -7953254 -1189551 8760009 11931002
4270A1931002l464323K869731J5618644J8463195Q763143m958368j9014187l0472086
$$ 11931002 8466679 11336410 26955054 45418249 54181392 49223024 30208837 -263249
4262b63249k7589664n079936J8290081J8510825j052577j5051996j1411597k424567
$$ -263249 -27852913 -32932849 -14642768 3868057 2815480 -12236516 -23648113 -26072680
4254b6072680j086189l854606k81045J1860780K3322754J9386484o362256l7629173
$$ -26072680 -27158869 -31013475 -31294520 -19433740 3889014 23275498 16913242 -20715931
4246b0715931m4458582j8019338J3623986J8722667J288474r092643J948355K1701992
$$ -20715931 -65174513 -83193851 -69569865 -50847198 -49558724 -58651367 -56703012 -35001020
4238c5001020L2431370K5864356J627760k8250470l8293578j5181781J8463120
$$ -35001020 -2569650 23294706 24922466 -3328004 -41621582 -56803363 -38340243
4231c8340243K7918989J1346915k488496J040380P544962N293249K340853M082234
$$ -38340243 -10421254 925661 -1562835 -522455 7022507 12315756 14656609 18738843
4223A8738843R16855r802553j3118280q52507J3786471J7865520J5124874J0172947
$$ 18738843 19655698 9853145 -3265135 -4117642 9668829 27534349 42659223 52832170
4215E2832170j367611j4527533j1107801R577504K0184495N314801j1570190m840327
$$ 52832170 51464559 36937026 25829225 35406729 55591224 60906025 49335835 44495508
4207D4495508J2095867J0645501o965866j7469647j7387360j9700206k0530519
$$ 44495508 56591375 67236876 60271010 42801363 25414003 5713797 -14816722
4200a4816722o100656J2129263O985628j8636132l1120574j6314787L051120P442938
$$ -14816722 -20917378 -8788115 -1802487 -20438619 -51559193 -67873980 -64822860 -57379922
4192e7379922N189151O389486L930968m628627n040995O365384R161858q334112
$$ -57379922 -52190771 -45801285 -41870317 -46498944 -51539939 -45174555 -36012697 -44346809
4184d4346809k5441191j8515624N342241K3106902K6376759J9049040L365331
$$ -44346809 -69788000 -88303624 -82961383 -59854481 -33477722 -14428682 -11063351
4177a1063351j1947598p954192J8141388L8692776K9038972L56071k0664269k7070119
$$ -11063351 -23010949 -30965141 -12823753 25869023 54907995 55264066 34599797 7529678
4169G529678k4630040j0554391J2262074J9180811l741272k6685368j3363789
$$ 7529678 -17100362 -27654753 -15392679 3788132 46860 -26638508 -40002297
4162d0002297K0239578K6381231j417392k1482276j1840794J812056k811984r415359
$$ -40002297 -19762719 6618512 5201120 -16281156 -28121950 -26309894 -29121878 -38537237
4154c8537237J053743J5637091J4174696R16588j0713980k0651685k8786734k2203311
$$ -38537237 -37483494 -21846403 -7671707 -6755119 -17469099 -38120784 -66907518 -89110829
4146h9110829K090238K1538948J7159405J657787j939482N591309P055537k518925
$$ -89110829 -87020591 -65481643 -48322238 -46664451 -48603933 -43012624 -35957087 -38476012
4138c8476012j3230073j6071878p270443J1394310K5317537J5623442j2795842
$$ -38476012 -51706085 -67777963 -75048406 -63654096 -38336559 -22713117 -35508959
4131c5508959k9018709j5284505R491995J9317010J4777205J1146693J1967982
$$ -35508959 -64527668 -79812173 -70320178 -51003168 -36225963 -25079270 -13111288
4124a3111288J1919982R519817K768435j0423124j8135507m757718J6880461J6644816
$$ -13111288 -1191306 8328511 11096946 673822 -17461685 -22219403 -5338942 11305874
4116A1305874l06182L907833K9975543L2827536J2662649M1495764J38158523
$$ 11305874 10999692 14907525 44883068 77710604 90373253 131869017 270027540
4109B70027540J87610190Q1637604j03764633j85208754j12722459j8080541j2333633
$$ 270027540 457637730 539275334 435510701 250301947 137579488 119498947 107165314
4102A07165314n3191864n5138153k3828324j0337697j1441090L570111J9362940
$$ 107165314 53973450 -1164703 -24993027 -35330724 -46771814 -43201703 -23838763
4095b3838763M850298j8716488r861214J8970150K3523506L499145m816696M275275
$$ -23838763 -18988465 -37704953 -47566167 -28596017 -5072511 -1573366 -6390062 -2114787
4087b114787N788139L7074R317108K3531317Q189838k9936311m1295157r406716
$$ -2114787 3673352 3710426 13027534 36558851 44748689 14812378 -26482779 -35889495
4079c5889495K1821578J4575819j1924835j9510433n552642N984712L636847n098330
$$ -35889495 -14067917 507902 -11416933 -30927366 -36480008 -30495296 -26858449 -31956779
4071c1956779j0762867p241951Q328195K7417958L1566043J2507890j6351816
$$ -31956779 -42719646 -49961597 -41633402 -14215444 17350599 29858489 13506673
4064A3506673l4540814l3355829j7895347M238Q307540L514982m827237n583643
$$ 13506673 -21034141 -54389970 -72285317 -72281079 -63973539 -60458557 -65285794 -70869437
4056g0869437j046186j865875r101365j2211358n232940M557946O370188o93900
$$ -70869437 -71915623 -73781498 -82882863 -95094221 -100327161 -95769215 -89399027 -90092927
4048i0092927n050219N913001K7665540L6439139J8073401n843718l428078J6703694
$$ -90092927 -95143146 -89230145 -61564605 -25125466 -7052065 -12895783 -16323861 379833
4040C79833J3128565k0833886l7393516o299609L2700313K8001012n310034j4059486
$$ 379833 13508398 -7325488 -44719004 -51018613 -18318300 9682712 4372678 -9686808
4032i686808P520446J6613938k322400j6839274n769633J1482292J6091856J5788127
$$ -9686808 -2166362 14447576 12125176 -4714098 -10483731 998561 17090417 32878544
4024C2878544J5567550K942281k0356907k7737467p730890J5347734J7270981
$$ 32878544 48446094 51388375 31031468 3294001 -4436889 10910845 28181826
4017B8181826K991523j3189600k7245590l2290037j7071101P548509J2224442
$$ 28181826 31173349 17983749 -9261841 -41551878 -58622979 -51074470 -38850028
4010c8850028m981779j0111424J0748211K4092406M013254k1017307j1815503
$$ -38850028 -43831807 -53943231 -43195020 -19102614 -15089360 -36106667 -47922170
4003d7922170J8938787K7897081P059517j0992433n639689Q626683J0499032k211039
$$ -47922170 -28983383 -1086302 5973215 -5019218 -10658907 -2032224 8466808 6255769
3995F255769j5381327j1994069J1864695L4338047K5729831r104121k8167807
$$ 6255769 -9125558 -21119627 -9254932 25083115 50812946 41708825 13541018
3988A3541018r802571J3210575L202313k4445770k8254423n459122J1156660Q840841
$$ 13541018 3738447 16949022 20151335 -4294435 -32548858 -38007980 -26851320 -18010479
3980a8010479M481373M286966l058532j2068420r91303K6642545L9481616K7085507
$$ -18010479 -13529106 -9242140 -12300672 -24369092 -25360395 1282150 40763766 67849273
3972F7849273J4412246J5229846Q895257j6616535l3768311j6055530J6758132
$$ 67849273 82261519 97491365 106386622 89770087 56001776 39946246 56704378
3965E6704378K5625924O828040j1586990j6043558j7846704k1589724j4670748
$$ 56704378 82330302 89158342 77571352 61527794 43681090 22091366 7420618
3958G420618O460287K4702787K6525225J9001240J2687716M464523r335449j7289551
$$ 7420618 13880905 38583692 65108917 84110157 96797873 101262396 91926947 74637396
3950G4637396q847384K798735m418457k5372599l0071140q539298R932301j583872
$$ 74637396 65790012 68588747 64170290 38797691 8726551 187253 10119554 8535682
3942H535682k5784630k5101303L378263K5373399J9949774L839134j080633J631463
$$ 8535682 -17248948 -42350251 -38971988 -13598589 6351185 10190319 9109686 10741149
3934A0741149k013005j1388977j6970517j6628853j2492409l818489N556842N604216
$$ 10741149 8728144 -2660833 -19631350 -36260203 -48752612 -52571101 -47014259 -41410043
3926d1410043l281885o295312K223776P666830L74335o395479O9655R561283J0106647
$$ -41410043 -44691928 -50987240 -48763464 -41096634 -40722299 -47117778 -47048123 -37486840 -27380193
3917b7380193J2155875K5951807L1971523O244402l4839793m9241869k6364995
$$ -27380193 -15224318 10727489 42699012 48943414 14103621 -35138248 -61503243
3910f1503243K203765J0407605O009531N674416R531594J0927287J0296771Q920148
$$ -61503243 -59299478 -48891873 -42882342 -37207926 -27676332 -16749045 -6452274 2467874
3902B467874M177055k596105o601663r342571j3459519j0435816P312362K4919813
$$ 2467874 6644929 4048824 -2552839 -11895410 -25354929 -35790745 -28478383 -3558570
3894c558570J9888989j149863p194982J1348288K9130160K5717024J0973092p44262
$$ -3558570 16330419 15180556 7985574 19333862 48464022 74181046 85154138 84409876
3886H4409876j3322980k8955696l1657103j3028387N910990K348341j4511789
$$ 84409876 71086896 42131200 10474097 -2554290 3356700 5705041 -8806748
3879h806748k0242256j2040646m436739P10188J2848829K6512425K3458671K700073
$$ -8806748 -29049004 -41089650 -45526389 -44816201 -31967372 -5454947 18003724 20703797
3871B0703797j4600562j5392813j0386932j1892695j3157103j870947J6915313
$$ 20703797 6103235 -9289578 -19676510 -31569205 -44726308 -46597255 -29681942
3864b9681942K5325016J6137019J54065r862879j2690219j2593091q556068J731495
$$ -29681942 -4356926 11780093 11934158 2071279 -10618940 -23212031 -31768099 -30036604
3856c0036604J1571160J0785675K487718J927279J3424215K0988599J1524992
$$ -30036604 -18465444 -7679769 -5192051 -3264772 10159443 31148042 42673034
3849D2673034m138788p171200J313212M952737q45090m858307j197831L151423
$$ 42673034 38534246 31363046 32676258 37628995 36783905 31925598 30727767 33879190
3841C3879190K788755L65487k498442o786204q918827n914729n084991j2726300
$$ 33879190 36667945 37033432 34534990 27748786 18829959 12915230 7830239 -4896061
3833d896061j7873703p647261N893521J43700j8429114j9617144J931448J6765804
$$ -4896061 -22769764 -30417025 -24523504 -24379804 -42808918 -62426062 -60494614 -43728810
3825d3728810R097632O60021R233961J7227632O572971m831109O677073K6295766
$$ -43728810 -34631178 -33971157 -24737196 -7509564 -936593 -5767702 909371 27205137
3817B7205137K1708900n721514k4339543j8420321k50424J7736224L2335487L4022572
$$ 27205137 48914037 43192523 18852980 432659 182235 17918459 50253946 84276518
3809H4276518J2318016k0904590l9103197l5089560k4729291j5927235L7486K1395906
$$ 84276518 96594534 75689944 36586747 1497187 -23232104 -39159339 -39121853 -17725947
3801a7725947K7094755P317011j8146653k5961829j7406738o924586K458692J5069296
$$ -17725947 9368808 16685819 -1460834 -27422663 -44829401 -51753987 -49295295 -34225999
3793c4225999K3804109J5363931o331472j8581755q179310R165073P896052j2801677
$$ -34225999 -10421890 4942041 -1389431 -19971186 -28150496 -18985423 -11089371 -23891048
3785b3891048k6115456j3352920R430433J2875409m860663j6572970n032613J5653530
$$ -23891048 -50006504 -63359424 -53928991 -41053582 -45914245 -62487215 -67519828 -51866298
3777e1866298K3393647J4770642q81950j6763954k5391939j6243166P390667K2546363
$$ -51866298 -28472651 -13702009 -14583959 -31347913 -56739852 -72983018 -65592351 -43045988
3769d3045988J4754346K31880J590375J2703853R647705j0974076k8080986k7775276
$$ -43045988 -28291642 -28059762 -26469387 -13765534 -4117829 -15091905 -43172891 -70948167
3761g0948167j7141663n935803N923261J9256065K9326990L2308674K8047369
$$ -70948167 -88089830 -94025633 -88102372 -68846307 -39519317 -7210643 20836726
3754B0836726J6995871L028047n740544q710745j6643748l1446666l4445362j2952951
$$ 20836726 37832597 40860644 35120100 26409355 9765607 -21681059 -56126421 -69079372
3746f9079372J3622413J7719607M261426M76403J1534059J6437755O537166l017522
$$ -69079372 -55456959 -37737352 -33475926 -32999523 -21465464 -5027709 1509457 -1508065
3738a508065l436468l902406o956936j368460J1767167J4041874J967845l090212
$$ -1508065 -4944533 -8846939 -15803875 -17172335 -5405168 8636706 10604551 7514339
3730G514339R142827J8323523P078688r526909q463958N889517J1342936o94632
$$ 7514339 16657166 34980689 42059377 32532468 24068510 29958027 41300963 40606331
3722D0606331k0532073l4830859l2150907p862142K2594669L0134863O771955
$$ 40606331 20074258 -14756601 -46907508 -54769650 -32174981 -2040118 4731837
3715D731837j9884917k1454109l785793P874965L597242q382726j9291965k1959217
$$ 4731837 -15153080 -36607189 -40392982 -32518017 -28920775 -37303501 -56595466 -78554683
3707g8554683q092652J7801906L3278958K4958878Q792964M857695N971453n475897
$$ -78554683 -86647335 -68845429 -35566471 -10607593 -1814629 3043066 9014519 3538622
3699C538622k1927200k0141652k85241J2761469O873091m158301p782251r517966
$$ 3538622 -18388578 -38530230 -38815471 -26054002 -19180911 -23339212 -31121463 -40639429
3691d0639429j5924492j9915394j2563418K153051J1371001O202420r722541j9461851
$$ -40639429 -56563921 -76479315 -89042733 -86889682 -75518681 -69316261 -79038802 -98500653
3683i8500653o726567K1128563L4536964J9245578m62967M199052K1992374J9392099
$$ -98500653 -105227220 -84098657 -49561693 -30316115 -30779082 -26580030 -4587656 14804443
3675A4804443m232068j4001656M128106J9280804L002316k7221870l3394052p940402
$$ 14804443 10572375 -3429281 698825 19979629 22981945 -4239925 -37633977 -45574379
3667d5574379K2674563L5253959L1364121K4942180K2800027J9131193M540823
$$ -45574379 -22899816 12354143 43718264 68660444 91460471 110591664 115132487
3660A15132487j8762606l2907761k3813591k969863L495208j1414513k7986905
$$ 115132487 96369881 63462120 39648529 36678666 40173874 28759361 772456
3653G72456k9202119k0537760j3785173q655853j358277L256728N83568l812860
$$ 772456 -28429663 -48967423 -62752596 -71408449 -72766726 -69509998 -68926430 -72739290
3645g2739290l484923O3092N088508J2509536J4223899k653782k8965588l3174741
$$ -72739290 -76224213 -76161121 -71072613 -58563077 -44339178 -46992960 -75958548 -109133289
3637a09133289n553181J9844589J2395815o687572L152880L5692504M5837640
$$ -109133289 -114686470 -94841881 -82446066 -89133638 -85980758 -50288254 -4450614
3630d450614K0299993l558694J368557J3171531L087027j7418971j9547779l577471
$$ -4450614 15849379 12290685 13659242 26830773 29917800 12498829 -7048950 -10626421
3622a0626421P592136O707411N236914O524027K780818m157176k757288P470627
$$ -10626421 -3034285 3673126 8910040 15434067 18214885 14057709 11300421 18771048
3614A8771048J5101805J6565788J7582354J5095346o99846k2891893k8480750
$$ 18771048 33872853 50438641 68020995 83116341 82416495 59524602 31043852
3607C1043852j0808174Q240806R424318J345464M01032K692102m183855j3346231
$$ 31043852 20235678 28476484 37900802 39246266 39647298 42339400 38155545 24809314
3599B4809314o669576J3264745K2784236J1749284j930546q4407J0573420J2502290
$$ 24809314 18139738 31404483 54188719 65938003 64007457 63923050 74496470 86998760
3591H6998760L502424n021048p357359o220767j039591J0636172K0370003J3369544
$$ 86998760 90501184 85480136 78122777 71902010 70862419 81498591 101868594 115238138
3583A15238138r209571k5672837j9802624j295088R723486R686867R554701J1458282
$$ 115238138 106028567 80355730 60553106 59258018 68981504 78668371 88223072 99681354
3575I9681354M769765j3051690k7975254k8457534k0219234j3924692r962894
$$ 99681354 104451119 91399429 63424175 34966641 14747407 822715 -9140179
3568i140179n792737p100123j7545602k6017927k0430187q011065l625715k741617
$$ -9140179 -14932916 -22033039 -39578641 -65596568 -86026755 -94037820 -97663535 -100405152
3560a00405152J1065416L1817013L1829733O010048j1487548N803409L4451319
$$ -100405152 -89339736 -57522723 -25692990 -19682942 -31170490 -25367081 9084238
3553I084238L2668081J243682j8521430o277244R671712k367510k9230530l1806700
$$ 9084238 41752319 42996001 24474571 18197327 27869039 25501529 -3729001 -35535701
3545c5535701j384399K6686269J9410786j1219128k5868444j1102216M539683
$$ -35535701 -36920100 -10233831 9176955 -2042173 -27910617 -39012833 -34473150
3538c4473150n567908k4847819j7499828J5321053L3873985J9400639K794798
$$ -34473150 -40041058 -64888877 -82388705 -67067652 -33193667 -13793028 -10998230
3531a0998230J4231979L2579105J8138900k1159510l6930529j1673028J6836030
$$ -10998230 3233749 35812854 53951754 32792244 -4138285 -15811313 1024717
3524A024717J3141660q093548j2091664L616853J2963716L999083p965711o796120
$$ 1024717 14166377 6072829 -6018835 -2401982 10561734 14560817 6595106 -201014
3516b01014M976299J5701870J9826593J8200401J1138767j788024j5754194j9881252
$$ -201014 4775285 20477155 40303748 58504149 69642916 67854892 52100698 32219446
3508C2219446q355309P941624R872785n299974j8104362j4308554n478123o928329
$$ 32219446 23864137 31805761 41678546 36378572 18274210 3965656 -1512467 -8440796
3500h440796q276437R499447L5042359L5479807O231965j9165392j8272402r231485
$$ -8440796 -16717233 -7217786 27824573 63304380 69536345 50370953 32098551 22867066
3492B2867066j5614915k8508724k5473681p382038P525621J3140516J6671898
$$ 22867066 7252151 -21256573 -46730254 -54112292 -46586671 -33446155 -16774257
3485a6774257J8990347J3714130J383480j0029753j4630678r899748K886371J2559800
$$ -16774257 2216090 15930220 17313700 7283947 -7346731 -17246479 -14360108 -1800308
3477a800308N957597j0003682j1870517L932883R899804j0821099l4073267k9184210
$$ -1800308 4157289 -5846393 -17716910 -13784027 -3884223 -14705322 -48778589 -77962799
3469g7962799m238516J0020534N505748k659788p273904j0226326l739242J7151622
$$ -77962799 -82201315 -72180781 -66675033 -69334821 -76608725 -86835051 -90574293 -73422671
3461g3422671L1722364J7241899r598626j0381867J7252229L5806347K4920024
$$ -73422671 -41700307 -24458408 -34057034 -44438901 -27186672 8619675 33539699
3454C3539699N758900K09780O16467n720611j1967830r024375l709719l274729
$$ 33539699 39298599 39508379 40124846 34404235 22436405 13412030 9702311 6427582
3446F427582j204424P195387J2418133O706880l134609r261232j4095443j9768438
$$ 6427582 5223158 12418545 24836678 31543558 28408949 19147717 5052274 -14716164
3438a4716164k1431325j7680203j2321354k533691J5967839L0322106K1360232
$$ -14716164 -36147489 -53827692 -66149046 -68682737 -52714898 -22392792 -1032560
3431a032560k829096j1977682L39178O730905n787616j1505340R083148L1605816
$$ -1032560 -3861656 -15839338 -15500160 -8769255 -14556871 -26062211 -16979063 14626753
3423A4626753K4330323j503564j0565349K808141J1972158J297368j6317341k3159169
$$ 14626753 38957076 37453512 26888163 29696304 41668462 42965830 26648489 3489320
3415C489320j6171339l235168N039793K350965m858913l532264M359084R18338
$$ 3489320 -12682019 -15917187 -10877394 -8526429 -13385342 -16917606 -12558522 -11640184
3407a1640184j7152806k6336167r583858J7764295L3092679L6542860L4709628
$$ -11640184 -28792990 -55129157 -64713015 -46948720 -13856041 22686819 57396447
3400E7396447J7986235j6021727l6942402j6938486K0501853K6306562m510189
$$ 57396447 75382682 59360955 22418553 5480067 25981920 52288482 47778293
3393D7778293k7836658j6456859O967119J1556274j004288j2038921j5589769
$$ 47778293 19941635 3484776 10451895 22008169 21003881 8964960 -6624809
3386f624809j5348635j0405128K53102J0552826J4778135J2904757M011593j3788731
$$ -6624809 -21973444 -32378572 -32125470 -21572644 -6794509 6110248 10121841 -3666890
3378c666890l2931540l8489781k5534811m559717J2289919K0303965J8219598
$$ -3666890 -36598430 -75088211 -100623022 -105182739 -92892820 -72588855 -54369257
3371e4369257P839771j718549j327099N821561Q904941M577829j958886o135796
$$ -54369257 -46529486 -48248035 -49575134 -43753573 -34848632 -30270803 -32229689 -38365485
3363c8365485m601525M740299J2199587k12119k8444922l7510622p951873K6498126
$$ -38365485 -42967010 -38226711 -26027124 -26239243 -54684165 -92194787 -100146660 -73648534
3355g3648534K1928212q748962j4288318J5318560L5899973K0599222m223959
$$ -73648534 -51720322 -60469284 -74757602 -59439042 -23539069 -2939847 -7163806
3348g163806r266117l157226j489541L656975J6268609J5350131p810861k3464268
$$ -7163806 -16429923 -19587149 -21076690 -17419715 -1151106 14199025 6388164 -17076104
3340a7076104p481170J7092683J7603346M372431O651195J8806144J4444492j707113
$$ -17076104 -24557274 -7464591 10138755 14511186 21162381 39968525 54413017 52705904
3332E2705904k802534P127541l483524l6103812n2221732l0715848K463017J5354207
$$ 52705904 49903370 57030911 53547387 17443575 -34778157 -65494005 -63030988 -47676781
3324d7676781R424409L349559M085273R750764J9598790K6475301J7853599k763767
$$ -47676781 -38252372 -34902813 -30817540 -21066776 -1467986 25007315 42860914 40097147
3316D0097147j3046743k818916R401267M251642j0457893j5190093q488786m141054
$$ 40097147 27050404 24231488 33632755 37884397 27426504 12236411 3747625 -393429
3308c93429p907738j3586927j6430366j5786038q207685Q391615K4811452K6406024
$$ -393429 -8301167 -21888094 -38318460 -54104498 -62312183 -53920568 -29109116 -2703092
3300b703092J0579218q661545j4879456m195374J2655906J9941772J0930803m571908
$$ -2703092 7876126 -785419 -15664875 -19860249 -7204343 12737429 23668232 19096324
3292A9096324r591854L30283J0943206O558126j0793441k4741181k4133933j3183988
$$ 19096324 9504470 9834753 20777959 27336085 16542644 -8198537 -32332470 -45516458
3284d5516458k699404L170991Q493493J5574942J7728952O762660j2222940k1370261
$$ -45516458 -48215862 -45044871 -36551378 -20976436 -3247484 3515176 -8707764 -30078025
3276c0078025j1977533Q34272k546434j5476532j0895521J7752893M0004979K6977789
$$ -30078025 -42055558 -41221286 -43767720 -59244252 -70139773 -52386880 -12381901 14595888
3268A4595888o841953k1204422m401038J3820764Q130369p081449l979851J4009428
$$ 14595888 7753935 -13450487 -17851525 -4030761 4099608 -2981841 -6961692 7047736
3260G047736J7786099k453023k2972454k2138468q506291j781266l520193l090790
$$ 7047736 24833835 22380812 -591642 -22730110 -31236401 -33017667 -36537860 -39628650
3252c9628650O33163K964965Q944604K2830950K8543156P251075k5832721l1484011
$$ -39628650 -38995487 -36030522 -27085918 -4254968 24288188 31539263 5706542 -25777469
3244b5777469q02282K8827979K5703320M313313o197925p914358j9031616l2344032
$$ -25777469 -26579751 2248228 27951548 32264861 26066936 18152578 -879038 -33223070
3236c3223070k5463406l932212L698654n319189r10561K8040124M8331422K8591935
$$ -33223070 -58686476 -62618688 -58920034 -64239223 -65149784 -37109660 11221762 39813697
3228C9813697j3211476l2148462j2828675J8112275K9565903J7431308r93245
$$ 39813697 26602221 -5546241 -18374916 -262641 29303262 46734570 45741325
3221D5741325j0741547j2646194j6205544k1562103j5244075Q129451K7527010
$$ 45741325 34999778 22353584 6148040 -15414063 -30658138 -22528687 4998323
3214D998323J7521706j2257690k3078717M40357K7926714K7550580R736429M362378
$$ 4998323 22520029 10262339 -12816378 -12376021 15550693 43101273 52837702 57200080
3206E7200080J2209489P972800j6354768l9625279m2878817k8906554q710619
$$ 57200080 69409569 77382369 61027601 21402322 -21476495 -50383049 -59093668
3199e9093668J0173122J8876954J1500121p55839J002554J4381368J6196021p16968
$$ -59093668 -48920546 -30043592 -18543471 -19299310 -18296756 -3915388 12280633 11563665
3191A1563665j3133692k698974J4949692J4452499k243001j4237929j4618814
$$ 11563665 -1570027 -4269001 10680691 25133190 22890189 8652260 -5966554
3184e966554j1570075n265683R750670K1900713J0684623j7533088k8465570o360233
$$ -5966554 -17536629 -22802312 -13051642 8849071 19533694 2000606 -26464964 -32825197
3176c2825197K1139183K0992650o63526j2129246j411358J4477653J8648858J0990433
$$ -32825197 -11686014 9306636 8643110 -3486136 -4897494 9580159 28229017 39219450
3168C9219450j878314j3251341j3199155J980751J6216306R276686j1947620j9722551
$$ 39219450 37341136 24089795 10890640 12871391 29087697 38364383 26416763 6694212
3160F694212p759434j619940j5630232k6792204j2732317Q290668N345669j3230333
$$ 6694212 -1065222 -2685162 -18315394 -45107598 -57839915 -49549247 -44203578 -57433911
3152e7433911j1277473J7722048M0731232L5550457J6802109K083260j4584612
$$ -57433911 -68711384 -50989336 -10258104 25292353 42094462 44177722 29593110
3145B9593110l7127750m3614333j5223624K7438786M4030603K3441382q272715
$$ 29593110 -7534640 -51148973 -66372597 -38933811 5096792 28538174 20265459
3138B0265459k3784406j8918830m444066P723342R079445l95372r730064q433837
$$ 20265459 -3518947 -22437777 -26881843 -19158501 -10079056 -10474428 -20204492 -28638329
3130b8638329J411957J1957966K1513862K9028929K5940883R262480n100109j336034
$$ -28638329 -27226372 -15268406 6245456 35274385 61215268 70477748 65377639 64041605
3122F4041605R743575N335187j1592964j5366689m00818P680663o498797k2318614
$$ 64041605 73785180 79120367 67527403 52160714 51759896 59440559 52941762 30623148
3114C0623148j5450064O052640J8130306J5953769J0415900K339649j5023584
$$ 30623148 15173084 21225724 39356030 55309799 65725699 68065348 53041764
3107E3041764l4024961l6857587k1409128m048978L871712N894583O524210L760334
$$ 53041764 19016803 -17840784 -39249912 -43298890 -39427178 -33532595 -27008385 -23248051
3099b3248051j766424l773094M32891P522556J4426829J7295513R091684p796764
$$ -23248051 -25014475 -28787569 -28354678 -20832122 -6405293 10890220 19981904 12185140
3091A2185140j3295467N351212K4899444J0079525l1378186m9216937j8060664
$$ 12185140 -1110327 4240885 29140329 39219854 7841668 -41375269 -59435933
3084e9435933K6346347L8441130K1994747R210353M709163j0191124k9451733
$$ -59435933 -33089586 5351544 27346291 36556644 41265807 31074683 1622950
3077A622950k3475814P959620K4993914N659505j8602971q817883K4191473L6682595
$$ 1622950 -21852864 -13893244 11100670 16760175 -1842796 -10660679 13530794 50213389
3069E0213389J3432136j5894587j9674099o50582J5293161J1172455p164057k0826730
$$ 50213389 63645525 47750938 28076839 27426257 42719418 53891873 46727816 25901086
3061B5901086j6566686N47850J1848718N328481j0456827j7150525r299969k35186
$$ 25901086 9334400 9882250 21730968 27059449 16602622 -547903 -9847872 -10083058
3053a0083058m577873j9320443k5324396q629418J9930786L1241743J0444891
$$ -10083058 -14660931 -33981374 -59305770 -67935188 -48004402 -16762659 -6317768
3046f317768k0600050k5156531L366351L2537992L2314750R695576q564903j2236983
$$ -6317768 -26917818 -52074349 -48707998 -16170006 16144744 25840320 17275417 5038434
3038E038434r291621l443221O698564J0993699m064652k7263916k7014917N359296
$$ 5038434 -4253187 -7696408 -997844 9995855 5931203 -21332713 -48347630 -42988334
3030d2988334L6342095L0659933j778964j8540427N07215K9870221L3750804J0209564
$$ -42988334 -6646239 24013694 22234730 3694303 4201518 34071739 67822543 78032107
3022G8032107j1157299j0025510M61849l986018k3005705l3135237k3255075r595589
$$ 78032107 66874808 56849298 57311147 53325129 30319424 -2815813 -26070888 -35666477
3014c5666477p727500q174147L491073J7125787J2487254m719815q597340N964134
$$ -35666477 -43393977 -51568124 -48077051 -30951264 -18464010 -23183825 -31781165 -25817031
3006b5817031J6036567R409207K704380R721249J7590558J0589588m505864j4919408
$$ -25817031 -9780464 -371257 2333123 12054372 29644930 40234518 35728654 20809246
2998B0809246k2963572l0164760k1009705J0993952L7697866K8010600m631418
$$ 20809246 -2154326 -32319086 -53328791 -42334839 -4636973 23373627 18742209
2991A8742209j8601629l125126J1787671M813184j0391001j5130151j1150997
$$ 18742209 140580 -2984546 8803125 13616309 3225308 -11904843 -23055840
2984b3055840m517555Q323811K2781006J8687063r890491l6124513l2100176n108081
$$ -23055840 -27573395 -19249584 3531422 22218485 12327994 -23796519 -55896695 -61004776
2976f1004776J6704046K2366503K1463474J9636785J3580725O519808P257375
$$ -61004776 -44300730 -21934227 -470753 19166032 32746757 39266565 46523940
2969D6523940J2519920P596521j1689178l0712682l3821300k1036236m466652
$$ 46523940 59043860 66640381 54951203 24238521 -9582779 -30619015 -35085667
2962c5085667M170130J010012p862542j0536689j082731J2767198J8438717J3081507
$$ -35085667 -30915537 -29905525 -37768067 -48304756 -49387487 -36620289 -18181572 -5100065
2954e100065M106782j492859j673119L269691R748790J0010518N48276j0815473
$$ -5100065 -993283 -2486142 -4159261 -889570 8859220 18869738 19418014 8602541
2946H602541j4209557j0801753p505392l035844P917993J8826831J5158219l503747
$$ 8602541 -5607016 -16408769 -23914161 -26950005 -19032012 -205181 14953038 11449291
2938A1449291j9710539k1529432j6048908j2518845o095650R301705K2611416
$$ 11449291 -8261248 -29790680 -45839588 -58358433 -64454083 -55152378 -32540962
2931c2540962J7112246k724056j2583139n82026J5169100J0922920q894901j6399628
$$ -32540962 -15428716 -18152772 -30735911 -31317937 -16148837 -5225917 -14120818 -30520446
2923c0520446J016414K1783960J9777482J206477o506977J600635P02477j9880547
$$ -30520446 -29504032 -7720072 12057410 13263887 6756910 8357545 9060022 -10820525
2915a0820525l2070858j0008981K4510496K9113906L394404j2100332K12980J1335765
$$ -10820525 -42891383 -52900364 -28389868 724038 4118442 -7981890 -7768910 3566855
2907C566855j329375j5150228k015134K3069027K7300395J4034211J2548979K3482292
$$ 3566855 2237480 -12912748 -14927882 8141145 35441540 49475751 62024730 85507022
2899H5507022J6129209j6265550l7088483j8120002J7471741K4984012n665778
$$ 85507022 101636231 85370681 48282198 30162196 47633937 72617949 66952171
2892F6952171m2615661n1118448k5028570J3901037L6191629K8662339O392943
$$ 66952171 24336510 -26781938 -51810508 -37909471 -1717842 26944497 33337440
2885C3337440l633627N767186J5473628Q529752q343876j9147727k0104449j5250641
$$ 33337440 29703813 35470999 50944627 59474379 51130503 31982776 11878327 -3372314
2877c372314m086294J1092983J6739950N140596p941044k614448J2845918J0967803
$$ -3372314 -7458608 3634375 20374325 25514921 17573877 14959429 27805347 38773150
2869C8773150j3295946l1893034k0992141R344603L1999024L4226981K1343428
$$ 38773150 25477204 -6415830 -27407971 -18063368 13935656 48162637 69506065
2862F9506065J714408j7678567k7281227k0348900k318212J2572839J4023397
$$ 69506065 71220473 53541906 26260679 5911779 3593567 16166406 30189803
2855C0189803K220037j4511336k4983214k2767161j3039012p845852j1042881
$$ 30189803 32409840 17898504 -7084710 -29851871 -42890883 -50736735 -61779616
2848f1779616j3027333m360990J1150488K1733301K0431188Q232307q640809j9148687
$$ -61779616 -74806949 -79167939 -68017451 -46284150 -25852962 -17620655 -26261464 -45410151
2840d5410151j3403773L999911J4746181J0152662M603805J2927444K3942314
$$ -45410151 -58813924 -54814013 -40067832 -29915170 -25311365 -12383921 11558393
2833A1558393J5867472o765277j5442453k8670J5074864P991576q031180o325143
$$ 11558393 27425865 20660588 5218135 5189465 20264329 28255905 20224725 13899582
2825A3899582J3233351K6115079J7680300l181615k1774407l1165574k7913286
$$ 13899582 27132933 53248012 70928312 67746697 45972290 14806716 -13106570
2818a3106570j0708243J2642842K8645637L1842562K6212892J3725668n757005
$$ -13106570 -23814813 -11171971 17473666 49316228 75529120 89254788 83497783
2811H3497783k2793964k2460516n415367Q809632N927451q090505k1387169l0574037
$$ 83497783 60703819 38243303 32827936 41637568 47565019 39474514 18087345 -12486692
2803a2486692l3195909k3004977m671519L697993k131651m70866K1020877L6885484
$$ -12486692 -45682601 -68687578 -73359097 -69661104 -71792755 -72263621 -51242744 -14357260
2795a4357260K0029708q457363m598220K8178753L8679104O188027k6069595j7803023
$$ -14357260 5672448 -2784915 -7383135 20795618 59474722 65662749 39593154 21790131
2787B1790131Q378885Q247952j3606251j7794106K786643J5564018M198120r825241
$$ 21790131 30169016 38416968 24810717 7016611 9803254 25367272 29565392 19740151
2779A9740151o937312M227295R729497R876620N507933q086419k2213075j6383164
$$ 19740151 12802839 17030134 26759631 36636251 42144184 34057765 11844690 -4538474
2771d538474P220418J6712181m703393l0959782l0727467j0666314L025733O272063
$$ -4538474 2681944 19394125 14690732 -16269050 -46996517 -57662831 -54637098 -48365035
2763d8365035J1053620J2842855j991143k2944335k3707831m686336M541556q186412
$$ -48365035 -37311415 -24468560 -26459703 -49404038 -73111869 -77798205 -73256649 -81443061
2755h1443061j7797141j267978K7541684L9035396K6329632N554908r275324j4430461
$$ -81443061 -99240202 -100508180 -72966496 -33931100 -7601468 -2046560 -11321884 -25752345
2747b5752345q256627P486164K0373289J5425354p384363l0950504l7140781k1552147
$$ -25752345 -34008972 -26522808 -6149519 9275835 1891472 -29059032 -66199813 -87751960
2739h7751960N343787K7214227L3320696K4243489P059753j2035112k6432863
$$ -87751960 -82408173 -55193946 -21873250 2370239 9429992 -2605120 -29037983
2732b9037983k6581099j0571516N164790J671783j3828973j3219588J1271723
$$ -29037983 -55619082 -66190598 -61025808 -59354025 -73182998 -86402586 -75130863
2725g5130863L0768201J9253996p945584j6278514n13523J4181165J4236820J2716690
$$ -75130863 -44362662 -25108666 -33054250 -49332764 -49846287 -35665122 -21428302 -8711612
2717h711612J8959882J9827262L683068j6363178j9092801l252727J5032957K4313416
$$ -8711612 10248270 30075532 33758600 17395422 -1697379 -4950106 10082851 34396267
2709C4396267K4562787J8854647J0644903M561538j53377j0718173k5005286k4201322
$$ 34396267 58959054 77813701 88458604 93020142 92866765 82148592 57143306 32941984
2701C2941984K054290L0407708K6842967m484962k0822682J234149L1229570K7066362
$$ 32941984 34996274 65403982 92246949 87761987 66939305 68173454 99403024 126469386
2693A26469386o578308k8618695k1529947j0112169j6581311k6098139j3732634
$$ 126469386 119891078 91272383 69742436 59630267 43048956 16950817 3218183
2686C218183J3592056K4694297O339694k2307169l6929499l3049052k0284977
$$ 3218183 16810239 41504536 47844230 25537061 -11392438 -44441490 -64726467
2679f4726467n733001Q459953J8486016J8929138Q874694n767530j6311608j7716667
$$ -64726467 -70459468 -61999515 -43513499 -24584361 -15709667 -21477197 -37788805 -55505472
2671e5505472j2471920p273286m178173K149024J4966818K7145072K8632450J9657271
$$ -55505472 -67977392 -75250678 -79428851 -77279827 -62313009 -35167937 -6535487 13121784
2663A3121784R200510K297593k703549n651218l629965P59575L63469n372258
$$ 13121784 22322294 24619887 21916338 16265120 12635155 13394730 13758199 8385941
2655H385941r846195j1060759j2742255j2847306n662253J795299n850940k3921207
$$ 8385941 -1460254 -12521013 -25263268 -38110574 -43772827 -41977528 -47828468 -71749675
2647g1749675k4846971J519268K5595916J8396168l553734l313341J8084638K4236471
$$ -71749675 -96596646 -95077378 -69481462 -51085294 -54639028 -57952369 -39867731 -15631260
2639a5631260K315457j8701409j7086035r108557j3062627j4973473L552649K8084292
$$ -15631260 -13315803 -32017212 -49103247 -58211804 -71274431 -86247904 -82695255 -54610963
2631e4610963L2987849K3328721K2107674K6292808J1801209j8930093l0712763
$$ -54610963 -21623114 1705607 23813281 50106089 61907298 42977205 12264442
2624A2264442o783329K3923605K7258245Q967770p22216Q009644J7830472J5868055
$$ 12264442 5481113 29404718 56662963 65630733 64908517 72918161 90748633 106616688
2616A06616688J0493412J3551996K0736086J7818483N06973j9449135k8440011
$$ 106616688 117110100 130662096 151398182 169216665 169723638 150274503 121834492
2609A21834492k6241858k1932019j6637042j076373K4055339L6925185J8431692
$$ 121834492 95592634 73660615 57023573 55947200 80002539 116927724 135359416
2602A35359416j8340801l9905353l3044528j6180638q261217o233883j187628
$$ 135359416 117018615 77113262 44068734 27888096 19626879 13392996 12205368
2595A2205368K104461m611533j6587234k3259926k2034406j4311627L95549J4894915
$$ 12205368 14309829 9698296 -6888938 -30148864 -52183270 -66494897 -66099348 -51204433
2587e1204433J2770903q088683k3114834j0609615J6929365L0943292K6386016
$$ -51204433 -38433530 -46522213 -69637047 -80246662 -63317297 -32374005 -5987989
2580e987989K0054918J7207314P180524r717173j8752362j7141311j8056978k3509583
$$ -5987989 14066929 31274243 38454767 28737594 9985232 -7156079 -25213057 -48722640
2572d8722640j9020471k327867R116080R300166J4770435L0264608L1689157N307547
$$ -48722640 -67743111 -70070978 -60954898 -51654732 -36884297 -6619689 25069468 30377015
2564C0377015k1149417j4980387J2157360K2507476P625698o959251o106132o24750
$$ 30377015 9227598 -5752789 6404571 28912047 36537745 29578494 23472362 22847612
$$ [...]
##END NTUPLES=NMR SPECTRUM
##END=
