##TITLE=31Pdec_DE-60rm_5h
 , 64 sc
 27.6.2024
##JCAMPDX= 6.0         $$ Bruker NMR JCAMP-DX V2.0
##DATA TYPE= NMR SPECTRUM
##DATA CLASS= NTUPLES
##ORIGIN= UXNMR, Bruker Analytische Messtechnik GmbH
##OWNER= root
$$ XWIN-NMR		Version 3.5
$$ Thu Jun 27 16:38:24 2024 Russian Standard Time (UT+4h)  she@DPX200
##.OBSERVE FREQUENCY= 81.013821
##.OBSERVE NUCLEUS= ^31P
##.ACQUISITION MODE= SIMULTANEOUS
##.ACQUISITION SCHEME= undefined
##.AVERAGES= 64
##.DIGITISER RES= 17
##SPECTROMETER/DATA SYSTEM= spect
##.PULSE SEQUENCE= zgpg30
##.SOLVENT NAME= CDCl3
##.SHIFT REFERENCE= (INTERNAL, CDCl3, 0, 198.062)
##AUDIT TRAIL= $$ (NUMBER, WHEN, WHO, WHERE, WHAT)
$$ ##TITLE= Audit trail, XWIN-NMR		Version 3.5
$$ ##JCAMPDX= 5.01
$$ ##ORIGIN= Bruker BioSpin GmbH
$$ ##OWNER= she
$$ F:/spectra/data/she/nmr/P31/2/pdata/1/auditp.txt
$$ ##AUDIT TRAIL=  $$ (NUMBER, WHEN, WHO, WHERE, WHAT)
(   1,<2024-06-27 16:37:23.26 +0400>,<she>,<DPX200>,
      <created by zg, POWCHK disabled, PULCHK disabled
       configuration hash MD5:
       00 E9 B6 7A A2 85 ED C7 34 08 36 98 17 FE 4E 26
       data hash MD5: 32K
       21 61 90 83 7E 88 40 94 1A C7 3B 8F F2 6C 7A F6>)
(   2,<2024-06-27 16:37:25.57 +0400>,<she>,<DPX200>,
      <Start of raw data processing
       efp BC_mod = 2 LB = 1.5 FT_mod = 6 PKNL = 1 PHC0 = 2810.46 PHC1 = 119.4863 SI = 64K 
       data hash MD5: 64K
       6D B3 06 4B 6B 6E 53 F4 F8 9F 27 31 97 4A D3 A6>)
(   3,<2024-06-27 16:37:53.81 +0400>,<she>,<DPX200>,
      <pk PHC0 = -136.5151 PHC1 = 339.2 
       data hash MD5: 64K
       F7 48 03 D4 52 87 79 CE A4 F3 5C F9 80 0F 9A 74>)
(   4,<2024-06-27 16:37:59.57 +0400>,<she>,<DPX200>,
      <abs ABSG = 5 
       data hash MD5: 64K
       EE 44 7E C1 3C 0D 5F B4 B3 CB E3 45 79 D1 0C 1B>)
$$ ##END=
$$ 
$$ hash MD5
$$ 2E 27 92 43 11 00 60 EE A6 F4 ED 6F 3F E1 16 98
##$RELAX= 
##$RELAX= 
##$RELAX= 
##$RELAX= 
##$RELAX= 
##$RELAX= 
##$RELAX= 
##$RELAX= 
$$ Bruker specific parameters
$$ --------------------------
##$DU= <F:/spectra>
##$EXPNO= 2
##$NAME= <P31>
##$PROCNO= 1
##$TYPE= <nmr>
##$USER= <she>
##$AMP= (0..31)
100 100 100 100 100 100 100 100 100 100 100 100 100 100 100 100 100 100 
100 100 100 100 100 100 100 100 100 100 100 100 100 100 
##$AQSEQ= 0
##$AQ_mod= 1
##$AUNM= <au_zg>
##$AUTOPOS= <>
##$BF1= 81.014009
##$BF2= 200.13
##$BF3= 200.13
##$BF4= 200.13
##$BF5= 200.13
##$BF6= 200.13
##$BF7= 200.13
##$BF8= 200.13
##$BYTORDA= 1
##$CFDGTYP= 0
##$CFRGTYP= 5
##$CHEMSTR= <none>
##$CNST= (0..31)
1 1 145 1 1 1 1 1 1 1 1 1 1 1 1 1 1 1 1 1 1 1 1 1 1 1 1 1 1 1 1 1 
##$CPDPRG= <waltz16>
##$CPDPRG1= <>
##$CPDPRG2= <waltz16>
##$CPDPRG3= <>
##$CPDPRG4= <mlev>
##$CPDPRG5= <mlev>
##$CPDPRG6= <mlev>
##$CPDPRG7= <mlev>
##$CPDPRG8= <mlev>
##$CPDPRGB= <>
##$CPDPRGT= <>
##$D= (0..31)
0 1 0 0 0 0 0 0 0 0.06 0 0.03 2e-05 3e-06 0 0 0.0002 0 0 0 0 0 0 0 0 0 
0 0 0 0 0 0 
##$DATE= 1719491842
##$DBL= (0..7)
120 120 120 11 120 120 24 19 
##$DBP= (0..7)
150 150 150 150 150 150 150 150 
##$DBP07= 0
##$DBPNAM0= <>
##$DBPNAM1= <>
$$ [...]
##$SUBNAM3= <"">
##$SUBNAM4= <"">
##$SUBNAM5= <"">
##$SUBNAM6= <"">
##$SUBNAM7= <"">
##$SUBNAM8= <"">
##$SUBNAM9= <"">
##$SW= 400.765351723535
##$SWIBOX= (0..15)
0 1 3 0 0 0 0 0 0 0 0 0 0 0 0 0 
##$SW_h= 32467.5324675325
##$TD= 32768
##$TD0= 1
##$TE= 0
##$TE2= 300
##$TE3= 300
##$TEG= 300
##$TL= (0..7)
0 120 53 12 22 120 120 120 
##$TP= (0..7)
150 150 150 150 150 150 150 150 
##$TP07= 0
##$TPNAME0= <>
##$TPNAME1= <>
##$TPNAME2= <>
##$TPNAME3= <>
##$TPNAME4= <>
##$TPNAME5= <>
##$TPNAME6= <>
##$TPNAME7= <>
##$TPOAL= (0..7)
0.5 0.5 0.5 0.5 0.5 0.5 0.5 0.5 
##$TPOFFS= (0..7)
0 0 0 0 0 0 0 0 
##$TUNHIN= 0
##$TUNHOUT= 0
##$TUNXOUT= 0
##$USERA1= <user>
##$USERA2= <user>
##$USERA3= <user>
##$USERA4= <user>
##$USERA5= <user>
##$V9= 5
##$VALIST= <valist>
##$VCLIST= <CCCCCCCCCCCCCCC>
##$VD= 0
##$VDLIST= <DDDDDDDDDDDDDDD>
##$VPLIST= <PPPPPPPPPPPPPPP>
##$VTLIST= <TTTTTTTTTTTTTTT>
##$WBST= 1024
##$WBSW= 4
##$XGAIN= (0..3)
0 0 0 0 
##$XL= 0
##$YL= 0
##$YMAX_a= 23082
##$YMIN_a= -23654
##$ZGOPTNS= <>
##$ZL1= 120
##$ZL2= 120
##$ZL3= 120
##$ZL4= 120
##$ABSF1= 198.0616
##$ABSF2= -202.7028
##$ABSG= 5
##$ABSL= 3
##$ALPHA= 0
##$AQORDER= 0
##$ASSFAC= 0
##$ASSFACI= 0
##$ASSFACX= 0
##$ASSWID= 0
##$AUNMP= <proc_1d>
##$AZFE= 0.1
##$AZFW= 0.5
##$BCFW= 0
##$BC_mod= 2
##$BYTORDP= 0
##$COROFFS= 0
##$CY= -3
##$DATMOD= 1
##$DC= 0
##$DFILT= <>
##$DTYPP= 0
##$F1P= 0
##$F2P= 0
##$FCOR= 1
##$FTSIZE= 65536
##$FT_mod= 6
##$GAMMA= 0
##$GB= 0
##$INTBC= 1
##$INTSCL= 9.790993e-09
##$ISEN= 30
##$LB= 1.5
##$LEV0= 0
##$LPBIN= 0
##$MAXI= 10000
##$MC2= 0
##$MEAN= 0
##$ME_mod= 0
##$MI= 50
##$NCOEF= 0
##$NC_proc= -9
##$NLEV= 6
##$NOISF1= 182.463
##$NOISF2= 159.3651
##$NSP= 0
##$NTH_PI= 0
##$NZP= 0
##$OFFSET= 198.0616
##$PC= 4
##$PHC0= 2673.945
##$PHC1= 458.6863
##$PH_mod= 1
##$PKNL= yes
##$PPARMOD= 0
##$PSCAL= 0
##$PSIGN= 0
##$REVERSE= no
##$SF= 81.0140089999434
##$SI= 65536
##$SIGF1= 159.3651
##$SIGF2= -187.1042
##$SINO= 113.3802
##$SIOLD= 16384
##$SREGLST= <1H.CDCl3>
##$SSB= 0
##$STSI= 65536
##$STSR= 0
##$SW_p= 32467.5324675325
##$SYMM= 0
##$S_DEV= 0
##$TDeff= 32768
##$TDoff= 0
##$TI= <>
##$TILT= no
##$TM1= 0
##$TM2= 0
##$TOPLEV= 0
##$USERP1= <user>
##$USERP2= <user>
##$USERP3= <user>
##$USERP4= <user>
##$USERP5= <user>
##$WDW= 1
##$XDIM= 65536
##$YMAX_p= 313918700
##$YMIN_p= -226178922
$$ End of Bruker specific parameters
$$ ---------------------------------
##NTUPLES= NMR SPECTRUM
##VAR_NAME=  FREQUENCY,     SPECTRUM/REAL,   SPECTRUM/IMAG
##SYMBOL=    X,             R,               I
##VAR_TYPE=  INDEPENDENT,   DEPENDENT,       DEPENDENT
##VAR_FORM=  AFFN,          ASDF,            ASDF
##VAR_DIM=   65536,         65536,           65536
##UNITS=     HZ,            ARBITRARY UNITS, ARBITRARY UNITS
##FACTOR=    0.49542278885378, 1,            1
##FIRST=     16045.7642231865, 0,            0
##LAST=      -16421.768244346, 0,            0
##MIN=       -16421.768244346, -226178922,   0
##MAX=       16045.7642231865, 313918700,    0
$$ Real data points
##PAGE= N=1
##DATA TABLE= (X++(R..R)), XYDATA
$$ [...]
45081b9008101k688364O284744P194586L644506M003138Q589206Q738649Q32561
$$ -29008101 -31696465 -25411721 -18217135 -14572629 -10569491 -1980285 6758364 7590925
45073G590925o871652o332453j100379J303049J610016M346686O429405J480733
$$ 7590925 719273 -5613180 -6713559 -5410510 -3800494 546192 6975597 8456330
45065H456330o777016p389839Q60292O684188L370548j926303r05144L307672
$$ 8456330 1679314 -5710525 -4850233 1833955 5204503 3278200 2373056 5680728
45057E680728L192099r54944l704897m153192n059381n964455m523182k118985
$$ 5680728 8872827 7917883 4212986 59794 -4999587 -10964042 -15487224 -17606209
45049a7606209j469851r49878K236634N462571L973685j083589m647959n848037
$$ -17606209 -19076060 -20025938 -17789304 -12326733 -8353048 -9436637 -14084596 -19932633
45041a9932633o894904n876846O36221Q540700R257352K802269j436911J212166
$$ -19932633 -26827537 -32704383 -32068162 -23527462 -14270110 -11467841 -12904752 -11692586
45033a1692586N232466O107913O807525Q630143N860358l564915j1100004r621243
$$ -11692586 -6460120 -352207 6455318 15085461 20945819 17380904 6280900 -3340343
45025c340343m657942m372717n427807L7131Q610919R469398J784924m091631
$$ -3340343 -7998285 -12371002 -17798809 -17761678 -9150759 318639 2103563 -1988068
45017a988068k787705M13698J410273L298872P079260O844320j52727o898772
$$ -1988068 -4775773 -4362075 -2951802 347070 7426330 14270650 14117923 7219151
45009G219151o320283j222941J489707J069930R95564J114888j339809n255493
$$ 7219151 898868 -324073 1165634 2235564 3231128 4346016 3006207 -2249286
45001b249286o507853m435607k207372j000765J482063N951202Q771905O214743
$$ -2249286 -8757139 -13192746 -15400118 -16400883 -14918820 -8967618 -195713 6019030
44993F019030k37646m700137l280042J108210J848337k823945o720486l722694
$$ 6019030 5781384 1081247 -2198795 -1090585 757752 -2066193 -8786679 -12509373
44985a2509373L324138O252229L043979j09609J172673L630579K972765M54215
$$ -12509373 -9185235 -2933006 110973 1364 1174037 4804616 7777381 8231596
44977H231596j056070k597174n763618p673444m847003M14007L093769L258553
$$ 8231596 7175526 4578352 -1185266 -8858710 -13705713 -13291706 -10197937 -6939384
44969f939384N033840Q385198Q000177J822065m357540l977036J507025M436332
$$ -6939384 -1905544 6479654 14479831 16301896 11944356 7967320 9474345 13910677
44961A3910677Q19672m694375m999417O0015L318680j34492o189158p417971l270906
$$ 13910677 14730349 10035974 5036557 5096572 8415252 8280760 2091602 -5326369 -8597275
44952h597275K9642r27743k697894j565150J156319K758445L230307K629440r81676
$$ -8597275 -8567633 -9495376 -12193270 -13758420 -12602101 -9843656 -6613349 -3983909 -4965585
44943d965585o890739r159027l825650M201121O849096L639425J333869L652196
$$ -4965585 -11856324 -21015351 -24841001 -20639880 -13790784 -10151359 -8817490 -5165294
44935e165294O657332N114793n63697n212072m691094M9602M024172L757550J546488
$$ -5165294 1492038 6606831 6043134 831062 -3860032 -3810430 213742 3971292 5517780
44926E517780J858358L803701K005225l677396n634640K48308O969493O207966
$$ 5517780 7376138 11179839 13185064 9507668 3873028 4121336 11090829 17298795
44918A7298795N33911j931248r45582k803040p542580p724448q80037N831187
$$ 17298795 17832706 15901458 14955876 12152836 4610256 -3114192 -3994229 1836958
44910A836958N858510R30247l878095o229348n418112j493270K016590M04035
$$ 1836958 7695468 8625715 4747620 -1481728 -6899840 -8393110 -6376520 -5972485
44902e972485m797915o525517k507655J482588J259355N5666J002227J004452
$$ -5972485 -10770400 -17295917 -19803572 -18320984 -17061629 -17005963 -16003736 -14999284
44894a4999284k461088m766860j054214M903785N715087J205194k194800r30760
$$ -14999284 -17460372 -22227232 -23281446 -18377661 -12662574 -11457380 -13652180 -14582940
44886a4582940K390856L797156J500860l726785p953816o269963O49582N387713
$$ -14582940 -12192084 -8394928 -6894068 -10620853 -18574669 -24844632 -24195050 -18807337
44878a8807337L507031L39808K249497N432998J792144o510949q339417j20137
$$ -18807337 -15300306 -14960498 -12711001 -7278003 -5485859 -11996808 -20336225 -20456362
44870b0456362Q359776P975079K194694r001K715162M265305J291158k694124
$$ -20456362 -12096586 -4121507 -1926813 -1935814 779348 5044653 6335811 3641687
44862C641687k991327M79807L662844K717331k311925p279105p815118m002960
$$ 3641687 650360 1130167 4793011 7510342 5198417 -2080688 -9895806 -13898766
44854a3898766m15361j041343n134135q487088p702378k677602M011870R257660
$$ -13898766 -14314127 -15355470 -20489605 -28976693 -36679071 -39356673 -35344803 -26087143
44846b6087143J1234214R654512M976566j388620o121204n721594q59549L107791
$$ -26087143 -14852929 -5198417 -221851 -1610471 -7731675 -13453269 -14312818 -11205027
44838a1205027K412911r2984P89027M832880O804592M110021j03733j943388j152901
$$ -11205027 -8792116 -8885100 -8096073 -3263193 3541399 7651420 7547687 5604299 4451398
44829D451398L61600J058996p9651k652535l320976R55054O866758O469024k246750
$$ 4451398 4812998 5871994 5792343 3139808 -181168 773886 7640644 14109668 11862918
44820A1862918j0644713r541137j039214M743685L082070q87227j204788J144182
$$ 11862918 1218205 -8322932 -9362146 -4618461 -1536391 -2423618 -3628406 -2484224
44812b484224J976757J072267J416814L197806K855158j513777o875671q683384
$$ -2484224 -507467 564800 1981614 5179420 8034578 6520801 -354870 -9038254
44804i038254n738314m04905M442741P016845O348558K763872j360524l180724
$$ -9038254 -14776568 -15181473 -10738732 -3721887 2626671 5390543 4030019 849295
44796H49295k197008l28653P15993O22003p10773l244438n352169m744312j691159
$$ 849295 -1347713 -1676366 -960373 -338370 -1049143 -4293581 -9645750 -14390062 -16081221
44787a6081221J009251K074556K927211L829271K608788n21318j015548L252429
$$ -16081221 -15071970 -12997414 -10070203 -6240932 -3632144 -4153462 -5169010 -1916581
44779a916581O896689L961540k534035m241811L53010M082161J947582k743406
$$ -1916581 4980108 8941648 6407613 2165802 2518812 6600973 8548555 5805149
44771E805149n116853n493658n846732m460741J024854Q050969J1242673Q977452
$$ 5805149 688296 -4805362 -10652094 -15112835 -14087981 -6037012 5205661 14183113
44763A4183113M449353Q77439j522952l928133o288688o765191l560833K038410
$$ 14183113 18632466 19509905 17986953 14058820 7770132 1004941 -2555892 -517482
44755e17482N064866J675605n304438q651595n441221l27964J194330o32367k097151
$$ -517482 4547384 6222989 918551 -7733044 -13174265 -13502229 -12307899 -12940266 -15037417
44746a5037417j560888P6179J778093K435175R31345j275604m61599L580087N397167
$$ -15037417 -16598305 -16522126 -14744033 -12308858 -11377513 -12653117 -13114716 -9534629 -4137462
44737d137462J449000l451298k434574L181958O014617L520740P6921j608811
$$ -4137462 -2688462 -6139760 -8574334 -5392376 622241 4142981 4219902 2611091
44729B611091l845947p093007o904968j485786L519716K708915r30668j036125
$$ 2611091 -1234856 -8327863 -15232831 -16718617 -13198901 -10489986 -11420654 -12456779
44721a2456779K164327L160516Q32836J9779K813553M657986J854443k073856
$$ -12456779 -10292452 -7131936 -6299100 -6279321 -3465768 1192218 3046661 972805
44713I72805j675941K071493L554503J078341j405383j122596j60450q35561j610640
$$ 972805 -703136 1368357 4922860 6001201 4595818 3473222 3312772 2477211 866571
44704H66571k65040K192326L970040O056687R473682J1199562P601151Q80244
$$ 866571 601531 2793857 6763897 12820584 22294266 33493828 41094979 41975223
44696D1975223k921995k285357j549651l312655m858133l944094k965406m369595
$$ 41975223 39053228 36767871 35218220 31905565 27047432 23103338 20137932 15768337
44688A5768337o226181n718219l399379p37735K785489O462409O238315N02635
$$ 15768337 9542156 3823937 424558 -313177 2472312 8934721 15173036 15675671
44680A5675671n408171n734124k334674m86992L43267M159929Q552565N960695
$$ 15675671 10267500 4533376 2198702 1711710 2054977 6214906 14767471 20728166
44672B0728166l976339j1504920r615407l267382j214275l673712l792891J340054
$$ 20728166 16751827 5246907 -4368500 -7635882 -8850157 -12523869 -16316760 -14976706
44664a4976706O824606O906067J787080l560201n177486l315880n40857J724547
$$ -14976706 -8152100 -1246033 541047 -3019154 -8196640 -11512520 -12053377 -10328830
44656a0328830L404107L341656p6765m641869m522828J847962P467316N330159
$$ -10328830 -6924723 -3583067 -3659832 -8301701 -12824529 -10976567 -3509251 1820908
44648A820908j246590l131374J293728M742745L059135N44828J154799K225970
$$ 1820908 574318 -2557056 -1263328 3479417 6538552 7083380 8238179 10464149
44640A0464149Q88145k88881P63321J12505n293335r879142n971527M336608J0916368
$$ 10464149 11352294 11063413 11826734 11939239 6645904 -3233238 -9204765 -4868157 6048211
44631F048211Q592294K399871n56177N66973J713602K60817k116852k108357N00327
$$ 6048211 14640505 17040376 16484199 17051172 18764774 19025591 16908739 14800382 15300709
44622A5300709J643433j809814o524640o237069j167521J293472k584056o921633
$$ 15300709 16944142 15134328 8609688 2372619 1205098 2498570 -85486 -7007119
44614g007119n017671Q80000L627950J031543l686653p763363r667905p203744
$$ -7007119 -12024790 -11144790 -7516840 -6485297 -10171950 -17935313 -27603218 -34806962
44606c4806962p64972M240637L996287K256336L640677M894536Q03838m683654
$$ -34806962 -35571934 -31331297 -27335010 -25078674 -21437997 -16543461 -15739623 -20423277
44598b0423277l254211L549241N794964J014640k655268j032988L2136k771021
$$ -20423277 -23677488 -20128247 -14333283 -13318643 -15973911 -17006899 -16974763 -19745784
44590a9745784k946831L794188J0078022P985904J906817P98919L468042J863960
$$ -19745784 -22692615 -18898427 -8820405 -834501 1072316 1871235 5339277 7203237
44582G203237m487806p816120m885927j055510p68658j961037j773689j156938
$$ 7203237 2715431 -5100689 -9986616 -11042126 -11810784 -13771821 -15545510 -16702448
44574a6702448j151252J85814M149202Q370655J0038834R408988P990407N580928
$$ -16702448 -17853700 -17667886 -13518684 -5148029 4890805 14299793 22290200 27871128
44566B7871128J310946l842907p548217q572392p597545n852645l685867p78459
$$ 27871128 29182074 25339167 17790950 9218558 1621013 -4231632 -7917499 -8695958
44558h695958K268567L328236R65079k987975m881133l509664r52320R93404K413587
$$ -8695958 -6427391 -3099155 -2134076 -5122051 -10003184 -13512848 -14465168 -13471764 -11058177
44549a1058177K718160J94165l946259m707087M09882P038482R089058N845643
$$ -11058177 -8340017 -8145852 -12092111 -16799198 -16389316 -9350834 -261776 5583867
44541E583867Q23076l590274o336996n221927O10742P100332R116185O985440
$$ 5583867 6406943 2816669 -3520327 -8742254 -8131512 -1031180 8085005 15070445
44533A5070445M427770J311755n209041j2258781j1328356o065J1985781J3222495
$$ 15070445 19498215 20809970 15600929 3342148 -7986208 -7992273 3993508 17216003
44525A7216003M023530m821248n120451P95126M814706K505528l133141n869736
$$ 17216003 21239533 16418285 11297834 12092960 16907666 19413194 16280053 10410317
44517A0410317l019405K153181M490283K420309j332410l458748k990292j156451
$$ 10410317 7390912 9544093 14034376 16454685 15122275 11663527 8673235 7516784
44509G516784M1041n64205j909101j724105j3816M24633j106000o87109L943443
$$ 7516784 7557825 6993620 5084519 3360414 3346598 3771231 2665231 1978122 5921565
44500E921565P306092K611678o552829q602031m79Q530080O459793k171907n715858
$$ 5921565 13227657 15839335 9286506 684475 683996 9214076 15673869 13501962 7786104
44491G786104k037257J57082l549374n981550J21394R920175J2105736M000137
$$ 7786104 5748847 5905929 2356555 -3624995 -3503601 6416574 18522310 22522447
44483B2522447n275258o912963k320270J314462J064280l63837j129115k871155
$$ 22522447 17247189 10334226 8013956 9328418 10392698 10028861 8899746 6028591
44475F028591o261835q384211o737711k943324k73458J76829r49530k691482k560089
$$ 6028591 -233244 -8617455 -15355166 -18298490 -18571948 -18395119 -19344649 -22036131 -24596220
44466b4596220K573542J0919069J4572729Q735256o42491m195477j881380j313688
$$ -24596220 -22022678 -11103609 3469120 12204376 11561885 7366408 5485028 4171340
44458D171340m591811n560090j587611R96006k413506o234388l198370M299363
$$ 4171340 -420471 -5980561 -7568172 -6572166 -8985672 -15220060 -18418430 -14119067
44450a4119067Q382331P352862N749073M985220J693502m516607q483848o608815
$$ -14119067 -5736736 1616126 7365199 12350419 14043921 9527314 1043466 -5565349
44442e565349j753398J133116R31436K1168N72985K910430N917601P760786P112525
$$ -5565349 -7318747 -6185631 -5254195 -5233027 -4660042 -1749612 4167989 11928775 19041300
44433A9041300M270237O60193k304755l351197j850253M02183k52640m683048
$$ 19041300 23311537 23971730 21666975 18315778 16465525 16867708 16615068 11932020
44425A1932020q431704o607567j03933N849287P830746N596492p09401r569167
$$ 11932020 3500316 -3107251 -3211184 2638103 10468849 16065341 15355940 5786773
44417E786773j5096518j1381484j368642M411461R62578m360655k193790O024716
$$ 5786773 -9309745 -20691229 -22059871 -17648410 -16685832 -21046487 -23240277 -17215561
44409a7215561J1032446Q778096M196551K559645L081262K485274J07612k905511
$$ -17215561 -6183115 2594981 6791532 9351177 12432439 14917713 15025325 12119814
44401A2119814n915304p755771o304895j946311R56909o40655l555955k645756
$$ 12119814 6204510 -1551261 -7856156 -9802467 -8845558 -9486213 -13042168 -15687924
44393a5687924J190956K052975j595054l785089J96384O170509O432979L97033
$$ -15687924 -14496968 -12443993 -14039047 -17824136 -17627752 -11457243 -5024264 -4627231
44385d627231m866357m127279M43027L942513M965854N060079M713396K763914
$$ -4627231 -9493588 -13620867 -13177840 -9235327 -4269473 790606 5504002 8267916
44377H267916j067235n209622p853062q394617p242602m950845j855280J652319
$$ 8267916 7200681 1991059 -5862003 -14256620 -21499222 -26450067 -28305347 -26653028
44369b6653028M914966P423451Q988551Q639137M218806m435411j1940215j0914683
$$ -26653028 -21738062 -14314611 -5326060 3313077 7531883 3096472 -8843743 -19758426
44361a9758426j241252P780693P984843K041208j533417l8859K311881K606805
$$ -19758426 -20999678 -13218985 -5234142 -3192934 -4726351 -4765210 -2453329 153476
44353A53476J638128p58189m974464o238928J127128J2110529J3227043R48276
$$ 153476 1791604 1033415 -3941049 -10179977 -9052849 3057680 16284723 17232999
44345A7232999j0995049r540484K00899M121524k69589l171836N21548M837670
$$ 17232999 6237950 -3302534 -3101635 1019889 750300 -2421536 -1899988 2937682
44337B937682L965399K51386j833826k312508k657460j639042J800978N026364
$$ 2937682 6903081 7154467 5320641 3008133 350673 -1288369 512609 5538973
44329E538973M571648O88613l224291m470069k958988k55293K310360M652926
$$ 5538973 10110621 10799234 7574943 3104874 145886 -109407 2200953 6853879
44321F853879O812398P248227M337160j29087k137745j304221j599682m370485
$$ 6853879 13666277 20914504 25251664 25122577 22984832 21680611 20080929 15710444
44313A5710444n579921l214249j808390m553900o456760k251103L617826L276827
$$ 15710444 10130523 6916274 5107884 553984 -5902776 -8153879 -4536053 -1259226
44305a259226j750151l189165N29339K918295P89378k261928l752520m781932
$$ -1259226 -3009377 -6198542 -5669203 -2750908 -1961530 -4223458 -7975978 -12757910
44297a2757910m305257R2658N107214M524771j16560j179501J991305K269125
$$ -12757910 -17063167 -16970509 -11863295 -7338524 -7455084 -8634585 -6643280 -4374155
44289d374155j461429j603586L787419O234857J582524k464691j40104K619970
$$ -4374155 -5835584 -7439170 -3651751 2583106 4165630 1700939 1560835 4180805
44281D180805K21895j781324K507413P411431M908204k454335p728669j0313413
$$ 4180805 4402700 2621376 5128789 12540220 17448424 14994089 7265420 -3047993
44273c047993j0572892l330482J0935762J7704786O314585j0958124j4095836
$$ -3047993 -13620885 -16951367 -6015605 11689181 18003766 7045642 -7050194
44266g050194m005209J892979j141001q07113P009644R777052R68817p215271
$$ -7050194 -11055403 -9162424 -10303425 -11110538 -4100894 5676158 6644975 -570296
44258e70296l208328O152594P632046M96050o646921r315084p964042k196520
$$ -570296 -3778624 2373970 10006016 10502066 3855145 -5459939 -13423981 -15620501
44250a5620501O753831J2506164R993289J970738n761832j0870009j2124979p002381
$$ -15620501 -8866670 3639494 13632783 15603521 9841689 -1028320 -13153299 -20155680
44242b0155680K796057R276161P530958K235705k12936l12469r26634n73341K122381
$$ -20155680 -17359623 -8083462 -552504 1683201 1470265 1157796 231162 -342179 1780202
44233A780202L051075r64428n240881m068817k0639R91676m03253q7279O06833
$$ 1780202 4831277 3866849 -1374032 -5442849 -5463488 -4471812 -4875065 -4962344 -4355511
44224d355511k187170n962260m976327m64579J265287k12120M74761L761352L935135
$$ -4355511 -6542681 -12504941 -17481268 -17945847 -16680560 -16892680 -16417919 -12656567 -8721432
44215h721432j75532k395932K60714K445686k77188l961674k850210J792168M502090
$$ -8721432 -8896964 -11292896 -11032182 -8586496 -8863684 -12825358 -15675568 -13883400 -9381310
44206i381310L923139L601432O025003R205322Q777022K291368p577503j4089228
$$ -9381310 -5458171 -1856739 4168264 13373586 22150608 24441976 16864473 2775245
44198B775245j2811798o807307k701538j995795l53291M055933O648541L552330
$$ 2775245 -10036553 -16843860 -19545398 -21541193 -21894484 -17838551 -11190010 -7637680
44190g637680j487259j612366L531706O925680L377751l319485m510809K581221
$$ -7637680 -9124939 -10737305 -7205599 -279919 3097832 -221653 -4732462 -2151241
44182b151241J0522945R976468J203721o231525n756829j280170K42095r55220
$$ -2151241 8371704 18348172 19551893 13320368 7563539 6283369 6525464 5570244
44174E570244J17890L629559M542261J194466k083132j899135j36260M7898j765665
$$ 5570244 5688134 9317693 13859954 15054420 12971288 11072153 10935893 10983791 9218126
44165I218126m502209p007524p340596m421755q16987J93750K36719L381037P974025
$$ 9218126 4715917 -2291607 -9632203 -14053958 -14870945 -14677195 -14440476 -11059439 -3085414
44156c085414P546810J453875k472094P58801N821147N405407L13999l961062
$$ -3085414 4461396 5915271 3443177 4201978 10023125 15428532 15742531 11781469
44148A1781469n741611o410228n344342j919868N91356o15848k257571J1646L428349
$$ 11781469 6039858 -370370 -5714712 -7634580 -7043224 -7659072 -9916643 -9904997 -6476648
44139f476648K016265k986711m296266j7519L704359K713582M81903J320364M037418
$$ -6476648 -4460383 -7447094 -11743360 -11760879 -8056520 -5342938 -4861035 -3540671 496747
44130D96747N470981N321927M151299Q06191m648013q753965q648059n543729
$$ 496747 5967728 11289655 15440954 16247145 11599132 2845167 -5802892 -11346621
44122a1346621j799300K270518N916306N860556N75090n899969q356952o712178
$$ -11346621 -13145921 -10875403 -4959097 901459 1476549 -4423420 -12780372 -19492550
44114a9492550m212720j494239K952531P582569Q175106L838798j501399m399384
$$ -19492550 -23705270 -25199509 -22246978 -14664409 -6489303 -2650505 -4151904 -8551288
44106h551288n070066m559642k639280n6713P73248l41312J28750M186254Q124996
$$ -8551288 -13621354 -18180996 -20820276 -20876989 -20103741 -20445053 -20316303 -16130049 -8005053
44097h005053P145880K539971K71017K716418N645684M253630r90744o039909
$$ -8005053 -859173 1680798 1951815 4668233 10313917 14567547 13576803 7536894
44089G536894q244247p575787m783583r96654J531263R00414j718241k693603
$$ 7536894 -707353 -8283140 -13066723 -14063377 -12532114 -11631700 -13349941 -16043544
44081a6043544k92822K711445K261524j300415k389232L549580J3365385J7977699
$$ -16043544 -16336366 -13624921 -11363397 -12663812 -15053044 -11503464 1861921 19839620
44073A9839620J2090514M61637p704327r224589q356073q419577p269596l129272
$$ 19839620 31930134 32391771 24687444 15462855 7106782 -1312795 -8582391 -11711663
44065a1711663K69257r64253l870435k784898J417554K670591j19915j194651
$$ -11711663 -11442406 -12406659 -16277094 -19061992 -17644438 -14973847 -15093762 -16288413
44057a6288413K399353O024231N344666K918416K648416K993453J081158q22054
$$ -16288413 -13889060 -7864829 -2520163 398253 3046669 6040122 7121280 6299226
44049F299226O74606K775615K29577n375983p268870m015276j270873k279444
$$ 6299226 6973832 9749447 9979024 4603041 -2665829 -6681105 -7951978 -10231422
44041a0231422l515596j745620Q23581J239116K74229o88824k125799k684929
$$ -10231422 -13747018 -15492638 -14669057 -13429941 -13155712 -13844536 -15970335 -18655264
44033a8655264J369501Q771368J0818465K437177q344977r169201M05694Q585782
$$ -18655264 -17285763 -8514395 2304070 4741247 -3603730 -12772931 -12367237 -3781455
44025c781455O956780l48167m359781k289207J841892L456086J219111l114096
$$ -3781455 3175325 2827158 -1532623 -3821830 -1979938 1476148 2695259 -418837
44017d18837o251748n938591l191297r80220n13011m07180N57482K022620L467029
$$ -418837 -6670585 -12609176 -15800473 -16780693 -17293704 -17700884 -17143402 -15120782 -11653753
44008a1653753M670510M533078K018539j227559j993871k02503L54213k345914
$$ -11653753 -6983243 -2450165 -431626 -1659185 -3653056 -3855559 -3501346 -5847260
44000e847260m715865j954882N038796R925109Q303792K861137k34174N68231
$$ -5847260 -10563125 -12518007 -7479211 2445898 10749690 13610827 13376653 13944884
43992A3944884M4260o064885j3158667j2336035l387284K881647p97801p035051
$$ 13944884 13989144 7924259 -5234408 -17570443 -20957727 -18076080 -18873881 -25908932
43984b5908932m201547O106846J1461805P133656J570578J547581K578328q28286
$$ -25908932 -30110479 -24003633 -12541828 -5408172 -3837594 -2290013 288315 -539971
43976e39971m772185l276983J124616K387398J106920J149313P20085l741977
$$ -539971 -5312156 -8589139 -7464523 -5077125 -3970205 -2820892 -2100807 -5842784
43968e842784q082606n311971J464029J893686n184774q974003l172305N007146
$$ -5842784 -13925390 -19237361 -17773332 -15879646 -21064420 -30038423 -33210728 -28203582
43960b8203582P121480N675450P046595R375746O212663j638978o457319m709506
$$ -28203582 -21082102 -15406652 -8360057 1015689 7228352 5589374 -867945 -5577451
43952e577451q46972K29753j259597l043876m583635n516359l713607J861802
$$ -5577451 -6424423 -6194670 -7454267 -10498143 -15081778 -20598137 -24311744 -22449942
43944b2449942P442636O739699j588424j0126947r145840K273572J4104777J6431770
$$ -22449942 -15007306 -8267607 -9856031 -19982978 -29128818 -26855246 -12750469 3681301
43936C681301J0046776K782671j575121m707164n899198j378985O601001Q504446
$$ 3681301 13728077 16510748 14935627 10228463 4329265 2950280 9551281 18055727
43928A8055727L64590q797000q917189l005082j419345n497154o206134J039262
$$ 18055727 18420317 9623317 706128 -2298954 -3718299 -9215453 -15421587 -14382325
43920a4382325R015146R072888K622273j885596J16437N167590O973588L145678
$$ -14382325 -5367179 3705709 6327982 4442386 4558823 9726413 16700001 19845679
43912A9845679k805178n213230k424483J096429J16950m624089p317394m548311
$$ 19845679 17040501 11827271 9402788 10499217 10616167 5992078 -1325316 -5873627
43904e873627P52612L415824J853486j260014k609560j490339k2243l98617j833041
$$ -5873627 -5121015 -1705191 148295 -1111719 -3721279 -5211618 -5233861 -5632478 -7465519
43895g465519j329838J762438L910759K148492j140682j297534J849608M014445
$$ -7465519 -8795357 -7032919 -3122160 -973668 -2114350 -3411884 -1562276 2452169
43887B452169L068450J632728K055147K500367L27457l069956l496878Q19584
$$ 2452169 5520619 7153347 9208494 11708861 12036318 8966362 5469484 6289068
43879F289068P076691J0660055R043069L402502k632085n852180n719714m136109
$$ 6289068 13365759 24025814 33068883 36471385 33839300 27987120 22267406 18131297
43871A8131297l163996k982741j940706J165693M656607M805809L80575m693047
$$ 18131297 14967301 11984560 10043854 11209547 15866154 20671963 21052538 16359491
43863A6359491n484023k220537O11980Q18415K61209J74015l18639k47520K703852
$$ 16359491 10875468 8654931 9266911 10085326 10346535 10520550 10201911 9954391 12658243
43854A2658243N961557L280053m512318p852052k832392J317359k738402o612409
$$ 12658243 18619800 21899853 17387535 9535483 6703091 8020450 5282048 -1330361
43846a330361N45409J1712187J0614275k021513q184776l43227P753673L952210
$$ -1330361 -784952 10927235 21541510 19519997 11335221 10991994 18745667 22697877
43838B2697877m579444o039131k769240l014543m527460o60133M190454J97235
$$ 22697877 18118433 12079302 9310062 6295519 1768059 1107926 5298380 5495615
43830E495615j0061938j3481690n900900K600161L319906q30737l323584l021960
$$ 5495615 -4566323 -18048013 -23948913 -21348752 -18028846 -18859583 -22183167 -25205127
43822b5205127j505973J324481M934693O629931N516908L960451L197292J672369
$$ -25205127 -26711100 -25386619 -20451926 -13821995 -8305087 -4344636 -1147344 525025
43814E25025p80188j593259p9268Q51488m73457j792384j057336J67244m33801
$$ 525025 -255163 -1848422 -1927690 -1076202 -1549659 -3342043 -4399379 -4232135 -4665936
43805d665936k332329l109558j051926L714429Q466772Q698658K914152l862691
$$ -4665936 -6998265 -10107823 -11159749 -7445320 1021452 9720110 12634262 8771571
43797H771571n284988j985351m8674j462366k005106L33620J381286j817362n407150
$$ 8771571 3486583 1501232 1452558 -9808 -2014914 -1681294 -300008 -2117370 -7524520
43788g524520m737668j447148J46072K30022J975650M970059N201938J128430
$$ -7524520 -12262188 -13709336 -13563264 -13333242 -11357592 -6387533 -1185595 -57165
43780e7165l929684n524080k109857L871714P213307L859864m127191r091441
$$ -57165 -3986849 -9510929 -11620786 -7749072 -535765 3324099 -803092 -9894533
43772i894533n843380K026376O392856L971708j232923l892967k694867K98369
$$ -9894533 -15737913 -13711537 -7318681 -3346973 -4579896 -8472863 -11167730 -10869361
43764a0869361K983885M937506O811698Q405709P455051J742768o868361j2519491
$$ -10869361 -7885476 -2947970 3863728 12269437 19724488 21467256 14598895 2079404
43756B079404j1319017n752094j122049R57230K911287O027036Q120888O829619
$$ 2079404 -9239613 -14991707 -16113756 -15156526 -12245239 -6218203 1902685 8732304
43748H732304K932771n13727j217630M23621J535267p45987n832323r365468p935124
$$ 8732304 11665075 11151348 9933718 10357339 11892606 11146619 5314296 -4051172 -11986296
43739a1986296l439021n25441j10922J412474N670819Q462333N288562j349325
$$ -11986296 -15425317 -15950758 -16061680 -14649206 -8978387 -516054 4772508 3423183
43731C423183m202711p85459L376915K780505l31211j18277K968613K052369n235742
$$ 3423183 -779528 -1564987 1811928 4592433 4261222 4142945 7111558 9163927 3928185
43722C928185j0940769o148741O510868J4806640J1185415Q03400n855663m844511
$$ 3928185 -7012584 -13161325 -6650457 8156183 19341598 20144998 14289335 9444824
43714I444824r33462j08346k829016m848758l154575Q2804J87545l553718o033799
$$ 9444824 8511362 8403016 5574000 725242 -2429333 -2346529 -2158984 -5712702 -11746501
43705a1746501k711862L647801N817551J583624l158832k253917K640900M522797
$$ -11746501 -14458363 -10810562 -4993011 -3409387 -6568219 -8822136 -6181236 -1658439
43697a658439L65000m803329l761748M329321J2499499J3363079P022712J91027
$$ -1658439 -1293439 -6096768 -9858516 -5529195 6970304 20333383 27356095 27547122
43689B7547122k260720k294949m093537p358470q246733n340579j218287J383432
$$ 27547122 25286402 22991453 18897916 11539446 3292713 -2047866 -3266153 -1882721
43681a882721K013429J510920J193505K410070M444656M177374P22340j651799
$$ -1882721 130708 1641628 2835133 5245203 9689859 13867233 14589573 12937774
43673A2937774O87390M226153L135005j009188j226227L504287O538946M358091
$$ 12937774 13625164 17851317 20986322 19977134 18750907 22255194 28794140 33152231
43665C3152231J304474J179513J683656N94426K08602J560036J264243j384016
$$ 33152231 34456705 35636218 37319874 37914300 38122902 39682938 40947181 39563165
43657C9563165j523390J836359J564291n329259r265888j551652J0268472J1855928
$$ 39563165 38039775 39876134 41440425 36111166 26845278 25293626 35562098 47418026
43649D7418026K577266n401522n994897m540332m569023k177065L607855O260291
$$ 47418026 49995292 44593770 38598873 34058541 29489518 27312453 30920308 37180599
43641C7180599K425043j840259q01374K176776R34978m003961p185135n365874
$$ 37180599 39605642 37765383 36964009 39140785 40075763 36071802 28886667 23520793
43633B3520793N66657P035818R012858M260039k255526l591791j386214l863198
$$ 23520793 24087450 31123268 40136126 44396165 42140639 38548848 37162634 33299436
43625C3299436j1434388j3507227m470767O056108O407669p75663m139486m44950
$$ 33299436 21865048 8357821 3887054 9943162 16350831 15575168 11435682 10990732
43617A0990732L616686L498125J468368J07740q90273j264173q5363P14216j556949
$$ 10990732 14607418 18105543 19573911 19681651 18791378 17527205 17441842 18156058 16599109
43608A6599109m888107m798981j706591j80780r39294J7402L442454M515635P32256
$$ 16599109 11711002 6912021 5205430 5024650 4085356 4102758 7545212 12060847 12793103
43599A2793103l408226k672406J984315N514336M615286n68406p350607j1202703
$$ 12793103 9384877 6712471 8696786 14211122 18826408 18258002 10907395 -295308
43591b95308q842140k635693J321910J416246K788870Q397210J2080582O007600
$$ -295308 -9137448 -11773141 -10451231 -9034985 -6246115 2151095 14231677 20239277
43583B0239277o956883j4556067r739476R94315O415975M132994J290941L230908
$$ 20239277 13282394 -1273673 -11013149 -10018834 -3602859 530135 1821076 5051984
43575E051984O500031M962432r30498n037440m258301j762689j043559j335677
$$ 5051984 11552015 16514447 15583949 10546509 6288208 4525519 3481960 2146283
43567B146283j016585j348987l306253l999251p52711L558894M198621K030688
$$ 2146283 1129698 -219289 -3525542 -7524793 -8277504 -4718610 -519989 1510699
43559A510699J821362L868226L580275N5877j468346J826098N239532L758384
$$ 1510699 3332061 7200287 10780562 10836439 9368093 11194191 16433723 20192107
43551B0192107n44242k836641l187229m546377o045850m374015m41677J389951
$$ 20192107 19647865 16811224 13623995 9077618 3031768 -1342247 -1783924 -393973
43543c93973O77341J657244N467002P108502K936468l112802m499948n89670L602859
$$ -393973 283368 1940612 7407614 14516116 17452584 14339782 9839834 9250164 12853023
43534A2853023M535905L137237J230711j104288l638140m585906l154033j666646
$$ 12853023 17388928 20526165 21756876 20652588 17014448 12428542 9274509 7607863
43526G607863k777886n249440m851972J11087O013354P811975M736772O72427
$$ 7607863 4829977 -419463 -5271435 -5160348 853006 8664981 13401753 14074180
43518A4074180q13470l20396r72953l993889p043629o874254k848865K377082
$$ 14074180 13260710 12940314 11967361 7973472 929843 -5944411 -8793276 -6416194
43510f416194N132411L499404j331800n551783n117664O54699P314890Q639369
$$ -6416194 -1283783 2215621 883821 -4667962 -9785626 -9130927 -1816037 6823332
43502F823332L158065l665342n366883j697208K159652K706584J302646J60341
$$ 6823332 9981397 6316055 949172 -748036 1411616 4118200 5420846 5581187
43494E581187q60442j773183n69607L043723M948109J730349l386082m262154
$$ 5581187 4720745 2947562 2377955 5421678 10369787 12100136 8714054 4451900
43486D451900n68109K019001L70576k269397k106859K22896K428725M050270M644954
$$ 4451900 3883791 5902792 6273368 4003971 1897112 2120008 4548733 8599003 13243957
43477A3243957K475196j771991l498851k55711L746506L473915O84810N44925
$$ 13243957 15719153 13947162 10448311 10192600 13939106 17413021 18097831 18642756
43469A8642756K732515K280226j216578k192161J494638M304919J669822k547753
$$ 18642756 21375271 23655497 22438919 20246758 21741396 26046315 27716137 25168384
43461B5168384k272765R57426N12565m700963q446300o421451j652160J446730
$$ 25168384 22895619 23853045 24365610 19664647 11218347 4796896 3144736 4591466
43453D591466L524912O920297R056148M730544m968249j0972789o340156M419535
$$ 4591466 8116378 15036675 24092823 28823367 23855118 12882329 6542173 10961708
43445A0961708R836361N150055k039449j697734N590768R297136K617300q580444
$$ 10961708 20798069 25948124 23908675 22210941 27801709 37098845 39716145 31135701
43437C1135701j3041672p825661p42139M41049l051933m530836r52610M581958
$$ 31135701 18094029 10268368 9526229 9967278 6915345 2384509 1431899 6013857
43429F013857P569263N928428K3934p357586j0948799o950333J450489N967418
$$ 6013857 13583120 19511548 19535482 12177896 1229097 -5721236 -4270747 1696671
43421A696671K853256k430519k955233M52394J877559l34122k498569k882744
$$ 1696671 4549927 2119408 -835825 -383431 1494128 1160006 -1338563 -4221307
43413d221307l695120m871922k316534M729488J0111007Q784562L990489J555971
$$ -4221307 -7916427 -12788349 -15104883 -10375395 -264388 8520174 12510663 14066634
43405A4066634Q81302k401376p374140q248196l168662L552783Q049238R955669
$$ 14066634 14947936 12546560 5172420 -3075776 -6244438 -2691655 5357583 15313252
43397A5313252Q765184L674221j739863j532492L387260M741227p39778n152905
$$ 15313252 24078436 27752657 26012794 24480302 27867562 32608789 31869011 26716106
43389B6716106j130679O278599O889441M44363m115262k567113K03785J25555
$$ 26716106 25585427 31864026 38753467 39197830 35082568 32515455 32719240 32844795
43381C2844795j80425J779460K581464j534911p643106r344696m897052J365072
$$ 32844795 32664370 34443830 37025294 35490383 27847277 18502581 13605529 14970601
43373A4970601M531340L530992Q64577k51116J187564L145864L055867P78908
$$ 14970601 19501941 23032933 23897510 23646394 24833958 27979822 31035689 31814597
43365C1814597k044817m504366o050472m882239j97191M556877M860059J699113
$$ 31814597 29769780 25265414 19214942 14332703 14135512 18692389 23552448 25251561
43357B5251561N50607L205673N489136M375552K045305O38823j463195m654509
$$ 25251561 25802168 29007841 34496977 38872529 40917834 41556657 40093462 35438953
43349C5438953m712764P63072O660167O440262J003077l492397m079450k448119
$$ 35438953 30726189 31489261 38149428 44589690 45592767 42100370 38020920 35572801
43341C5572801n21131M18356j444027n381039o322168j537880L590644K748793
$$ 35572801 35051670 35470026 34025999 28644960 22322792 20784912 24375556 27124349
43333B7124349j122327m43582M311317N674567K368403J261234M451531M649491
$$ 27124349 26002022 25558440 29869757 35544324 37912727 39173961 43625492 48274983
43325D8274983k409974j0060754j0906459p251421m902094l281264Q41572N163828
$$ 48274983 45865009 35804255 24897796 17646375 12744281 9463017 10304589 15468417
43317A5468417N538717M079988N459693P740632N179470j128039l662721J51555
$$ 15468417 21007134 25087122 30546815 38287447 43466917 42338878 38676157 38827712
43309C8827712M461335M246551J484466j11848p77157k154655l524215l712061
$$ 38827712 43289047 47535598 49020064 48908216 48131059 45976404 42452189 38740128
43301C8740128l510885l435506j845070J902554M637164K790854k326047n199551
$$ 38740128 35229243 31793737 29948667 31851221 36488385 39279239 36953192 31753641
43293C1753641k178665M407528Q450061O144742R288l512880r94704M151495N819365
$$ 31753641 29574976 33982504 42432565 48577307 48586595 45073715 44079011 48230506 54049871
43284E4049871K234764k896069n597107n656126n208879n362819n248170l483977
$$ 54049871 56284635 53388566 47791459 42135333 36926454 31563635 26315465 22831488
43276B2831488L9342L494249M390051K068402j366431l040221j745862J632794
$$ 22831488 22870830 26365079 30755130 32823532 31457101 28416880 26671018 28303812
43268B8303812M836989N158089J629520k925417m249823k145329r95059l221807
$$ 28303812 33140801 38298890 39928410 37002993 32753170 30607841 29612782 26390975
43260B6390975n316858l072764J924445M357610J848163l350157p331713o565686
$$ 26390975 21074117 18001353 19925798 24283408 26131571 22781414 15449701 8884015
43252H884015K51143R076090J2433698Q400504M032823M934401N915848n38564
$$ 8884015 9135158 18211248 30644946 39045450 43078273 48012674 53928522 53389958
43244E3389958j0224569j1612354l280390L651548K035511k589400l195711j473226
$$ 53389958 43165389 31553035 28272645 31924193 33959704 31370304 28174593 26701367
43236B6701367j481100j535892P83177K234084k32723k610003k83823L098710
$$ 26701367 25220267 23684375 24467552 26701636 26468913 23858910 23575087 26673797
43228B6673797J129007m266483n556396j721883O73322j390229k859256Q87956
$$ 26673797 27802804 23536321 17979925 16258042 16931364 15541135 12681879 13569835
43220A3569835P004864R555704P113202L293973J777442K581220K432236j550437
$$ 13569835 20574699 30130403 37243605 40537578 42315020 44896240 47328476 45778039
43212D5778039p983655j1887313j0186857n136771j073496L13088j1105p74732
$$ 45778039 37794384 25907071 15720214 10583443 9509947 9823035 9811930 9037198
43204I037198q03026O47037K166135J474628q0094J822733P190907R920969O572464
$$ 9037198 8234172 8881209 11047344 12521972 12441878 14264611 21455518 31376487 37948951
43195C7948951J628504m05415k203955o679290q829922l235147M797161N756115
$$ 37948951 39577455 39172040 36968085 30288795 21458873 18223726 23020887 28777002
43187B8777002Q57536n73254K516558J259610o877805j2174554p409360J483632
$$ 28777002 29634538 29061284 31577842 32837452 25959647 13785093 6375733 7859365
43179G859365N149845L083752M02316o96867n01464J209057K458846q28660p071943
$$ 7859365 13009210 16092962 16495278 15798411 15296947 16506004 18964850 18136190 11064247
43170A1064247p734076M65475Q456128O820424r32040m905982l553072k931713
$$ 11064247 3330171 3795646 12251774 19072198 18140158 13234176 9681104 6749391
43162F749391m790362m892436j827080J130770K692805M652114O479361N754895
$$ 6749391 1959029 -2933407 -4760487 -3629717 -936912 3715202 10194563 15949458
43154A5949458L850377M389571O100682M159533r98445l341441q02695J693114
$$ 15949458 19799835 24189406 30290088 34449621 33451176 30109735 29307040 31000154
43146C1000154M31756k321361l703259m134476l514820K75969O073421Q204978
$$ 31000154 31431910 29110549 25407290 21272814 17757994 18033963 24107384 32312362
43138C2312362L924848k602822o453167p194184n642168j314014L459977L055604
$$ 32312362 36237210 33634388 27181221 19987037 14344869 13030855 16490832 19546436
43130A9546436l055789o961397k802705M385377O372871L556411J951770K296274
$$ 19546436 16490647 9529250 6726545 11111922 17484793 21041204 22992974 25289248
43122B5289248O04611k432584j450258L948208P290227M455959j417419n625437
$$ 25289248 25893859 23461275 22011017 25959225 33249452 37705411 36287992 30662555
43114C0662555o841588n162842r31797K833307K224076j544852l048265j036808
$$ 30662555 23820967 18658125 17726328 20559635 22783711 21238859 18190594 17153786
43106A7153786p501j438366l76771N416518R546192N769865k457715p225417o686972
$$ 17153786 17146285 15707919 15331148 20747666 30293858 36063723 33606008 26380591 19693619
43097A9693619m170293q55607L360684M741551l19106p464170q469599k917772
$$ 19693619 15523326 14667719 18028403 22769954 22450848 14986678 6517079 3599307
43089C599307J865292K581591L278559N616660M836054r56915n539075l716460
$$ 3599307 5464599 8046190 11324749 16941409 21777463 20820548 15281473 11565013
43081A1565013Q65879K528062K220299L304177M115216J832060o20142P33367
$$ 11565013 12430892 14958954 17179253 20483430 24598646 26430706 25810564 26543931
43073B6543931K677496n01682o442826p627802l750733j918464m160244m283815
$$ 26543931 29221427 28719745 22276919 14649117 10898384 8979920 4819676 535861
43065E35861O24743M801768L845612J740165K483003K268353k929666p963621
$$ 535861 1160604 5962372 9807984 11548149 14031152 16299505 13369839 5406218
43057E406218n120180L380387P904811M976736N60981j67376Q79414J22230k006205
$$ 5406218 286038 3666425 11571236 16547972 17108953 16941577 17820991 17943221 15937016
43048A5937016l394371l904876l990706k760506Q7302K582482K927022K200169
$$ 15937016 12542645 8637769 4647063 1886557 1973859 4556341 7483363 9683532
43040I683532K763988M605409M685314M53796n923209p845646j160722Q881811
$$ 9683532 12447520 17052929 21738243 22192039 16268830 8423184 7262462 16144273
43032A6144273J1269099K307864q627147j0620212n089209j951271m224375m900464
$$ 16144273 27413372 29721236 21094089 10473877 5384668 3433397 -790978 -5691442
43024e691442P1311M596990K501624k278936j885599L498055O578747L725601
$$ -5691442 -5620131 -1023141 1478483 -800453 -2686052 812003 7390750 11116351
43016A1116351j248841l436573j961180J263729L815846L552370M42137k277000
$$ 11116351 9867510 6430937 4469757 5733486 9549332 13101702 13543839 11266839
43008A1266839j601813R32982J401554o67326k004455q19466J309314K658103
$$ 11266839 9665026 10598008 11999562 11332236 9327781 8508315 9817629 12475732
43000A2475732K697494L00726m887398q744354n554902L407795R202432O283110
$$ 12475732 15173226 15473952 10586554 1842200 -3712702 -304907 8897525 15180635
42992A5180635k65348k603123j008020j255378m122541m531540o47973L004400
$$ 15180635 14915287 12312164 11304144 10048766 5926225 1394685 746712 3751112
42984C751112L014825J818276K262412K407420l59573l601299k803418J764283
$$ 3751112 6765937 8584213 10846625 13254045 12894472 9293173 6489755 8254038
42976H254038N362060N152667K648751K89493q04772M10502M674524R843892J1639271
$$ 8254038 13616098 18768765 21417516 21707009 20902237 21312739 25987263 35831155 47470426
42967D7470426Q626639M061089J064891j625739o529802j1764412j2105969o052574
$$ 47470426 56097065 60158154 61223045 59597306 53067504 41303092 29197123 23144549
42959B3144549J028585K623739j215895l906317m43906O122435Q178450L189494
$$ 23144549 24173134 26796873 25580978 21674661 21230755 27353190 35531640 38721134
42951C8721134k877652l428379L3228P82780k713152m564151j003901L138410
$$ 38721134 35843482 32415103 32448331 33231111 30517959 25953808 24949907 28088317
42943B8088317J470764m232955o751194m049940j282513k003203l068376l79804
$$ 28088317 29559081 25326126 18574932 14524992 13242479 11239276 8170900 7791096
42935G791096M719737P869467P572925N491830K765224p85274m488629o421408
$$ 7791096 12510833 20380300 27953225 33445055 36210279 35425005 30936376 24514968
42927B4514968n344117j853540K124597M329199L469369L23515l059137n301215
$$ 24514968 19170851 17317311 19441908 23771107 27240476 27563991 24504854 19203639
42919A9203639n725673l189018K260924O553173M509312k765080p551009n417999
$$ 19203639 13477966 10288948 12549872 19103045 23612357 20847277 13296268 7878269
42911G878269j315743j557634l680877o68990O887014J0471270N994944o54044
$$ 7878269 6562526 5004892 1324015 655025 7542039 18013309 24008253 23354209
42903B3354209k847834j926399k802414n435986n444622q18536N875295J0476991
$$ 23354209 20506375 18579976 15777562 10341576 4896954 4078418 9953713 20430704
42895B0430704R630751K327210p613341j2333575p115800L555252J0051648P704954
$$ 20430704 30061455 32388665 24775324 12441749 5325949 8881201 18932849 26637803
42887B6637803Q00608l044458n02463N025444O982700K304341m524344n777493
$$ 26637803 27438411 24393953 23891490 28916934 35899634 38203975 33679631 27902138
42879B7902138j21507M906782K531909m428856q365019p392541n310453l148553
$$ 27902138 27780631 32687413 35219322 30790466 22425447 15032906 9722453 6573900
42871F573900J665007P344326O993930r22694p928101o108925J508898O323293
$$ 6573900 8238907 15583233 22577163 21654469 13726368 7617443 9126341 15449634
42863A5449634N911884M383687L606905J011276l931795p055559n072604J01757
$$ 15449634 21361518 25745205 29352110 30363386 26431591 19376032 14303428 14405185
42855A4405185M190973M913972K532887j178346l443081k450763J14348P49889
$$ 14405185 18596158 23510130 26043017 24864671 21421590 18970827 19085175 19835064
42847A9835064q66779j255182J146963K548499j203107p877571j0314155m752942
$$ 19835064 18968285 17713103 18860066 21408565 20205458 12327887 2013732 -2739210
42839b739210M427489R137700N820572j343320n065069k188933L880081P485822
$$ -2739210 1688279 10825979 16646551 15303231 10238162 8049229 11929310 19415132
42831A9415132O392240K825447K06468J81870K105724L863212L525730J478936
$$ 19415132 25807372 28632819 28839287 29021157 31126881 34990093 38515823 39994759
42823C9994759K55349Q26018M09316l406551p534738o409190k66245M130502K590744
$$ 39994759 40250108 41076126 41485442 38078891 30544153 24134963 23868718 27999220 30589964
42814C0589964j151327j940036o96300j038859j897161N23787M920138N503825
$$ 30589964 29438637 27498601 26802301 25763442 23866281 24390068 29310206 34814031
42806C4814031R75662l068599k570714l90496j95886m0851L141031O352419M117398
$$ 34814031 35789693 32721094 30150380 29759884 29563998 29523147 32664178 39016597 43133995
42797D3133995k148499m820058q67513L839770L325067m43689j928386l92631
$$ 43133995 40985496 36165438 35297925 39137695 42462762 42019073 40090687 39698056
42789C9698056R61067J521940L127168M382929J466678m324117n891087k24397
$$ 39698056 40659123 42181063 45308231 49691160 51157838 46833721 40942634 40718237
42781D0718237O035510N242765q48161m511750l266060j656860k840784m626554
$$ 40718237 46753747 51996512 51148351 46636601 43370541 41713681 38872897 34246343
42773C4246343m683507m121247l982143k782646J92668L069052M906181O969016
$$ 34246343 29562836 25441589 21459446 18676800 18869468 21938520 26844701 33813717
42765C3813717Q306737M937759l004438q116032m861933J875304L417000l24891
$$ 33813717 42120454 47058213 44053775 35937743 31075810 32951114 36368114 36043223
42757C6043223k092794M27135J432595k713308p184488n952282k52644L925817
$$ 36043223 33950429 34377564 35810159 33096851 25912363 19960081 19707437 23633254
42749B3633254L489730K33002k327329j566978K704548P343036Q425491N931745
$$ 23633254 27122984 27355986 25028657 23461679 26166227 33509263 41934754 47866499
42741D7866499L494019K735621J418184j324966k104518J604850O965676R384021
$$ 47866499 51360518 54096139 55514323 54189357 52084839 53689689 60655365 70039386
42733G0039386P465996J800677o962327j5051985j5278140n667433M905158O343326
$$ 70039386 77505382 79306059 72343732 57291747 42013607 36346174 41251332 47594658
42725D7594658M20971k711047N30613L948159L391569K792513N525344P758284
$$ 47594658 48015629 45304582 45835195 49783354 53174923 55967436 61492780 69251064
42717F9251064N281419Q21964r52506r40549k309435l568258j419926J910478
$$ 69251064 74532483 75354447 74401941 73461392 71151957 67583699 66163773 68074251
42709F8074251R90996l861352o198859k658571K784221N137541M302068K578975
$$ 68074251 69065247 65203895 59005036 56346465 59130686 64268227 68570295 71149270
42701G1149270K37196l328256o370763o003540k157596J774526K516872K30475
$$ 71149270 71386466 68058210 61687447 55683907 53526311 55300837 57817709 58048184
42693E8048184j978018j601152N94867K038757K271088L728424P810128J2023239
$$ 58048184 56070166 54469014 55063881 57102638 59373726 63102150 70912278 82935517
42685H2935517J2759580R435692L985984k026837p148156q493911m165261L172742
$$ 82935517 95695097 105130789 109116773 107089936 99941780 91447869 87282608 90455350
42677I0455350Q431668R735849R018346P736161N882020M901958O818175R708711
$$ 90455350 98887018 108622867 117641213 125377374 131259394 136161352 142979527 152688238
42669A52688238Q896238M090945M64056O16813Q44796j384063j732698M136928
$$ 152688238 161584476 165675421 166139477 166756290 167601086 166217023 164484325 168621253
42661A68621253J2276751J5128371J1747680P246303M079457O42841k238381o42243
$$ 168621253 180898004 196026375 207774055 215020358 219099815 219742656 217504275 216862032
42653B16862032N355258J0058719R883992P699338O948758O084716K355746k242604
$$ 216862032 222217290 232276009 242160001 249859339 256808097 262892813 265248559 263005955
42645B63005955k869932J585108O740872P369951K716770k453088k486511K117651
$$ 263005955 260136023 261721131 268462003 275831954 278548724 276095636 273609125 275726776
42637B75726776L731032l086259j2559278j3279200l216081O937467P687339J933591
$$ 275726776 279457808 276371549 263812271 250533071 247316990 254254457 261941796 263875387
42629B63875387j698655j092580l71506j448406k630143l536645m895018m598383
$$ 263875387 262176732 261084152 260712646 259264240 256634097 253097452 248202434 243604051
42621B43604051m53807L595690R28691p159073j1279735o964683j465502l273213
$$ 243604051 243150244 246745934 247674625 240515552 229235817 222271134 220805632 217532419
42613B17532419r986248j2414477p778846k492496k358054n725749p871874p808892
$$ 217532419 207546171 195131694 187352848 184860352 182502298 176776549 168904675 161095783
42605A61095783p810984q500333p744523m298987j64784J675546P12395j064649
$$ 161095783 153284799 144784466 137039943 132740956 132576172 134251718 134964113 133899464
42597A33899464k082086k755996l987961n481059o418550o733633o405299m287034
$$ 133899464 131817378 129061382 125073421 119592362 113173812 106440179 100034880 95747846
42589I5747846M95409N917379P669454L497550l758200q297143o515758j09541
$$ 95747846 96243255 102160634 109830088 113327638 109569438 101272295 94756537 94646996
42581I4646996N412720N314671l81445o880253q852199n119352P38862M175815
$$ 94646996 100059716 105374387 104992942 98112689 89260490 84141138 84880000 89055815
42573H9055815L669127J079082j148354k364609l303348m165057m229005l463532
$$ 89055815 92724942 93804024 92655670 90291061 86987713 82822656 78593651 75130119
42565G5130119l181019m025397m283753j916673K018270L863821J767517j809561
$$ 75130119 71949100 67923703 63639950 61723277 63741547 67605368 69372885 67563324
42557F7563324k710125M98579M991774O215204K475359k530445l228335P86488
$$ 67563324 64853199 65351778 70343552 76558756 79034115 76503670 73275335 74061823
42549G4061823L733430J904584n14929J616750M981383K523267m100092n964020
$$ 74061823 77795253 79699837 79184908 80801658 85783041 88306308 84206216 78242196
42541G8242196j541172L24781m295968o639367M79735R908062J0832051M761717
$$ 78242196 76701024 77025805 72729837 66090470 66570205 76478267 87310318 92072035
42533I2072035L52064j591904n737711r114329m246701N598383Q002354n6996
$$ 92072035 92424099 90832195 85094484 75980155 71733454 77331837 85334191 85277195
42525H5277195p677859p057548l217651k255808j041936M909823J2251824J5269181
$$ 85277195 77599336 70541788 67324137 65068329 64026393 68936216 81188040 96457221
42517I6457221J3559408Q731910N19309q435426j1279231o444751j563803k037747
$$ 96457221 110016629 118748539 119267848 110832422 99553191 93108440 91544637 89506890
42509H9506890l017513P75790N081850L975256N58623P66021K684121J496237
$$ 89506890 86489377 87265167 92347017 96322273 96880896 97646917 100331038 101827275
42501A01827275o66337R3997j04082n897517j0698144m641756Q072115J3294168
$$ 101827275 101160938 101254935 101150853 95253336 84555192 79913436 87985551 101279719
42493A01279719P872658K981313N106769P187233K769574l107830l368058L27777
$$ 101279719 109152377 112133690 117240459 124427692 127197266 124089436 120721378 121049155
42485A21049155K885788M318496O511121P471577M977671J490692L35785P73460
$$ 121049155 123934943 128253439 134764560 142236137 147213808 148704500 149040285 149813745
42477A49813745Q91746J479794L249584L857831J210651l182925o383419o430924
$$ 149813745 150705491 152185285 155434869 159292700 160503351 157320426 150937007 144506083
42469A44506083j896645O141196J1118345O629045l284892p063708j674960K684492
$$ 144506083 142609438 148750634 159868979 166498024 163213132 156149424 154474464 157158956
42461A57158956j551111p718068o404310o33885J013m995011p599627m676826
$$ 157158956 155607845 147889777 141485467 140851582 140852595 135857584 128257957 123581131
42453A23581131q52404R43254K549552L933979J980003k617607m606889k407415
$$ 123581131 122728727 123671981 126221533 130155512 132135515 129517908 124911019 122503604
42445A22503604p25065k605449m662817l153093J42751J486443P97019L19910
$$ 122503604 121778539 119173090 114510273 111357180 111499931 112986374 113783393 114103303
42437A14103303N94674R38013J700182K923929K317634k277195q806698j1915995
$$ 114103303 114697977 115635990 117336172 120260101 122577735 120300540 111493842 99577847
42429I9577847q482291j048289M626859M891510J051383k524004k738604k89746
$$ 99577847 91095556 90047267 94674126 99565636 100617019 98093015 95354411 95064665
42421I5064665J607275M82912l090597n749897m290446N46596L807807J691823
$$ 95064665 96671940 97154852 94064255 88314358 84023912 84570508 88378315 90070138
42413I0070138l167255m485154q39706J915127j343964p463279q688610k582635
$$ 90070138 86902883 82417729 81578023 83493150 82149186 74685907 65997297 63414662
42405F3414662M959338O753353K140792l029631l125383J522901N738810N676838
$$ 63414662 68374000 75127353 77268145 74238514 71113131 72636032 78374842 84051680
42397H4051680K307300j658434n527384q807029q419647k482400M424047N402668
$$ 84051680 86358980 84700546 79173162 70366133 61946486 59464086 63888133 69290801
42389F9290801O89709k876565k395321k093110m171861m241351l1219K700895
$$ 69290801 69980510 67103945 64708624 62615514 58443653 54202302 54171083 56871978
42381E6871978q53813n700405m459231J062567L691926K717203L135095N035265
$$ 56871978 56018165 50317760 45858529 46921096 50613022 53330225 56465320 61500585
42373F1500585K955198l810614q458749o137275R9368M496744M454707J08392
$$ 61500585 64455783 60645169 52186420 46049145 46148513 50645257 55099964 55208356
42365E5208356o371296r593561m619380N749489J1786172P499617k655998r316887
$$ 55208356 48837060 39243499 34624119 40373608 52159780 59659397 57003399 47686512
42357D7686512p596304k08997N624737M013792l584795q383547m079069M223558
$$ 47686512 40090208 39881211 45505948 49519740 45934945 37551398 33472329 37695887
42349C7695887O083065J07721m575008k261543J537889k24300n315972o509597
$$ 37695887 43778952 43886673 39311665 37050122 38588011 38363711 33047739 26538142
42341B6538142k285008K438691L895021K886435J691403J312058J483437J199581
$$ 26538142 24253134 26691825 30586846 33473281 35164684 36476742 37960179 39159760
42333C9159760k44651j740845j402261J67004l0853k955981n699873n334434k230619
$$ 39159760 38915109 37174264 35772003 35939007 35908154 32952173 27252300 21917866 19687247
42324A9687247J384620L549283K633178j379162m821201l335856J923283N178210
$$ 19687247 21071867 24621150 27254328 25875166 21053965 17718109 19641392 24819602
42316B4819602M323585L310124M181406K678428m013668j0317786q925679j231453
$$ 24819602 29143187 32453311 36634717 39313145 35299477 24981691 16056012 14824559
42308A4824559M718944M819195J971818l42034k098727l927661m634880k991545
$$ 14824559 19543503 24362698 26334516 25992482 23893755 19966094 15331214 12339669
42300A2339669K58845K955372L107260N58877k015453j384223J712312K572036
$$ 12339669 12598514 15553886 18661146 19220023 17204570 15820347 17532659 20104695
42292B0104695j043835n073540m496284l02015K160950L75109k937004l774787
$$ 20104695 19060860 13987320 9491036 9189021 11349971 11725080 8788076 5013289
42284E013289q03911L815586N769290K152496m680761q638914o662058j494308
$$ 5013289 4209378 8024964 13794254 15946750 11265989 2627075 -4034983 -5529291
42276e529291L450634P861500J0752226Q115900o78194q256438p387049j268673
$$ -5529291 -2078657 5782843 16535069 24650969 23972775 15716337 8329288 7060615
42268G060615R69337k445214m390496p51200L484013K507248j703694k985287
$$ 7060615 8029952 5584738 1194242 443042 3927055 6434303 4730609 1745322
42260A745322J60925L316657K806993O66575J759004O502440Q629856K854984
$$ 1745322 1906247 5222904 8029897 8696472 10455476 16957916 25587772 28442756
42252B8442756o375594q938986k850639K525642N51829k817957P770M423368J190175
$$ 28442756 22067162 13128176 10277537 12803179 13355008 10537051 10544821 14968189 16158364
42243A6158364o567248o787735J725986O247936j39204q058945o922121p0450
$$ 16158364 9591116 2803381 4529367 10777303 10638099 2579154 -4342967 -4413417
42235d413417K874007O58497j181999o16307P22285L333436P608204R106122M094027
$$ -4413417 -1539410 -880913 -2062912 -2679219 -1956934 1376502 8984706 18090828 22184855
42226B2184855k621810l275589J109664K424621j859881n652622m392646q87977
$$ 22184855 19563045 16287456 17397120 19821741 17961860 12309238 7916592 7028615
42218G028615O27885L2098j098618k172107k047411M04114K847614J654228j238743
$$ 7028615 7656500 7688598 6589980 4417873 2370462 2774576 5622190 7276418 6037675
42209F037675L24018O216563P566208p46362j0830044j1154874j478864Q002551
$$ 6037675 6361693 12578256 20144464 19398102 8568058 -2586816 -4065680 3936871
42201C936871J0227801P483870M680454K676278k43598m498683q579227j0052787
$$ 3936871 14164672 21648542 26328996 29005274 28761676 24262993 15683766 5630979
42193E630979p102274j353285J884951m40752m184482l357174Q53751K379642
$$ 5630979 -1471295 -2824580 -939629 -1380381 -5564863 -8922037 -8068286 -5688644
42185e688644J059743L140164R043559R630084K51990r235043o978300L542372
$$ -5688644 -4628901 -1488737 7554822 17184906 17436896 8201853 1223553 4765925
42177D765925Q485619L269817l195788l752663k004880l389621o263260o422543
$$ 4765925 13251544 16521361 13325573 9572910 7568030 4178409 -2084851 -8507394
42169h507394l659870O84068O716041J2145637J1449159M002588k531113k589638
$$ -8507394 -12167264 -11483196 -4767155 7378482 18827641 22830229 20299116 17709478
42161A7709478r63764l988192p896029m751721L513956O849717J872848m380953
$$ 17709478 16745714 12757522 4861493 109772 3623728 10473445 12346293 7965340
42153G965340n977493m583904k826965L75698M601409N304122O81569m351967
$$ 7965340 1987847 -2596057 -5423022 -5047324 -445915 4858207 5539776 1187809
42145A187809m999631k628327m87720J649690M477223N391167K511999j168568
$$ 1187809 -3811822 -6440149 -6927869 -5278179 -800956 4590211 7102210 5933642
42137E933642k276490k286513l457850l031068K448381R294910R942858L612310
$$ 5933642 3657152 1370639 -2087211 -5118279 -2669898 6625012 16567870 20180180
42129B0180180k540535l579114k195951k275234k743514j366582l65003l282823
$$ 20180180 17639645 14060531 11864580 9589346 6845832 5479250 5114247 1831424
42121A831424q131499q614448k585745M467741N969664J817496k586970l211763
$$ 1831424 -6300075 -14914523 -17500268 -13032527 -7062863 -5245367 -7832337 -11044100
42113a1044100p52190K233257M531172N673688M545489P09983l774037n637032
$$ -11044100 -11796290 -9563033 -5031861 641827 5187316 5897299 2123262 -3513770
42105c513770l407758J570257O413382Q341241O315947K211711o94285j354807
$$ -3513770 -6921528 -5351271 1062111 9403352 15719299 17931010 17236725 15881918
42097A5881918j732238l184870m338591l975927l248898k740399l97951M330443
$$ 15881918 14149680 10964810 6626219 2650292 -598606 -3339005 -3736956 593487
42089E93487P402946N601294K234103J958979K255671k919549j1653689j4003585
$$ 593487 7996433 13597727 15831830 17790809 20046480 17126931 5473242 -8530343
42081h530343n218290P296537J2880249Q685312j67334o864639p387184k966638
$$ -8530343 -13748633 -6452096 6428153 15113465 14946131 8081492 694308 -2272330
42073b272330M29675j084270l192914L81076O308266M846162m190032q722510
$$ -2272330 -1842655 -2926925 -6119839 -5738763 569503 5415665 1225633 -7496877
42065g496877j778684Q231274J0750285P317449M587100J766702m544683r525043
$$ -7496877 -9275561 -1044287 9705998 17023447 21610547 23377249 18832566 9307523
42057I307523o011747K429475N626452J856730j839249k642504m079930n752471
$$ 9307523 3295776 5725251 11351703 13208433 11369184 8726680 4646750 -1105721
42049a105721k656788L786156N182722l29169m206063j158413K776756J081832
$$ -1105721 -3762509 23647 5206369 4877200 671137 -487276 2289480 3371312
42041C371312k669047j555585L757214P425785P117873M388684J89706m438450
$$ 3371312 702265 -853320 2903894 10329679 17447552 21836236 22025942 17587492
42033A7587492o166371l021679J774504L678854K610463J527119J443198J217270
$$ 17587492 11421121 8399442 10173946 13852800 16463263 17990382 19433580 20650850
42025B0650850M23620n73965j914042l434664m254550m501191n059883m724042
$$ 20650850 21074470 20500505 18586463 15151799 10897249 6396058 1336175 -3387867
42017c387867j186501L851030N028349R57786l157069l251183j666668j164794
$$ -3387867 -4574368 -723338 4305011 5262797 2105728 -1145455 -2812123 -3976917
42009c976917O15369N265561P343646J531975o954944p414623J330208Q540578
$$ -3976917 -3361548 1904013 9247659 10779634 3824690 -3589933 -2259725 6280853
42001F280853N687615l145875p688477m034819K353463M033954m85511n758696
$$ 6280853 11968468 8822593 1134116 -2900703 -547240 3486714 3001203 -2757493
41993b757493n607173k41862L953073K414931k078229l820788j651060J108146
$$ -2757493 -8364666 -8606528 -4653455 -2238524 -4316753 -8137541 -9788601 -8680455
41985h680455K162644J774002O74l278009n815405m546772j77446L164456L329795
$$ -8680455 -6517811 -4743809 -4743135 -8021144 -13836549 -18383321 -18560767 -15396311 -12066516
41976a2066516K051541J150621M10986J66738K344495O787867R170812N390977
$$ -12066516 -10014975 -8864354 -8453368 -8286630 -5942135 845732 10016544 15407521
41968A5407521k734476q189999n682127K495959Q042355N159786k464006n412796
$$ 15407521 12673045 4483046 -1199081 1296878 9339233 14499019 12035013 6622217
41960F622217l55538N137825K711493m893701p461910j629918M837833M394966
$$ 6622217 6266679 11404504 14115997 9222296 1760386 130468 4968301 9363267
41952I363267o79927l420822k316877j473401k975320m075129j983942K136362
$$ 9363267 8683340 5262518 2945641 1472240 -1503080 -5578209 -7562151 -5425789
41944e425789M997275N044980L570978K814273L374755L370008O73660l693859
$$ -5425789 -428514 4616466 8187444 11001717 14376472 17746480 18420140 14726281
41936A4726281n514829j829751N155021R758463Q281046K163801l785430n503057
$$ 14726281 9211452 7381701 12536722 22295185 30576231 32740032 28954602 23451545
41928B3451545k556024J798444L274959K72766m457069o241622l166144J701795
$$ 23451545 20895521 22693965 25968924 26241690 21784621 15542999 12376855 14078650
41920A4078650L320664K23622l475502k486328L376926Q516236P670442J635552
$$ 14078650 17399314 17622936 14147434 11661106 15038032 23554268 31224710 32860262
41912C2860262m106372n629021l984985k612557k960327l588321k909790j531446
$$ 32860262 28753890 23124869 19139884 16527327 13567000 9978679 7068889 5537443
41904E537443j218165k098645k271352o82990J022951Q50536o29345j672033k449182
$$ 5537443 4319278 2220633 -50719 -733709 289242 1139778 510433 -1161600 -3610782
41895c610782l839162l968645K0288O443552R722652P862172M771310L247447
$$ -3610782 -7449944 -11418589 -11398301 -4954749 4767903 12630075 17401385 20648832
41887B0648832R90686k943551l504273K537132Q587531N821836l500461q515316
$$ 20648832 21639518 18695967 15191694 17728826 26316357 32138193 28637732 20122416
41879B0122416n044528j12948j9527k030006j102770K015191L689917L109444
$$ 20122416 15077888 14964940 14945413 12915407 11812637 13827828 17517745 20627189
41871B0627189R79812k789214o047656l893390L801470Q638911L542253o549306
$$ 20627189 21607001 18817787 12770131 8876741 12678211 21317122 24859375 18310069
41863A8310069j0190728m025936M329658P284427M822741M94416l894620p042160
$$ 18310069 8119341 4093405 8423063 15707490 20530231 21024647 17130027 10087867
41855A0087867o404926j478368L678797M557067J695055n53642j04716O97413
$$ 10087867 3682941 2204573 5883370 10440437 12135492 11581850 11477134 12174547
41847A2174547m54409j625177P50920N748365P607400L026001l885028o919246
$$ 12174547 11720138 10094961 10845881 16594246 24201646 27227647 23342619 16423373
41839A6423373n924887n201043n063404j369743N486387Q071435K248115n662857
$$ 16423373 10498486 5297443 234039 -1135704 4350683 12422118 14670233 9007376
41831I007376p176665k583811J990295M221989N496198M653750l9598m541270
$$ 9007376 1830711 -753100 1237195 5459184 10955382 15609132 15569534 11028264
41823A1028264l222367J178990O92472m354526m712455K478840P842336M228645
$$ 11028264 7805897 8984887 9677359 5322833 610378 3089218 10931554 15160199
41815A5160199k097839j848368L175891M849053K007619l05751j156533l641018
$$ 15160199 13062360 11213992 14389883 19238936 21246555 20940804 19784271 16143253
41807A6143253o378706m617763L44181J804873j306573k460850J566363N916466
$$ 16143253 9764547 5146784 5490965 7295838 5989265 3528415 5094778 11011244
41799A1011244O469452N500266M783810R95224o519273j0565236n926636J212395
$$ 11011244 17480696 22980962 27764772 28759996 22240723 11675487 5748851 6961246
41791F961246J804587k409466k964984N39360N03528m025612m402911K390438
$$ 6961246 8765833 6356367 3391383 3930743 4434271 408659 -3994252 -1603814
41783a603814O420557p3518q672429n978540N956043J1815011M921722m208142
$$ -1603814 4816743 4743225 -3929204 -9907744 -3951701 7863310 12785032 8576890
41775H576890m288389J434142K583590k606444p236147p712032o954333o385930
$$ 8576890 4288501 5722643 8306233 5699789 -1536358 -9248390 -16202723 -22588653
41767b2588653l182436K634092N617874L025638j87510J121480M514180M876922
$$ -22588653 -25771089 -23136997 -17519123 -14493485 -14680995 -13559515 -9045335 -4168413
41759d168413L190377M158553P529269Q487750N714119K501211J18626l113758
$$ -4168413 -978036 3180517 10709786 19197536 24911655 27412866 27531492 24417734
41751B4417734n703404l523403J674762K287880l016861n336895O67435O937541
$$ 24417734 18714330 15190927 16865689 19153569 16136708 10799813 11467248 18404789
41743A8404789M339243j782384L98745R231681J0670979K042j0198702q498789
$$ 18404789 22744032 20961648 21360393 30592074 41263053 41265095 31066393 22567604
41735B2567604m66173J295041m651768r254053p632262l992251k667891j904880
$$ 22567604 22101431 23396472 18744704 9490651 1858389 -2133862 -4801753 -6706633
41727f706633J481877O041907P214275L418841j252737j234962L363251N645162
$$ -6706633 -5224756 817151 8031426 11450267 10197530 8962568 12325819 17970981
41719A7970981P63398n801491m248937N251864J1467661P729637P83065j015284
$$ 17970981 18734379 12932888 8683951 13935815 25403476 33133113 33916178 32900894
41711C2900894m41219m180606r302963p872363j650077k29293m914977o304406
$$ 32900894 32459675 28279069 18976106 11103743 9453666 9224373 4309396 -1995010
41703a995010L4362O711486P337085N746746O607819O318991J047814m003348
$$ -1995010 -1960648 4750838 12087923 17834669 24442488 30761479 31809293 27805945
41695B7805945k580975J133938j125369p793196j0158256o809040m729987o019740
$$ 27805945 25224970 26358908 25233539 17440343 7282087 473047 -4256940 -10276680
41687a0276680m293054L056384Q830990P253308L254527M017485P227388N537748
$$ -10276680 -14569734 -11513350 -2682360 4570948 7825475 11842960 19070348 24608096
41679B4608096q25740m399200k662368j660927n306905q052330l163928N988764
$$ 24608096 23782356 19383156 16720788 15059861 9752956 1700626 -1463302 4525462
41671D525462R258923L296688m209074n268638j486978J06174k566752n131539
$$ 4525462 13784385 17081073 12871999 7603361 6116383 6222557 3655805 -1475734
41663a475734l857741O42211O207128J0623542J0226258K729955o945634r550390
$$ -1475734 -5333475 -4691264 1515864 12139406 22365664 25095619 18149985 8599595
41655H599595l343008K472064M62571m421997l267911K494688L844261j001592
$$ 8599595 5256587 7728651 8191222 3769225 501314 2996002 6840263 5838671
41647E838671m145917j101826K809660K104798p86196j553804j436645l036173
$$ 5838671 1692754 590928 3400588 5505386 4719190 3165386 1728741 -1307432
41639a307432l950072q63950L643879M618566K438425R38864J204l312826p326499
$$ -1307432 -5257504 -6121454 -2477575 2140991 4579416 5518280 5519484 2206658 -5119841
41630e119841o614944q84551L755669M107879M020690O306888O816451J571910
$$ -5119841 -11734785 -12619336 -8863667 -4755788 -735098 5571790 12388241 13960151
41622A3960151m945435n157758K95450L332301L52972k951893o14706N006200
$$ 13960151 9014716 3856958 4152408 7484709 7837681 4885788 4271082 9277282
41614I277282P192956M081162k73242k422382k897573l099943k646816j241793
$$ 9277282 16470238 20551400 20278158 17855776 14958203 11858260 9211444 7969651
41606G969651m95002j780961l774976m128144k709054j232817k20328J427875
$$ 7969651 7474649 5693688 1918712 -2209432 -4918486 -6151303 -6371631 -4943756
41598d943756L638496M258091K211072m0446Q75684M690737P472250O406771K889835
$$ -4943756 -1305260 2952831 5163903 5123457 5999141 10689878 18162128 24568899 27458734
41589B7458734q9099k039433m371272o448610n372432q99837K314221L40865l873128
$$ 27458734 27369635 25330202 20958930 14510320 9137888 8238051 10552272 10893137 7020009
41580G020009l911015R53269M535289K814350m88789l09531J925683J306828k588193
$$ 7020009 3108994 4062263 8597552 11411902 10923113 10613582 12539265 13846093 11257900
41571A1257900n932914p180420p773846p066426k627783L710649O110630K912808
$$ 11257900 5324986 -1855434 -9629280 -16695706 -19323489 -15612840 -9502210 -6589402
41563f589402q01706j109552k51287p10196KM019880P537985O151973K014063
$$ -6589402 -7391108 -8500660 -8751947 -9462143 -9462141 -5442261 2095724 8247697 10261760
41554A0261760l22404j720332n286939q274586n392458R53492K556327j737661
$$ 10261760 9939356 8219024 2932085 -5342501 -10734959 -9781467 -7225140 -8962801
41546h962801l838136M98469M888109L009923j368502j050934L604509P013081
$$ -8962801 -12800937 -12302468 -7414359 -4404436 -5772938 -6823872 -3219363 3793718
41538C793718P501593P248950O057797K325493j304042k73465M029666N071203
$$ 3793718 11295311 18544261 24602058 26927551 25623509 25350044 29379710 34450913
41530C4450913O19391m144543m283551j020604J604100J668875p86634m815230
$$ 34450913 35070304 30925761 26642210 25621606 27225706 28894581 28107947 23292717
41522B3292717p396576m923125J680053O414090N328101J559392P28674L616294
$$ 23292717 15896141 10973016 12653069 19067159 24395260 25954652 26683326 30299620
41514C0299620O122075M835118K19346m513939n954367l394858n79162k451522
$$ 30299620 36421695 41256813 41476159 36962220 31007853 27612995 27033833 24582311
41506B4582311q546038j2205114q606842q40833M811155O712247P196549O823460
$$ 24582311 16036273 3831159 -4775683 -5616516 -805361 5906886 13103435 19926895
41498A9926895M465858J637250J106977J545900p63543m490548l736109K238227
$$ 19926895 24392753 26030003 27136980 28682880 27919337 23428789 19692680 21930907
41490B1930907N981310K127083m580060o252863k669789M05990O61675P37101
$$ 21930907 27912217 30039300 25459240 19206377 16536588 16942578 17604253 18341354
41482A8341354J778403J801415M83132j29226l68043k931088o850633p016408
$$ 18341354 20119757 21921172 22404304 22275078 21907035 18975947 12125314 5108906
41474E108906k028048K684428K764644J096476J988750L718654K330938m92115
$$ 5108906 3080858 5765286 8529930 9626406 11615156 15333810 17664748 17172633
41466A7172633K19464M166220N908087L057334j515843n383926q228746p711173
$$ 17172633 17392097 21558317 27466404 30523738 29007895 23623969 15395223 7684050
41458G684050j044714P575076Q859820J386186m686222j976972L195764J431340
$$ 7684050 6639336 14214412 23074232 24460418 19774196 17797224 20992988 22424328
41450B2424328m615776n452929r80531q164m430423n728797K74730N940659M102555
$$ 22424328 17808552 12355623 11375092 11366928 6936505 1207708 1482438 7423097 11525652
41441A1525652j012848j637540J625282K892061R51573j061641k272759l468987
$$ 11525652 10512804 8875264 10500546 13392607 14344180 13282539 11009780 7540793
41433G540793k796042J201803M570926K755760j432156j659464J421122J036316
$$ 7540793 4744751 5946554 10517480 13273240 11841084 10181620 11602742 12639058
41425A2639058m487341q907866p559420k801110J576553M833383O176849L634514
$$ 12639058 8151717 -756149 -8315569 -11116679 -9540126 -4706743 1470106 5104620
41417E104620j276622l684957k916199l789561p279003o875475P74520Q220000
$$ 5104620 3827998 143041 -2773158 -6562719 -13841722 -20717197 -19942677 -11722677
41409a1722677P116339P71121j188120K570771M441770P76169l123389k252693
$$ -11722677 -4606338 -3835217 -5023337 -2452566 1989204 2765373 -358016 -2610709
41401b610709R82985J823022J98753o74903L50041J313546o0202m010211q031147
$$ -2610709 -1627724 195298 394051 -280852 69189 1382735 1322533 -2687678 -10718825
41392a0718825q356084l930296J348046K736739P11131r604K564684N242706M951952
$$ -10718825 -19074909 -23005205 -21657159 -18920420 -18209289 -18218893 -15654209 -10411503 -5459551
41383e459551K888718J630013J169166K64606m52306N47906K738542L962045L345728
$$ -5459551 -2570833 -940820 228346 492952 40646 588552 3327094 7289139 10634867
41374A0634867J827383j0478k561313n049253m707373j68147M895244M387239
$$ 10634867 12462250 12451772 9890459 4841206 133833 -34314 4860930 9248169
41366I248169k489160q594809o993891j14819L540634J203112j432926m86474
$$ 9248169 6759009 -1835800 -8829691 -8944510 -5403876 -4200764 -5633690 -6120164
41358f120164k3127l666787o268216j027136Q746139J2963573Q529092K179365
$$ -6120164 -6143291 -9810078 -16078294 -17105430 -8359291 4604282 13133374 15312739
41350A5312739m76088j422792m291532q363378j0868979j0324138n852856K004399
$$ 15312739 14836651 13413859 9122327 758949 -10110030 -20434168 -26287024 -24282625
41342b4282625Q498357Q103096K530039k31131K983929O249134M212545j27711
$$ -24282625 -15784268 -7681172 -5151133 -5382264 -2398335 3850799 8063344 7935633
41334G935633j407749q0607M30500K51763J363313K741558K161235K22887j462779
$$ 7935633 6527884 6447277 6877777 7129540 8492853 11234411 13395646 13618533 12155754
41325A2155754l240113n064162m826229k568618j899909l212288j090242O044816
$$ 12155754 8915641 3851479 -974750 -3543368 -5443277 -8655565 -9745807 -3700991
41317c700991R884115L589978o063296p351532o47255L562090J345094j169629
$$ -3700991 6183124 9773102 3709806 -3641726 -4288981 -726891 618203 -551426
41309e51426l34505N21051L81660L062682P690013P424513J507342j913360K56621
$$ -551426 -885931 -364880 16780 3079462 10769475 18193988 19701330 17787970 18044591
41300A8044591J04424o633601j0681465l464348P607341R480614K771855j449350
$$ 18044591 18149015 11515414 833949 -2630399 4976942 14457556 17229411 15780061
41292A5780061p1867j97201m314293o080385k640052J50385j579833l358603j313147
$$ 15780061 15708194 15510993 11196700 5116315 2476263 2626648 1046815 -2311788 -3624935
41283c624935Q49791m98475j264249L349952R014087P125641k475051j0296734
$$ -3624935 -2775144 -3273619 -4537868 -1187916 7826171 14951812 12476761 2180027
41275B180027q735855j03386P339418P953276K876646j914706j439035K902686
$$ 2180027 -6555828 -6659214 680204 8633480 11510126 9595420 8156385 11059071
41267A1059071M632283O03747l817250j386543O449055J0378768N378966k645841
$$ 11059071 15691354 16295101 12477851 11091308 17540363 27919131 33298097 30652256
41259C0652256n052413j656826M52239k488643o468296o557637l927230l128943
$$ 30652256 25599843 23943017 24395256 21906613 15438317 8880680 4953450 1824507
41251A824507m611457l675870K732282J0731011J2741319N605745n512680j1673365
$$ 1824507 -2786950 -6462820 -3730538 7000473 19741792 25347537 19834857 8161492
41243H161492q492997K23322P058236Q267821N545686J609891l011452p775223
$$ 8161492 -331505 -108183 6950053 15217874 20763560 22373451 19361999 11586776
41235A1586776r693367o219659M83387N044632M471326K17770m402639o235502
$$ 11586776 1893409 -4326250 -3842863 1201769 5673095 5890865 1488226 -4747276
41227d747276k951447M283852R131435N874668k234703n554477j008493L029592
$$ -4747276 -7698723 -3414871 5716564 11591232 9356529 3802052 2793559 5823151
41219E823151j311366r554541j0880379k943686N838652P746168L488230j480950
$$ 5823151 4511785 -5042756 -15923135 -18866821 -13028169 -5282001 -1793771 -3274721
41211c274721k822674J190836Q864757J4373781J2293439M308140k481060m706763
$$ -3274721 -6097395 -4906559 3958198 18331979 30625418 34933558 32452498 27745735
41203B7745735n436704o745893n803347j451553J362640j130891m443750k181983
$$ 27745735 22309031 15563138 9759791 8308238 9670878 8539987 4096237 1914254
41195A914254L655081N373764R25914m113631n456426m427914k801261R2080L054581
$$ 1914254 5569335 10943099 11869013 7755382 2298956 -2128958 -4930219 -4838139 -1783558
41186a783558J960622l511191p103300m307796M28514o5215m801948n685438J048250
$$ -1783558 177064 -3334127 -10437427 -14745223 -14316709 -14381924 -19183872 -24869310 -23821060
41177b3821060R477900J1238180M792835l782688p089926k655885N353076J0072853
$$ -23821060 -14343160 -3104980 1687855 -2094833 -9184759 -11840644 -6487568 3585285
41169C585285Q719209N043483L704401L823015J336937l334988m855762j170821
$$ 3585285 12304494 17347977 21052378 24875393 26212330 22877342 18021580 16850759
41161A6850759K653932J503668k663193m316073k205351K22566M28903j121058
$$ 16850759 19504691 21008359 18345166 14029093 11823742 12046308 12475211 11354153
41153A1354153l213059m389433k258577L476962P870493N249750k783390q351756
$$ 11354153 8141094 3751661 1493084 4970046 12840539 18090289 15306899 6955143
41145F955143p066896k279105J436734L776759N439335M795336J741574L52920
$$ 6955143 -111753 -2390858 -954124 2822635 8261970 13057306 14798880 15151800
41137A5151800K895278M898035J608119l784448m759414k163270k890022q207781
$$ 15151800 18047078 22945113 24553232 20768784 16009370 13846100 10956078 2748297
41129B748297j1062828o762468M61019M523626N263850N407111M842479K537140
$$ 2748297 -8314531 -15076999 -14615980 -10092354 -4828504 578607 5421086 7958226
41121G958226L66097L23820P58438k79965p65152J498823L459536Q82488l821979
$$ 7958226 8324323 8648143 9406581 9126616 8361464 9860287 13319823 14202311 10380332
41112A0380332m051029J044050N240735M702430K811591L545395N352789M649137
$$ 10380332 6329303 7373353 12614088 17316518 20128109 23673504 29026293 33675430
41104C3675430J135830l616635r119308j3854291j3638726o710124J617517M024656
$$ 33675430 34811260 31194625 22075317 8221026 -5417700 -12127824 -10510307 -6485651
41096f485651K5958m231847m243021j087953K531116N534805O760342M327677
$$ -6485651 -6459693 -10691540 -14934561 -16022514 -13491398 -7956593 -1196251 3131426
41088C131426r71931m685280l722834m21208Q06992o09260j310860R61525M583243
$$ 3131426 2159495 -2525785 -6248619 -6669827 -5862835 -6472095 -7782955 -6821430 -2238187
41079b238187O233797M158216q51465o285470r264274p997813k784751L993371
$$ -2238187 3995610 8153826 7302361 1016891 -8247383 -16245196 -19029947 -15036576
41071a5036576Q712332Q291879K996832k285672j822154M343259R198710O342595
$$ -15036576 -6324244 1967635 4964467 2678795 856641 5199900 14398610 20741205
41063B0741205k311785q822968q555444m342843j243984n26005n53553r21559
$$ 20741205 18429420 9606452 1051008 -3291835 -4535819 -5061824 -5615377 -6536936
41055f536936k566019m617186m275113o73330L176463L848095J908107J046611
$$ -6536936 -9102955 -13720141 -17995254 -18668584 -15492121 -11644026 -9735919 -8689308
41047h689308K889011M694864L381241J46300j293490k81959K42099p68481l85697
$$ -8689308 -5800297 -1105433 2275808 2422108 1128618 846659 1088758 320277 -65420
41038f5420K650484M061343L7143n628756o021375j401096J497770N35676Q69288
$$ -65420 2585064 6646407 6683550 1054794 -4966581 -6367677 -4869907 -4334231 -3464943
41029c464943M220494L746944m585407j2505390r889349k72585M143161J116702
$$ -3464943 755551 4502495 -82912 -12588302 -22477651 -22750236 -18607075 -17490373
41021a7490373Q05506Q129224J3971851R385319n93481n177864l416391k517256
$$ -17490373 -16684867 -8555643 5416208 14801527 14208046 9030182 5613791 3096535
41013C096535m579743m782667j684398J64876o74017Q35162P145537J2474316
$$ 3096535 -1483208 -6265875 -7950273 -7785397 -8459414 -7624252 -478715 11995601
41005A1995601J0746561M208488p65830k654968m233080n631443l946973O54900
$$ 11995601 22742162 26950650 26184820 23529852 19296772 13665329 9718356 10373256
40997A0373256L709507K427064q78814k631807k152086m66254K178663N239442
$$ 10373256 14082763 16509827 15631013 12999206 10847120 10380866 12559529 17798971
40989A7798971O204928K981469k292782m339855p43308M429943M592943j747014
$$ 17798971 24003899 26985368 24692586 20352731 19609423 24039366 28632309 26885295
40981B6885295q685075r265622l439682J948678J267434l637121o325390l419342
$$ 26885295 18200220 8934598 5494916 7443594 8711028 5073907 -1251483 -4670825
40973d670825K291131N573695L946212m02756k573349M70576N973591P323184
$$ -4670825 -2379694 3194001 7140213 6737457 4164108 4634684 10608275 17931459
40965A7931459J976344m102280l338274L033943O120837J564053m604215m882963
$$ 17931459 19907803 15805523 12467249 15501192 21622029 23186082 18581867 13698904
40957A3698904l67323K443869J493438L47448J125060J868157J029306l95634
$$ 13698904 13331581 15775450 17268888 17616336 18741396 20609553 21638859 21243225
40949B1243225k144747n642882j0049356j1188141o638287Q65339O829343R120307
$$ 21243225 19098478 13455596 3406240 -7781901 -14420188 -13554849 -6725506 2394801
40941B394801P351796J702923n132500p910579m103795K594032O650756O675835
$$ 2394801 9746597 11449520 6317020 -1593559 -5697354 -3103322 3547434 10223269
40933A0223269M651145J892720p36858j000960J818125L602071j46783o876341
$$ 10223269 14874414 16767134 16030276 15029316 16847441 20449512 20302729 13426388
40925A3426388q870355l268612M122925O357114K959934j563323l509844k251743
$$ 13426388 4556033 1287421 5410346 11767460 14727394 13164071 9654227 7402484
40917G402484P55187L196252L534800K358738Q88998j242022m183798m983779
$$ 7402484 8157671 11353923 14888723 17247461 18136459 16894437 12710639 7726860
40909G726860r67315M251676L896276j633196m017843M60452M477320R57430n299582
$$ 7726860 6759545 11011221 14907497 13274301 9256458 9716910 14194230 15151660 9852078
40900I852078m750924K268553O717900M828631K072077K802842M195570K697984
$$ 9852078 5101154 7369707 14087607 18916238 20988315 23791157 27986727 30684711
40892C0684711l55809k521493l919129m107789n91141N948980R477174N706223
$$ 30684711 30328902 27807409 23888280 19780491 19189350 25138330 34615504 40321727
40884D0321727j980779p130801p527430m781736l11278M297984N948217L274313
$$ 40321727 38340948 31210147 23682717 18900981 18589703 22887687 28835904 32110217
40876C2110217q90373l607371n615197p584232o311522K90918P404388Q383996
$$ 32110217 31219844 27612473 21997276 14413044 8101522 8392440 15796828 24180824
40868B4180824L672618j143805m147409p159489q493401l964872M173272P634731
$$ 24180824 27853442 26709637 22562228 15402739 6909338 2944466 7117738 14752469
40860A4752469L979251N08851K647002N633049L033494k610724m245451j100178
$$ 14752469 18731720 19240571 21887573 27520622 30554116 27943392 23697941 22597763
40852B2597763J906993K787614L603114M413302K819781m81851j650551j29975
$$ 22597763 24504756 27292370 30895484 35308786 38128567 37646716 35996165 35866190
40844C5866190j49097m265250r171798r472483l190173O740938J3896107J2038577
$$ 35866190 35717093 31451843 22280045 12807562 9617389 16358327 30254434 42293011
40836D2293011J326780r260531j0044934j756932N661061N803792K295954J248508
$$ 42293011 43619791 34359260 24314326 22557394 28218455 34022247 36318201 37566709
40828C7566709L021285M705471N738971O558874N481730J858656n60232J319700
$$ 37566709 40587994 45293465 51032436 57591310 63073040 64931696 64371464 65691164
40820F5691164L605166j06962q711430j3791802j0410835k703665K532903L305219
$$ 65691164 69296330 69189368 60477938 46686136 36275301 33571636 36104539 39409758
40812C9409758J620044o69839k387314k200532q1621K106090L354350M851444
$$ 39409758 41029802 40359963 37972649 35772117 35690496 37796586 41150936 46002380
40804D6002380O854042O890272L796165R95062J826776L272685o57794r244638
$$ 46002380 52856422 59746694 63542859 64537921 66364697 69637382 68979588 59734950
40796E9734950j4127598j0231069k970427n93963k774687k482849K174729M866847
$$ 59734950 45607352 35376283 32405856 31811893 29037206 26554357 28729086 33595933
40788C3595933J512020k620393j027733L386194K588917l604816o582878j968348
$$ 33595933 35107953 32487560 31459827 34846021 37434938 33830122 27247244 25278896
40780B5278896L853207L834393M91846J84163J793794j082594q172946j0807044
$$ 25278896 29132103 32966496 33458342 33642505 35436299 34353705 26180759 15373715
40772A5373715l908874O367377J0133321N014333k992044p106768n571811j687755
$$ 15373715 11464841 17832218 27965539 32979872 29987828 22881060 17309249 15621494
40764A5621494q006j443546j974664J621772N544505L013443m888593q283836
$$ 15621494 15613488 14169942 12195278 13817050 19361555 22374998 17486405 9202569
40756I202569j337162R307206J3241731Q877079K190287k853658o100725o498573
$$ 9202569 7865407 17172613 30414344 39291423 41481710 38628052 32527327 26028754
40748B6028754l077811O38091K94680j914935n89317K875177J877086l449086
$$ 26028754 22950943 23589034 23883714 21968779 21379462 24254639 26131725 22682639
40740B2682639n270361j269688J038550k385037m332780J123778P168058M661040
$$ 22682639 17412278 16142590 17181140 14796103 10463323 11587101 18755159 23416199
40732B3416199k832609n233527k226414j389666k934654M53192Q258400R901589
$$ 23416199 20583590 15350063 13123649 11733983 8799329 9252521 17510921 27412510
40724B7412510J546168o448983m703807K103771M244946J176563r96244l29140
$$ 27412510 28958678 22509695 17805888 19909659 24154605 25331168 24334924 24005784
40716B4005784O70785J366649K203922R22352l515704o236176k695045L073695
$$ 24005784 24676569 26043218 28247140 29169492 25653788 19417612 16722567 19796262
40708A9796262L832396N92620N79880M700842N636643m74657q147173j0709579
$$ 19796262 23628658 24221278 24801158 29502000 35138643 34663986 26516813 15807234
40700A5807234q103614l881238K37485L796232N689098N582144M515244K824966
$$ 15807234 7703620 3822382 4059867 7856099 13545197 19127341 23642585 26467551
40692B6467551K87458j624669j423852j146364l333527n002701j082523N795271
$$ 26467551 26755009 25130340 23706488 22560124 19226597 14223896 13141373 18936644
40684A8936644O715458k42128o293615n228372k169864l503867n898342l163780
$$ 18936644 25652102 25409974 19116359 13887987 11718123 8214256 2315914 -847866
40676h47866K184013L459154J685287L100470P119197P018974K508689J546864
$$ -847866 1336147 4795301 6480588 9581058 16700255 23719229 26227918 27774782
40668B7774782P290817J2043123Q522424M44981l399244j054373K079113K010296
$$ 27774782 35065599 47108722 55631146 56076127 52676883 51622510 53701623 55711919
40660E5711919J52171r09379j231756j744941j364696J547194N332348N539504
$$ 55711919 55864090 54954711 53722955 51978014 50613318 52160512 57492860 63032364
40652F3032364J034908k766473m91051M681352M464090k310704p534657o165444
$$ 63032364 64067272 61300799 60809748 65491100 69955190 67644486 60109829 53944385
40644E3944385l300974m095179m023085K910911J1880711J2899980N627106j371988
$$ 53944385 50643411 46548232 42525147 45436058 57316769 70216749 75843855 74471867
40636G4471867m320698o906987r905102r140102n234031m705632q333398q358287
$$ 74471867 70151169 63244182 53339080 44198978 38964947 34259315 25925917 17567630
40628A7567630j291237N849183O838851M761287L676138P77168n927911j0069291
$$ 17567630 16276393 22125576 28964427 33725714 37401852 38179020 32251109 22181818
40620B2181818n604315K940398P230783O917046O397198M969291j94680n006839
$$ 22181818 16577503 19517901 26748684 33665730 40062928 45032219 44837539 39830700
40612C9830700k835884L598984M649382j732010o805673l846804L484536P812153
$$ 39830700 36994816 40593800 45243182 43511172 36705499 32858695 36343231 44155384
40604D4155384O986775L884414J685966J288780N76406l818967j1131838j4401028
$$ 44155384 51142159 55026573 56712539 58001319 58577725 54758758 43626920 29225892
40596B9225892q228247K795040Q642583N963971L19940k753509k880179j416256
$$ 29225892 20997645 23792685 32435268 38399239 38719179 35965670 33085491 31669235
40588C1669235N89336M04086m058523q672122o080074L724521J1534809J0328446
$$ 31669235 32258571 32662657 28604134 19932012 13851938 17576459 29111268 39439714
40580C9439714L593666o99001k15626J039678o72804m507756o151652k313565
$$ 39439714 43033380 42334379 42118753 43158431 42485627 37977871 31826219 29512654
40572B9512654M705060P927758L847300k010286j862749L482941O048433K240146
$$ 29512654 34217714 42145472 45992772 43982486 42119737 45602678 51651111 53891257
40564E3891257l192038m984928k912587J204618N694312P209435L317173j744705
$$ 53891257 50699219 45714291 42801704 44006322 49700634 56910069 60227242 58482537
40556E8482537r12136M409072M757230k851924r223325o463611P22050L357062
$$ 58482537 57570401 61979473 66736703 63884779 54661454 48197843 48919893 52276955
40548E2276955J070609m27276O07950J863265K999924M671000M435249J78849
$$ 52276955 53347564 52920288 53528238 55391503 58391427 63062427 67497676 67676525
40540F7676525m697075n265084j968036J527636M292269O441497M956368k087590
$$ 67676525 62979450 57714366 55746330 57273966 61566235 68007732 72964100 70876510
40532G0876510r588425j0630318o054839k344732j486325J62048L690710N443635
$$ 70876510 61288085 50657767 44602928 42258196 40771871 40933919 44624629 50068264
40524E0068264L605858R77617R3380L32965O20683R74644J076322N71930J63371
$$ 50068264 53674122 54651739 54745119 55078084 55698767 56673411 57749733 58321663 58485034
40515E8485034l60662k834714o042704m305609L869356J0053155O287457k443500
$$ 58485034 58124372 55289658 49246954 44941345 48810701 58863856 65151313 62707813
40507F2707813n140579j304931J84708k759230k793570K175842M530074J014384
$$ 62707813 57567234 56262303 56447011 53687781 50894211 53070053 57600127 58614511
40499E8614511r80923K745849M472061k182144j0060076r340704k816939L16593
$$ 58614511 57633588 60379437 64851498 62669354 52609278 43268574 40451635 40768228
40491D0768228j27161K346960P067168O679013M89007l581588j396811K161761
$$ 40768228 40641067 42988027 50055195 56734208 57223215 53641627 52244816 54406577
40483E4406577K072727n41619k937014m477305l686339J752741R256064J1512779
$$ 54406577 56479304 55937685 53000671 48523366 44837027 46589768 55845832 67358611
40475F7358611N677731k429234o252098o014998n272092m598405k778813q17975
$$ 67358611 73036342 70607108 64355010 58340012 53067920 48469515 45690702 44872727
40467D4872727n66244j539003k339345l003815l093353l48569N099913P968318
$$ 44872727 44306483 42767480 40428135 37424320 34330967 33982398 39082311 47050629
40459D7050629M005172k821326m563388j16530L635920K093666j211881j318510
$$ 47050629 51055801 48234475 43671087 43554557 47190477 49284143 48072262 46753752
40451D6753752N71027J43183k786757m804022m771472m235182k709711J998997
$$ 46753752 47324779 47467962 44681205 39877183 35105711 30870529 28160818 30159815
40443C0159815P808019Q142602P93776p165988p566230j485833L244321K963774
$$ 30159815 37967834 46110436 46904212 39738224 32171994 30686161 33930482 36894256
40435C6894256J138525J033129J506720J304365J766767K742780J114274l072935
$$ 36894256 38032781 39065910 40572630 41876995 43643762 46386542 47500816 44427881
40427D4427881m099671R54077N829859L565641k303043k988274J239306J548723
$$ 44427881 40328210 41282287 47112146 50677787 48374744 45386470 46625776 48174499
40419D8174499m246442p361216k526927L063496J920799j065566K527847R133976
$$ 48174499 43928057 36566841 34039914 37103410 39024209 37958643 40486490 49620466
40411D9620466P931746j404386p496967m424974J119503K771044L801252P729922
$$ 49620466 57552212 56147826 48650859 44225885 45345388 48116432 51917684 59647606
40403E9647606R011582J721284q572907j0942290l982804L741484O186965M827989
$$ 59647606 68659188 70380472 61807565 50865275 46882471 50623955 56810920 61638909
40395F1638909K210378j509590n114385o394342o525753q080977q350117k032487
$$ 61638909 63849287 62339697 57225312 50830970 44305217 36224240 27874123 25841636
40387B5841636Q156013J1859715N402338k076282j717200K924549L363844j92627
$$ 25841636 33997649 45857364 51259702 49183420 47466220 50390769 53754613 53561986
40379E3561986j117244J226895N15200n308458r764892p005987J46958M196604
$$ 53561986 52444742 53671637 54186837 48878379 39113487 32107500 32254458 36451062
40371C6451062K015669k432875l245711P28420M542042L278914j030196j772089
$$ 36451062 38466731 36033856 32788145 33516565 38058607 41337521 40307325 38535236
40363C8535236K410555N034808J735138k605947j714082J952099J986105o43728
$$ 38535236 40945791 45980599 47715737 45109790 43395708 45347807 47333912 46690184
40355D6690184K11594L940888L229071k784094n101172J284047Q225376N368689
$$ 46690184 46901778 50842666 54071737 51287643 46186471 47470518 55695894 61064583
40347F1064583n124983j1699279q537435j196544K303220O75264j679610j507852
$$ 61064583 55939600 44240321 35702886 34506342 36809562 37484826 35805216 34297364
40339C4297364L1143L49859k97056P00529L600570M666710J107175m452166p109171
$$ 34297364 34328507 34678366 34381310 35081839 38682409 43349119 44456294 40004128 32894957
40330C2894957n465739j267190M351283R896080J0989140M838932l409922n138686
$$ 32894957 27429218 26162028 30513311 40409391 51398531 56237463 52827541 47688855
40322D7688855L58077M936457K983881k429555o180608p258307n832768p60215
$$ 47688855 48046932 52983389 55967270 53537715 47357107 40098800 34266032 33505817
40314C3505817O157350Q975307M988942r61079l131977j646146L66862J498983
$$ 33505817 39663167 48638474 53627416 52666337 49534360 47888214 48255076 49754059
40306D9754059O31921l852605r426731r406677k216221M674683N115608K949630
$$ 49754059 50385980 46533375 37106644 27699967 25483746 30158429 35274037 38223667
40298C8223667M296986O868547M707109q34622l404487k057233r69830q28121
$$ 38223667 42520653 49389200 54096309 53261687 49857200 47799967 46830137 46002016
40290D6002016J058116L289232J597652k579266k915965J642267N031258L587452
$$ 46002016 47060132 50349364 51947016 49367750 46451785 48094052 53125310 56712762
40282E6712762M54741r75037j345519j202317J116206N071069O819754M717429
$$ 56712762 57167503 56192466 54846947 53644630 54760836 59831905 66651659 71369088
40274G1369088J142321k504242p139299j0843488q658584m85472O319962N774424
$$ 71369088 72511409 70007167 62867868 52024380 43365796 42880324 49200286 54974710
40266E4974710K97308m038052m784201k638100J531650N315105M666191m63916
$$ 54974710 55272018 51233966 46449765 43811665 45343315 50658420 55324611 54860695
40258E4860695l925307j299965L086658K102155l583332o476356l097335J695944
$$ 54860695 50935388 49635423 52722081 54824236 51240904 44764548 41667213 43363157
40250D3363157K262821m84173j841189n72734P2680j888905l689719j812504K477867
$$ 43363157 45625978 45141805 43300616 42727882 42800562 40911657 37221938 35409434 37887301
40241C7887301M625441L315515J857883K258171K073208n68297l027344k780288
$$ 37887301 42512742 45828257 47686140 49944311 52017519 51449222 48421878 45641590
40233D5641590j908889k322633o76087N532309J0380043O404212k794415o201854
$$ 45641590 43732701 41410068 40733981 46266290 56646333 63050545 60256130 54054276
40225E4054276j585414J906543q33126l198752Q62953O245512N179671n46451
$$ 54054276 52468862 54375405 53542279 50343527 51206480 57451992 62631663 62085212
40217F2085212l285802q17731K786269M161410K758601j014895m853753n015421
$$ 62085212 58799410 57981679 60767948 64929358 67687959 66673064 61819311 56803890
40209E6803890k036085j716381n718850o748281J81251P211842L724724o563848
$$ 56803890 54767805 53051424 47332574 40584293 40765544 47977386 51702110 45138262
40201D5138262r576310j522328N547504J782218o528050o974000J417920P857829
$$ 45138262 35561952 34039624 39587128 41369346 34841296 27867296 29285216 37143045
$$ [...]
##END NTUPLES=NMR SPECTRUM
##END=
