##TITLE=31Pdec_DE-60rm_2h
 , 64 sc
 27.6.2024
##JCAMPDX= 6.0         $$ Bruker NMR JCAMP-DX V2.0
##DATA TYPE= NMR SPECTRUM
##DATA CLASS= NTUPLES
##ORIGIN= UXNMR, Bruker Analytische Messtechnik GmbH
##OWNER= root
$$ XWIN-NMR		Version 3.5
$$ Thu Jun 27 13:47:05 2024 Russian Standard Time (UT+4h)  she@DPX200
##.OBSERVE FREQUENCY= 81.013821
##.OBSERVE NUCLEUS= ^31P
##.ACQUISITION MODE= SIMULTANEOUS
##.ACQUISITION SCHEME= undefined
##.AVERAGES= 64
##.DIGITISER RES= 17
##SPECTROMETER/DATA SYSTEM= spect
##.PULSE SEQUENCE= zgpg30
##.SOLVENT NAME= D2O
##.SHIFT REFERENCE= (INTERNAL, D2O, 0, 182.463)
##AUDIT TRAIL= $$ (NUMBER, WHEN, WHO, WHERE, WHAT)
$$ ##TITLE= Audit trail, XWIN-NMR		Version 3.5
$$ ##JCAMPDX= 5.01
$$ ##ORIGIN= Bruker BioSpin GmbH
$$ ##OWNER= she
$$ F:/spectra/data/she/nmr/P31/2/pdata/1/auditp.txt
$$ ##AUDIT TRAIL=  $$ (NUMBER, WHEN, WHO, WHERE, WHAT)
(   1,<2024-06-27 13:45:47.28 +0400>,<she>,<DPX200>,
      <continue with go, POWCHK disabled, PULCHK disabled
       configuration hash MD5:
       00 E9 B6 7A A2 85 ED C7 34 08 36 98 17 FE 4E 26
       data hash MD5: 32K
       C6 11 E2 41 94 32 EA 07 DC A5 A7 5E E1 08 76 AD>)
(   2,<2024-06-27 13:45:49.00 +0400>,<she>,<DPX200>,
      <Start of raw data processing
       efp BC_mod = 2 LB = 1.5 FT_mod = 6 PKNL = 1 PHC0 = 2731.068 PHC1 = 251.6863 SI = 64K 
       data hash MD5: 64K
       94 39 22 2F 2C 9B 36 5C 04 45 CC 3E 2D 8E 85 B2>)
(   3,<2024-06-27 13:46:16.18 +0400>,<she>,<DPX200>,
      <pk PHC0 = 29.11353 PHC1 = -44.8 
       data hash MD5: 64K
       02 77 9A 2B EC 40 AD 69 52 4A F7 E1 F0 75 1E 39>)
(   4,<2024-06-27 13:46:28.31 +0400>,<she>,<DPX200>,
      <abs ABSG = 5 
       data hash MD5: 64K
       F0 FB 24 18 89 F0 92 2C BA 4B 00 9E D9 EA 52 FD>)
$$ ##END=
$$ 
$$ hash MD5
$$ A0 43 19 25 58 89 25 61 95 B1 FF 07 4A 1D 80 FE
##$RELAX= 
##$RELAX= 
##$RELAX= 
##$RELAX= 
##$RELAX= 
##$RELAX= 
##$RELAX= 
##$RELAX= 
$$ Bruker specific parameters
$$ --------------------------
##$DU= <F:/spectra>
##$EXPNO= 2
##$NAME= <P31>
##$PROCNO= 1
##$TYPE= <nmr>
##$USER= <she>
##$AMP= (0..31)
100 100 100 100 100 100 100 100 100 100 100 100 100 100 100 100 100 100 
100 100 100 100 100 100 100 100 100 100 100 100 100 100 
##$AQSEQ= 0
##$AQ_mod= 1
##$AUNM= <au_zg>
##$AUTOPOS= <>
##$BF1= 81.014009
##$BF2= 200.13
##$BF3= 200.13
##$BF4= 200.13
##$BF5= 200.13
##$BF6= 200.13
##$BF7= 200.13
##$BF8= 200.13
##$BYTORDA= 1
##$CFDGTYP= 0
##$CFRGTYP= 5
##$CHEMSTR= <none>
##$CNST= (0..31)
1 1 145 1 1 1 1 1 1 1 1 1 1 1 1 1 1 1 1 1 1 1 1 1 1 1 1 1 1 1 1 1 
##$CPDPRG= <waltz16>
##$CPDPRG1= <>
##$CPDPRG2= <waltz16>
##$CPDPRG3= <>
##$CPDPRG4= <mlev>
##$CPDPRG5= <mlev>
##$CPDPRG6= <mlev>
##$CPDPRG7= <mlev>
##$CPDPRG8= <mlev>
##$CPDPRGB= <>
##$CPDPRGT= <>
##$D= (0..31)
0 1 0 0 0 0 0 0 0 0 0 0.03 2e-05 3e-06 0 0 0 0 0 0 0 0 0 0 0 0 0 0 0 0 
0 0 
##$DATE= 1719481434
##$DBL= (0..7)
120 120 120 11 120 120 24 19 
##$DBP= (0..7)
150 150 150 150 150 150 150 150 
##$DBP07= 0
##$DBPNAM0= <>
##$DBPNAM1= <>
##$DBPNAM2= <>
$$ [...]
##$SUBNAM3= <"">
##$SUBNAM4= <"">
##$SUBNAM5= <"">
##$SUBNAM6= <"">
##$SUBNAM7= <"">
##$SUBNAM8= <"">
##$SUBNAM9= <"">
##$SW= 369.568048894756
##$SWIBOX= (0..15)
0 1 3 0 0 0 0 0 0 0 0 0 0 0 0 0 
##$SW_h= 29940.119760479
##$TD= 32768
##$TD0= 1
##$TE= 0
##$TE2= 300
##$TE3= 300
##$TEG= 300
##$TL= (0..7)
0 120 53 12 22 120 120 120 
##$TP= (0..7)
150 150 150 150 150 150 150 150 
##$TP07= 0
##$TPNAME0= <>
##$TPNAME1= <>
##$TPNAME2= <>
##$TPNAME3= <>
##$TPNAME4= <>
##$TPNAME5= <>
##$TPNAME6= <>
##$TPNAME7= <>
##$TPOAL= (0..7)
0.5 0.5 0.5 0.5 0.5 0.5 0.5 0.5 
##$TPOFFS= (0..7)
0 0 0 0 0 0 0 0 
##$TUNHIN= 0
##$TUNHOUT= 0
##$TUNXOUT= 0
##$USERA1= <user>
##$USERA2= <user>
##$USERA3= <user>
##$USERA4= <user>
##$USERA5= <user>
##$V9= 5
##$VALIST= <valist>
##$VCLIST= <CCCCCCCCCCCCCCC>
##$VD= 0
##$VDLIST= <DDDDDDDDDDDDDDD>
##$VPLIST= <PPPPPPPPPPPPPPP>
##$VTLIST= <TTTTTTTTTTTTTTT>
##$WBST= 1024
##$WBSW= 4
##$XGAIN= (0..3)
0 0 0 0 
##$XL= 0
##$YL= 0
##$YMAX_a= 30070
##$YMIN_a= -23310
##$ZGOPTNS= <>
##$ZL1= 120
##$ZL2= 120
##$ZL3= 120
##$ZL4= 120
##$ABSF1= 182.463
##$ABSF2= -187.1042
##$ABSG= 5
##$ABSL= 3
##$ALPHA= 0
##$AQORDER= 0
##$ASSFAC= 0
##$ASSFACI= 0
##$ASSFACX= 0
##$ASSWID= 0
##$AUNMP= <proc_1d>
##$AZFE= 0.1
##$AZFW= 0.5
##$BCFW= 0
##$BC_mod= 2
##$BYTORDP= 0
##$COROFFS= 0
##$CY= -3
##$DATMOD= 1
##$DC= 0
##$DFILT= <>
##$DTYPP= 0
##$F1P= 0
##$F2P= 0
##$FCOR= 1
##$FTSIZE= 65536
##$FT_mod= 6
##$GAMMA= 0
##$GB= 0
##$INTBC= 1
##$INTSCL= 9.790993e-09
##$ISEN= 30
##$LB= 1.5
##$LEV0= 0
##$LPBIN= 0
##$MAXI= 10000
##$MC2= 0
##$MEAN= 0
##$ME_mod= 0
##$MI= 50
##$NCOEF= 0
##$NC_proc= -10
##$NLEV= 6
##$NOISF1= 182.463
##$NOISF2= 159.3651
##$NSP= 0
##$NTH_PI= 0
##$NZP= 0
##$OFFSET= 182.463
##$PC= 4
##$PHC0= 2760.182
##$PHC1= 206.8863
##$PH_mod= 1
##$PKNL= yes
##$PPARMOD= 0
##$PSCAL= 0
##$PSIGN= 0
##$REVERSE= no
##$SF= 81.0140089999434
##$SI= 65536
##$SIGF1= 159.3651
##$SIGF2= -187.1042
##$SINO= 113.3802
##$SIOLD= 16384
##$SREGLST= <1H.CDCl3>
##$SSB= 0
##$STSI= 65536
##$STSR= 0
##$SW_p= 29940.119760479
##$SYMM= 0
##$S_DEV= 0
##$TDeff= 32768
##$TDoff= 0
##$TI= <>
##$TILT= no
##$TM1= 0
##$TM2= 0
##$TOPLEV= 0
##$USERP1= <user>
##$USERP2= <user>
##$USERP3= <user>
##$USERP4= <user>
##$USERP5= <user>
##$WDW= 1
##$XDIM= 65536
##$YMAX_p= 272884658
##$YMIN_p= -87096547
$$ End of Bruker specific parameters
$$ ---------------------------------
##NTUPLES= NMR SPECTRUM
##VAR_NAME=  FREQUENCY,     SPECTRUM/REAL,   SPECTRUM/IMAG
##SYMBOL=    X,             R,               I
##VAR_TYPE=  INDEPENDENT,   DEPENDENT,       DEPENDENT
##VAR_FORM=  AFFN,          ASDF,            ASDF
##VAR_DIM=   65536,         65536,           65536
##UNITS=     HZ,            ARBITRARY UNITS, ARBITRARY UNITS
##FACTOR=    0.456856943014862, 1,           1
##FIRST=     14782.0589164792, 0,            0
##LAST=      -15158.0608439998, 0,           0
##MIN=       -15158.0608439998, -87096547,   0
##MAX=       14782.0589164792, 272884658,    0
$$ Real data points
##PAGE= N=1
##DATA TABLE= (X++(R..R)), XYDATA
$$ [...]
45850a104432N160664n449858j0052929o600137L07282M733897L281922k984742
45842a2708333q468723p700271j475585M357772O373054N779704L501598p10618
45834a1051402l304749J164662R909756J1646328J918940q544347p968446K27013
45826f002245M017699N74316k963556l678487o101720j0622314r884742q20645
45818c5481694Q282217Q150777J32600p554952j0402666r201862m880070K024887
45810d8930763Q101903Q961538N104683J886595K397349L719045K319190K12085
45802a6228375J853866O075015O366639R14991k846292J715346R667862J0424986
45794A7944038K434100n934276r814305j2663646j5358740j1065566K429888J4083573
$$ plain form
45850 -1104432 4056232 -1393626 -11446555 -18046692 -17739410 -13005513 -9723591 -12708333
45842 -12708333 -21177056 -28877327 -30352912 -25995140 -19622086 -13842382 -10340784 -11051402
45834 -11051402 -14356151 -13191489 -3281733 8364595 10283535 1739188 -6229258 -6002245
45826 -6002245 -1984546 -1410230 -4373786 -8052273 -14153993 -24776307 -34661049 -35481694
45818 -35481694 -27199477 -19048700 -18916100 -26471052 -36873718 -46075580 -50955650 -48930763
45810 -48930763 -40828860 -31867322 -26762639 -24876044 -22478695 -18759650 -16440460 -16228375
45802 -16228375 -14374509 -8299494 -1932855 -1017864 -3864156 -2148810 7519052 17944038
45794 17944038 20378138 14443862 4629557 -8034089 -23392829 -34458395 -32028507 -17944934
45786a7944934J2689608K852941k061003J049045L742771J777707O70776M272713
45778G049624P808180N795517l05587n481057o412462j411332Q515167J6180179
45770C1738229J2529431j752990j4484204j5916476r683888n645597o432885o713303
45762a6361683k951056K335961N771510P316040P523661M254003m171048j3122989
45754i405601j3264761j332990J2755350J4825474K968882j0227304j3509115
45747a7190065q562822k603017K768576Q472348J0517018N290979j788393k832733
45739e928109J41181m46144l528774j204043O230408R710416O879803N295943
45731A7150681P535306O080930k368697r902209j0580707q849608q245319l917064
$$ plain form
45786 -17944934 -5255326 -2402385 -4463388 -3414343 328428 2106135 2776911 7049624
45778 7049624 14857804 20653321 20347734 14866677 8454215 7042883 15558050 31738229
45770 31738229 44267660 42514670 28030466 12113990 2430102 -3215495 -9648380 -16361683
45762 -16361683 -19312739 -16976778 -11205268 -3889228 3634433 7888436 3717388 -9405601
45754 -9405601 -22670362 -24003352 -11248002 3577472 6546354 -3680950 -17190065
45747 -17190065 -25752887 -28355904 -25587328 -17114980 -6597962 -1306983 -3095376 -5928109
45739 -5928109 -5786928 -6233072 -9761846 -10965889 -4735481 4974935 11854738 17150681
45731 17150681 24685987 30766917 28398220 18496011 7915304 -934304 -9179623 -13096687
45723a3096687N213898Q958481J316238p338032n854140l34153k193157o490213
45715a9817765M44591J5880051K1332556R056097p884681j5039023j2608151q145838
45707a6782163n328503n119325p996411r869689m634979M761992P205564M63418
45699c7300096k909351N613384J5563976J2405299L59066l497085M608897R802671
45691D646761K492080n950829m36378J3848691J7323408L469974j2241215j3957814
45683I194678n147893N59635r7784K31183L317959K179218m667789q276442l744741
45674f451976J012046j455471n057767k90200R184737J1611020N143513r88707
45666A2707195j956829k151821l671690j730006M679841P775588K632441l955932
$$ plain form
45723 -13096687 -7882789 1075692 2391930 -4946102 -10800242 -11134395 -13327552 -19817765
45715 -19817765 -19373174 -3493123 17839433 26895530 19010849 3971826 -8636325 -16782163
45707 -16782163 -22110666 -27229991 -35226402 -45096091 -49731070 -44969078 -37763514 -37300096
45699 -37300096 -40209447 -34596063 -19032087 -6626788 -6267722 -9764807 -5155910 4646761
45691 4646761 7138841 1188012 751634 14600325 31923733 35393707 23152492 9194678
45683 9194678 4046785 4606420 4508636 4739819 8057778 10236996 5569207 -2707235 -6451976
45674 -6451976 -5439930 -6895401 -11953168 -12243368 -3058631 8552389 13695902 12707195
45666 12707195 10750366 8598545 4926855 3196849 7876690 15652278 18284719 14328787
45658A4328787l206634K556766L882096j821308p358983o347976j121234J591507
45650B503021q8426p40487N060001J3984859J5493295M543205r945804j4402513
45642A6407151p501066j435009m967315j1890593j0659655m77730Q556503R403233
45634b564481N692027M112484M195108n5032r483860j5549591r989300L494914
45626b0147731J2529701J1715940Q777589J1440343J4709469R090878k641431
45619D5474758p765278k833260O90151n813886j4750349j4340492o642906l415699
45611i396961p430128q764233o14164J0560396J4699337J1077769N820223J168427
45603A7120666n021131j0329822p267168M499764J2457657N483648r548716j4773395
$$ plain form
45658 14328787 11122153 13678919 17561015 15739707 8380724 2032748 911514 2503021
45650 2503021 2414595 1674108 6734109 20718968 36212263 40755468 30809664 16407151
45642 16407151 8906085 7471076 2503761 -9386832 -20046487 -20524217 -11967714 -2564481
45634 -2564481 3127546 7240030 11435138 11380106 1896246 -13653345 -23642645 -20147731
45626 -20147731 -7618030 4097910 12875499 24315842 39025311 48116189 45474758
45619 45474758 37709480 34876220 35566371 29752485 15002136 661644 -5981262 -9396961
45611 -9396961 -16827089 -25591322 -26205486 -15645090 -945753 10132016 15952239 17120666
45603 17120666 12099535 1769713 -5497455 -997691 11459966 16943614 7394898 -7378497
45595g378497n180059M727967K216054n818738n037762L767366O752697r53335
45587f904307q462262o394977N21660L126884J061447k64300N17844R50538O06519
45578a5240954M18960p93800l378714l082763L577839J1646850J1896696L238721
45570H282835m624359l324519L269348L985332n066335j4778161j3796084k674169
45562b8726112O738483O266762P86648m20864L068904M203421K65617m230437
45554a2047578o004300o690013o702181k779459N341545J1912795J2338847Q407707
45546C777363L569549j589444o016676o271309k401151n40652m475574q864675
45538b2812569o301771K064093Q120341O719028k17276p371816j0246391p742788
$$ plain form
45595 -7378497 -12558556 -7830589 -5614535 -11433273 -16471035 -12703669 -5950972 -6904307
45587 -6904307 -15366569 -21761546 -21239886 -18113002 -17051555 -17315855 -16798011 -15847473 -15240954
45578 -15240954 -14821994 -15615794 -18994508 -22077271 -18499432 -6852582 5044114 8282835
45570 8282835 3658476 333957 3603305 7588637 2522302 -12255859 -26051943 -28726112
45562 -28726112 -21987629 -15720867 -14934219 -15355083 -12286179 -8082758 -7817141 -12047578
45554 -12047578 -18051878 -24741891 -31444072 -34223531 -28881986 -16969191 -4630344 3777363
45546 3777363 7346912 5757468 -259208 -6530517 -8931668 -9472320 -13947894 -22812569
45538 -22812569 -29114340 -27050247 -18929906 -12210878 -12428154 -19799970 -30046361 -37789149
45530c7789149l176896n47345J066152N199208R892618R104518L922549K946648
45522i381697P337681O353708m728439j3375462p721716M053027O672454K279411
45514h511033M349080J1554398Q298605p326153j6637477q396628M022259M188977
45506h457972l084080k391258P542613J4250920J0877663J878051p421325j4712617
45498a518005j5458839n540149R255199J5884614R289481j710460o223485l101232
45490H77124J642211L777200L391307J877828J49723j310841k428772k635740
45482E340040o162O085673J1123508Q222822k971576j3457053j4370524p116637
45474g149909j99591K246242L551490O367256P692439M590923o86644n661075
$$ plain form
45530 -37789149 -40966045 -41513390 -40447238 -35248030 -25355412 -16250894 -12328345 -9381697
45522 -9381697 -2044016 4309692 -418747 -13794209 -21515925 -17462898 -10790444 -8511033
45514 -8511033 -4161953 7392445 15691050 8364897 -8272580 -16669208 -12646949 -8457972
45506 -8457972 -11542052 -13933310 -6390697 7860223 18737886 20615937 13194612 -1518005
45498 -1518005 -16976844 -22516993 -13261794 2622820 11912301 10201841 3978356 877124
45490 877124 2519335 6296535 9687842 11565670 11715393 10404552 7975780 5340040
45482 5340040 5333878 11419551 22543059 30765881 27794305 14337252 -33272 -7149909
45474 -7149909 -7349500 -5103258 -1551768 4815488 12507927 17098850 16412206 10751131
45466A0751131j2650854k2245409k5781364j4016021P113267J9763795J6127474
45459b0937981P535909O845482J1396393J1308324O009972J414962l274436j2651389
45451G647236k1579000j8662966m652876N372788K175515o087121p480159j822743
45443d5089326L559154N386157M802101K707487J320251M653986J1250936J2488967
45435A079713N025139j275015L562415J3683595J4746012M488116m583963l161351
45427C3564661L501372M268989m612969j7023761k2886379j5926888l02119J0588950
45419h828144P073687n245950j2155358q001111L39785N551565P167639N941902
45411h155985R18425m026087j60011J2881833K1173583J2132048q293984k1992852
$$ plain form
45466 10751131 -1899723 -24145132 -49926496 -63942517 -56829250 -37065455 -20937981
45459 -20937981 -13402072 -6556590 4839803 16148127 22158099 23573061 20298625 7647236
45451 7647236 -13931764 -32594730 -37247606 -31874818 -29699303 -35786424 -43266583 -45089326
45443 -45089326 -41530172 -36144015 -31341914 -28634427 -27314176 -22660190 -11409254 1079713
45435 1079713 6104852 4829837 8392252 22075847 36821859 41309975 36726012 33564661
45427 33564661 37066033 41335022 36722053 19698292 -3188087 -19114975 -19417094 -8828144
45419 -8828144 -1754457 -7000407 -19155765 -27156876 -26817091 -21265526 -14097887 -8155985
45411 -8155985 -7237560 -11263647 -11423658 1458175 22631758 34763806 26469822 4476970
45403D476970j9588872p822838J877115M743755K993717J353408L064841O041470
45395b860434L816714n220845j1999314p108357M664053R078323K169870m705510
45387a2165500k362075M164155O852048P772152J1464871J2464466L263395r470343
45379B1983169j0750011N67026Q876030M349895l867296k961373N628545J1791829
45371C5617814J1809624Q043289j56679j3763581k5170977k3633379j0470292
45364a7724181O85698J194533k910213j654943N470504J1516638J2500022J0310500
45356A9388558P351040L090738l440247r845480j0568905k326787J0029232J5647700
45348B9325849Q651664m785745j3783240j5047319j3124490j0684166n810150
$$ plain form
45403 4476970 -15111902 -22934740 -21057625 -16313870 -13320153 -11966745 -8901904 -2860434
45395 -2860434 956280 -4264565 -16263879 -23372236 -18708183 -9629860 -7459990 -12165500
45387 -12165500 -14527575 -10363420 -3511372 4260780 15725651 28190117 31453512 21983169
45379 21983169 11233158 11800184 20676214 25026109 21158813 18197440 23825985 35617814
45371 35617814 47427438 55470727 55314048 41550467 16379490 -7253889 -17724181
45364 -17724181 -17038483 -15843950 -18754163 -20409106 -14938602 -3421964 9078058 19388558
45356 19388558 26739598 29830336 26390089 16544609 5975704 3648917 13678149 29325849
45348 29325849 37977513 33191768 19408528 4361209 -8763281 -19447447 -25257597
45341b5257597J048491N353336N984902P301595J0324984Q864127n04922j0604606
45333B510310j2330096p021555l334422m490850n825641m036802j727266j403200
45325c7659522o79098L480986R004252J0609956O803641K531737L595911R144588
45317F832451J2034548P846302Q00797k517749k724282n424070j0880348j3266865
45309g299216j0901849r067756r957857q231503j164065N101060N808109O013239
45301b9699838J0456484J2675984N167215n525253o939107n65148O69404n883118
45293a9643377q566646j879132M089943J263436k717950J804404R517221Q745597
45285g386504L31850m436094j435511K328305J529561j142417k518373l728084
$$ plain form
45341 -25257597 -24209106 -18855770 -12870868 -5569273 4755711 13619838 13114916 2510310
45333 2510310 -9819786 -16841341 -20175763 -24666613 -30492254 -34529056 -36256322 -37659522
45325 -37659522 -38338620 -34857634 -25853382 -15243426 -8439785 -5908048 -2312137 6832451
45317 6832451 18866999 26713301 27514098 24996349 22272067 16847997 5967649 -7299216
45309 -7299216 -18201065 -27268821 -37226678 -45458181 -46622246 -41521186 -35713077 -29699838
45301 -29699838 -19243354 -6567370 -1400155 -6925408 -13864515 -14429663 -13760259 -19643377
45293 -19643377 -28210023 -30089155 -25999212 -24735776 -27453726 -25649322 -16132101 -7386504
45285 -7386504 -7054654 -11490748 -12926259 -10597954 -9068393 -10210810 -12729183 -16457267
45277a6457267m967753l161116J674830M063614J351665p19300L972502J1482584
45269b760241J1287158m8258j3327156j6507667p736058L063796M841130l378438
45261b4565734j1825319j0130873J885485J3707289J4740182N258749m123133
45254a5053354m218702K825055O964947K731983m735064p006647k403155M186753
45246a6708184Q929259J1610371J1224187N105243m910354j0489817o036898K659404
45238A383211M802391r50387m754295l08434M998052M34984j1177770j5199221
45230b0771469m820746Q763955J0760723J872021m401763j035486M711000L847083
45222a074682k315314o856403p480063o280787l928085n30773Q63292j684111
$$ plain form
45277 -16457267 -21425020 -24586136 -22911306 -18847692 -17496027 -18215327 -14242825 -2760241
45269 -2760241 8526917 8478659 -4848497 -21356164 -29092222 -26028426 -21187296 -24565734
45261 -24565734 -36391053 -46521926 -44636441 -30929152 -16188970 -10930221 -15053354
45254 -15053354 -19272056 -16447001 -9482054 -6750071 -11485135 -18491782 -20894937 -16708184
45246 -16708184 -7778925 3831446 15055633 20160876 15250522 4760705 -1276193 1383211
45238 1383211 6185602 5235215 480920 172486 5170538 5605522 -5572248 -20771469
45230 -20771469 -25592215 -16828260 -6067537 -4195516 -8597279 -9632765 -4921765 -1074682
45222 -1074682 -3389996 -10246399 -17726462 -24007249 -27935334 -28466107 -27602815 -29286926
45214b9286926l636315M14624P300135R011912N329455M326231R202420J3232901
45206A5894437J0622208M161718j777552p493055j1869595q859311J790224P971307
45198A0440381K17884j2110688j2235315n35068O675101L085255Q14229P418866
45190C770645J0594186j976465j9265294j9936324l363656R760036P927290K885630
45182i603952P508010J4583049R311255o023563j3520743l493110J4200282K3356912
45174C6318140J7718511K700874j2030957j9077473j7454127j2845664j0782165
45167a5452861r333970k700476Q355019J5774203J5106732J0797640Q112132N995844
45159C6654263J687947l153288n560031o039542n959933m553553k646230m117590
$$ plain form
45214 -29286926 -32923241 -32508617 -25208482 -16196570 -10867115 -6540884 2661536 15894437
45206 15894437 26516645 30678363 28900811 21407756 9538161 678850 2469074 10440381
45198 10440381 10658265 -1452423 -13687738 -14222806 -7547705 -4462450 -3648221 3770645
45190 3770645 14364831 12388366 -6876928 -26813252 -30176908 -20416872 -12489582 -9603952
45182 -9603952 -2095942 12487107 21798362 15774799 2254056 -1239054 12961228 36318140
45174 36318140 54036651 56737525 44706568 25629095 8174968 -4670696 -15452861
45167 -15452861 -24786831 -27487307 -19132288 -3358085 11748647 22546287 30658419 36654263
45159 36654263 38342210 35188922 29628891 23589349 17629416 13075863 10429633 6312043
45151F312043q575091q457957k14591P544389N913945L52081J932836P472321
45143A2279976K913150j2569285k1098532j0916322N998294J0592332J880882
45136a0919505n520776l231429L148754O169681N793748N140408M754067L739867
45128I074815J792590j531038n721984o955246j485009P154907R130588j74358
45120A1285265j2664167j5671545o769463L277565L426652m514229q521381j541225
45112c1692528R533789J2399365M651866l559458k533526N332511R405544L847507
45104G385070o662506j3545347j3160164p921973j487055L985819O457424L930689
45096b1018043k052478n742971l652916L26086J019767J324843Q014119J8028289
$$ plain form
45151 6312043 -2263048 -10721005 -10935596 -3391207 2522738 2874819 4807655 12279976
45143 12279976 15193126 2623841 -18474691 -29391013 -23392719 -12800387 -10919505
45136 -10919505 -16440281 -19671710 -16522956 -10353275 -4559527 580881 5334948 9074815
45128 9074815 10867405 9336367 3614383 -3340863 -4825872 2329035 11459623 11285265
45120 11285265 -1378902 -17050447 -23819910 -20542345 -17115693 -21629922 -30151303 -31692528
45112 -31692528 -22158739 -9759374 -5107508 -8666966 -11200492 -5867981 3537563 7385070
45104 7385070 722564 -12822783 -25982947 -33904920 -35391975 -31406156 -24948732 -21018043
45096 -21018043 -23070521 -28813492 -32466408 -32140322 -31120555 -29795712 -21781593 -3753304
45088c753304J8921278P358258k894342J70176Q566515O629277m629614r863981
45080B0504263l633018K969624J136642m627529p724820q248461o099979J061105
45072d662173P189067j60445j8314045k4585220n909160J8940175K2706807N938726
45064A143732q067904q484427o728491j1605842j4935773p969104L406933Q507145
45056d4733731O458914L052544O54458j451138j950022J079257O647015J2194215
45048a8048488J5452372J3719545N949357l180584o566568l415393N80569K216052
45040F706862L124009K664350k490037q995776o990111M863938J3573144Q772344
45032B1228723k170741n415874r81821m52888p358682j2096427p529296J005358
$$ plain form
45088 -3753304 15167974 22526232 19631890 19802066 28368581 34997858 30368244 20504263
45080 20504263 16871245 19840869 20977511 16349982 8625162 376701 -5723278 -4662173
45072 -4662173 2526894 2366449 -15947596 -40532816 -46441976 -27501801 -4794994 1143732
45064 1143732 -6924172 -15408599 -22137090 -33742932 -48678705 -56647809 -53240876 -44733731
45056 -44733731 -38274817 -35222273 -34567815 -36018953 -37968975 -36889718 -30242703 -18048488
45048 -18048488 -2596116 11123429 17072786 13892202 7325634 3910241 4490810 6706862
45040 6706862 9830871 12495221 10005184 1009408 -5980703 -1116765 12456379 21228723
45032 21228723 19057982 13642108 12660287 12207399 4848717 -7247710 -14777006 -13771648
45024a3771648M980505L604239O27284k954069o892804p407765k134951L425307
45016b0523902K207475k245836J705263J6489870K8178063K2593372L644610j1707328
45008D0341587j4142118r654163p235011p761038p646652n877946k949123J548456
45000a3376008N874448N678633Q66330k196938Q1306K693538R40797r33279K628878
44991B257705P777870P253512K945190K305142M753550K394972o283069j3549749
44983I855123j3742926q400727j44432Q942721J2761627N900701n439609p915340
44975A817138J019676R913619J0339765N610881o11370j0897162k2790171k4145510
44967b9743134r603723Q506596J5962299J4442641J3204172J2061690N497926
$$ plain form
45024 -13771648 -8791143 -5186904 -4559620 -7513689 -14406493 -21814258 -23949209 -20523902
45016 -20523902 -18316427 -20562263 -18857000 -2367130 25810933 48404305 52048915 40341587
45008 40341587 26199469 16545306 9310295 1549257 -6097395 -11975341 -14924464 -13376008
45000 -13376008 -7501560 -1822927 -956597 -3153535 -3072229 -378691 562106 -371173 2257705
44991 2257705 10035575 17289087 20234277 22539419 27292969 29687941 23404872 9855123
44983 9855123 -3887803 -12288530 -12432962 -3490241 9271386 15172087 9732478 1817138
44975 1817138 2836814 12750433 23090198 28701079 28089709 17192547 -5597624 -29743134
44967 -29743134 -39346857 -30840261 -14877962 -435321 12768851 24830541 30328467
44960C0328467l030062m920454r30863J033660R9493J803541M920269J928402
44952C1232453o972252j2635622j1553113j0112012j1419021r177466K49474R256499
44944b1131060R035202J466138m983921o023383l013813J584040N021752M354496
44936a3690549P89717Q94266Q465853J7390900J7596982P262615n114625j0695809
44928B2899350q763660m696316k654549k229474j039318J442533L142547J620699
44920I721812l369709q752080r291997k004699Q674880J2596028M981469n690648
44912F865056o882270J133930N597052O95232l150405L605897J2134397O736449
44904B6735338j0546067k0602380j3215709M92364N889318L735500L444880O041399
$$ plain form
44960 30328467 27298405 22377951 21447088 22480748 22580241 24383782 29304051 31232453
44952 31232453 24260201 11624579 71466 -10040546 -21459567 -30637033 -30387559 -21131060
44944 -21131060 -12095858 -10629720 -15613641 -21637024 -24650837 -23066797 -18045045 -13690549
44936 -13690549 -12900832 -12006566 -3540713 13850187 31447169 38709784 33595159 22899350
44928 22899350 14135690 9439374 6784825 4555351 3516033 4958566 8101113 9721812
44920 9721812 6352103 -2399977 -11691974 -13696673 -5021793 7574235 12555704 6865056
44912 6865056 -17214 1116716 6713768 7409000 4258595 7864492 19998889 26735338
44904 26735338 16189271 -4413109 -17628818 -17136454 -11247136 -7511636 -4066756 1974643
44896A974643M794228o29682j871036M651765J0678123P274870k262152o784230
44888A7826529k287959M105396N774108N388059P911627J0201809N051351o228808
44880D7742112j3525596j1579626o579383o031183q618526q739855n810638l545289
44872a6687984l548722m472365m625524j739098N892290J4196930J4504871N295351
44864H815749k587418O93806J0158350J3485207Q214079K486879J471115K509326
44856D5247093K274391k46766o480147j4752736j5857131l133070J3495225J5925139
44848C6471998K248986r726710p449861J97370j233490j0355553j4361331q217889
44840a2426480O87292M435882L212155K444755N827893J0736277R273673k949685
$$ plain form
44896 1974643 6768871 6139189 4268153 8919918 19598041 26872911 24610759 17826529
44888 17826529 15538570 19643966 25418074 30806133 38717760 48919569 53970920 47742112
44880 47742112 34216516 22636890 16057507 10026324 1407798 -7332057 -13142695 -16687984
44872 -16687984 -20236706 -24709071 -29334595 -31073693 -25181403 -10984473 3520398 8815749
44864 8815749 6228331 6922137 17080487 30565694 38779773 41266652 42737767 45247093
44856 45247093 47521484 47274718 40794571 26041835 10184704 7051634 20546859 36471998
44848 36471998 38720984 28994274 21544413 21741783 20508293 10152740 -4208591 -12426480
44840 -12426480 -11739188 -7303306 -4091151 -1646396 4181497 14917774 24191447 21241762
44832B1241762j8053344k1336549q290624R124264J6527671J2137674M156012
44825A5506866q23933j358233K047709P169809R434466O142590o1796m975635
44817C3081843p595962q448083o556829j427027M668377Q958793J0050400O498497
44809C9230009j792261r263466q068347J080849P504861L817295n363166j1793014
44801A5352760j3758352j2851070q128744n60479L251867j05272l824151r78648
44793b1602089L815494K302965k927318l125115R49513P48906l650802k206348
44785b5694794P710055J4875217J0312344m535m936236l072193p85418q57579
44777b453139n89164J315239K510608J359299q20331k156444k246519j572028
$$ plain form
44832 21241762 3188418 -18148131 -26438755 -17314491 -786820 11350854 15506866
44825 15506866 14682933 13324700 15372409 22542218 31976684 38119274 38057478 33081843
44817 33081843 25485881 17037798 10480969 9053942 13722319 22681112 32731512 39230009
44809 39230009 37437748 28174282 20105935 21186784 28691645 32508940 27145774 15352760
44801 15352760 1594408 -11256662 -19385406 -19945885 -16694018 -16799290 -20623441 -21602089
44793 -21602089 -17786595 -15483630 -18410948 -21536063 -20586550 -19837644 -23488446 -25694794
44785 -25694794 -17984739 -3109522 7202822 7198287 2262051 -810142 -1595560 -2453139
44777 -2453139 -3042303 -1727064 783544 2142843 1322512 -833932 -3080451 -4652479
44769d652479m52926J297936M159958P804173J0172347R001877M815092J123165
44761C3269143O12893J646010k60543o610602j1975219q234167N211463J7649052
44753C1308030J7699838O956984k371800l773447l488859q536847j5066686j4754483
44745G972730p564631o33729K685316N077553P522861O488474K54029o822912
44737A4979691q458339k971977M762886P482522L426265M4384N446118J5404703
44729D0116253J5985545K525732j2205002j5056873r464309o362010o060662j911161
44721G567513L386608Q48123o424776m160816J0254426K0372722J2904446m247423
44713D0500823j4342891j2942624p565762l307907P32461L920890K781116k128044
$$ plain form
44769 -4652479 -5105405 -3807469 352489 8156662 18329009 27330886 32145978 33269143
44761 33269143 33882036 35528046 35267503 28656901 16681682 8447515 13658978 31308030
44753 31308030 49007868 55964852 53593052 49819605 46330746 37793899 22727213 7972730
44745 7972730 408099 -225630 2459686 7537239 15060100 21548574 21802603 14979691
44737 14979691 6521352 3549375 8312261 15794783 19221048 19265432 24711550 40116253
44729 40116253 56101798 58627530 46422528 31365655 21901346 15539336 9478674 7567513
44721 7567513 10954121 11802244 5377468 1216652 11471078 31843800 44748246 40500823
44713 40500823 26157932 13215308 5649546 2341639 3074100 6994990 9776106 7648062
44705G648062m517550L42536R520050J4877445J0874819J18278q668871q854786
44697B1339983j637836O853317J1687333J0501411K820609p366947j1829543o996233
44689B5372094P0394J133208j238532K79672L179049j529929j2107082j5654761
44681d95887p578835J436179K723539J484845M515966P822543N718611K510838
44673A8137799M505364P879655N446210k31719j386984J594466K154954q5274
44665C8014471L03779L269701K742667k159191m592044p33904M024560K392419
44657D3262458n888464j4431003j6687047j1228581k375214M447915Q097546J0395547
44649A5593157J0600972O960481L609257O837520J1949014N198831j4655289k8431330
$$ plain form
44705 7648062 3130512 3473048 12993098 27870543 38745362 38863640 30194769 21339983
44697 21339983 19702147 26555464 38242797 48744208 51564817 44197870 32368327 25372094
44689 25372094 25442488 26575696 25337164 25616836 28795885 27265956 15158874 -495887
44681 -495887 -8074722 -6638543 -3915004 -2430159 2085807 9908350 15626961 18137799
44673 18137799 22643163 30522818 35969028 35737309 34350325 35944791 38099745 38014471
44665 38014471 38318250 41587951 44330618 42171427 37579383 36845479 40870039 43262458
44657 43262458 37373994 22942991 6255944 -4972637 -7347851 -2899936 5197610 15593157
44649 15593157 26194129 33154610 36763867 43601387 55550401 60749232 46093943 17662613
44641A7662613k0603528j089071R896830R386653Q164545P812492J530939n816336
44633B6945137j245182J0858179R557165r315923k2130224j1473924P714868J1786899
44625B2696995K712228n20941N635924O980234k021971r670547o646007J930813
44617B1096728P796116R920376R307995M542410k493420n529212l260295j956938
44609C9423760m809212o804968m484613k105863k461819l05173P524423J3499539
44601C9476074J0506715M713317N651854Q498616O47182j5285590k0893645q410040
44593B4904483O794158Q236416P55091n04339N406263O182567k043527q791982
44585D0939130o516615j408066k267604p656402r812702n225405L692800J2564858
$$ plain form
44641 17662613 -2940915 -4029986 5866844 15253497 23418042 31230534 32761473 26945137
44633 26945137 25699955 36558134 46115299 36799376 14669152 3195228 10910096 22696995
44625 22696995 25409223 24888282 30524206 37504440 35482469 25811922 19165915 21096728
44617 21096728 28892844 38813220 48121215 52663625 50170205 44640993 41380698 39423760
44609 39423760 34614548 27809580 23324967 21219104 18757285 18452112 25976535 39476074
44601 39476074 49982789 54696106 60347960 68846576 69493758 54208168 33314523 24904483
44593 24904483 31698641 39935057 40690148 40185809 45592072 51774639 49731112 40939130
44585 40939130 34422515 33014449 30746845 23090443 13277741 8052336 11745136 24309994
44577B4309994J6250655J0733760j310575j0358497r956179l818445Q57597L372645
44569C0080955P512525J2439277J2164886M063916o992407j3808660j3209399
44562C2251093p429280j933952j179781l678017k321695O829078J6888923J5924415
44554E5350784J604430j3777373j5739486l415556R708150J0711273O63150q273715
44546C6831657p699663j453813J914562J029497J351742M911357O693707K448922
44538D6027968m959019r124577o433490K094109J0948995J1678761N39647j3471755
44530C7300639j5186488j497185J3529318J6003704P658813j327835o849262r940786
44522C9690918q523136j217649M829393J729831n516019m960703L235921O239410
$$ plain form
44577 24309994 40560649 51294409 49983834 39625337 29669158 25850713 26708310 30080955
44569 30080955 37593480 50032757 62197643 66261559 59269152 45460492 32251093
44562 32251093 24821813 22887861 21708080 18030063 15708368 22537446 39426369 55350784
44554 55350784 56955214 43177841 27438355 24022799 33730949 44442222 45105372 36831657
44546 36831657 29131994 27678181 29592743 30622240 31973982 36885339 43579046 46027968
44538 46027968 41068949 31944372 25510882 27604991 38553986 50232747 50772394 37300639
44530 37300639 22114151 20616966 34146284 50149988 57808801 56480966 49631704 39690918
44522 39690918 31167782 29950133 34779526 36509357 30993338 26032635 29268556 35507966
44514C5507966r98559p401367l234622N177754O408828J435061K75504N559637
44506D2730202R471465O424919L50061k676427k939171m546122p844529q721225
44498C2249173m851283R21976M449915M829622L414725J017215j038059R3859
44490D1087143M163753M798044k269907r682071o174368O036606J2478786P616533
44482E8054519K242134L760851K914802q710591k0225972j6262566k113384L623272
44474B3283065k613310o361084L16303Q828378J0778265Q715045O233353J569523
44466E0749538m221700n417094k362112j998795m249127j239482O081790N890638
44458D3233656l761327q155218R20615J0527133P076572k359047l759356K91340
$$ plain form
44514 35507966 34509407 27108040 23873418 29051172 35460000 36895061 37170565 42730202
44506 42730202 52201667 58626586 58976647 56300220 53361049 48814927 40970398 32249173
44498 32249173 27397890 28319866 32769781 37599403 41014128 42031343 40993284 41087143
44490 41087143 45250896 50048940 47779033 38096962 31922594 37959200 50437986 58054519
44482 58054519 60296653 64057504 66972306 58261715 38035743 21773177 19659793 23283065
44474 23283065 20669755 14308671 14624974 23453352 34231617 42946662 49180015 50749538
44466 50749538 46527838 41110744 38748632 36749837 32500710 31261228 37343018 43233656
44458 43233656 39472329 31317111 32237726 42764859 49841431 47482384 43723028 44014368
44450D4014368k505729j1372200j3770758o121874K023491L644524J596584M91828
44442A8000234J518633M993985R532375J0029940M208773j466732k84097M004544
44434E0537655L719754K27943R4509K223876Q23657j415747L429946J2161659
44426G1803252J1103379l657034j8436419j9417285q870200J091430L354374q31058
44418C6140439p105224j0813475q249784J0686Q490641J2144034J1178563R311096
44410E1106976Q346948N516218l082401j5087853j9704658q439554J1259120K0373312
44402E0288108R862524r060618k0278847k0093489j3440712k821608R138713J4609127
44394A8203198J0211970N365825Q505138J1422064K008454j2954744j5474526
$$ plain form
44450 44014368 41508639 30136439 16365681 10243807 12267298 15911822 17508406 18000234
44442 18000234 19518867 24512852 34045227 44075167 48283940 46817208 46533111 50537655
44434 50537655 54257409 54485352 54579861 56803737 57627394 56211647 59641593 71803252
44426 71803252 82906631 79249597 60813178 41395893 32525693 33617123 36971497 36140439
44418 36140439 29035215 18221740 9971956 9982642 18473283 30617317 41795880 51106976
44410 51106976 59453924 64970142 61887741 46799888 27095230 18655676 29914796 50288108
44402 50288108 60150632 51090014 30811167 10717678 -2723034 -5544642 3594071 18203198
44394 18203198 28415168 33780993 42286131 53708195 55716649 42761905 27287379
44387B7287379m507865K566640k037303o125159k49335P015660N291093o50727
44379B8590383o06984N076390R085259Q562748M610022k615440j1027619j4897154
44371B6777605j1807946n725424K79540O757078J0506834M989334o579316r462672
44363A5735033L327065J9201054K2115797J2653511L117549l80963j260008k881720
44355G1627318m764959n716586m562057p87678J924721j515248p833255o640852
44347D1731404L460682R697753L636728m829320k354229P041779Q323782k280020
44339F4428559j3359405j4522058o598820L093146P842979N272705j18180n42446
44331D5496480M802535Q032080N152422K483739M726431O096820J425105l978590
$$ plain form
44387 27287379 22779514 25346154 23308851 17183692 16934357 23950017 29241110 28590383
44379 28590383 27983399 33059789 42145048 50707796 55317818 52702378 41674759 26777605
44371 26777605 14969659 9244235 9523775 16280853 26787687 31777021 25197705 15735033
44363 15735033 19062098 38263152 60378949 73032460 76150009 75769046 74509038 71627318
44355 71627318 66862359 61145773 56583716 55796038 57720759 56205511 48372256 41731404
44347 41731404 45192086 54889839 58526567 53697247 51343018 58384797 66708579 64428559
44339 64428559 51069154 36547096 29948276 33041422 40884401 46157106 46038926 45496480
44331 45496480 50299015 58331095 63483517 65967256 70693687 76790507 78215612 74237022
44323G4237022n431288q893849j7413947j9119977n292104R568755N783896j0330256
44315B3108252j5414263n220203K204192o20143J05267J1990881K2133634J9879637
44307E8167254J3211311J0799561O246139o170383j6234940j3671852o158503
44300D6188587n631292p515568l61531J1903934J4570511M697098o144886r291848
44292D8415005o144345k25507N479112N037113m355977j3614086j0712943J711183
44284B5589555R071376N739995J562119M888833J0199636P939891j514009r714776
44276E3762620j0775462n395953J869393N664764L435804r19458N8439P919124
44268E5619271J4330111J0120507k708118j1495675o941011M990826Q497856l021268
$$ plain form
44323 74237022 68805734 59911885 42497938 23377961 18085857 27654612 33438508 23108252
44315 23108252 7693989 2473786 4677978 4057835 4163102 16153983 38287617 58167254
44307 58167254 71378565 82178126 88424265 82253882 66018942 52347090 46188587
44300 46188587 40557295 33041727 32680196 44584130 59154641 63851739 57706853 48415005
44292 48415005 42270660 42045153 47524265 52561378 48205401 34591315 23878372 25589555
44284 25589555 34660931 40400926 41963045 46851878 57051514 64991405 63477396 53762620
44276 53762620 42987158 37591205 39460598 45125362 48561166 47641708 47700147 55619271
44268 55619271 69949382 80069889 77361771 65866096 58925085 63915911 72413767 69392499
44260F9392499j6858724j5454252N22070J2021842O797533m849812o220445K251014
44252D7601725O397656N91489n870657m371292K441991Q166685J1196411J1837304
44244G7991312Q643397K367090k193253k611662k418782m633442o357168l865588
44236F6921904P40725K161697j195754n809388o503352j19726J0937069J7978544
44228H5111719J3616920J646332o068680m675491j872850n011233r976548q914698
44220F3855471k832944J141036P76165p34559j974901l325455k705632N70890
44212E4770071M21812q144991j7552474j4751195r4657J1840416J2295890Q010551
44204D6795423P017485O338532R86556m563876l402651J960230M122007K272257
$$ plain form
44260 69392499 52533775 37079523 37601593 49623435 56420968 51571156 45350711 47601725
44252 47601725 53999381 54590870 48720213 44348921 46790912 54957597 66154008 77991312
44244 77991312 86634709 89001799 86808546 84196884 81778102 77144660 70787492 66921904
44236 66921904 67662629 69824326 68628572 62819184 56315832 56196106 67133175 85111719
44228 85111719 98728639 100374971 94306291 89630800 87757950 82746717 72770169 63855471
44220 63855471 61022527 62163563 62939728 62205169 60230268 56904813 54199181 54770071
44212 54770071 55191883 47046892 29494418 14743223 14648566 26488982 38784872 46795423
44204 46795423 53812908 60151440 61137996 56574120 53171469 55131699 59253706 61525963
44196F1525963K60828k485913q673139j4860456j5033656j0500080p000284l729256
44188d95993M598965J5321915J8527322J2059386N716855P092120J1900955J2087763
44180H6809288N587105n649715j9085100k8282114k4142237o029586J3785281
44173B2992922K2371870J8388696Q569242j427390p742512o832758q3246M907423
44165F1144247L331832j158192l845371n132328m734180J010508Q926502O740327
44157F6283345q198117j8170471p627817J1667542J5508340J974285q417359n519596
44149D7500152r86473l726631n331406J415453P906313N406867P23005L351706
44141E6258986Q927887Q805826O174553Q519530J1666580N836864p179462j6154718
$$ plain form
44196 61525963 61786791 59300878 50627739 35767283 20733627 10233547 3233263 -495993
44188 -495993 4102972 19424887 37952209 50011595 55728450 62820570 74721525 86809288
44180 86809288 92396393 86746678 67661578 39379464 15237227 9207641 22992922
44173 22992922 45364792 63753488 72322730 70895340 63152828 56320070 56236824 61144247
44165 61144247 64476079 63317887 59472516 54340188 49606008 50616516 59543018 66283345
44157 66283345 58085228 39914757 32286940 43954482 59462822 61437107 53019748 47500152
44149 47500152 46513679 42787048 37455642 38871095 46777408 52184275 52907280 56258986
44141 56258986 65186873 73992699 80167252 88686782 100353362 106190226 99010764 82856046
44133H2856046j6419262j2053273n712386J760506M802013r01289p642599l907614
44125D2782142P056158J0094263P75922q167900o523997m5449J736165P3943R39439
44116D8720686K350332k326285j1682542j5344521o377532R704315J9584747J5056846
44108E9686046J450845p796261o099517l07051O23615j426117Q57427O057815
44100E3046802O130886J729581K863812J1348222J5042257O215328m933246m339521
44092H7104121N895254J1520608N412734o533215j5638880j7871600j3068177
44085E6820845m818165j80017k752269p152803o412701k492005k051996l997020
44077B6963869o96686Q156214J2643103O600953l459538p669241m853810o70045
$$ plain form
44133 82856046 66436784 54383511 48671125 50431631 55233644 54332355 46689756 42782142
44125 42782142 49838300 59932563 60708485 52540585 46016588 45971139 47707304 47781247 48720686
44116 48720686 51071018 48744733 37062191 21717670 15340138 25044453 44629200 59686046
44108 59686046 61136891 53340630 47241113 46934062 47557677 46131560 46988987 53046802
44100 53046802 59177688 60907269 63771081 75119303 90161560 96376888 91443642 87104121
44092 87104121 92999375 104519983 109932717 103399502 87760622 69889022 56820845
44085 56820845 52002680 51822663 49070394 41917591 35504890 33012885 30960889 26963869
44077 26963869 26267183 34423397 47066500 53667453 50207915 42538674 37684864 37014819
44069C7014819J467419K573433M055576N710629O502907N244886K118766J58170
44061F4846605K114774N298994M064825j088051k274325M828218J3840515J5755892
44053A07387447R946629K457228k806831n855366o985167p409344j0793840j7542267
44045F8398489j9667034r109210R198558K0312237J6424891M163274o313857j1660249
44037G1747099j2211849p038842K028609P577698M719153j621939l599128j620282
44029E9980519k417321p971840j2677723j1126295l711632N328744J1444729J1991453
44021E0840634Q545591N906450N702642L781496j788467m351298K198137J0818961
44013H1654146P941821o852134j7889225j3474326k22300P433139M615406k935552
$$ plain form
44069 37014819 38482238 41055671 45111247 50821876 57324783 62569669 64688435 64846605
44061 64846605 66961379 72260373 76325198 75237147 72962822 77791040 91631555 107387447
44053 107387447 117334076 119791304 116984473 111129107 104143940 96734596 85940756 68398489
44045 68398489 48731455 39622245 48820803 69133040 85557931 89721205 83407348 71747099
44037 71747099 59535250 52496408 54525017 62102715 66821868 65199929 61600801 59980519
44029 59980519 57563198 49591358 36913635 25787340 22075708 27404452 38849181 50840634
44021 50840634 59386225 65292675 70995317 74776813 72988346 68637048 70835185 81654146
44013 81654146 89595967 82743833 64854608 51380282 51157982 58591121 63206527 60270975
44005F0270975q973784j0879649p502560L39227Q513763J2948269J2959803R305324
43997G6981368K735237l203648l447714P30269J252892m409360p410835j290776
43989F1937433N555217J654391q458351r917502n28520N710035P8067q733597
43981D7297173r003752j753590M617807O910220O661090L665952j731690m070923
43973E2592287J458376J0605794J3993239Q544988p8479n464461o275691m782244
43965G0593809l622083l890571l747232K60857Q292764J5269823J6198468J1466579
43957A10822414M582072k424578q186165r974468p163726m250969n263794p040352
43949G1100434l795814K833584M865238m99821o715843p037709k485166J577995
$$ plain form
44005 60270975 51297191 40417542 32914982 33254209 41767972 54716241 67676044 76981368
43997 76981368 79716605 76512957 73065243 73795512 75048404 70639044 63228209 61937433
43989 61937433 67492650 69147041 60688690 50771188 50242668 55952703 56030770 47297173
43981 47297173 38293421 36539831 41157638 48067858 54728948 58394900 56663210 52592287
43973 52592287 54050663 64656457 78649696 87194684 87116205 81651744 75376053 70593809
43965 70593809 66971726 63081155 59333923 59594780 67887544 83157367 99355835 110822414
43957 110822414 115404486 112979908 104793743 94819275 87655549 83404580 78140786 71100434
43949 71100434 67304620 70138204 75003442 74503621 67787778 60750069 58264903 59842898
43941E9842898K086365r37688n573998p007902j25498J2498124J9092804J0837499
43933I0712604o335497j7269034j3959715j783056R327449J3869012J0821125
43926H5382888J796256p648418j0252669n050231N48340Q47700J14471N000566
43918G0738903J1973286J0440132j677341j3657350j5811398j0633130o238546
43911D5134556n038559m577449m436263m909991j923591Q434332K0855406K4197245
43903G7735686J5464452L835005j529881j669219k751503o602357j0920002j4334382
43895E9227799j5395030r582466N532082K2350549K7382664J6200062l66664q879843
43887I6469153q822137r922814j5232101j4764647k59036J9754102K8064950K0370517
$$ plain form
43941 59842898 61929263 60991575 55417577 48409675 48284177 60782301 79875105 90712604
43933 90712604 84377107 67108073 53148358 51365302 60692751 74561763 85382888
43926 85382888 87179144 79530726 69278057 64227826 64776166 65623866 65738337 70738903
43918 70738903 82712189 93152321 91474980 77817630 62006232 51373102 45134556
43911 45134556 40095997 35518548 31082285 26172294 24248703 32683035 53538441 77735686
43903 77735686 93200138 97035143 95505262 93836043 91084540 84482183 73562181 59227799
43895 59227799 43832769 34250303 39782385 62132934 89515598 105715660 105348996 96469153
43887 96469153 87647016 77724202 62492101 47727454 47468418 67222520 95287470 115657987
43879A15657987R447511O123455O166551J761074l709229k748493J000241k073510
43871A31625587r633605r076141J385754P598143P42623r056762q603216m04620
43863A04577763M538400M032512K974550O99039o632594j3966677j0973204J974241
43855H7224030J2874400J4523355J1281260P482686M74580r868184j4932875q713938
43847A00345314J270371K991719l658416p409858j530085P760793J0338146N133789
43839A15241773Q66102M457047J1075767Q724437n920399j9979616j8042241j885818
43831I4537052J0737461Q296191j340034l966166K053833P056334N370567Q09818
43823A23555056j250935O75186O326015J3709665J6184011P181316r381845j9965464
$$ plain form
43879 115657987 125105498 131228953 137395504 139156578 135447349 132698856 133699097 131625587
43871 131625587 121991982 112915841 114301595 121899738 122642361 113585599 104982383 104577763
43863 104577763 109116163 113148675 116123225 116822264 110189670 96222993 85249789 87224030
43855 87224030 100098430 114621785 125903045 133385731 133860311 123992127 109059252 100345314
43847 100345314 101615685 104607404 100948988 93539130 92009045 99769838 110107984 115241773
43839 115241773 116107875 120564922 131640689 140365126 134444727 114465111 96422870 94537052
43831 94537052 105274513 113570704 112230670 108264504 110318337 117374671 122745238 123555056
43823 123555056 122304121 122979307 129305322 143014987 159198998 166380314 156998469 137033005
43815A37033005j6496007n224778L284384O965663R239325Q915030K198014p553229
43807A38361407j1922841j0062509r897031j3908158j3213278k007517J0081799
43800H7431872R470624j858112q356061j293190J2100409K0378992J9957309J3579935
43792A51411778N339857O82277L328283P567435J646502j4652522k3724898j1293309
43784A20305403J1522933J9620681O226708q918986o858804O588200J1653749
43777A60139884J588341j1434166j4742305r378462l634947k05989L942023P992711
43769A34267090N131677p441504k0814376k1641961o708734J3118179K3560429
43762A19470800J8943743M502319q870948j1874404m047958M304676K290947p364966
$$ plain form
43815 137033005 120536998 115312220 118596604 125562267 134801592 143716622 145914636 138361407
43807 138361407 126438566 116376057 106479026 92570868 79357590 77350073 87431872
43800 87431872 96902496 95044384 86688323 85395133 97495542 117874534 137831843 151411778
43792 151411778 156751635 157433912 160762195 168329630 169976132 155323610 131598712 120305403
43784 120305403 131828336 151449017 157675725 148756739 141897935 148486135 160139884
43777 160139884 161728225 150294059 135551754 126173292 122538345 122332356 126274379 134267090
43769 134267090 139398767 131957263 111142887 89500926 82792192 95910371 119470800
43762 119470800 138414543 142916862 134045914 122171510 118123552 122428228 124719175 117354209
43754A17354209j0276654j61574J0504037O751987p626547j5120375q522858R27970
43746I3830195R52227n866243q334948k489537M630323M715431k230781q001147
43738G7205520n121961M236622J0220368P590063K119021R19741J485863k301959
43730I6353278p357666m945470M215543R676982P173345L378829K116296j781401
43722A08829736r282033j0173240J478867J4683746J5311248N418887k268563
43715A23998648l205773k280155q57819L641031O895204P18185j1282548j4406503
43707A03220270l835659O727665M268439n271164o796649K570204J1945449J3192318
43699A26020873R044778M784875O82499m197118p017816m929268p37700j30057
$$ plain form
43754 117354209 107077555 106915981 117420018 124172005 116545458 101425083 92902225 93830195
43746 93830195 94782422 88916179 80581231 78091694 82722017 87437448 85206667 77205520
43738 77205520 72083559 76320181 86540549 94130612 96249633 97169374 98655237 96353278
43730 96353278 88995612 84050142 88265685 97942667 105116012 108494841 110611137 108829736
43722 108829736 99547703 89374463 90853330 105537076 120848324 126267211 123998648
43715 123998648 120792875 118512720 117654901 121295932 128191136 128909321 117626773 103220270
43707 103220270 99384611 106112276 110380715 105109551 98312902 100883106 112828555 126020873
43699 126020873 135065651 139850526 140533025 136335907 129318091 124388823 123651123 123521066
43691A23521066m045080p527977o341608j450963L966759Q661494J2124958J1863423
43683A40772072N668077l745258r415163o238197M657701J6800880K2363201J7500449
43675A88363762O579476j030037j883102l306106j2011789k1139454j7579176
43668A37993574j836019R895853O860357k647468m615507J910303P139410N628932
43660A60329435L73871m800331q779396j0382274q439964m212407L19728M987290
43652A29395952R309557J1139465J0508773J0314351R969301M720190m334312
43645A81023277p643375j376992M501190J555309k614766K538269J0958661R152517
43637A98094090n65362l771994J434398K341702m949937r047571m251168J82008
$$ plain form
43691 123521066 119475986 111948009 105606401 104155438 108122197 116783691 128908649 140772072
43683 140772072 146440149 142694891 133279728 127041531 131699232 148500112 170863313 188363762
43675 188363762 194943238 193913201 192030099 188723993 176712204 155572750 137993574
43668 137993574 136157555 146053408 152913765 150266297 145650790 147561093 154700503 160329435
43660 160329435 160703306 155902975 147123579 136741305 128301341 124088934 124408662 129395952
43652 129395952 138705509 149844974 160353747 170668098 180637399 185357589 181023277
43645 181023277 173379902 172002910 176504100 178059409 175444643 177982912 188941573 198094090
43637 198094090 197528728 193756734 195191132 197532834 192582897 183535326 179284158 179466166
43629A79466166j965560l970487k240940n155770j5408130j9800350r770099K293281
43621A23448111K083841m017725j959237N309225M890916k228408m162744k56229
43613A23107750l77261m010083l9364J1104691J4182847L005016q914294q520416
43605A29538886m99148L253750M30431l192690l716781j025331K881882L534496
43597A31205495j358609n327666l44735Q172926N902259p415310j3887069l463133
43589A13484158J0329525J1364600M489899L826108P949662M198975p877087j5293094
43581A32472746j2772046q851101r040109p400277P08661R297718J0766309N601144
43573A20783045j542557q032513j1750454j0522109o647658n298355n511336l69888
$$ plain form
43629 179466166 177500606 173530119 171289179 166133409 150725279 130924929 121154830 123448111
43621 123448111 125531952 121514227 119554990 124864215 129755131 127526723 123363979 123107750
43613 123107750 122730489 118720406 118681042 129785733 143968580 146973596 138059302 129538886
43605 129538886 129039738 132293488 132723919 129531229 125814448 124789117 127670999 131205495
43597 131205495 129846886 124519220 124174485 132347411 138249670 130834360 116947291 113484158
43589 113484158 123813683 135178283 139668182 143494290 151443952 155642927 147765840 132472746
43581 132472746 119700700 110849599 101809490 94409213 95117874 104415592 115181901 120783045
43573 120783045 119240488 111207975 99457521 88935412 82287754 76989399 71478063 71108175
43565G1108175J0496382J7174578J3314836N407888J770394L94345l712465o387520
43557A09566613r49892P163025N222029p083636j4401081n894928J0181619J7482986
43549A21286735J1129955L23505n130398m617515l013970j982921J547814Q475397
43541A28018602J2649760P159897m783491j0966522n135047M533262O980908L113765
43533A41571134J347756K281898j324000r469327j1457208j680176J0390929J1954542
43525A43615548J988666j0805204j8913950j9002249j0104177L735781J3200235
43518A03714650J3217202R458906R015080R044952L049963n236286m952554N128952
43510A42440865J3158278J0044371O81910l959075L41540R275791J5610769J3498000
$$ plain form
43565 71108175 81604557 98779135 112093971 117501859 119272253 119666598 115954133 109566613
43557 109566613 108616721 115779746 121001775 113918139 99517058 93622130 103803749 121286735
43549 121286735 132416690 132740195 127609797 122992282 119978312 117995391 119543205 128018602
43541 128018602 140668362 147828259 143044768 132078246 126943199 131476461 138457369 141571134
43533 141571134 142918890 145200788 143876788 134407461 122950253 121270077 131661006 143615548
43525 143615548 145604214 134799010 115885060 96882811 86778634 90514415 103714650
43518 103714650 116931852 126390758 135405838 144450790 147500753 142264467 137311913 142440865
43510 142440865 155599143 165643514 166325424 162366349 162707889 171983680 187594449 201092449
43502B01092449K059882j1883832j8114752j2675733q72531R683860J4940340
43495A84229683J3300852M908072n608031j0955943q809394l841977p05941K40242
43487A72757563p40454m022484o029104j123177P936343R500551r25737j1662042
43479A65691459r820752J069761P690800N804388J491352k663780r409129j5212189
43471A44641910j0838022K296768Q591507j375807j6065969j7731305n821230
43464A03697852M461164L957076o46403L20814O029610Q929438O250290K094982
43456A35094823L62592N91897P71244M62775q733q28877j537762n10424K421746
43447A36819281M161397J547987m212339q729567r817428q945987o948969j731074
$$ plain form
43502 201092449 203152331 191268499 173153747 160478014 159605483 169289343 184229683
43495 184229683 197530535 202438607 196830576 185874633 177065239 173223262 172517321 172757563
43487 172757563 172017109 167994625 161965521 160842344 168778687 178279238 177353501 165691459
43479 165691459 155870707 156940468 164631268 170435656 171927008 169263228 159854099 144641910
43471 144641910 133803888 136100656 144692163 143316356 127250387 109519082 103697852
43464 103697852 108159016 112116092 111469689 111790503 117820113 126749551 132999841 135094823
43456 135094823 135457415 136049312 136820556 137283331 137274598 136445721 134907959 134397535 136819281
43447 136819281 140980678 142528665 138316326 129586759 119769331 110823344 103874375 102143301
43439A02143301P303349J4690116J2683583P16819j1152658j1235052N15195J0767737
43431A26432390P502637n105760j1828054o569376M28165n79400l823072J014759
43423A07472289R877501R889671J102452k572481M222661J0129547O387675n5551
43415A46453764n05241J726029J436078K946039R107074J0083153k080243j6523975
43407A52642678j7351904p546741k204298l563672j689140L491538J869374n101861
43399A20545974m083659N098325N815107o729951j4486191n423072O290824M225386
43391A11252743l168912J556231J4259687J6081893M557029l335110J513422Q432488
43383A51149471N576647l986597r727649p010814J286655Q928599R077519o22170
$$ plain form
43439 102143301 109446650 124136766 136820349 137537168 126384510 115149458 115664653 126432390
43431 126432390 133935027 128829267 117001213 110431837 110860002 110280602 106457530 107472289
43423 107472289 117349790 127239461 128341913 125769432 129992093 140121640 146509315 146453764
43415 146453764 145948523 147674552 149110630 152056669 161163743 171246896 169166653 152642678
43407 152642678 135290774 127744033 125539735 121976063 120286923 123778461 125647835 120545974
43399 120545974 116462315 121560640 127375747 120645796 106159605 100736533 107027357 111252743
43391 111252743 108083831 109640062 123899749 139981642 144538671 141203561 142716983 151149471
43383 151149471 156726118 152739521 143011872 136001058 137287713 146216312 155293831 154671661
43375A54671661j3249640j8189354j3146360o082841m483710p162974p464186
43368H4892596j126430R193588J5273718J1367894K961010K767514J4034613K3886760
43360A63251263J9824485O818746r38549j75588O55652k489479m764324l660522
43352A78521684k684036k446799O03921M244479N52174j0118685j5832457r326373
43344A43513908J535478N894596M523058N007073Q539553R587124N492384j94756
43336A83898418k631050j55810M249133M018374m827521j6569201j9628672j0380409
43328A37973262J702089N858524J895101l451817o488605p621474o688361l153443
43320A20025276J203557M223288O073434O896450M815363m8668k680497J289136
$$ plain form
43375 154671661 141422021 123232667 110086307 104003466 99519756 92356782 84892596
43368 84892596 83766166 92959754 108233472 119601366 122562376 125329890 139364503 163251263
43360 163251263 183075748 189894494 188955945 188780357 189436009 186946530 182182206 178521684
43352 178521684 175837648 173390849 173994770 178239249 178791423 168672738 152840281 143513908
43344 143513908 145049386 150943982 155467040 160474113 169013666 178600790 184093174 183898418
43336 183898418 181267368 181111558 185360691 189379065 184551544 167982343 148353671 137973262
43328 137973262 139675351 145533875 147428976 143977159 137488554 129867080 123178719 120025276
43320 120025276 121228833 125452121 131525555 138422005 143237368 143188700 140508203 141797339
43312A41797339Q960378J2649729P844069l100364j2923470j4130323n650566
43305A35446792L754894L867487l172041m012637P065646J7806250J3468125k899430
43297A71325086j4499853j2521075n142255m681569j2798982k0580753j9282036
43290H1818563q875086K981572R938979J3533413J7858683J9660005J1273955
43283A48190084n359828j6829350j4992768p086435l210841k705896r57570n37552
43275I6509844m573502o834806j493063L331058l537512j6043991j7500821n635842
43267D4221365N596823R400540J3528489K0931936K1089755Q518974n204488p777998
43259A10305396k703404j71458k071609n358772j0273306j5396007j3794551m206454
$$ plain form
43312 141797339 150757717 163407446 171251515 168151151 155227681 141097358 135446792
43305 135446792 139201686 143069173 139897132 135884495 142950141 160756391 174224516 171325086
43297 171325086 156825233 144304158 139161903 134480334 121681352 101100599 81818563
43290 81818563 72943477 75925049 85864028 99397441 117256124 136916129 148190084
43283 148190084 142830256 126000906 111008138 103921703 100710862 98004966 97047396 96509844
43275 96509844 91936342 85101536 83608473 86939531 83402019 67358028 49857207 44221365
43267 44221365 49818188 59218728 72747217 93679153 114768908 123287882 118083394 110305396
43259 110305396 107601992 107430534 105358925 100000153 89726847 74330840 60536289 56329835
43251E6329835K695952m34976m965095l16552Q154267Q846834M047890N021319
43243G9379474J1939765J4671093J0902009P489460M671953m605573j7937439
43236A06510742k2054416j2597324j116457L349433O460850J4849187K1953693
43229A17355708J7510698L402183r332688j4382572j3692204j1207835r302846
43222H0350444q314931n444721K292445J1531402J4606236J0752661P772482Q547997
43214A22094015M921272p883958j9077912j4811329J898593J3980174J1060116
43207A12180971r78430r654512p499459M759434J9260771K5381751J8851254O364935
43199A68666715k473847m930178k858468L439258J1340786J1566419r80363j4976571
$$ plain form
43251 56329835 59025787 58590811 53625716 53309164 61463431 70310265 74358155 79379474
43243 79379474 91319239 105990332 116892341 124381801 129053754 124448181 106510742
43236 106510742 84456326 71859002 70742545 74091978 80552828 95402015 117355708
43229 117355708 134866406 138268589 128935901 114553329 100861125 89653290 80350444
43222 80350444 72035513 66590792 68883237 80414639 95020875 105773536 113546018 122094015
43214 122094015 127015287 119131329 100053417 85242088 87140681 101120855 112180971
43207 112180971 111202541 101548029 94048570 98808004 118068775 143450526 162301780 168666715
43199 168666715 166192868 161262690 158404222 161843480 173184266 184750685 183770322 168793751
43191A68793751j4014155M7279Q243020J234369q689114p760939K916K772557
43183A50629684j77428j284915r7514l206031j0685305j3796517p545174K877581
43175A16714381J0491223J4650947J7445147J6954125R018930n343808j7886594
43168A62044351k0283267j2983283n059437l621034n160865j138573Q760090J4859663
43160A37417645J0698150J860020k472669j603969j281916l438834m852540m307668
43152A32018219m346798n850884o396195m416487l16381O409268J5679517K1833408
43144A54613667J6412582q61120j8210151k2872212j4082621k281261K977962
43137A15696846J604417J21488K681966O129391M147833m246698j2237816j2637146
$$ plain form
43191 168793751 154779596 154826875 163069895 164304264 155615150 147854211 147857127 150629684
43183 150629684 150452256 149167341 149069827 145863796 135178491 121381974 113836800 116714381
43175 116714381 127205604 141856551 159301698 176255823 185274753 179930945 162044351
43168 162044351 141761084 128777801 123718364 120097330 114936465 113797892 122557982 137417645
43160 137417645 148115795 149975815 147503146 145899177 144617261 141178427 136325887 132018219
43152 132018219 127671421 121820537 115424342 111007855 110691474 117100742 132780259 154613667
43144 154613667 171026249 170165129 151954978 129082766 115000145 112718884 115696846
43137 115696846 117301263 117422751 120104717 126234108 130381941 126135243 113897427 101260281
43129A01260281o270512n85693o30535l985419m792473q86798L674959K938021
43121I0721831l334427p148102j098944R803249J1424315n88779j2161196q709411
43113G8908536L961059P719314j714093r946454o476182J734875M580244L905592
43105H2672891N226282M826759k667758j0376929o284394P723633J5959774Q957431
43097A06037689o118236j6429530j6352878p675432M582651J2851304J0396683
43090H7292251r39747j0276937q828787R30346R273402R544577K931545l907111
43082H6019539m319894K410708R387287R046208K200065l296744k993826k83614
43074I8169729M02293n43297q55597q1795K327980P740493J4149039J6018162
$$ plain form
43129 101260281 94989769 94404076 93773541 89788122 84995649 84108851 87783810 90721831
43121 90721831 87387404 80239302 79140358 88943607 100367922 99779143 87617947 78908536
43113 78908536 82869595 90588909 88874816 78928362 72452180 74187055 78767299 82672891
43105 82672891 87899173 92725932 90058174 79681245 73396851 81120484 97080258 106037689
43097 106037689 99919453 83489923 67137045 59461613 64044264 76895568 87292251
43090 87292251 86352504 76075567 67246780 68177126 77450528 86995105 89926650 86019539
43082 86019539 81699645 84110353 93497640 102543848 104743913 101447169 98453343 98169729
43074 98169729 98572022 98028725 97173128 97091333 99419313 107159806 121308845 137327007
43066A37327007J1589005N612695J630271k679892q282531r895330n105157j896107
43058A28299961p700241j5590915j2518267J013981J1529694J2680027J1829459
43051A29543699J3865182J1943632J436468q336387o484805L145615Q627180P243397
43043A60983981N245910M515394J274433l787310n882031o341151j0707078j5849505
43035A29452643j1932875l59574M164524l790261r342593L70983J4632850J4615154
43027A37810851K103145m631750M02117N139153K910186K300703Q000985R943613
43019A63979003J694307n926320l109214R9527r796528k3786294k0777407l13741
43011A02063333J5465450J3955517O863679P224231R455866K831053q776277j3553569
$$ plain form
43066 137327007 148916012 154528707 156158978 153479086 145196555 135301225 130196068 128299961
43058 128299961 120599720 105008805 92490538 93504519 105034213 117714240 129543699
43051 129543699 143408881 155352513 156788981 148452594 141967789 145113404 153740584 160983981
43043 160983981 166229891 170745285 172019718 168232408 162350377 156009226 145302148 129452643
43035 129452643 117519768 117160194 121324718 117534457 108191864 108562847 123195697 137810851
43027 137810851 139913996 135282246 135684363 140823516 143733702 146034405 154035390 163979003
43019 163979003 165673310 159746990 156637776 156737303 146940775 123154481 102377074 102063333
43011 102063333 117528783 131484300 138347979 145572210 155028076 157859129 149082852 135529283
43003A35529283r638768m301569j002732J802626L162891J115344j220518L7698
42995A25484255J841671r08568n943311p632586p082872q872820j0790641p144094
42987G8951034J19544M548691P134571J2684540J6039819P020307r893570j7179424
42979I9425512r645648j647448k382259j570698R137075J7421861R551144m496242
42971A15793297m910082O811187J1192782J637630q657661j0867050j1370030
42964I9630073j4006585j0307783L570898J5003441J1422572j160274p080803
42957I7071539j986121M765434M530314j943401q173447q628599l106751K732087
42949H5261055L388330O33817K53931K180934J229172j906664j68979O541287
$$ plain form
43003 135529283 125890515 121588946 120586214 122388840 125551731 126667075 125446557 125484255
42995 125484255 127325926 126417358 120474047 112841461 105758589 96885769 86095128 78951034
42987 78951034 79070578 83619269 90753840 103438380 119478199 126498506 116604936 99425512
42979 99425512 89779864 88132416 85750157 84179459 93316534 110738395 120289539 115793297
42971 115793297 110883215 117694402 128887184 130524814 121867153 111000103 99630073
42964 99630073 85623488 75315705 78886603 93890044 105312616 104152342 97071539
42957 97071539 95085418 99850852 104381166 102437765 94264318 85635719 82528968 85261055
42949 85261055 88649385 89283202 89537133 91718067 92947239 91040575 90871596 97412883
42941I7412883Q116482m41378j0429376j2697660r827230p517874l862478K983670
42933F3737039N714003j406378r727996p064210L480569Q172564K555168n527197
42925E9933562r690033r452955l772040O677201J2653582N760539n819235n449969
42917E0840652P078032J3695447M404022q848200j0353466m63362R374698J1260763
42909G6988586M280373p751195j6114486j2541387L62460J0852275J2552649Q934058
42901G7563333K763684o742364j4123415r903055K026713M623377o718264j4330002
42893C5160007m835941R583955J0595887J072100l597033p97619J043373J601462
42885D9826191O739775J2065552P362777m441843j0278790p952420p015928q806192
$$ plain form
42941 97412883 105529365 105087987 94658611 81960951 72133721 64615847 60753369 63737039
42933 63737039 69451042 68044664 58316668 51252458 54733027 62905591 65460759 59933562
42925 59933562 50243529 40790574 37018534 43695735 56349317 62109856 56290621 50840652
42917 50840652 57918684 71614131 76018153 67169953 56816487 56353125 65727823 76988586
42909 76988586 81268959 73517764 57403278 44861891 45224351 56076626 68629275 77563333
42901 77563333 80327017 73584653 59461238 49558183 51584896 56208273 49490009 35160007
42893 35160007 30324066 39908021 50503908 51576008 47978975 47181356 48224729 49826191
42885 49826191 56565966 68631518 75994295 71552452 61273662 53321242 46305314 37499122
42877C7499122l622670R612462J8148671J4903889Q058161N376865K901611l817970
42869H9060141r717728r480267o815908o994598q366575p547539n308625k166563
42861C2662338L779761R917888Q968389J070286l156440K176838Q917382P861802
42853G2198244K549876J794210N526888O920812L516118j663997n988514p614370
42845G7239267m215586K734926O715290M471650P85045J56665j53939l149171
42837H4584147m852577j076126M567942O706689O335872N355520k42793j1978910
42829H9399764j9553325j1982774M586714J2045243L377370r436115j1701437
42822E6735440j890554J0138109J3878811O019499o588696j1362932k756234R807677
$$ plain form
42877 37499122 33876452 43488914 61637585 76541474 84599635 89976500 92878111 89060141
42869 89060141 79342413 69862146 63046238 56051640 47685065 40137526 34828901 32662338
42861 32662338 36442099 46359987 55328376 56398662 53242222 55419060 64336442 72198244
42853 72198244 74748120 76542330 82069218 88990030 92506148 90842151 84853637 77239267
42845 77239267 73023681 75758607 82473897 86945547 87730592 87887257 87733318 84584147
42837 84584147 79731570 78655444 83223386 89930075 96265947 101621467 101378674 89399764
42829 89399764 69846439 57863665 62450379 74495622 77872992 68436877 56735440
42822 56735440 54844886 64982995 78861806 84881305 78292609 66929677 64173443 73981120
42814G3981120J2285786L179568o160462p462534m001806k383795l647199n542207
42806F0248471p769563j0937751j3407135j2221326o183253K688827J0008232
42799B2426502J2417919J1219638J0075514P772005j640574j7450705k6766424
42792A8053875j8085754K547203J7102991J6363479P780780K935738M755804Q439626
42784E9893742Q483364K425657p727052j5698199j5576488p340694L723524J1679318
42776C9863172J2230916M312625o458515j0067313l559882L532810J550149n823311
42768C5580651q350277n147623l518337m711862k777689K726631N047062L000292
42760B1848848L716159R207164J1319220N187864k302903l984707l567365p326436
$$ plain form
42814 73981120 86266906 89446474 83286012 75823478 71821672 69437877 65790678 60248471
42806 60248471 52478908 41541157 28134022 15912696 9729443 12418270 22426502
42799 22426502 34844421 46064059 56139573 63911578 62271004 44820299 18053875
42792 18053875 -31879 2515324 19618315 35981794 43762574 46698312 51454116 59893742
42784 59893742 68377106 70802763 63075711 47377512 31801024 24460330 28183854 39863172
42776 39863172 52094088 56406713 49948198 39880885 36321003 39853813 41403962 35580651
42768 35580651 27230374 22082751 18564414 13852552 11074863 13801494 18848556 21848848
42760 21848848 25565007 34772171 46091391 51279255 48976352 44991645 41424280 34097844
42752C4097844j1250629n965662P933475J7647450J2714518k221784j1591779
42745D1363433o013197O202397Q361578l001634j2669947p851475L331445M563189
42737C4285789m061130q666480n732855o122256j2898251j2993383J219977J6788831
42729A820242J7563661O426552j037300J808353P665844Q048777K820918j383000
42721D3734047J749262J0348223J3263837K533824j3753458k0029267j4285594
42714B3560874q642750q230261m749932M925468J0373677N486228j001599j972132
42706A9749573l130449p307212m667332P686147J3427859J698594j1613549p607074
42698H236557M655758M279702o074255p535844J34251k1552q708417p754313O591075
$$ plain form
42752 34097844 22847215 16881553 24815028 42462478 55176996 52955212 41363433
42745 41363433 35350236 41552633 49914211 46912577 34242630 26391155 29722600 34285789
42737 34285789 30224659 21558179 15825324 9703068 -3195183 -16188566 -14968589 1820242
42729 1820242 19383903 25810455 24773155 26581508 34247352 42296129 45117047 43734047
42721 43734047 45483309 55831532 69095369 71629193 57875735 37846468 23560874
42714 23560874 14918124 6687863 1937931 6863399 17237076 22723304 21721705 19749573
42706 19749573 16619124 9311912 4644580 12330727 25758586 27457180 15843631 8236557
42698 8236557 12892315 17172017 11097762 3561918 3696169 3674617 -5033800 -12788113 -6197038
42689f197038J5408478Q612872k84172K90693K468630k064550n809101j043199
42681A1382613M864085K488125m639195q835325r647414p310853J865957J4265059
42673D433052J6848897O468819k219782J153707O556097J795231o788854o628538
42665B1618629m21742O59808l440783m433891j417896M24091J046001K388464
42657A6422681J99865p907624j2600513m816084Q169047J2633110Q578715N140420
42649B5819617J702052q852984k1209371k0663726n911005P994040J1836458J2026973
42641B742054J4810297J5384054Q502870j610311p636667p115103j420990M739636
42633B8395840K782873r691975j8497150o904362J7636244K7093754R365877j4658173
$$ plain form
42689 -6197038 9211440 17824312 17540140 17830833 20299463 18234913 12425812 11382613
42681 11382613 16246698 18734823 14095628 5260303 -4387111 -11697964 -9832007 4433052
42673 4433052 21281949 27750768 25530986 26684693 33240790 35036021 28247167 21618629
42665 21618629 21196887 21856695 18415912 13982021 12564125 12988216 14034217 16422681
42657 16422681 16622546 8714922 -3885591 -8701675 -532628 12100482 20679197 25819617
42649 25819617 27521669 18668685 -2540686 -23204412 -29115417 -21121377 -9284919 2742054
42641 2742054 17552351 32936405 41439275 39828964 32192297 25077194 23656204 28395840
42633 28395840 31178713 21486738 2989588 -3914774 13721470 40815224 50181101 35522928
42625C5522928k0050180r035993o7776J633661M876673J0529378P959156n634676
42617B5733171j7820088j7909673j0567483o331489o277841l700986K755821N778907
42609b8339661M70071o813028n383276N515207J4818647J3803401O951877M174937
42601E198175O645933P680809N296071M681374P577072Q434335M109005r37112
42593D8685662l181772n870778j1090961j3674696r898219n569989p055609r421847
42585a7078209l129373J0403360J9635719J8318597J0994997L069157n190785
42578C7023463j2438413j2851332m220497O048816Q531660K601360m582788p976846
42570A2135423r391923j2445669j5920352j4147476m104186R205182J6758181
$$ plain form
42625 35522928 15472748 6436755 6368979 8002640 12879313 23408691 31367847 25733171
42617 25733171 7913083 -9996590 -20564073 -26895562 -33173403 -36874389 -34118568 -28339661
42609 -28339661 -27869590 -34682618 -40065894 -34550687 -19732040 -5928639 1023238 5198175
42601 5198175 11844108 19524917 24820988 29502362 37079434 45513769 49622774 48685662
42593 48685662 45503890 39633112 28542151 14867455 4969236 -600753 -7656362 -17078209
42585 -17078209 -20207582 -9804222 9831497 28150094 39145091 42214248 37023463
42578 37023463 24585050 11733718 7513221 13562037 22093697 24695057 20112269 12135423
42570 12135423 2743500 -9702169 -25622521 -39769997 -43874183 -34669001 -17910820
42563a7910820J5315137J0080677N932412N85500q784475j6306061j2972235m24134
42555b4483999R676057J1360377J0280005J0652524O637829n527348j5417639
42548C177806j0163848N808919J5131034J0810695L031929R06280P7387n664768
42540B3115434j1387380q952571p51143M467518N005987N790232P650952P020376
42532C1959405M740515N013719N810806Q08138p924984j0232540m138438o32497
42524B5404124o378327j2229039p641790K348528N591075J908143J066191M889571
42516A4958476M941199j319796m951586m04152M601236R26100p634293r821259
42508A295925k746083N337482O857781L079107m59214j782929l017221n388607
$$ plain form
42563 -17910820 -2595683 7484994 13417406 14002906 5218431 -11087630 -24059865 -24483999
42555 -24483999 -14807942 -3447565 6832440 17484964 24122793 18595445 3177806
42548 3177806 -6986042 -1177123 13953911 24764606 27796535 28702815 28780202 23115434
42540 23115434 11728054 2775483 2024340 6491858 11497845 17288077 24939029 31959405
42532 31959405 36699920 41713639 47524445 48332583 40407599 30175059 26036621 25404124
42524 25404124 19025797 6796758 -845032 1503496 7094571 9002714 10068905 14958476
42516 14958476 19899675 18579879 13628293 13224141 17825377 18751477 11117184 1295925
42508 1295925 -1450158 3887324 10745105 13824212 13364998 11582069 8564848 3176241
42500C176241p036947o271529m449334l184700j01287Q383589J9258459K2915732
42492C2690224J4489402J356695n493803m755215l794382o384318q480600o433711
42484A3194292k529753j12079J389799L595321N402052N102107L357787J439060
42476C0838586j346106o229218j2249563j6131159j4185137n134394O888986J3613631
42468c934374J0678192L803953K652240Q571707J3073303R101063p68183q444533
42460C4733368q397450p05933R402856J3791629P833149l487832r735908o682709
42452C6751170O658L395116K641921M36910j644355k941777l325832m917049r861230
42443B0541532j5105457j4374734o601574K997396J0900520J7367926J9625519
$$ plain form
42500 3176241 -3860706 -10132235 -14581569 -17766269 -17867556 -9483967 9774492 32690224
42492 32690224 47179626 48536321 43042518 38287303 34492921 28108603 19628003 13194292
42484 13194292 10664539 10552460 11942259 15537580 20939632 26041739 29399526 30838586
42476 30838586 29492480 23263262 11013699 -5117460 -19302597 -24436991 -17548005 -3934374
42468 -3934374 6743818 10547771 13200011 21771718 34845021 43946084 43177901 34733368
42460 34733368 26335918 25629985 35032841 48824470 56657619 53169787 43433879 36751170
42452 36751170 36757828 40152944 42794865 43231775 41587420 38645643 35319811 30402762 20541532
42443 20541532 5436075 -8938659 -15540233 -12542837 -1642317 15725609 35351128
42436C5351128J2318055j533084r491056n737515R4519k729222j0486713j2326313
42428E459799o641525k63557M139274R462727J5123073J6082323J0600980J818713
42420E5781807p576726j6025210k0050301j7006662r751404l245442J467201N089407
42412a1317330N809000L342861K647333O011099O313616k419422j2243011j0669090
42404a2524944L734N710607K309170M61743O734212J3367916J2119300O797831
42396C4979569M984350O016302M562032p873m091477n138393k125935M480240
42388D3658815R766035O692451m877343j6074115j8733200j2654866k029712Q745801
42380A4493866J3997210R566210L7068m333685j183372J509618l52600n52859
$$ plain form
42436 35351128 47669183 46136099 36645043 30907528 31002047 28272825 17786112 5459799
42428 5459799 -1181726 -1445283 2693991 12156718 27279791 43362114 53963094 55781807
42420 55781807 48205081 32179871 12129570 -4877092 -14628496 -17873938 -16406737 -11317330
42412 -11317330 -5508330 -2165469 481864 6492963 12806579 10387157 -1855854 -12524944
42404 -12524944 -12521210 -6810603 -4501433 -4039690 2694522 16062438 28181738 34979569
42396 34979569 39963919 45980221 50542253 50534380 46442903 41304510 39178575 43658815
42388 43658815 53424850 60117301 55239958 39165843 20432643 7777777 5748065 14493866
42380 14493866 28491076 38057286 38094354 33760669 32577297 34086915 33734315 33181456
42372C3181456M305061O429603K61200n948300l204043K181620p74239p273125
42364B9159233l051123J0608399J4833011r1707j9645613k3977709j2426828q14802
42356e407139J92026m363691l512583N437006J4258101J3549674L723390m965279
42348A8911505m084375L329175P359917L759783j987787k848041J378238M861274
42340C0679689K465006n200870j2025534j1699128l934103N238935J0117460J0287501
42332B5928956P798343K999802l365991p046600m472226J069926K440118k162992
42324B3189336p247761p574023l808400j6977J169035J66288j29916L543262J0438005
42315A9728849J3905056P743890m993870j3500432j1053701j981444N041699P005080
$$ plain form
42372 33181456 37486517 43916120 44177320 38229020 35024977 37206597 36432358 29159233
42364 29159233 26108110 36716509 51549520 51457813 31812200 7834491 -4592337 -5407139
42356 -5407139 -5215113 -9578804 -13091387 -7654381 6603720 20153394 23876784 18911505
42348 18911505 14827130 18156305 25516222 29276005 27288218 24440177 25818415 30679689
42340 30679689 33144695 27943825 15918291 4219163 285060 5523995 15641455 25928956
42332 25928956 33727299 36727101 33361110 26314510 21842284 22912210 25352328 23189336
42324 23189336 15941575 8367552 4559152 4542175 5711210 5877498 5747582 9290844 19728849
42315 19728849 33633905 41377795 36383925 22883493 11829792 9848348 14890047 21895127
42307B1895127O456654M274904j675988r940709j2992252n770213N786683J0304151
42299A8338357N092444j108583j276442P02027j306107m353480j930794L579183
42291A7736605M199354J53174q93648J589150m55965q031093j0875099m154549
42283g32071L115385L656803L606813Q832752J1449764L073625q026295q125331
42275A6851445L18138L844117L2629j853244O42407Q56895j493506O51409N752924
42266B5603214L249870p591074j4083055j0043532m250839l211422m98337Q724829
42258b100346J6217294J3415283M576639j981652n612424p769138n301908J424438
42250A2868186M101390j09339j371042O043672J1222408L866808p026157p600274
$$ plain form
42307 21895127 28351781 32626685 30950697 21009988 8017736 2247523 8034206 18338357
42299 18338357 23430801 22322218 21045776 21747803 20441696 16088216 14157422 17736605
42291 17736605 21935959 22089133 21195485 22784635 22328670 14297577 3422478 -732071
42283 -732071 2383314 6040117 9646930 18479682 29929446 33003071 24976776 16851445
42275 16851445 17169583 21013700 21046329 19193085 19835492 20692387 19198881 19850290 25603214
42266 25603214 28853084 21262010 7178955 -2864577 -7115416 -10326838 -10825175 -2100346
42258 -2100346 14116948 27532231 32108870 30127218 24514794 16745656 11443748 12868186
42250 12868186 16969576 16860237 15489195 21532867 32755275 36622083 29595926 21995652
42242B1995652k736471o550788j5935059j4511998r20935P788519L186823l273084
42234a0957341r14618N502658Q724796J1200526J5442468J5096079N846250m363250
42226D5577568n611420P78401P020482R602152Q137897J341895p950330j1213917
42218D7682728o131158k763800q497465j4054414o032609J1951352K3296200K0544057
42210F5994891J0854411J152843q402868j5152259j2334777j855487L016975n074380
42202C8199349j6139773j5851988l202735J1522199J9898009J9147968Q990810
42195F2563839o114169j5621667j3278911o508859o394105j0570362o892083O174482
42187C358165J5116825J0798131J033155k495062k70113M25546q05590O08758
$$ plain form
42242 21995652 19259181 12708393 -3226666 -17738664 -18659599 -10871080 -7684257 -10957341
42234 -10957341 -11871959 -6369301 2355495 13556021 28998489 44094568 49940818 45577568
42226 45577568 39966148 40744549 47765031 57367183 65505080 66846975 58896645 47682728
42218 47682728 41551570 38787770 30290305 16235891 10203282 22154634 45450834 65994891
42210 65994891 76849302 78002145 69599277 54447018 42112241 40256754 43273729 38199349
42202 38199349 22059576 6207588 3004853 14527052 34425061 53573029 62563839
42195 62563839 56449670 40828003 27549092 21040233 14646128 4075766 -2816317 3358165
42187 3358165 18474990 29273121 30306276 27811214 27541101 27966647 27161057 27769815
42179B7769815L363802J964136k777573m606170k408661q69720p94306J753607
42171B3394930N589090L426437o115952j4131336j3128718n675601K490169R838786
42163E687805J4370490J0169182l180596j4080147j1265219R99387Q930039P717208
42155A9348149M683748N045654M411905k181790j1211370j4473111q198703L460253
42147H84735J1271025P587001n692186j6213126j3114169N5322R494032Q329176
42139B601810L346566L036508N857855M901896n27025l828457j62529P782587
42131B3009211J3231543J2060399N763607j000964n234492p644525r717795j0304394
42123B0162590p127835q80509M609535O097853K959502l421713r604076j0638603
$$ plain form
42179 27769815 31133617 33097753 30320180 25714010 23305349 22435629 21641323 23394930
42171 23394930 28984020 32410457 26294505 12163169 -965549 -6641150 -4150981 5687805
42163 5687805 20058295 30227477 27046881 12966734 1701515 2700902 11630941 19348149
42155 19348149 24031897 29077551 33489456 31307666 20096296 5623185 -2575518 884735
42147 884735 12155760 19742761 14050575 -2162551 -15276720 -15221398 -5727366 2601810
42139 2601810 5948376 8984884 14842739 19744635 19217610 15389153 15226624 23009211
42131 23009211 36240754 48301153 54064760 53063796 47829304 40184779 30466984 20162590
42123 20162590 13034755 12154246 16763781 22861634 25821136 22399423 12795347 2156744
42115B156744m678916K853005L652600l741995j1557958j1219428j805093J0492164
42107a3848877J8692139J9823651J5568719R425867K884326m593057j1018505
42100C6934263j0717150j601151Q923137J0794896L072036o467654j2289139j4707986
42092A3941252j2642233j813973J5739190K7599078K3132117O606771p116809
42085F5445393q418708p63939N619819M321515k444609p213865n326418K19661
42077E1438849L094403J782662R3402m7517j434751n713259r147950p047936K76137
42068C3294040P779329R705630L179615q654515j7021799j5576455q299487m160241
42060B46117m131551q40082P843225J3919495J1623047N855934K817657N49423
$$ plain form
42115 2156744 -2522172 330833 3983433 241438 -11316520 -22535948 -24341041 -13848877
42107 -13848877 4843262 24666913 40235632 49661499 52545825 47952768 36934263
42100 36934263 26217113 24615962 33539099 44333995 47406031 40938377 28649238 13941252
42092 13941252 1299019 -514954 15224236 42823314 65955431 72562202 65445393
42085 65445393 57026685 56262746 61882565 66204080 63759471 56545606 51219188 51438849
42077 51438849 54533252 56315914 56409316 56361799 54927048 49213789 40065839 33017903 33294040
42068 33294040 41073369 50778999 53958614 45304099 28282300 12705845 4406358 246117
42060 246117 -3885434 -4725516 3117709 17037204 28660251 34516185 37333842 37883265
42052C7883265m180764p352424m743957r52429j652545k525353K894284Q694787
42044B8064864L155117j1340727j8558533j0864854Q41231M209050J462394J275330
42036a756128L428975J183075n571745r261299o349630k339949k749488m473411
42028b7889600n17949Q766096J4305661R811680Q34859j933784L336785Q016409
42020A4730157N846935R02778l17365J147811p0951m345884o562570l195686M004037
42011A2139262R621663P923681j355590q706015l250086J0658840J4272595o08065
42003D0696285j6778070j3202603N997678J8471710J4549722M677542k045872
41996E2366392q157008j3782590j0476650K982642J2995194Q932937k210471p665305
$$ plain form
42052 37883265 33702501 26350077 21606120 20653691 19001146 16475793 19370077 28064864
42044 28064864 31219981 19879254 1320721 -9544133 -8702902 -4493852 -3031458 -1756128
42036 -1756128 1672847 2855922 -2715823 -11977122 -18326752 -20666701 -23416189 -27889600
42028 -27889600 -28407549 -19641453 -5335792 4475888 5310747 3376963 6713748 14730157
42020 14730157 20577092 21479870 21162505 22310316 22239365 17893481 11330911 8135225 12139262
42011 12139262 21760925 29684606 28329016 19623001 16372915 27031755 41304350 40696285
42003 40696285 23918215 10715612 16713290 35185000 49734722 54412264 52366392
41996 52366392 44209384 30426794 19950144 22932786 35927980 44860917 42650446 34985141
41988C4985141n777951k632266r15656j003966m855436r904133p028554O107707
41980H974886J7403461J5826360O961016K373313J392704l214271p949658l191021
41972C8576790P315478Q057329n244223j8349209j8155546p868125K096565P759926
41964A4188985J0089917Q575467L693616M50699K866845P639693P721425M77592
41956E5704239r946156j6386352j4113310n367242J822419L027946M016984J1760986
41948C0519514K0276881J5302214m213507j9414486j3453344O812863J9605269
41941E5435404J4598014J386685o905767q658184r426838j0271385p295102n66316
41933B8296511L286374l25195o870592q506692n168175m156711p807909q197664
$$ plain form
41988 34985141 29207190 26574924 25659268 24655302 19799866 9895733 2867179 8974886
41980 8974886 26378347 42204707 49165723 51539036 52931740 49717469 41767811 38576790
41972 38576790 45892268 53949597 48705374 30356165 12200619 4332494 6429059 14188985
41964 14188985 24278902 32854369 36547985 36998684 39865529 47505222 55226647 55704239
41956 55704239 45758083 29371731 15258421 9891179 11713598 14741544 18758528 30519514
41948 30519514 50796395 66098609 61885102 42470616 29017272 35830135 55435404
41941 55435404 70033418 71420103 64514336 55856152 46429314 36157929 28862827 28296511
41933 28296511 31582885 31257690 24387098 15880406 10712231 6555520 -1252389 -9450053
41925i450053J189885J3712074J6952563R552067K315734K189309L577892j146089
41917C8893382r527326j2834081p931285k29358L228809J992o665729j0099362
41909e162958n339972N402051J4218732J6417222J5396713J6271196J7915865
41902G5118849J5281064P272388k188791r648742j4153489j4620445j0316881
41895D6743953m579989l049904o077538p084859j557030N896562P758525M307827
41887D2357547K300002L577879K092941n036134j0284768n784890L810753O910073
41879C9943403J869554j090336L845343R680389Q849388M608473K878447P60591
41871G1345252o520282j2946469q821532J451888K527231q762687j6504039p953568
$$ plain form
41925 -9450053 -8260168 5451906 22404469 31956536 34272270 36461579 40039471 38893382
41917 38893382 29366056 16531975 8600690 8371332 11600141 11602133 4936404 -5162958
41909 -5162958 -10502930 -5100879 9117853 25535075 40931788 57202984 75118849
41902 75118849 90399913 97672301 95483510 85834768 71681279 57060834 46743953
41895 46743953 42163964 39114060 33036522 25951663 24394633 30291195 38049720 42357547
41887 42357547 44657549 48235428 50328369 45292235 35007467 29222577 33033330 39943403
41879 39943403 41812957 40722621 44567964 54248353 63097741 67706214 70584661 71345252
41871 71345252 64824970 51878501 43056969 44508857 47036088 38273401 21769362 13815794
41863A3815794Q082060J3941963O704637j140066p64899L652372M777808K593578
41855E1663247J590061K639431K297874j020773l897234k643469N27743l76089
41847E0780791o093400r634526o165830p40781l5345m15055O340051J7008844
41839E1044749J8328566O675148n257405o681475k888577l722694p616739o957272
41831D2924301j791416K519796N261316O958296J985754j2197696k2912383j5211270
41823G536698L871541J0741390k051005j4946505j0182951L722470P630272Q1331
41815F403241m818847j361579J569063k229546o136411j739268Q671370J5456288
41807A5814311J2829827L484412m913999o013811j58303N568931N038898N45400
$$ plain form
41863 13815794 21897854 35839817 42544454 41404388 40639489 44291861 49069669 51663247
41855 51663247 53253308 55892739 58190613 57169840 53272606 50629137 51156880 50780791
41847 50780791 44687391 35052865 28887035 28146254 28110909 27695854 34035905 51044749
41839 51044749 69373315 76048463 70791058 64109583 61221006 57498312 49881573 42924301
41831 42924301 41132885 43652681 48913997 55872293 57858047 45660351 22747968 7536698
41823 7536698 11408239 22149629 20098624 5152119 -5030832 -1308362 6321910 6403241
41815 6403241 1584394 222815 1791878 -437668 -6574079 -8313347 358023 15814311
41807 15814311 28644138 32128550 27214551 21200740 21042437 26611368 31650266 32195666
41799C2195666q76461J912706K561393k308154o841418m204499L147887O910517
41791C2497637M392417O82868j55827n9372j592801k921608j459966J158975J682600
41782C4224923M81348L55144J692776K570574K477555K184358J037829j439725
41774D3584782k318716J259774N761335M432225k295061n993430k273163K642197
41766D4799943J359819m017242n688821p33311O895625J1764225J0335025K749599
41758F7464862m697162l759379L889487M856752q230111k2694317k0184884k027145
41750A4618103J1999266J0065138P91595l384849k663354l154935m194543j778344
41742B2298077J737870P74558l810679n763159k083108N262679J3643796J9703980
$$ plain form
41799 32195666 31319205 33231911 35793304 33485150 26643732 22439233 25587120 32497637
41791 32497637 36890054 37572922 37417095 37357723 35764922 32843314 31383348 32542323 34224923
41782 34224923 34706271 35061415 36754191 39324765 41802320 43986678 45024507 43584782
41774 43584782 41266066 42525840 48287175 52719400 50424339 44430909 42157746 44799943
41766 44799943 46159762 42142520 36453699 35720388 42616013 54380238 64715263 67464862
41758 67464862 62767700 59008321 62897808 67754560 59524449 36830132 16645248 14618103
41750 14618103 26617369 36682507 37474102 34089253 31425899 28270964 24076421 22298077
41742 22298077 24035947 24810505 20999826 15236667 13153559 18416238 32060034 51764014
41734E1764014J7733085N476629r289263j4981654r451618j064169L589433N929793
41726D9706250P472652L764395p495781j7307144j3174468L780077J6995559J3144867
41718E6886407k493616j3959396j3873515p996414k504560M025035J3092737J8939059
41710E2115737J5236388M517153n231701r762300q547087k50930J3418027K2567151
41702H4062438J7880370L922713n618380n671505k896284j442125J924378O206497
41694I8368102L496574o180883j0461213l663679K024608m436625j3933882j1571821
41686E3641181j233293J583795l365731n47596J4399398K5345300J8659748P85172
41678A09267974j4255470k2331797k5512004k1731943r571051L033984O123415
$$ plain form
41734 51764014 69497099 74973728 65684465 50702811 41251193 40187024 43776457 49706250
41726 49706250 57178902 60943297 53447516 36140372 22965904 26745981 43741540 56886407
41718 56886407 54392791 40433395 26559880 18563466 16058906 20083941 33176678 52115737
41710 52115737 67352125 71869278 66637577 56875277 48328190 48077260 61495287 84062438
41702 84062438 101942808 105865521 100247141 94575636 91679352 90237227 92161605 98368102
41694 98368102 101864676 95683793 85222580 81558901 83583509 79146884 65213002 53641181
41686 53641181 52407888 53991683 50625952 50078356 64477754 89823054 108482802 109267974
41678 109267974 95012504 72680707 47168703 25436760 15865709 18899693 25023108
41671B5023108J283862r76123L948223J0229781J1425666P861844L436670P03578
41663F2936609N08208K069086K041724k553274q930145r977003l497104L584797
41655D6182898L930186j39919o84661K760142J271238r480820j9893063j7542238
41647F403763l979767P338900Q595944M768708K858264L284599N069922J0183457
41639D4523790J6726500J5970334M441377p109479n970553N480033J3984800J3006103
41631A01052905O423992k122220j1897440j7786486j2660981L03818P959853L627644
41623G4901085n123749q350383n221973l21225L251421L107804k034582o864070
41615E3344328k654535Q934836J3853949M260205q986932j0976572k966903K256598
$$ plain form
41671 25023108 26306970 25330847 29279070 39508851 50934517 58796361 62233031 62936609
41663 62936609 63444817 65513903 67555627 65002353 56072208 46095205 42598101 46182898
41655 46182898 50113084 49973165 49288504 52048646 53319884 43839064 23946001 6403763
41647 6403763 2423996 9762896 18358840 23127548 25985812 29270411 34340333 44523790
41639 44523790 61250290 77220624 81662001 74552522 68581969 74062002 88046802 101052905
41631 101052905 107476897 105354677 93457237 75670751 63009770 63313588 71273441 74901085
41623 74901085 69777336 61426953 56204980 55883755 59135176 62242980 60208398 53344328
41615 53344328 50689793 59624629 73478578 77738783 68751851 57775279 54808376 57064974
41607E7064974K52572j543218J548929M918485M685439M662605Q792151J2939802
41599I3321739R676324j396833j2299898j5213125r929711k400304K465346M504205
41591F8727743M801950K042209m246451r333641p780843j650977J980907K021480
41583E6562377M543428J1066705J3740371O703600m616467j1022262j0497309
41576F6480443o061562J204618R784024J3273664O705296m908794j1237475q444182
41568F6796032j382319L516345L109892j029059j745250P645532K1070871K1084475
41560A19066519J272117k0190265k1509152o151741L937162P03623k092790M894647
41552G9930120J0699844K855237j1672540j6021546o076335O941974J2146292
$$ plain form
41607 57064974 57317546 55774328 57323257 62241742 66927181 71589786 80381937 93321739
41599 93321739 102998063 101601230 89301332 74088207 64158496 61758192 64223538 68727743
41591 68727743 73529693 75571902 71325451 61991810 54210967 52559990 54540897 56562377
41583 56562377 61105805 72172510 85912881 92616481 88000014 76977752 66480443
41576 66480443 60418881 61623499 71407523 84681187 91386483 86477689 75240214 66796032
41568 66796032 65413713 68930058 72039950 71010891 69265641 76911173 97982044 119066519
41560 119066519 120338636 100148371 78639219 72487478 76424640 77128263 75035473 79930120
41552 79930120 90629964 93485201 81812661 65791115 59714780 66656754 78803046
41545G8803046Q724073K555072k80773K154164N882724N320664J115164k86116
41537A03988018L231816N380396Q60394o898426j1746763j3164413j3524471j2059046
41529E6067505p528677k857619r05927J050040O302187J1108750R129630J809719
41521G4175608k786129j240485J791518K190154J989296L941698N639296L015010
41513H8715966k944061o819079n593830k141232j050666k415717j675261L745758
41505F9821878R369576P905701j268100r754562r221820j169622M945963L094714
41497G3723728k383169k884348K665811N662475m15873r246342q446257L011229
41489F1687254J1662241P519774k057212l634703K734856N369875J13816l805950
$$ plain form
41545 78803046 87527119 90082191 89801418 91955582 97838306 103158970 104274134 103988018
41537 103988018 107219834 112600230 113460624 106562198 94815435 81651022 68126551 56067505
41529 56067505 48538828 45681209 44775282 45825322 52127509 63236259 72365889 74175608
41521 74175608 71389479 70148994 71940512 74130666 76119962 80061660 85700956 88715966
41513 88715966 85771905 78952826 73358996 71217764 70167098 67751381 66076120 69821878
41505 69821878 79191454 87097155 85829055 76074493 66852673 65683051 70629014 73723728
41497 73723728 71340559 68456211 71122022 76784497 76368624 67122282 58676025 61687254
41489 61687254 73349495 80869269 78812057 75177354 77912210 83282085 83395901 79589951
41481G9589951R33868Q436780Q325470p05487j0652500j3272918o418622M908377
41473G1144919J1995180J0525682N576408M289281N196204J851123m534131o182842
41465I9861824l001340m127160j2069439j6993359j2093891l538400J339134M557056
41457E3934425Q350011P054981j392036o224972J255247J1888209J1493124K989812
41449H9348801R19442P982579J2188124O291629l636999r752969j1005475r192527
41441H3142605o091398m763752n579504k964215N264244R728104K209691q066824
41433G2878951n711889O037051Q986579j395803r404066m797258K931814K769247
41425G2294626j916398m596891p658069j2590777j1480016m68062R523941Q340816
$$ plain form
41481 79589951 80523819 88960599 97286069 96580582 85928082 72655164 66236542 71144919
41473 71144919 83140099 93665781 99242189 103531470 108727674 110578797 106044666 99861824
41465 99861824 96860484 92733324 80663885 63670526 51576635 48038235 49377369 53934425
41457 53934425 62284436 69339417 67947381 61722409 62977656 74865865 86358989 89348801
41449 89348801 90268243 98250822 110438946 116730575 113093576 103340607 92335132 83142605
41441 83142605 77051207 72287455 66707951 63743736 69007980 78736084 80945775 72878951
41433 72878951 67167062 73204113 82190692 80794889 71390823 66593565 69525379 72294626
41425 72294626 70378228 65781337 58123268 45532491 34052475 33584413 43108354 51449170
41417E1449170L167655O009469J2983116J1387761K009286j736837M468368R767929
41409I9505917N653481k661520o427762n753929o451460r728236j0000745j906441
41401F2229305J2212549K2141325J8782943M159781j0150973j5419086j2805783
41394H1150061p364679j323185L663721M134020k66577m445083m936342m360227
41386F6251709m872611l409647J608811N418541M476364K247173J568169r34047
41378G2354462n627488m095621P355990J6650877J0882314l885499j1044855o846469
41370G5743711j461519n85502j129176k870341q201742j0769400j394109J2938554
41362F2270476J3568386j875094j3287939p125039M886402O240936j34578j533265
$$ plain form
41417 51449170 54616825 60626294 73609410 84997171 87006457 85269620 89737988 99505917
41409 99505917 105159398 102497878 96070116 90316187 83864727 74136491 64135746 62229305
41401 62229305 74441854 96583179 115366122 119525903 109374930 93955844 81150061
41394 81150061 73785382 72462197 76125918 80259938 79993361 75548278 70611936 66251709
41386 66251709 61379098 57969451 59578262 64996803 69473167 71720340 73288509 72354462
41378 72354462 66726974 62631353 69987343 86638220 97520534 93635035 82590180 75743711
41370 75743711 74282192 73696690 72567514 69697173 61495431 50726031 49331922 62270476
41362 62270476 75838862 73963768 60675829 53550790 58437192 64678128 64543550 63010285
41354F3010285K463846K974520n88973j066987K178092L023608P06640K84049
41346G2985080J902061N57103l482690m372546j750467k197573p234250q882211
41338D7524507j384961R619855J4454426J0995632M485433k61808j729647M08610
41330H4112047M815553O291905r71909j5545096k6675972k3669853p955922O766789
41322B7167542Q592140K67503m900134M42717R202699R634870M57540p502050
41314D3362827m331104P335548J5368362J1981004K224251l066715j085126P82713
41306G2571760k558359n613274j528955N610358O043540m63024m122374m224O182972
41297G6118420R096113J0581692J1542995P211676k515601p010539J181452J2586029
$$ plain form
41354 63010285 65474131 68448651 67859678 66792691 68970783 71994391 72701031 72985080
41346 72985080 74887141 75444244 71961554 67589008 65838541 63640968 56406718 47524507
41338 47524507 46139546 55759401 70213827 81209459 85694892 85433084 83703437 84112047
41330 84112047 88927600 95219505 94247596 78702500 52026528 28356675 20400753 27167542
41322 27167542 35759682 36027185 31127051 31569768 40772467 50407337 50864877 43362827
41314 43362827 39031723 46367271 61735633 73716637 75940888 72874173 71789047 72571760
41306 72571760 70013401 64400127 62871172 68481530 74525070 74062046 69939672 69935448 76118420
41297 76118420 85214533 95796225 107339220 114550896 112035295 105024756 106206208 118792237
41289A18792237J1623160k160372j3905689j2946007k909412P146843J1981126
41282A17621886R300548r60135j2751609j6402527r524022o65244J616282q90374
41274H7344805o45199L833709N491453k012495j5057284k1455963j2448484O034919
41266E1085461J7055692J0995110k488811o290088K273618R303778M637545n040266
41258H1532039q146520m999812m026033n831254j771754J1019326K2481810K1855634
41250A12113436J1096808O27086m672994q793866j4805332j8416866j4114039
41243F3034233l637903N520788Q291595N464408M32150l678017m038034N58571
41235G1947791P164609J0387009P937746K366749l060337p074052q308740m657070
$$ plain form
41289 118792237 130415397 128255025 114349336 101403329 98493917 105640760 117621886
41282 117621886 126922434 125962299 113210690 96808163 87284141 86618897 88235179 87344805
41274 87344805 86699606 90533315 96024768 94012273 78954989 57499026 45050542 51085461
41266 51085461 68141153 79136263 76647452 70357364 72630982 81934760 86572305 81532039
41258 81532039 73385519 68385707 64359674 58528420 56756666 67775992 90257802 112113436
41250 112113436 123210244 123837330 119164336 110370470 95565138 77148272 63034233
41243 63034233 59396330 64917118 73208713 78673121 79105271 75427254 71389220 71947791
41235 71947791 79112400 89499409 97437155 99803904 96743567 89669515 81360775 76703705
41227G6703705K818304Q565801Q187037L329102j359811l841851m982354n845176
41219H3574757p342803j0069453j1767284p764755K708534J3080142J5814136
41212G8233274J0313799J818323m540123n548569j16264P429288Q305894j08524
41204I5787098p878334m121658P293251J2017642M257467p298049j3045324j2684554
41196G4327539r378612k679137P477437J5873607J6668643R692162r34868j0673786
41188A00372985j4986531j1054806k360818K947227J481880j713872j362104J358994
41180G4682955L274142M417624M651437J189976n036737o433817Q13672Q304982
41172H5864234N905240k732958m802029K493826P520050J241915j0039575j4001469
$$ plain form
41227 76703705 79522009 88087810 96274847 99603949 98244138 94402287 89419933 83574757
41219 83574757 76231954 66162501 54395217 46630462 49338996 62419138 78233274
41212 78233274 88547073 90365396 85825273 80276704 80160440 87589728 95895622 95787098
41204 95787098 87908764 83787106 91080357 103097999 107355466 100057417 87012093 74327539
41196 74327539 64948927 62269790 69747227 85620834 102289477 111981639 111046771 100372985
41188 100372985 85386454 74331648 71970830 74918057 76399937 74686065 73323961 74682955
41180 74682955 77957097 82374721 87026158 88216134 83179397 76745580 77559252 85864234
41172 85864234 91769474 89036516 84234487 86728313 94248363 95490278 85450703 71449234
41164G1449234q540993k391476j841173l049214Q44111Q839988J2636470Q254786
41156H6201733K498229L638342Q680829P227387j992996p611154k616865M055968
$$ plain form
41164 71449234 62908241 60516765 58675592 55626378 56470489 65310477 77946947 86201733
41156 86201733 88699962 92338304 101019133 108246520 106253524 98642370 96025505 100081473
$$ [...]
##END NTUPLES=NMR SPECTRUM
##END=
