##TITLE=31Pdec_DE-60k_d6_T'
 DMSO-d6, 64 sc
 3.7.2024
##JCAMPDX= 6.0         $$ Bruker NMR JCAMP-DX V2.0
##DATA TYPE= NMR SPECTRUM
##DATA CLASS= NTUPLES
##ORIGIN= UXNMR, Bruker Analytische Messtechnik GmbH
##OWNER= root
$$ XWIN-NMR		Version 3.5
$$ Wed Jul  3 14:41:19 2024 Russian Standard Time (UT+4h)  she@DPX200
##.OBSERVE FREQUENCY= 81.013821
##.OBSERVE NUCLEUS= ^31P
##.ACQUISITION MODE= SIMULTANEOUS
##.ACQUISITION SCHEME= undefined
##.AVERAGES= 64
##.DIGITISER RES= 17
##SPECTROMETER/DATA SYSTEM= spect
##.PULSE SEQUENCE= zgpg30
##.SOLVENT NAME= DMSO
##.SHIFT REFERENCE= (INTERNAL, DMSO, 0, 198.062)
##AUDIT TRAIL= $$ (NUMBER, WHEN, WHO, WHERE, WHAT)
$$ ##TITLE= Audit trail, XWIN-NMR		Version 3.5
$$ ##JCAMPDX= 5.01
$$ ##ORIGIN= Bruker BioSpin GmbH
$$ ##OWNER= she
$$ F:/spectra/data/she/nmr/P31/2/pdata/1/auditp.txt
$$ ##AUDIT TRAIL=  $$ (NUMBER, WHEN, WHO, WHERE, WHAT)
(   1,<2024-07-03 14:40:13.45 +0400>,<she>,<DPX200>,
      <created by zg, POWCHK disabled, PULCHK disabled
       configuration hash MD5:
       00 E9 B6 7A A2 85 ED C7 34 08 36 98 17 FE 4E 26
       data hash MD5: 32K
       DD 51 D5 F9 3D 20 11 9A B0 E1 2C A9 52 D0 53 95>)
(   2,<2024-07-03 14:40:15.70 +0400>,<she>,<DPX200>,
      <Start of raw data processing
       efp BC_mod = 2 LB = 1.5 FT_mod = 6 PKNL = 1 PHC0 = 3007.603 PHC1 = -468.5137 SI = 64K 
       data hash MD5: 64K
       77 E1 E9 BA 26 F4 18 4B 5F BC B9 32 32 F1 D5 53>)
(   3,<2024-07-03 14:40:48.00 +0400>,<she>,<DPX200>,
      <pk PHC0 = 127.0573 PHC1 = -310.4 
       data hash MD5: 64K
       1E 92 53 B1 F0 D2 55 E2 26 9D 08 1F DE 33 71 0F>)
$$ ##END=
$$ 
$$ hash MD5
$$ 65 10 BA CC F1 EA 88 80 32 B6 50 FE B1 74 C4 F6
##$RELAX= 
##$RELAX= 
##$RELAX= 
##$RELAX= 
##$RELAX= 
##$RELAX= 
##$RELAX= 
##$RELAX= 
$$ Bruker specific parameters
$$ --------------------------
##$DU= <F:/spectra>
##$EXPNO= 2
##$NAME= <P31>
##$PROCNO= 1
##$TYPE= <nmr>
##$USER= <she>
##$AMP= (0..31)
100 100 100 100 100 100 100 100 100 100 100 100 100 100 100 100 100 100 
100 100 100 100 100 100 100 100 100 100 100 100 100 100 
##$AQSEQ= 0
##$AQ_mod= 1
##$AUNM= <au_zg>
##$AUTOPOS= <>
##$BF1= 81.014009
##$BF2= 200.13
##$BF3= 200.13
##$BF4= 200.13
##$BF5= 200.13
##$BF6= 200.13
##$BF7= 200.13
##$BF8= 200.13
##$BYTORDA= 1
##$CFDGTYP= 0
##$CFRGTYP= 5
##$CHEMSTR= <none>
##$CNST= (0..31)
1 1 145 1 1 1 1 1 1 1 1 1 1 1 1 1 1 1 1 1 1 1 1 1 1 1 1 1 1 1 1 1 
##$CPDPRG= <waltz16>
##$CPDPRG1= <>
##$CPDPRG2= <waltz16>
##$CPDPRG3= <>
##$CPDPRG4= <mlev>
##$CPDPRG5= <mlev>
##$CPDPRG6= <mlev>
##$CPDPRG7= <mlev>
##$CPDPRG8= <mlev>
##$CPDPRGB= <>
##$CPDPRGT= <>
##$D= (0..31)
0 1 0 0 0 0 0 0 0 0.06 0 0.03 2e-05 3e-06 0 0 0.0002 0 0 0 0 0 0 0 0 0 
0 0 0 0 0 0 
##$DATE= 1720003212
##$DBL= (0..7)
120 120 120 11 120 120 24 19 
##$DBP= (0..7)
150 150 150 150 150 150 150 150 
##$DBP07= 0
##$DBPNAM0= <>
##$DBPNAM1= <>
##$DBPNAM2= <>
##$DBPNAM3= <>
##$DBPNAM4= <>
##$DBPNAM5= <>
##$DBPNAM6= <>
##$DBPNAM7= <>
##$DBPOAL= (0..7)
0.5 0.5 0.5 0.5 0.5 0.5 0.5 0.5 
##$DBPOFFS= (0..7)
$$ [...]
##$SUBNAM3= <"">
##$SUBNAM4= <"">
##$SUBNAM5= <"">
##$SUBNAM6= <"">
##$SUBNAM7= <"">
##$SUBNAM8= <"">
##$SUBNAM9= <"">
##$SW= 400.765351723535
##$SWIBOX= (0..15)
0 1 3 0 0 0 0 0 0 0 0 0 0 0 0 0 
##$SW_h= 32467.5324675325
##$TD= 32768
##$TD0= 1
##$TE= 0
##$TE2= 300
##$TE3= 300
##$TEG= 300
##$TL= (0..7)
0 120 53 12 22 120 120 120 
##$TP= (0..7)
150 150 150 150 150 150 150 150 
##$TP07= 0
##$TPNAME0= <>
##$TPNAME1= <>
##$TPNAME2= <>
##$TPNAME3= <>
##$TPNAME4= <>
##$TPNAME5= <>
##$TPNAME6= <>
##$TPNAME7= <>
##$TPOAL= (0..7)
0.5 0.5 0.5 0.5 0.5 0.5 0.5 0.5 
##$TPOFFS= (0..7)
0 0 0 0 0 0 0 0 
##$TUNHIN= 0
##$TUNHOUT= 0
##$TUNXOUT= 0
##$USERA1= <user>
##$USERA2= <user>
##$USERA3= <user>
##$USERA4= <user>
##$USERA5= <user>
##$V9= 5
##$VALIST= <valist>
##$VCLIST= <CCCCCCCCCCCCCCC>
##$VD= 0
##$VDLIST= <DDDDDDDDDDDDDDD>
##$VPLIST= <PPPPPPPPPPPPPPP>
##$VTLIST= <TTTTTTTTTTTTTTT>
##$WBST= 1024
##$WBSW= 4
##$XGAIN= (0..3)
0 0 0 0 
##$XL= 0
##$YL= 0
##$YMAX_a= 10165
##$YMIN_a= -2989
##$ZGOPTNS= <>
##$ZL1= 120
##$ZL2= 120
##$ZL3= 120
##$ZL4= 120
##$ABSF1= 0
##$ABSF2= 0
##$ABSG= 0
##$ABSL= 0
##$ALPHA= 0
##$AQORDER= 0
##$ASSFAC= 0
##$ASSFACI= 0
##$ASSFACX= 0
##$ASSWID= 0
##$AUNMP= <proc_1d>
##$AZFE= 0.1
##$AZFW= 0.5
##$BCFW= 0
##$BC_mod= 2
##$BYTORDP= 0
##$COROFFS= 0
##$CY= -3
##$DATMOD= 1
##$DC= 0
##$DFILT= <>
##$DTYPP= 0
##$F1P= 0
##$F2P= 0
##$FCOR= 1
##$FTSIZE= 65536
##$FT_mod= 6
##$GAMMA= 0
##$GB= 0
##$INTBC= 1
##$INTSCL= 9.790993e-09
##$ISEN= 30
##$LB= 1.5
##$LEV0= 0
##$LPBIN= 0
##$MAXI= 10000
##$MC2= 0
##$MEAN= 0
##$ME_mod= 0
##$MI= 50
##$NCOEF= 0
##$NC_proc= -9
##$NLEV= 6
##$NOISF1= 182.463
##$NOISF2= 159.3651
##$NSP= 0
##$NTH_PI= 0
##$NZP= 0
##$OFFSET= 198.0616
##$PC= 4
##$PHC0= 3134.66
##$PHC1= -778.9137
##$PH_mod= 1
##$PKNL= yes
##$PPARMOD= 0
##$PSCAL= 0
##$PSIGN= 0
##$REVERSE= no
##$SF= 81.0140089999434
##$SI= 65536
##$SIGF1= 159.3651
##$SIGF2= -187.1042
##$SINO= 113.3802
##$SIOLD= 16384
##$SREGLST= <1H.CDCl3>
##$SSB= 0
##$STSI= 65536
##$STSR= 0
##$SW_p= 32467.5324675325
##$SYMM= 0
##$S_DEV= 0
##$TDeff= 32768
##$TDoff= 0
##$TI= <>
##$TILT= no
##$TM1= 0
##$TM2= 0
##$TOPLEV= 0
##$USERP1= <user>
##$USERP2= <user>
##$USERP3= <user>
##$USERP4= <user>
##$USERP5= <user>
##$WDW= 1
##$XDIM= 65536
##$YMAX_p= 176738209
##$YMIN_p= -263804086
$$ End of Bruker specific parameters
$$ ---------------------------------
##NTUPLES= NMR SPECTRUM
##VAR_NAME=  FREQUENCY,     SPECTRUM/REAL,   SPECTRUM/IMAG
##SYMBOL=    X,             R,               I
##VAR_TYPE=  INDEPENDENT,   DEPENDENT,       DEPENDENT
##VAR_FORM=  AFFN,          ASDF,            ASDF
##VAR_DIM=   65536,         65536,           65536
##UNITS=     HZ,            ARBITRARY UNITS, ARBITRARY UNITS
##FACTOR=    0.49542278885378, 1,            1
##FIRST=     16045.7642231865, 0,            0
##LAST=      -16421.768244346, 0,            0
##MIN=       -16421.768244346, -263804086,   0
##MAX=       16045.7642231865, 176738209,    0
$$ Real data points
##PAGE= N=1
##DATA TABLE= (X++(R..R)), XYDATA
$$ [...]
##PAGE= N=2
##DATA TABLE= (X++(I..I)), XYDATA
8934 -6071262 -10014683 -13905238 -11968994 -1835555 10472692 16260698 13766528 9365635
8926 9365635 9294071 12647473 13582501 8709744 517005 -6003530 -8246196 -6922787 -3724451
8917 -3724451 -33516 2162056 343101 -5822618 -12571757 -14647301 -10316371 -3212930
8909 -3212930 901161 -982690 -6756947 -10889663 -9061516 -2124185 4887050 8189480
8901 8189480 8573808 8480257 7908188 5701429 3145305 2458957 2217907 -1406533 -8088024
8892 -8088024 -12241737 -10232856 -4879220 -450480 3040831 7220176 10320231 9267042
8884 9267042 5067845 1813694 1130607 1398223 1716186 2553715 2537435 -1263464 -8797442
8875 -8797442 -15769811 -17877379 -14204389 -6581869 1519643 5516609 2691625 -4420191
8867 -4420191 -10310422 -12439730 -11973192 -9180622 -3084200 3389519 3718341 -3485853 -10656836
8858 -10656836 -10280898 -4093210 1070922 3107786 4643862 5442102 1608694 -7123949
8850 -7123949 -14912550 -16501323 -12738666 -7971437 -5192669 -5233235 -7655871 -10289035 -9857251
8841 -9857251 -5019729 2207036 8884397 13753716 17013078 19218327 21050975 22641908
8833 22641908 22659824 19622285 14366315 9530945 6561441 5181348 5506237 7829549 10225316
8824 10225316 9815405 7237598 6304143 8000419 8733893 6438400 4129019 4343370 4259889
8815 4259889 752235 -3175250 -2594804 739614 -15651 -7078655 -15422152 -20182639 -21507395
8806 -21507395 -20935633 -17746854 -11034304 -2208619 6013304 10693523 9078451 1933403
8798 1933403 -3823672 -1408222 5970317 7785399 840931 -5752939 -4247742 306744
8790 306744 -1044339 -6671840 -7541033 -1616504 4213160 5632911 5358073 5497749 4123788
8781 4123788 1674984 2803409 8119235 10773552 5713403 -3063386 -8896517 -11094703
8773 -11094703 -12344119 -12087544 -8304527 -2794618 934729 2973133 5404499 7636582
8765 7636582 8089453 8105781 8950769 7364059 161480 -8768650 -13008385 -13808806 -17758172
8756 -17758172 -24261845 -24351178 -14550649 -3545267 -399553 -3037024 -4074972 -2306490
8748 -2306490 -1544377 -2150383 -1233679 626806 -172062 -3517418 -5259272 -3865300 -2112647
8739 -2112647 -1540417 -266209 2345161 3393418 873003 -3196447 -6154969 -8120915
8731 -8120915 -9819090 -9813412 -6733442 -2484928 -486260 -1498124 -3187462 -3127929 -666316
8722 -666316 3126838 5385003 2292691 -7170478 -18093746 -23037555 -20073896 -15346999
8714 -15346999 -15359018 -18360416 -17175600 -10546457 -6649347 -12064889 -21111338 -22021976 -12631049
8705 -12631049 -3361913 -3276810 -9558127 -14254862 -15435002 -15736381 -14315637 -8294502 -852767
8696 -852767 300722 -6058866 -11988598 -11352418 -7685577 -7455178 -10390328 -11484753 -9494348
8687 -9494348 -7938120 -8583326 -8791484 -6177878 -2584602 -1718020 -4263579 -6786882 -5577702
8678 -5577702 -1164659 1845833 193694 -3807810 -5424039 -4193290 -4423201 -8627602
8670 -8627602 -13875754 -16211035 -15653337 -14559461 -13478507 -11254580 -7581159 -3214390
8662 -3214390 897479 3007094 1215522 -3168641 -5282735 -2530191 1220866 264477
8654 264477 -5844267 -12850444 -17525096 -19128234 -16809983 -10116567 -1739383 4281198
8646 4281198 7080342 8150337 6654483 305471 -8611638 -13183255 -10088797 -4287054
8638 -4287054 -3154433 -8523042 -16151921 -20231384 -16655297 -5046379 9607825 19521067
8630 19521067 21195216 18611901 17185420 16398908 11545336 1721911 -7656306 -11169961
8622 -11169961 -9554500 -7670324 -7528429 -5765345 1033476 10110538 14218387 10005665
8614 10005665 2309507 -1595586 5219 3420770 5779547 7447256 8914564 9038614
8606 9038614 6694821 1343509 -7465660 -17511297 -21822871 -14909178 -1917400 4635794
8598 4635794 46195 -6275347 -3532216 6679941 14572539 15773251 14058449 12963289
8590 12963289 11763051 9466428 6620695 2488496 -4228153 -10781005 -11509103 -5479358
8582 -5479358 1114233 2392121 -638084 -3024020 -2407780 -223503 1337579 995869 -1672197
8573 -1672197 -5886671 -9879127 -12535103 -14006893 -14197405 -12159386 -7965970 -3817192
8565 -3817192 -2004019 -2318939 -2115430 1271090 7644733 12682569 10961120 2457500 -5360407
8556 -5360407 -5597172 -1457350 -2750900 -11976118 -19820860 -18111531 -11831069 -11769443 -18103771
8547 -18103771 -19373912 -8725672 5912257 11498268 4861174 -6578440 -15664736 -21096958
8539 -21096958 -23099640 -20201567 -13214244 -7967410 -9347641 -14143605 -14327255 -7640660
8531 -7640660 -803384 -598922 -5337432 -8237622 -6995562 -5954203 -9105952 -14653204
8523 -14653204 -17672961 -15618619 -9634729 -2260069 4265813 8346960 9613377 9324804
8515 9324804 9145006 9187457 7854841 4106662 -237814 -1235601 3202049 10162885 13889922
8506 13889922 11696139 6504471 2696381 1072957 -504371 -3235200 -6861984 -11949306
8498 -11949306 -19100045 -25568412 -26211104 -19764116 -12165366 -11583439 -20600464 -33806933
8490 -33806933 -42259714 -40614527 -31806908 -24771960 -25257422 -28770226 -25666793 -13900774
8482 -13900774 -2782376 -1787730 -9203256 -15443990 -14961157 -10377339 -6282210 -4116548
8474 -4116548 -3726600 -5291156 -7343805 -5846336 1752641 12382136 19294149 18223106
8466 18223106 10923574 2999163 -1079786 -1103735 -178563 -1262495 -4667104 -8270352 -9282529
8457 -9282529 -6232678 -906387 1496525 -3501386 -13884117 -21446802 -19942411 -11454107
8449 -11454107 -2554651 3880302 9568250 14982102 17609123 16816876 15810694 16377594
8441 16377594 15341990 9532907 1697576 -2390991 -1459369 376552 -120396 -1774064
8433 -1774064 -2284036 -1757265 -1488756 -1791237 -3034816 -6964573 -14488625 -22951565 -27924016
8424 -27924016 -27711114 -24429773 -20766964 -17596025 -15008528 -13372660 -11965007 -8194400
8416 -8194400 -287053 9589776 16418789 16718571 11257253 4022066 -530890 -30190 4274004
8407 4274004 8529830 9966774 9081181 6886956 1432916 -9640666 -23094071 -30704513
8399 -30704513 -28026452 -19698515 -13458895 -11286219 -9684646 -6749295 -4477967 -4260667
8391 -4260667 -4393372 -3453721 -2985347 -4982701 -8872262 -12615196 -14969191 -15180328 -12407594
8382 -12407594 -7436364 -3429914 -2857785 -4815372 -7282117 -10462657 -15133271 -18890328
8374 -18890328 -17709717 -11270584 -3345498 3320713 8524034 10158210 3580724 -10963190
8366 -10963190 -24490469 -28176486 -23742671 -19449664 -17639084 -13337230 -5118031 921862
8358 921862 900052 -663920 755943 1755132 -1886301 -5744731 -3187638 2124606 295819
8349 295819 -8763835 -13568163 -7571749 1720537 4360154 924743 -1615603 -861049 386972
8340 386972 57389 -2529963 -8433589 -15972381 -19090313 -14531813 -7709680 -5470182 -5849131
8331 -5849131 -1917858 6183521 10848179 8332938 2923267 -1177094 -4845221 -8568356
8323 -8568356 -8497044 -2007096 6894812 11409729 8958076 2487231 -2824434 -3171791 660330
8314 660330 2988331 -602316 -6506142 -6704717 325082 7343506 8382280 5643637 3996482
8305 3996482 3996981 3883967 3753152 3694031 1854160 -1596091 -2600606 315814 1813200
8296 1813200 -2885353 -10142623 -13329347 -12772244 -13419048 -15044985 -12798343 -6928417 -3890100
8287 -3890100 -6527120 -10447308 -12310730 -14679783 -19090419 -20709163 -15206355 -6561524
8279 -6561524 -2304908 -3614373 -5520333 -5249823 -4787275 -5424531 -5156111 -2926892 -1261588
8270 -1261588 -2280187 -3910524 -2650031 1654096 6159268 8830952 9368964 7293157
8262 7293157 2243545 -3630186 -6622817 -5894893 -4308113 -3483385 -1027985 4799498 10468219
8253 10468219 11091531 7311540 4054296 3444416 3622661 4006730 6013933 7871406 4997047
8244 4997047 -2086250 -6242398 -3688912 275062 211241 -436649 4118590 10825618 11158691
8235 11158691 3298033 -7079674 -16709557 -26550624 -33554269 -30417774 -16986388 -3881727
8227 -3881727 86681 -2123353 -3390860 -3942402 -8412947 -15443110 -18138173 -14073740
8219 -14073740 -8260376 -5416671 -4478235 -2321774 1088725 3508459 3853394 2672442
8211 2672442 450162 -2876998 -7156143 -11778373 -15996216 -18798113 -18631236 -14359414
8203 -14359414 -7483565 -2785601 -4651044 -11942932 -18607398 -20905335 -21586470 -24156303
8195 -24156303 -25788780 -21019000 -11367325 -5135522 -6623784 -11350285 -14051260 -15554270
8187 -15554270 -18224584 -20231474 -19633053 -19850485 -24739937 -30875379 -31357340 -26141670 -22137259
8178 -22137259 -22983309 -24849742 -23552127 -20144134 -17018959 -13227437 -7350875 -2157250
8170 -2157250 -2455712 -8831685 -15891061 -17122963 -10977533 -2293379 2429874 1545008 -820901
8161 -820901 -1026171 -1033616 -5019800 -12861854 -20703599 -26941472 -33067449 -38279421 -38124483
8152 -38124483 -30649984 -20399199 -13701738 -12126446 -12396252 -10692901 -5446251 2042640
8144 2042640 8131540 9809637 8197958 6782432 5420480 -152579 -10631307 -18895571
8136 -18895571 -17580144 -8499982 -30981 3580601 5471898 8786915 11014501 7833567
8128 7833567 -499088 -9239994 -14219088 -14706955 -11968074 -7184924 -1655084 2109382
8120 2109382 1423050 -3414057 -8040983 -7976481 -3513150 1198938 3839706 5911055 8400235
8111 8400235 9118025 6876033 5220421 8118893 13677716 16351059 14665716 12511486
8103 12511486 12699714 13548449 12889760 11388849 9847587 6625897 592780 -5639153 -8440254
8094 -8440254 -7966729 -7722019 -9932758 -13369939 -15337608 -14109779 -9731754 -4039362 68734
8085 68734 550921 -2305610 -6469919 -9448527 -8759111 -3063133 5398412 10860589 9109704
8076 9109704 2259963 -3818647 -6665378 -8910565 -12186263 -13124435 -8525616 -2088691
8068 -2088691 -1204387 -6867147 -11453947 -8827953 -2753519 -1161900 -4625831 -6298144
8060 -6298144 -3052639 -218293 -2619272 -6596181 -5949305 -1938076 -901789 -3572528
8052 -3572528 -3742613 1732105 8114491 10573508 11428621 15606718 22452883 26465381 24379057
8043 24379057 17858828 10156427 3030030 -3472024 -9875300 -15046931 -14730001 -5697965
8035 -5697965 6736744 10023518 -1817376 -18512087 -23663525 -13625418 -545180 3271111
8027 3271111 -2038481 -8116586 -9194138 -5495970 -176458 3260797 2694582 -638340
8019 -638340 -3278331 -3891306 -4170986 -4477617 -2214037 3235173 7535779 6757828 3095155
8010 3095155 1660622 3490865 5274089 4556539 1770323 -1659352 -3768821 -1895543
8002 -1895543 3909345 8018714 4323607 -5290141 -11750174 -9477943 -2708622 674901
7994 674901 -1653430 -6063396 -9158760 -10666200 -11034684 -9988648 -8632607 -10317524 -16899214
7985 -16899214 -24889916 -27896939 -23665552 -16804508 -13162171 -13349308 -14185854 -14834528 -17334715
7976 -17334715 -21037992 -21341636 -16224476 -10312764 -9285848 -12819087 -16123606 -16179116 -13303830
7967 -13303830 -8856408 -5003435 -4812127 -8760533 -12833485 -13651971 -13009900 -12841105 -8952503
7958 -8952503 3117900 17663942 22927528 16669482 9172807 7852207 7093411 -1456758
7950 -1456758 -15419489 -25522842 -28473204 -28681351 -29423404 -29184003 -26516881 -23079805
7942 -23079805 -21024874 -20725188 -21222047 -20548181 -16487737 -9359159 -2564009 2033927 7041092
7933 7041092 14807326 22414113 25509652 24902674 24524516 24527418 21756784 16091957 10633645
7924 10633645 5773345 -1132433 -9544767 -14867626 -15201424 -13771795 -12925131 -10916192
7916 -10916192 -7009267 -4604173 -5858292 -7529659 -6140195 -3842636 -4980994 -9446064
7908 -9446064 -13643244 -16104297 -17920738 -18853579 -17258822 -13720955 -11204828 -11103737 -11752334
7899 -11752334 -11418908 -10762510 -11633612 -14597711 -17997886 -18991033 -15940851 -10264191 -5126318
7890 -5126318 -2067103 -416532 -298828 -3436619 -9246911 -12815460 -9855998 -2365396
7882 -2365396 3593723 4946634 3603347 1921095 -577860 -5075177 -10222910 -12510345
7874 -12510345 -9540817 -2814344 2694504 2710280 -1964877 -6367875 -7129287 -5346976 -2916284
7865 -2916284 834837 6296438 10212186 9024739 3952685 -1035778 -4760866 -8098592
7857 -8098592 -9347206 -6060181 -1189528 -854425 -4466992 -3629845 5710509 15790614
7849 15790614 16749515 9558293 3350227 2615032 3543516 2122836 -733814 -3096883 -5180593
7840 -5180593 -6088361 -2226000 7015173 14902857 13408333 3175765 -6296485 -7285462
7832 -7285462 -1952781 1603137 -795825 -6047478 -9312316 -9551047 -8435188 -6649753
7824 -6649753 -4093655 -2236658 -2787059 -4203768 -3047068 464040 1644046 -2514318
7816 -2514318 -9700559 -16629411 -23235647 -29415736 -31367074 -26198871 -17904457 -12982241
7808 -12982241 -11003879 -5593603 4894327 14065728 16797919 15844755 15708066 15168946
7800 15168946 10766231 3927346 -801461 -2266877 -2102069 658160 8328765 18062312
7792 18062312 22466674 18324592 10151157 3275472 -2232884 -8054350 -12119504 -11079332
7784 -11079332 -6468884 -3944134 -6111697 -9325593 -8731012 -4389199 -788919 -1177993
7776 -1177993 -4019240 -5398156 -3902325 -1941813 -2214350 -4048147 -4049906 280884 8273647
7767 8273647 16560408 20949174 19042089 12669554 6973920 5305361 5754426 4726634
7759 4726634 2818062 3802224 7911957 10194842 7184177 1890027 -369590 1237142
7751 1237142 3188712 2888956 806049 -1982347 -5507621 -9668540 -12989769 -13391352 -9832049
7742 -9832049 -3402135 2934495 6430220 6916511 6477865 6749323 7683155 8779820 9490709
7733 9490709 8229808 3686484 -2080580 -4956067 -4666363 -5981186 -11634973 -17520768
7725 -17520768 -18481710 -15820833 -14400113 -14503407 -12247128 -7381866 -4694233 -6414211
7717 -6414211 -8294685 -5715344 -158230 3028909 1103242 -3876589 -7640778 -6930759
7709 -6930759 -1536607 5546590 10729120 12898189 13044617 11676167 8775353 5792001
7701 5792001 4818684 5594032 5921495 5133564 4345127 3335071 636733 -2813715 -3815154
7692 -3815154 -1719920 412483 701883 901928 2488751 4020650 4394704 5201096 7515698
7683 7515698 9616126 10258584 10990787 12778671 13744872 12923312 12596258 13812884 13643165
7674 13643165 10962575 10897604 17970317 27778506 31768112 28629576 24552016 22812331
7666 22812331 19904753 13209093 6467309 4746381 7835596 11407100 12291465 10452207
7658 10452207 7240909 3179280 -2928801 -12270978 -22543846 -28103571 -26176057 -21187640
7650 -21187640 -19408232 -20766788 -20347091 -16923884 -14467072 -14723562 -13923982 -8842200 -1520353
7641 -1520353 4508950 8912816 12834604 15538150 15396981 12173562 6743571 843850
7633 843850 -1944037 1862949 11125491 20282120 25232375 26010642 23250927 16926860 10329800
7624 10329800 9568146 15307463 19778266 16491445 8709596 3386541 1163403 -1188546
7616 -1188546 -2345705 905220 4179901 -1635222 -16136251 -26392290 -22312443 -8867601
7608 -8867601 1664833 4585781 4289260 4587931 4549408 3525404 4126312 7922853 11736726
7599 11736726 10919610 4928433 -2160800 -5886327 -4724350 163794 6518183 11582903
7591 11582903 12633725 9007296 3868237 2092164 4941381 7855487 5409586 -1710923
7583 -1710923 -6530453 -3135940 7069307 17094022 21261586 19594467 16180442 14373369
7575 14373369 13785413 11674123 6979419 2299092 1193469 4094117 8111744 10587752
7567 10587752 11083812 9718041 6008518 954000 -1782000 393401 4693563 5300562
7559 5300562 528291 -4898070 -5843999 -2700840 532683 2010923 2900090 3437897 1695216
7550 1695216 -3021556 -8397302 -12208527 -15106743 -18646348 -22195034 -23674300 -22245315
7542 -22245315 -18571440 -13404905 -7483041 -1754616 3844221 10397761 16841962 18659039
7534 18659039 12960322 3763778 -1660989 -1625079 -1364250 -5110808 -10961334 -15092889 -16996776
7525 -16996776 -17807975 -16729866 -12774091 -8229363 -6815991 -8892919 -11037067 -10075857
7517 -10075857 -5797368 -429751 2878485 2099957 -1217081 -2511626 753279 5582647
7509 5582647 7147935 4939499 2460113 1393236 -474011 -4669793 -8270103 -6771639
7501 -6771639 371514 8677363 12977696 12101946 9186054 7734292 8040487 8076451 7131657
7492 7131657 6683452 7517141 8407634 8874714 10854527 15419368 19677342 19828814 16466362
7483 16466362 14063962 15382792 18731629 20829113 20354993 18407416 16915483 16654049
7475 16654049 15856417 11490262 3152807 -5294453 -9417911 -8361210 -4001063 1818501
7467 1818501 6817157 7619188 3566651 -368981 987729 5439887 6001660 812158 -4661785
7458 -4661785 -5796509 -3706341 -583804 4111006 9966020 13244579 12107688 10273133
7450 10273133 11440926 13382804 11670402 6291539 255198 -5520364 -10933634 -12659334
7442 -12659334 -7307472 2046483 7910743 7152030 3065516 -1334678 -6814393 -13515463
7434 -13515463 -18044476 -17504001 -13135776 -7999633 -3963589 -2406563 -4353091 -7883280
7426 -7883280 -8911479 -7036087 -7139557 -12083680 -17381232 -17485371 -14477332 -14809374 -18675209
7417 -18675209 -18952966 -11675902 -1919697 3217672 2968320 886738 -1788148 -6119060
7409 -6119060 -10662077 -11740868 -9108362 -7619282 -11528025 -19037797 -23912287 -21525947
7401 -21525947 -12789618 -3377951 305132 -4157059 -13157376 -20168127 -21611529 -19409131
7393 -19409131 -17771359 -18627017 -20683925 -21573396 -19646001 -14560928 -7713652 -1879248
7385 -1879248 985893 1788018 3020149 5116670 5244073 677716 -7172958 -13252653 -13579870
7376 -13579870 -8854269 -3290536 -815049 -2872148 -8528034 -14802789 -17443272 -14121400
7368 -14121400 -7895355 -5306792 -9445868 -16598626 -21194651 -21726198 -19521556 -14580497
7360 -14580497 -6882488 -77472 1449185 -856900 -1137856 2261781 4685529 2817732
7352 2817732 -1036258 -4341532 -8166549 -12322779 -12451753 -6766406 -780953 271912
7344 271912 -524274 2444356 7375282 8330117 5807463 5923503 10225821 14367676 16545780
7335 16545780 18914707 20083965 15234018 6125260 2233804 7464166 13025375 9027907
7327 9027907 -2503950 -11848969 -14190261 -12111477 -8940402 -5730756 -3466182 -3484469
7319 -3484469 -5937420 -10067527 -14497344 -16056652 -11860293 -4603063 -1400375 -4231175
7311 -4231175 -6138041 -1075116 7039520 10480554 9107054 9304017 13893968 19281530
7303 19281530 21503915 19857024 15415275 10468405 8193312 8727108 7414346 1179295
7295 1179295 -6017446 -9025591 -9532853 -11900632 -14100688 -10768621 -3312445 1877174
7287 1877174 4361520 8992882 13932749 10463350 -1802565 -10125462 -5321050 5183309
7279 5183309 8390957 3144077 -1843033 -2432135 -2177163 -3081170 -2365905 514897 698953
7270 698953 -5423947 -14507052 -19929069 -19220715 -15996838 -15173897 -17220346 -17630001 -12572449
7261 -12572449 -4143443 2020099 3749888 3778145 4129392 3319875 541885 -1676822 -1520063
7252 -1520063 -908708 -1717931 -2379442 -1092593 952892 2344818 3632243 3767658 -901291
7243 -901291 -9885516 -15864563 -14532398 -12360295 -17008862 -23868415 -21652286 -9857861
7235 -9857861 -407222 -772100 -5120656 -5322262 -1997574 92119 186955 -776023 -4502281
7226 -4502281 -10721892 -12925162 -6098843 4104870 7291226 2161952 -2563729 -959182
7218 -959182 3417528 5341231 5868708 8300353 10478539 6673030 -3676642 -13582291
7210 -13582291 -16237563 -12647720 -9479490 -10238939 -11128696 -6738026 2096365 8908353
7202 8908353 9895302 8368342 9335086 12406961 13264555 10893795 9534100 12665049 17902255
7193 17902255 19666986 15580857 8617116 3394276 1556394 1034210 -666161 -3188406
7185 -3188406 -4120578 -2887473 -2074959 -3648459 -5612948 -5052395 -3507244 -5500130 -10949670
7176 -10949670 -13138574 -7240242 1829471 4296062 -2428479 -10699827 -12420809 -8138329
7168 -8138329 -4201475 -3804674 -4588929 -4169681 -3835382 -5240360 -6413649 -4133209 653135
7159 653135 3000486 431244 -3191173 -2122573 4401610 12037817 17140103 19686643
7151 19686643 20269560 17756077 12054403 6572464 4699336 4995372 3063430 -2163122
7143 -2163122 -7168428 -9207281 -9787649 -11604523 -14569334 -16599712 -16518467 -14476527 -10904440
7134 -10904440 -6639561 -3065111 -895998 231809 377833 -737168 -1603938 625943
7126 625943 5654686 8475363 5096439 -2019539 -7312206 -9200966 -9913993 -9341042 -4152753
7117 -4152753 5688549 13703702 13047412 4090668 -6215668 -11559639 -11379004 -9346144
7109 -9346144 -8036458 -5845543 102938 8373071 13142422 11350112 7112470 5600821
7101 5600821 4916564 -633138 -9993771 -14614691 -10002311 -2181969 812123 -846964
7093 -846964 -1574201 217994 1059062 -840472 -3275199 -4749086 -7080073 -11945353 -17857486
7084 -17857486 -22161326 -24022573 -23945012 -21825486 -17383710 -12167315 -9353976 -10667258
7076 -10667258 -14453511 -18225830 -22267916 -27761809 -31058585 -24697200 -7896282 8085608
7068 8085608 11537250 5159934 1574313 4507745 4270295 -5134298 -14711193 -13421709
7060 -13421709 -4380816 1363835 1679205 2925489 5514228 2187331 -7912306 -14442058
7052 -14442058 -9652807 1020569 7365628 7369437 6365580 7733437 10188800 11842014
7044 11842014 12015635 10171196 6569845 3099342 975066 -1079751 -4332325 -7591898
7036 -7591898 -9568889 -11749723 -16222078 -22113445 -26731292 -28812392 -28111174 -23457960
7028 -23457960 -14620722 -5231180 -207294 33643 -134230 2458852 6220863 8110304
7020 8110304 7767958 6469732 3976838 -814113 -6641148 -10076336 -9787045 -8451610 -8704623
7011 -8704623 -8768521 -4998156 1459773 4011256 -1593510 -11227665 -16753726 -15107682 -10447452
7002 -10447452 -8218859 -10132883 -14857466 -20323080 -24036868 -23470497 -18140623 -10625926
6994 -10625926 -4435588 -1027762 967061 4054901 9269378 14772304 17561194 17004711
6986 17004711 15566465 15337217 15623270 15271691 15063342 15323826 13191801 5646363 -5756052
6977 -5756052 -16094447 -21879097 -21947218 -15874787 -5797777 1976028 2509596 -1281529
6969 -1281529 -2765638 -1203770 -1087068 -2564260 -316342 6786542 12882536 14682137
6961 14682137 16009210 18901571 18127517 10392672 1999711 54894 1601212 -504835
6953 -504835 -5210393 -5368057 500187 6936832 10370851 11192482 8416748 880804 -6571046
6944 -6571046 -7019697 -2563776 -2614008 -8917813 -11346117 -2899020 9326183 14461343 12720249
6935 12720249 12269340 15408273 16368157 11894075 6415435 5105348 7216347 8849392
6927 8849392 8825263 9014336 10712461 13198252 15214086 15872785 14038960 8668152 1050093
6918 1050093 -4241887 -2898191 3740634 8427865 4925420 -5240177 -14257683 -15901833
6910 -15901833 -10716180 -3930673 -8775 534575 279645 1572301 3905537 4953400
6902 4953400 4087253 3149731 2929994 1288529 -2924133 -6184995 -4173097 1347814 3236555
6893 3236555 -2919202 -14307231 -24984818 -31431401 -32988990 -29938114 -23776591 -18153642
6885 -18153642 -17043763 -21367310 -27943244 -32115444 -31729255 -28599941 -25654624 -23189011
6877 -23189011 -19728073 -16292939 -16330443 -19951965 -22067812 -19281348 -15126028 -14332471 -15260141
6868 -15260141 -13606472 -10910337 -12132420 -15843266 -14965993 -8320750 -3357271 -4536519
6860 -4536519 -6448630 -2754204 4729044 11290110 17649131 26061918 32648404 31845701
6852 31845701 26369708 24574675 28181166 30340473 26956031 22269883 20140224 16806817
6844 16806817 7953475 -1875098 -4267222 220626 1647030 -5371953 -13617584 -13195884
6836 -13195884 -5132642 683891 -785653 -4529542 -4603203 -2266899 -2128109 -5042313 -8868457
6827 -8868457 -12620414 -15501299 -14993305 -10904738 -8648437 -12792695 -19309772 -20383572
6819 -20383572 -15385420 -10172492 -6571167 -925886 6304467 8716924 4783980 2020815
6811 2020815 5575378 9974084 8074161 2090433 -914335 172528 871304 -1259147
6803 -1259147 -5366642 -10410443 -13829040 -10733218 -791852 7402481 5866467 -1503002
6795 -1503002 -4433590 -729668 2834720 2695578 2739628 5800285 9075842 9837692 8751069
6786 8751069 5697641 -894457 -8248297 -9510274 -3206795 3315808 3613394 330502
6778 330502 -190368 2960534 5835957 6010048 4293705 2516358 3010089 8044858 16532184
6769 16532184 23070005 23036655 17242425 9828349 3851452 808112 1619050 5228468 8306755
6760 8306755 8913092 8617225 9028585 8894110 7230054 6419094 8583267 11171535 10329338
6751 10329338 7206465 6534449 9501599 12336070 12170952 10192237 7972964 4589757
6743 4589757 -526718 -4930963 -6228881 -6004251 -7638140 -10933981 -11973951 -8714146
6735 -8714146 -3927020 -1154840 -63763 1740001 3844360 3414303 263500 -2123724
6727 -2123724 -1810985 -1315515 -3174201 -5475944 -4787512 -1601406 169691 -2150723 -8302812
6718 -8302812 -16169580 -21663436 -19863332 -10496019 -890829 1031290 -4006191 -8667344
6710 -8667344 -9253475 -8773393 -10162935 -12237551 -13257960 -13156331 -11040003 -5848475 -934759
6701 -934759 -2230259 -9534972 -15214171 -14451424 -11357784 -11453256 -13485251 -13059451 -9634739
6692 -9634739 -5204911 -325902 3665461 2699448 -4222987 -10888403 -11275714 -7877239 -6800302
6683 -6800302 -8028706 -7483535 -5811037 -6846633 -8760814 -5656916 1492253 4200282
6675 4200282 -965708 -7047650 -7600869 -6067434 -9147688 -15954909 -19796909 -17998023
6667 -17998023 -14269345 -12063841 -10157678 -5609347 1597371 8000919 9871058 6630695
6659 6630695 1229496 -3037884 -5526622 -7197812 -7801660 -6541533 -5112071 -6808316
6651 -6808316 -11634829 -15145319 -13911094 -10053632 -8340187 -10232507 -12891466 -13211644
6643 -13211644 -10723667 -6658885 -2201947 1465354 2875073 1895999 1360056 4692336
6635 4692336 10737879 13335422 8807715 2086671 1229468 6597788 10722582 9376594
6627 9376594 6441750 5397824 2859812 -4407412 -11827488 -12942846 -8715653 -4003110
6619 -4003110 1226920 8951429 14617018 11534179 2706056 -1859352 -159852 -283866
6611 -283866 -5711922 -9342140 -6238555 -1977393 -2024223 -1871794 4263563 12157728 13929373
6602 13929373 10514714 8884682 10489867 11263864 10657684 11882869 14075688 12274431
6594 12274431 5474341 -1959126 -7090161 -10539509 -11972430 -9886104 -6300521 -5321575
6586 -5321575 -6129551 -3613636 2675449 6560337 4537272 1102635 1483449 4076079 4097039
6577 4097039 951539 -2139981 -3271764 -2977280 -2043359 -1173690 -1391674 -2498083 -2709943
6568 -2709943 -1807949 -2699277 -7505726 -13773554 -17084588 -16284420 -13935445 -12680752 -13305964
6559 -13305964 -15407392 -17649821 -17811055 -14646753 -9763964 -6326278 -6041261 -8273845
6551 -8273845 -11401371 -13895330 -14802288 -14482584 -14421235 -15333536 -16190868 -16027177 -15412814
6542 -15412814 -14647230 -12051087 -6675090 -1772787 -1989690 -6536838 -8788513 -4731466
6534 -4731466 1208314 2091829 -1826416 -3879715 -1216696 964224 -2350345 -7940648
6526 -7940648 -8841196 -4335108 -376000 -784594 -3133044 -3979400 -3268324 -1879374 435114
6517 435114 1924927 -1830811 -11310155 -19142481 -17714257 -8633570 113604 4761926
6509 4761926 8318139 13524604 19087370 23299877 25839904 24653430 16555559 3602883
6501 3602883 -5705932 -5109928 2575739 10167451 14611066 17621200 20687739 23359787
6493 23359787 24881766 24151010 19509261 11906289 6743759 8503844 14136616 15922364
6485 15922364 11168614 5077238 2965123 3604049 2640914 -456225 -2285210 -810585
6477 -810585 2795667 7401919 13374593 19318078 20406744 13458441 2951482 -1718969
6469 -1718969 3584556 12727930 16274304 11377835 2395446 -6062538 -12500435 -15781870
6461 -15781870 -14295700 -9658865 -6999311 -8466087 -9409104 -4457346 4715707 11326778
6453 11326778 11641354 7323113 849897 -6439615 -11309829 -8983777 502022 9744429
6445 9744429 11386214 6254103 904614 -1317417 -2742588 -5468544 -7820816 -8356326
6437 -8356326 -9214821 -12072183 -13562705 -9269526 -1270248 3050261 261082 -5467580
6429 -5467580 -9465700 -12849695 -18811306 -26545535 -33023117 -37834833 -41293695 -39877927
6421 -39877927 -29751321 -14625042 -4083166 -2745997 -6093667 -8347588 -8983395 -9071390
6413 -9071390 -6949814 -1957507 1677131 -455546 -7017290 -13749234 -19322573 -23991829
6405 -23991829 -25539934 -22280950 -18042816 -17770905 -18964388 -14217236 -3024655 5454363
6397 5454363 3796648 -4783111 -11832412 -13516489 -11706143 -8980616 -6706742 -5923502
6389 -5923502 -6349090 -5634460 -2499013 504710 67587 -3001271 -4684978 -2957804 444256
6380 444256 3071360 4084168 3567277 1982162 849608 1949961 5002709 7657934 8489542
6371 8489542 8384172 7983017 5671030 414523 -4386019 -3259925 3924782 9749411 7400624
6362 7400624 -269478 -3583013 1767399 9326055 10625735 5667604 1007241 23127
6354 23127 260637 -182455 670014 3831547 5839040 3420357 -1181093 -3086151 -1404984
6345 -1404984 278727 -796847 -3863474 -6995409 -9254286 -9828142 -7405596 -1809056
6337 -1809056 4843626 9610383 10886998 8891727 4995342 1218191 -412622 817138
6329 817138 3356288 4234600 1423594 -4292870 -9799935 -12322624 -11840531 -10716512 -10869521
6320 -10869521 -11682170 -11054399 -8264446 -5102249 -3818416 -4379621 -4541263 -2702497 356094
6311 356094 3262935 6313015 10080646 12441999 9847214 2406707 -4862511 -7499740
6303 -7499740 -6196143 -4202739 -2686392 -1398693 -1495540 -3588633 -4433116 -363241 6246957
6294 6246957 9008552 6755711 5513912 9238876 13846057 14227592 12874098 16097382
6286 16097382 23821369 28706418 25297834 15459388 4044718 -6621657 -16018063 -22447078
6278 -22447078 -24076118 -22102896 -20156700 -19872949 -18732299 -13720472 -6304893 -1542711
6270 -1542711 -1733378 -3419007 -2551487 -287843 -281855 -1843638 -646302 3614303 5458275
6261 5458275 1456474 -4527691 -6566659 -3445632 2483756 9265836 14517976 14352440
6253 14352440 7986960 1140151 110850 4070983 7544224 8661261 9871707 11646830
6245 11646830 11042707 6719923 778183 -4629403 -8347071 -8139837 -2333132 6083597
6237 6083597 11392529 11499293 8242787 2229219 -6658330 -13683476 -11814825 -2221935
6229 -2221935 4903578 3777919 770732 3921718 10861590 13730683 11505582 9765446
6221 9765446 10711376 11212685 10289876 11332047 15459202 18264914 15460260 8169319 955109
6212 955109 -2591686 -1249022 3894557 9359930 11251821 8824970 5077754 3253848
6204 3253848 3532133 2956992 -2103904 -12325867 -23092207 -27732705 -25227303 -22409829
6196 -22409829 -25146476 -29397177 -25863061 -12810415 919362 6248200 2416454 -5709919
6188 -5709919 -13591668 -17888918 -16157431 -9484256 -2585849 1703819 5294853 9619244
6180 9619244 11357662 7609911 2114964 645423 1863993 -887583 -8530029 -13458952
6172 -13458952 -10258187 -3961501 -3623361 -10905919 -19230045 -22302384 -19337063 -12901082
6164 -12901082 -6093786 -2388041 -4339452 -10569961 -16290048 -18166871 -16661892 -12701704
6156 -12701704 -5304544 4860520 12294472 11358635 3674071 -2838876 -2706756 2326527
6148 2326527 7608289 11154512 13525212 15223151 16457194 17561199 17915359 16300583
6140 16300583 13632038 12740406 13607759 11955530 5492363 -1534481 -4125045 -4197388 -7063700
6131 -7063700 -11819110 -11869280 -5524105 687098 1832361 1729071 6066176 13052342 16438403
6122 16438403 15120387 13813626 14956178 15515274 12775886 8714472 6484984 5825801
6114 5825801 4716578 3664202 5229477 9527944 12776623 11484598 6867974 3637014
6106 3637014 4676137 8422231 11858593 14321931 16900210 19555072 21279209 22366847
6098 22366847 23527229 22707686 16308593 4893664 -5384509 -9112602 -7083695 -3828942
6090 -3828942 -2651675 -5401004 -13592865 -25554836 -34854924 -36456435 -33164863 -31114330
6082 -31114330 -30035670 -24100662 -12618713 -3029996 -894855 -3171229 -5217729 -8603946
6074 -8603946 -16176548 -23743932 -24174984 -18370711 -15175467 -19801282 -27905514 -32067911
6066 -32067911 -29044188 -19590374 -6771529 3243870 4301487 -1880235 -5392913 -236455
6058 -236455 7103753 6688057 -463511 -4196562 -381299 3742974 1129596 -5381872 -8957083
6049 -8957083 -8830500 -9041686 -10458258 -9835173 -5656478 -111663 4483363 7353421 7584641
6040 7584641 4566567 399427 -1398973 81554 3145208 6901771 10816347 11258261
6032 11258261 3933824 -8537374 -16542934 -14162894 -6077998 -483042 1040430 2136998
6024 2136998 3479098 2087423 -1972206 -3946993 -590321 5903003 11194715 12904835
6016 12904835 10761178 5900522 1065516 -1312765 -2192907 -4467679 -7853340 -8549581
6008 -8549581 -5227161 -1845157 -2353708 -5633287 -8307946 -9865314 -11745252 -13394559
6000 -13394559 -12905064 -10518802 -8039626 -5334302 -887224 4165776 6088116 3604769
5992 3604769 40894 -1036587 -63616 255417 -966550 -2514854 -3686853 -4874552 -5795054
5983 -5795054 -5300246 -3548471 -2637555 -3734678 -4613364 -1999923 3544010 7045008 4597525
5974 4597525 -1930256 -7297995 -8987836 -8674753 -8046187 -5996765 -870336 6690058 14272506
5965 14272506 19343970 19698596 14799654 8058663 4944505 6472381 7213879 2897608
5957 2897608 -2574436 -2156296 3830400 7633918 4762505 -547461 -2213037 65722
5949 65722 2853087 4749973 6248703 6197243 2601277 -3478002 -7772688 -6825796 -882809
5940 -882809 6469422 10388318 8054676 1827873 -2081338 -152186 4254100 5196104 1275275
5931 1275275 -4139559 -8575436 -12673468 -16497776 -17155738 -12059874 -2978808 4857196
5923 4857196 7516090 5877833 4507002 6456671 8892255 5493553 -5442461 -17180759
5915 -17180759 -21322109 -16989456 -10208338 -5433960 -1997544 1149661 2252061 296657
5907 296657 -2288012 -3326592 -4381633 -7610152 -11482078 -12867997 -11900843 -11649341 -13725717
5898 -13725717 -16811233 -18952777 -19005164 -16276822 -10948346 -4786707 -64378 1726229
5890 1726229 -686541 -8188287 -18541213 -25908019 -26248720 -21913977 -17773679 -14414992
5882 -14414992 -9464743 -4483776 -4528051 -9549395 -11897423 -5731384 5084854 12281494
5874 12281494 13365682 12351422 12461746 12863495 12186387 11031200 10275059 9952914 10455074
5865 10455074 12117968 13080049 10556820 5499744 3133640 6688089 12554643 14107282
5857 14107282 9144544 1186598 -5658352 -10120510 -11964459 -10069146 -4470840 1285727
5849 1285727 2548869 -1296902 -5597154 -5171982 212366 5522208 5182425 -2168389 -12959363
5840 -12959363 -21643547 -24108781 -19185734 -8535795 3799211 12427258 13383552 7411780
5832 7411780 -149887 -4130997 -4068254 -3090010 -3115372 -3310169 -3239532 -4549734 -7790206
5823 -7790206 -9823470 -7180075 -1131173 3210948 2817910 -338455 -2426830 -1901687 -216395
5814 -216395 -108804 -3499202 -9550420 -14734940 -16605425 -17389648 -21291235 -27804840 -30923533
5805 -30923533 -26689902 -18661131 -13294235 -12243135 -12512079 -12466595 -13356059 -15054892 -14743438
5796 -14743438 -11459262 -8641861 -9642652 -12645247 -12516338 -6702859 2666612 11558209
5788 11558209 16677020 15998473 9532867 464043 -6282716 -7813467 -4954018 -270404
5780 -270404 3760097 4290512 -1124731 -10806444 -18121275 -18103430 -14275417 -14877011 -21861860
5771 -21861860 -27946429 -26353799 -19130816 -12415771 -7352973 -1038777 5629723 7411371
5763 7411371 2404954 -5156281 -11153863 -15754106 -19351561 -19193028 -13490688 -5374049
5755 -5374049 931099 5192711 8976735 11108185 9679261 6763628 6278849 7515106
5747 7515106 5123364 -3783033 -15649293 -24215954 -26008642 -22307829 -18058735 -18320707
5739 -18320707 -23118626 -26447627 -23275621 -16416724 -12528683 -12276110 -9922394 -3230474
5731 -3230474 2292318 1654775 -2270840 -3417336 -453814 4230142 10004004 17065760
5723 17065760 21794635 18690357 7514683 -5273669 -12926015 -13803134 -10776086 -8299548
5715 -8299548 -10025770 -16168300 -22682720 -25466030 -25214318 -25185872 -24679732 -19482884 -10194873
5706 -10194873 -5065087 -10506334 -21724765 -27489111 -23221924 -15068052 -10920460 -11666286
5698 -11666286 -13007345 -12620824 -12275560 -13717479 -15188969 -13142466 -6957826 -1225394
5690 -1225394 -2201746 -10929939 -20700878 -23469770 -18708305 -13181790 -11455924 -10574620 -6722854
5681 -6722854 -3033153 -5113791 -10504621 -9602677 1182116 13013630 14986279 6965174
5673 6965174 -1854227 -4329106 -1172275 2567876 2507331 -2599370 -9622827 -12876596 -10137076
5664 -10137076 -5658166 -4293470 -5017573 -4688364 -5540399 -11985804 -20684169 -21947427 -13196742
5655 -13196742 -3824663 -3014597 -8915094 -14364816 -17534822 -20800773 -23388446 -22314746
5647 -22314746 -18669306 -16366751 -15156536 -10489720 -602759 10804342 19231727 22851218
5639 22851218 21470780 16208148 10605979 8231077 8285783 6545824 1068314 -5702944
5631 -5702944 -10362483 -11222641 -8189429 -3420140 -1501473 -4896690 -9471231 -9058946 -4565214
5622 -4565214 -3344061 -8529840 -14533569 -15469735 -12892231 -11673906 -12483688 -12674119 -11743222
5613 -11743222 -11550597 -12644281 -13882377 -14658198 -14879982 -14041603 -12632528 -12826238 -15241920
5604 -15241920 -16626297 -13524352 -7102032 -1857895 -635381 -3026223 -7119303 -10214772
5596 -10214772 -9296283 -3978725 1644430 2911946 141078 -1948145 -66592 4282484
5588 4282484 7026064 5827756 2808833 3540161 11366264 21753483 25289074 18407789
5580 18407789 7958310 2320639 1705973 1403448 694883 2072984 3849403 1124240
5572 1124240 -5801001 -10954991 -11834742 -12535719 -15740888 -17747552 -14619362 -8249300 -3042465
5563 -3042465 -991062 -3059443 -10630657 -21518145 -28650410 -27296351 -20632118 -14381473
5555 -14381473 -9559325 -4945799 -2794111 -5842197 -10934637 -12102944 -9125163 -6992957
5547 -6992957 -7125945 -5349645 207677 4742756 2792593 -4979344 -13059311 -16577612
5539 -16577612 -14395599 -9287570 -5983072 -6819474 -9074958 -8855924 -6830184 -6550566 -7806933
5530 -7806933 -6622706 -2482313 -267235 -2939291 -6867555 -7055219 -3141715 2341249
5522 2341249 7778200 11580928 11266938 6972781 2847022 1640012 940731 -1984473 -5205651
5513 -5205651 -5982432 -5903233 -7103069 -6676645 -1213560 5189335 4540587 -3711035 -11502625
5504 -11502625 -12899356 -9802863 -5653662 255430 9074829 17608584 20836809 16921434
5496 16921434 7903176 -2259241 -9598868 -13070467 -15959243 -20975167 -24446202 -20642958
5488 -20642958 -11962094 -7730220 -10764613 -12753828 -7262787 143990 1286576 -1605969
5480 -1605969 -1045149 1736841 -1873807 -13491519 -24271328 -27307442 -25335518 -23241366
5472 -23241366 -19984233 -12607477 -3654213 603420 -2066847 -6992153 -7390220 -1433551
5464 -1433551 4907190 3402559 -5941228 -12219391 -5789898 8652663 17111864 13771826
5456 13771826 6392648 3536849 4570806 5448184 6356256 8099219 7513769 3229659 703423
5447 703423 4034517 7081244 1346573 -9903635 -14654539 -8774870 -779628 1101221
5439 1101221 -1730931 -4341252 -6087674 -8249696 -9692715 -9357214 -8731232 -8028811 -4144108
5430 -4144108 3543396 9413345 8471496 3819467 2280709 5052725 7955449 9205385
5422 9205385 11170182 14589647 16268029 13605652 7752582 1371656 -3816954 -6892653
5414 -6892653 -8040573 -9309929 -12371028 -15502656 -15562194 -12594393 -9321633 -6713246 -4068405
5405 -4068405 -2833284 -4911480 -6825562 -2144313 7969831 13383030 8570093 1655739
5397 1655739 3737123 13587762 20161809 17530770 9684907 1834062 -4933066 -9629710
5389 -9629710 -9584985 -5124948 -292386 3317261 8154714 14248374 17046229 14530732 10627467
5380 10627467 7966827 3233273 -5582752 -13232906 -14843748 -14443913 -18084585 -22122117
5372 -22122117 -17474108 -4195579 7430509 11023962 10617262 10979329 10038229 5319029
5364 5319029 747809 877668 3048233 1637505 -2799734 -4870072 -3473905 -3646349 -8683859
5355 -8683859 -15050955 -16984473 -13550034 -9314752 -9128021 -13440201 -18591282 -21097738
5347 -21097738 -20891181 -19818462 -18229655 -15278130 -12066056 -11168936 -12157980 -10945346 -5614521
5338 -5614521 -128855 448552 -3533022 -7299896 -7689995 -5521322 -3031806 -1737463 -2513255
5329 -2513255 -5556924 -10060897 -14933560 -19341697 -21997063 -21447178 -18103846 -14205436
5321 -14205436 -10677083 -6420757 -2199823 -1925130 -6985413 -12037100 -10540828 -2896630
5313 -2896630 5001509 10077576 14317447 18882642 20682307 16341676 6647088 -4256187
5305 -4256187 -12225418 -15344554 -14729623 -13229484 -11881958 -8735069 -3269416 36719
5297 36719 -3514078 -11595985 -16996844 -16888449 -15365854 -16445566 -19614020 -23541247 -28757732
5288 -28757732 -33748153 -33039368 -23517541 -10168513 -1660178 -1305650 -5009955 -7111837
5280 -7111837 -6050547 -4845629 -7270607 -13071323 -17117964 -15010117 -8953774 -5046555
5272 -5046555 -5188040 -6153617 -6961346 -11010370 -18326397 -21919129 -16809604 -7980903 -3548010
5263 -3548010 -3578331 -2073229 2485313 5538842 4218306 -209192 -7419312 -18349168
5255 -18349168 -29147558 -31787144 -24012459 -13601018 -9220603 -10908937 -12768960 -11453325
5247 -11453325 -8369844 -6300295 -7411675 -12436630 -18488787 -19615915 -12880344 -2414265
5239 -2414265 5490741 9416389 11602602 12079424 9133594 4711718 3373052 4570122
5231 4570122 1458441 -9455754 -21541819 -25028656 -18444372 -9144523 -3945967 -3365346
5223 -3365346 -4508655 -5099658 -3590928 874356 6424528 8955591 6967745 4135682
5215 4135682 4871402 8712872 11348848 10194872 6663291 3479760 1930494 1604284 1075881
5206 1075881 -1062553 -4578054 -7670185 -9911036 -13420483 -18602095 -20440635 -13220486
5198 -13220486 1209197 14055195 19181585 18112470 14567474 9050279 1781606 -3399657
5190 -3399657 -2696085 2411145 7737859 12401972 17999745 23232612 24470703 21890960
5182 21890960 20320118 22349176 24181802 20587518 11777786 3314806 427638 3712466
5174 3712466 9226209 11585040 7991334 586613 -5446184 -6855581 -5181177 -4216406
5166 -4216406 -4928194 -3724301 3334392 14351141 21104788 17041802 5641667 -2087787
5158 -2087787 435708 8728893 14125182 13755944 10482101 6330985 1395855 -2152797
5150 -2152797 -829868 4813677 10349327 13737994 16874755 20105336 20539312 17809899
5142 17809899 16179394 17698518 18111251 13702463 7849636 5491062 4498129 -1133785
5134 -1133785 -11270800 -19226348 -20929937 -18416713 -13871810 -6736092 1201579 3991626
5126 3991626 -1010534 -7846189 -8499444 -2288389 5080549 9601095 11766590 12529916 11111117
5117 11111117 7268242 2311927 -2747505 -7220913 -8668517 -4290713 4371087 11244976
5109 11244976 12092405 8561774 4239376 -127709 -4486732 -5671747 -866995 5924126
5101 5924126 6286222 -2199063 -12020786 -14523216 -9531535 -3633348 -1624044 -3164724
5093 -3164724 -6196308 -9391113 -10993641 -8792227 -2889242 3180731 5236882 1558880
5085 1558880 -6726219 -16630404 -24155900 -25953168 -21660646 -14349648 -8221164 -6106541
5077 -6106541 -8664958 -14396823 -19927860 -21672976 -18443506 -12253826 -6328001 -2644611
5069 -2644611 -1099092 -93132 1866990 4019926 3188148 -2461790 -9656681 -12444216
5061 -12444216 -8996220 -3483619 -150942 1403721 2858891 2420204 -2215712 -7879613
5053 -7879613 -8436312 -3999515 -2547131 -9676274 -20519796 -25444686 -21229729 -12588312
5045 -12588312 -4497106 1769800 4962356 1882725 -7915752 -18794153 -23891880 -21878268
5037 -21878268 -16369354 -10286842 -3944179 2111477 5846597 5980860 3294876 -683888
5029 -683888 -4446307 -5898167 -3212380 3039102 9993662 14686436 14742830 8242191 -3630979
5020 -3630979 -14031904 -14944398 -5827888 5624749 12771982 16048006 17698222 15745855
5012 15745855 8169189 -460693 -2933852 994328 4716958 4536459 3646262 5001421
5004 5001421 5573477 1017150 -7330957 -13884092 -15817726 -15567261 -16522836 -18503059 -18483198
4995 -18483198 -15175125 -11590772 -11658473 -14466498 -14535067 -9506797 -4752834 -6647386 -12990309
4986 -12990309 -15055466 -9149920 -1018720 2639394 2020304 733474 -994716 -4947721
4978 -4947721 -9398626 -10404887 -8264843 -7732262 -10312365 -10269711 -1555504 12905997 22377459
4969 22377459 19506892 8197153 -1161002 -2743226 759720 4329839 6856309 9504264
4961 9504264 11172696 9468004 5377580 3289061 5404017 8389327 6939662 -180679
4953 -180679 -8442545 -11904171 -9380708 -5786865 -6118023 -8935550 -8896694 -5596482 -4824518
4944 -4824518 -8937670 -11706170 -7375297 237118 4200874 5753357 10592049 16490332
4936 16490332 15018422 6245155 1390257 7171333 16033054 17049190 9978727 3117893
4928 3117893 2294782 7110665 13933240 17923008 15650615 9737320 7341643 10560799
4920 10560799 12646777 7715069 -468810 -4360549 -3113136 -1550168 -1938821 -2634493
4912 -2634493 -2725618 -2582137 -1213329 2294476 5984020 7564544 8247982 10623245 14457152
4903 14457152 17626841 19071725 18166108 14005232 8000271 3926176 2968782 2694997 2829531
4894 2829531 6119547 10707377 9422693 1646758 -2304944 4394363 14266213 17713587
4886 17713587 18185466 24353157 33624339 35931887 29942628 23614001 21781188 24093078
4878 24093078 31013580 40439474 44260718 41589904 46784437 64679842 65665692 14424079
4870 14424079 -74273613 -138738152 -141004447 -108232299 -87735137 -86085008 -77484293 -53729969
4862 -53729969 -33982643 -30301006 -31964992 -27256362 -19395922 -15015072 -12867540 -10405655
4854 -10405655 -9732711 -11398268 -11147784 -7037635 -2883087 -2355985 -5747767 -12761291 -21587343
4845 -21587343 -25932958 -21044520 -12034288 -7482837 -5649683 2483048 16108903 22525260
4837 22525260 15478376 4515385 771446 3127203 5035959 6526031 10880749 15082922
4829 15082922 12641700 3874805 -3635895 -4435330 -384382 3134477 2765916 -802345
4821 -802345 -4036221 -3824683 -359531 3811564 6921486 8100125 5560922 -1406848 -8906309
4812 -8906309 -11494402 -9397468 -8075560 -9754294 -10557528 -7663675 -3758434 -1532070
4804 -1532070 978757 5462944 7972470 3360682 -7384647 -18453760 -26025385 -29944345
4796 -29944345 -30140715 -25711194 -17979029 -11543720 -10654730 -14666823 -17536965 -13270064
4788 -13270064 -3379551 2713968 -2011335 -12411273 -16142058 -8673200 1430045 3575465
4780 3575465 -3189075 -11789918 -16032600 -14798289 -10763412 -8210829 -9824868 -13348377
4772 -13348377 -13808619 -10680794 -9523818 -14369967 -21957941 -26069080 -24349502 -18518192
4764 -18518192 -11596831 -7566386 -9321022 -13299866 -10682054 1268228 13144064 14410189
4756 14410189 6963990 960065 -167406 -2183387 -8004366 -12123692 -10131834 -6823135
4748 -6823135 -9598746 -17625974 -22915319 -21035609 -16367728 -15841164 -20219420 -23808682
4740 -23808682 -22261756 -18203714 -17363443 -20578324 -22865688 -20549776 -15647339 -11730978
4732 -11730978 -9089236 -6634200 -5453942 -6983152 -9905636 -12301129 -14751746 -17664106
4724 -17664106 -17711902 -11601875 -2266562 3351541 2463594 -1618573 -5372991 -8701899 -12380372
4715 -12380372 -15673864 -17268937 -15957890 -10758777 -3300139 998042 -1818145 -8421074
4707 -8421074 -11994794 -11244067 -10517398 -11174935 -9096546 -2241602 5355818 9824374 12400715
4698 12400715 14923965 15237693 11142268 5242039 1821482 1605477 2754653 3984251
4690 3984251 3684912 -294062 -6167023 -7310856 -529098 8168132 11310428 10231905
4682 10231905 11161926 13713408 11505604 4052483 -477787 3143712 9876673 12355001
4674 12355001 10340279 7615166 4150965 -2659228 -11229730 -16012726 -14477097 -9863483
4666 -9863483 -6667276 -6437403 -8309299 -10706927 -11500713 -8767996 -3037915 2139235 3103113
4657 3103113 -403995 -4940046 -6724585 -5536410 -4988595 -8035332 -12476043 -12860512 -7497567
4648 -7497567 -1149821 1137831 630066 2070740 5570595 5737076 -293479 -7939383 -10678871
4639 -10678871 -7757182 -3444819 -442608 2220604 4926745 4973083 351127 -6016311
4631 -6016311 -8437797 -4787234 1013024 3395651 982933 -2893177 -4964329 -5868647
4623 -5868647 -8438192 -12902163 -15350097 -11818215 -3411400 3775247 4551952 188258
4615 188258 -2970507 -1122781 1770878 -1569035 -11899426 -20763752 -19707166 -10221687
4607 -10221687 -1289282 1972844 2943710 6187399 10292197 11071722 8445385 5642319
4599 5642319 3121589 -1838751 -9111746 -13583609 -11097184 -3976973 1602534 2528512
4591 2528512 1330142 2407695 6783530 10531029 8409703 -301864 -9982343 -14032433
4583 -14032433 -11827685 -8452840 -7564319 -7307081 -4544510 -352157 1499007 188272
4575 188272 -1136874 -99194 1675210 1109468 -2099495 -5207148 -5769384 -3921484 -1127457
4566 -1127457 2113724 6022986 9388425 9757513 7003824 4909256 6619811 9342759
4558 9342759 7072387 -649491 -6331005 -3476432 4571474 8339190 3796464 -3544542
4550 -3544542 -6501943 -4660185 -3067182 -5018798 -9078196 -12515271 -14736012 -16242151
4542 -16242151 -15967372 -11639100 -2963143 6526249 11447074 8640067 -226839 -9624424
4534 -9624424 -14155712 -12583366 -8105267 -4249681 -1166633 2650994 5763140 4123829
4526 4123829 -2642360 -8328717 -6610899 1147529 7926889 10067579 10441908 12407966
4518 12407966 14643275 13843685 9693579 4903046 2149181 2857317 7226349 13132002
4510 13132002 16018256 12297376 3260683 -5156173 -6532772 1562838 15307011 26151304
4502 26151304 26801784 17714494 7079987 3331338 8125256 16572772 22391256 22130328
4494 22130328 16680027 10416584 7576646 8328121 9700136 10506692 12313437 14496373
4486 14496373 12591828 4885154 -2789491 -3565841 1058280 3438143 683422 -2018770
4478 -2018770 80436 4161230 3551452 -4454284 -16660859 -27543883 -32573820 -29745776
4470 -29745776 -20519158 -9386148 -1286136 1207375 -1119724 -4930004 -6477198 -4366818
4462 -4366818 -510103 2196676 2476418 172247 -5060094 -12066518 -16475556 -14413080
4454 -14413080 -8151358 -4351855 -5577639 -7254005 -5162934 -2276997 -4270133 -10459998
4446 -10459998 -14127725 -11907308 -8345600 -9175442 -13363747 -15140731 -12457795 -9653488
4438 -9653488 -11050606 -14886648 -15706408 -11237786 -4452450 676844 2871052 2535939 -328574
4429 -328574 -5217623 -9396315 -9589880 -5917907 -2660829 -3867658 -8497555 -11219374 -8752680
4420 -8752680 -4248087 -3385068 -6518988 -7914976 -4062913 853857 1071530 -2071612 -2364197
4411 -2364197 1955462 6662604 8952983 10327001 11175446 8836833 3567565 671971
4403 671971 3108072 6810077 7075009 4947648 3228527 916036 -3447821 -7215833 -7912377
4394 -7912377 -8274180 -11328179 -14223171 -13344443 -11898041 -14875798 -19420940 -18840128 -14604180
4385 -14604180 -15043300 -21859484 -27021632 -24975571 -19851418 -17752475 -19009026 -21387404
4377 -21387404 -24725151 -28601043 -30370572 -28979333 -26832806 -25573386 -24022767 -21914948
4369 -21914948 -20995733 -20773212 -18216928 -13476152 -10588056 -10517100 -9105053 -4285622 457357
4360 457357 2511673 3990345 5954743 4890917 -1093386 -8159244 -12752914 -16013592
4352 -16013592 -18167043 -15061634 -5765892 2418285 2936950 -1127391 -3509678 -4775308
4344 -4775308 -8352590 -11323284 -8251035 -1596687 688853 -2791768 -5200958 -2015213
4336 -2015213 3526138 6101750 3942847 -1302527 -5515100 -3737193 3989172 9642881
4328 9642881 5892648 -3376440 -7702310 -4523635 -1643256 -4633105 -9582896 -11160535
4320 -11160535 -11188922 -14659023 -21307995 -25563005 -23106325 -14882871 -5853458 -1193619
4312 -1193619 -2441578 -6480681 -8972841 -8295440 -5180995 -403151 4867764 8397306
4304 8397306 9637635 11279016 14702124 16112889 11436789 2970684 -3822281 -8332700
4296 -8332700 -13805565 -19451183 -20081196 -13950870 -5095629 2756424 8902267 11615018
4288 11615018 7656496 -2032002 -11274063 -15542084 -15796598 -14243477 -11166461 -7808151
4280 -7808151 -7546588 -11504727 -16452496 -18856409 -17813713 -13445647 -6859505 -2467465
4272 -2467465 -4986909 -12461280 -17509674 -17321955 -16609826 -18168900 -17121433 -9114311 1210660
4263 1210660 5602931 2444798 -3535538 -8657818 -12031922 -12238882 -8068782 -2215601
4255 -2215601 198067 -2741025 -8151134 -12085419 -12749397 -10751487 -8186928 -7011436
4247 -7011436 -7241032 -7800409 -9490055 -14587889 -22360844 -27873265 -27230557 -21635695 -14587027
4238 -14587027 -7935321 -2837262 -1448578 -4426333 -8801599 -11298582 -12177433 -13303639
4230 -13303639 -14204800 -12801852 -8814220 -4123225 -794139 -280857 -2826386 -5906112
4222 -5906112 -5291075 242651 7012985 10999878 12166824 12346959 11532628 9129616 6690097
4213 6690097 6086843 6447596 6088805 6297995 9739414 15439523 18573383 15945515 9716234
4204 9716234 5012881 4900083 7920742 9904394 8201128 4363183 2183188 3018256 3994030
4195 3994030 1229000 -5854027 -13672527 -17526783 -15659826 -10388505 -4459075 3018314
4187 3018314 14088891 25201138 27832586 18761748 5232669 -4144604 -9016058 -12719212
4179 -12719212 -13659738 -9353788 -4981159 -7971949 -15926151 -19878472 -18563864 -18932922
4171 -18932922 -22622345 -23140495 -17829842 -11734203 -7829228 -4273547 -2801018 -7774378
4163 -7774378 -14993891 -14695584 -8177213 -6893650 -12188612 -12984203 -7929935 -9913188 -21404253
4154 -21404253 -27653012 -24881816 -30311190 -49988584 -66878185 -83901419 -142981858 -257737448
4146 -257737448 -352638546 -329088507 -191319958 -51298781 3454486 -3845954 -4601548
4139 -4601548 16242206 27052486 18358487 13061494 20626371 25454479 20480614 17640674
4131 17640674 21105619 18673144 6289586 -2371557 1216358 7187866 5441288 1214414
4123 1214414 3425469 9812381 12681881 10670542 7451882 5401692 5926503 10327536
4115 10327536 16483502 19916870 20240115 20656563 20223862 14452342 5270332 1389079 5100113
4106 5100113 7302882 897955 -8398109 -10949334 -6763783 -3033300 -2539515 -2073917 -179233
4097 -179233 617375 -879414 -2531688 -2998769 -3841252 -6318374 -8880289 -9211139 -7267643
4088 -7267643 -5330907 -5725921 -8845233 -12894524 -15241662 -14130348 -9491968 -2918114
4080 -2918114 2750082 4851412 3217561 695364 284325 2031175 3538405 2867116 1588
4071 1588 -3639898 -5893740 -4904043 -865395 3916691 7679738 10828782 13905374 15638015
4062 15638015 14794488 12580159 11210202 11099074 11023656 9732762 5924203 -1457651 -10983869
4053 -10983869 -18849205 -23289082 -26434151 -29414805 -29048578 -23323295 -16876902 -15411672
4045 -15411672 -16678750 -13396717 -4487293 3155716 4578762 1857354 -2214671 -8644331
4037 -8644331 -17023802 -21810035 -19019948 -12839185 -10359229 -12216916 -13512461 -12353513
4029 -12353513 -11963494 -14203378 -16064682 -14505745 -11276950 -10240671 -11747045 -12489820
4021 -12489820 -10619699 -8590617 -9911137 -14370089 -18004546 -17566611 -13695333 -9509266
4013 -9509266 -7438994 -7997842 -10147819 -11582878 -9734532 -4139494 2568893 7178581
4005 7178581 8893657 8851785 7724722 5544205 3289850 2549665 3344391 3817764 2592177
3996 2592177 526816 -235723 1441820 4447315 6557807 7260593 8774843 12585585 15467306
3987 15467306 12122335 2706310 -5692249 -7174670 -3502480 143178 2357404 4444453
3979 4444453 5201448 2349271 -2054487 -3223486 -715379 1091525 43467 -1143721
3971 -1143721 -261818 1117793 1364673 1454672 1968758 1411189 -352090 -806990 759972
3962 759972 1456498 162058 497144 4500942 7245223 3319211 -3622997 -4326336 2941971
3953 2941971 8880415 5146034 -4840895 -11091553 -10430014 -9628189 -14678405 -21250352 -19370133
3944 -19370133 -6437586 8253563 13417653 7666175 -850214 -4858163 -4425095 -3217345
3936 -3217345 -2399039 -555519 2527101 4815180 4376943 1026681 -4249739 -10043222 -14300549
3927 -14300549 -14396220 -8722827 1016322 9438703 10988600 5092617 -2825763 -6766817
3919 -6766817 -6171304 -5314947 -7436130 -11444379 -14369651 -14925984 -13922076 -12681539 -11954023
3910 -11954023 -11564680 -10783344 -9735468 -10107091 -13035466 -16407516 -16015700 -9921437 -475737
3901 -475737 8161513 13194250 13942428 11382759 7713757 4900613 2647328 -1302634 -8096322
3892 -8096322 -15621481 -20010457 -19101679 -14371217 -9557666 -7007692 -5461481 -2571050
3884 -2571050 559680 -10878 -4719076 -8036936 -5488272 -581963 -285944 -4807838 -6962756
3875 -6962756 -2127808 5863442 10265989 8939280 4246360 -1356790 -6923085 -11886220
3867 -11886220 -15418448 -16340465 -13369642 -6930475 -627949 1343508 -1532929 -6640081
3859 -6640081 -12612338 -19727898 -25726519 -25689152 -18266222 -8848629 -4100192 -5413020 -9315435
3850 -9315435 -11809553 -10529361 -5239964 1435034 5587056 6188987 6012962 7072734 7464170
3841 7464170 4568218 -740967 -5191905 -6847341 -6050124 -4150968 -2692428 -2368734 -1850619
3832 -1850619 500533 3084058 1811828 -4447322 -11769669 -15742094 -15456195 -11953499
3824 -11953499 -6202274 -479889 1714022 -264274 -2889693 -3370311 -2973192 -3435172 -3538972
3815 -3538972 -1969512 -232613 295182 1042807 2961624 4061164 3580505 4713772 8905854
3806 8905854 11280865 7099067 -387649 -4442213 -4630823 -5636696 -8265415 -9033168 -8170739
3797 -8170739 -10225658 -15374488 -17422538 -13366294 -8780907 -9658194 -13638338 -14062877 -9556526
3788 -9556526 -4633019 -2343854 -1158310 624843 1475855 -327196 -2646840 -1534172
3780 -1534172 2814879 5066345 1450192 -4627201 -6727206 -4169939 -2788818 -6564817
3772 -6564817 -12635038 -16067249 -15563346 -12253304 -6951855 -1805388 -962659 -5667338 -11518945
3763 -11518945 -14254383 -15197075 -17072403 -18015154 -14992892 -10349354 -9043198 -11197254
3755 -11197254 -13049582 -13602907 -14326631 -13641030 -8240456 550600 7909495 12596534 16684174
3746 16684174 18852123 15306398 7848051 3295070 3095172 958852 -6410005 -13277353
3738 -13277353 -13346033 -8181527 -3000704 627110 3295677 3410243 -771890 -7551776 -13993958
3729 -13993958 -19354695 -23754674 -26350241 -27017633 -26554819 -23450328 -14743419 -2275568
3721 -2275568 6883501 9267961 9244087 10879344 10978049 4960439 -5247191 -14710135 -22446804
3712 -22446804 -28711307 -29309295 -20136189 -5393895 5740497 9693075 9674028 7759500
3704 7759500 2949158 -2955053 -4783863 -1110098 3651859 5994441 7214341 8942589
3696 8942589 9814652 8916313 7992900 7441827 4289175 -2321666 -7132064 -4741548 2239081
3687 2239081 5394879 545705 -8012516 -13648646 -14454884 -12724244 -10133480 -6492684
3679 -6492684 -2622995 -1271063 -3718127 -7324551 -8390308 -6493784 -4121714 -2899013
3671 -2899013 -2481841 -2394582 -1978642 984126 7592038 13300995 11001540 1150065 -5527949
3662 -5527949 285737 14636653 24368040 21666492 10738887 1094650 -1698322 1397510
3654 1397510 5776508 7489288 6530805 6167558 7952102 8771746 5043275 -1750302 -7009346
3645 -7009346 -9485484 -11827884 -14789686 -15331826 -11966217 -8209822 -8035735 -10191182 -9935218
3636 -9935218 -5461276 -51591 2240070 1184436 -184659 201684 1023277 -408512 -4639781
3627 -4639781 -9396790 -11776472 -10061394 -4265966 3044915 6895806 3780938 -3779259
3619 -3779259 -9035186 -8271422 -3791249 902137 5088601 8232124 7760551 3059326 -1688920
3610 -1688920 -2827192 -2505888 -4077531 -5290390 -2309119 1515907 -1226932 -9715005
3602 -9715005 -13860197 -8622792 -2184417 -4522882 -13092249 -16722196 -11154530 -3573659
3594 -3573659 -1775398 -5330803 -9496495 -12449188 -14693656 -14845331 -11181468 -6334040
3586 -6334040 -5460477 -9053807 -11969725 -11207006 -10054614 -11243601 -10495626 -2768510 7596931
3577 7596931 10328029 3163573 -4494497 -3937913 2813915 8144582 8191568 3111062 -6482638
3568 -6482638 -17625206 -23364880 -19332091 -10163725 -4159637 -3040167 -1853352 2504199
3560 2504199 8008935 12083041 14396256 14877120 12937671 9036341 4305033 -579595
3552 -579595 -3694165 -1367403 6828940 14916726 16954945 14701082 14030952 15860039 16198542
3543 16198542 13365909 9036128 3761605 -1855335 -3120693 3731426 13050684 14758880
3535 14758880 8304262 2943803 2900378 1779992 -5248700 -13330855 -17076549 -19404734
3527 -19404734 -24747815 -30160241 -30259373 -26053246 -22207291 -19518151 -16250441 -13435315
3519 -13435315 -12885867 -12851605 -11037775 -9093650 -9021547 -8328218 -4342861 -431460 -1765199
3510 -1765199 -6946425 -9946998 -9059153 -7954381 -8338741 -7189251 -2005500 5265146 10246802
3501 10246802 9584059 3065523 -5145650 -8684945 -5157733 1135317 4844322 5714552
3493 5714552 6601334 8309436 9710035 10099311 7995121 1020139 -8884206 -14022165 -10234107
3484 -10234107 -4272007 -5387187 -12050213 -14459595 -9324856 -4525502 -7855464 -17133183
3476 -17133183 -23465921 -20420584 -8971355 3557833 9512356 8592207 8206483 13251454
3468 13251454 18531566 16076990 6865205 -1121693 -4202524 -5143556 -5587838 -4379412
3460 -4379412 -3195784 -5800891 -10761159 -12186576 -8723776 -4751867 -1865724 3146204
3452 3146204 10512417 15592362 16727507 17230706 17544178 13644732 5732076 -194357 -2486650
3443 -2486650 -6344602 -12507341 -13868577 -8900392 -7464042 -15004746 -21090304 -14270296
3435 -14270296 -11117 8158232 8761199 10384312 14065923 11988256 2623537 -6058120
3427 -6058120 -9472349 -11061534 -12801403 -12020488 -9512086 -10113418 -12735418 -10430577 -3421998
3418 -3421998 -825415 -4787571 -4513030 6641109 18576169 18475585 9151295 2672791
3410 2672791 1862615 -161695 -5687796 -9767361 -11125506 -14576945 -20985697 -24112628
3402 -24112628 -20093688 -12524608 -5644127 469461 5145782 4573681 -2076215 -9732976
3394 -9732976 -14508005 -18385452 -23028114 -24703071 -20520551 -14585671 -11942230 -10774954
3386 -10774954 -7133061 -3247929 -3443378 -5288243 -4083067 -3890337 -12902704 -27287914
3378 -27287914 -31688199 -20044139 -5159143 -897241 -4180540 -3355950 3222109 7789713
3370 7789713 7557550 6922321 7005912 3892717 -2180756 -5534735 -4683008 -4859445 -8700743
3361 -8700743 -11917582 -10531574 -5450047 1843380 10309049 14243794 6842721 -7015972
3353 -7015972 -11619648 -829208 11578654 10903946 2663172 3008169 13487287 19230713
3345 19230713 11508288 -903139 -5711266 -1999984 3412358 6438205 7017128 5331125
3337 5331125 2038660 -588227 -1233608 -958608 -107090 3175628 9266376 14779590 16022151
3328 16022151 12438615 5446933 -3158040 -10162032 -11488030 -6145192 2175213 8695841
3320 8695841 11027190 9106878 4875697 2398736 4350307 7215437 4216514 -5035581
3312 -5035581 -12173369 -10532112 -4429185 -4001672 -12824225 -24259681 -28971554 -23212924
3304 -23212924 -10659305 1282061 7231415 7700254 7297254 8920033 10980703 10458171
3296 10458171 6517577 567682 -4927154 -7170790 -5339929 -2848258 -4221270 -8859956
3288 -8859956 -11282560 -8496072 -3344187 414836 1769668 -48807 -5922066 -12087047
3280 -12087047 -11346920 -3326591 2456673 -796866 -7303589 -8286349 -5870415 -8204456
3272 -8204456 -14326723 -14746010 -6845511 465070 -450512 -7003698 -13066354 -16960751 -18885386
3263 -18885386 -16824521 -9954982 -1989236 2889989 4319364 3320556 -692098 -7476912
3255 -7476912 -13858727 -17033770 -17355278 -15824304 -12109912 -7208453 -4408575 -4923499 -5900229
3246 -5900229 -5341887 -5400281 -7868847 -10242359 -9974820 -9214687 -11053026 -13971820 -14699004
3237 -14699004 -14334452 -16555845 -20869165 -22521812 -19047732 -12867536 -7137636 -2490060
3229 -2490060 1524475 4583620 6070091 5655221 2958362 -2266789 -9563750 -17690275
3221 -17690275 -24141032 -24983016 -18081055 -7626756 -2046258 -4911581 -10753995 -12534195
3213 -12534195 -10178838 -8386507 -9117167 -10645850 -11739312 -12133674 -10580804 -6885492
3205 -6885492 -4127444 -4171821 -2990689 3814462 12256714 13361334 5248501 -4664665 -10148701
3196 -10148701 -12162254 -12816517 -10334365 -3656314 3286387 6127706 5345193 3751288
3188 3751288 2088125 49032 -1697749 -3451394 -7118663 -12023901 -13764757 -10788646
3180 -10788646 -8419825 -11660674 -16713358 -15023751 -4612056 7538322 14162688 14392734
3172 14392734 11400309 7704899 4835016 4862569 9220514 15906623 19517879 15757311
3164 15757311 6656348 95508 2151525 10368209 16936164 18095981 17006862 17028750
3156 17028750 16593855 12973551 7541179 4122477 4130534 5575302 5067088 -278597 -9704287
3147 -9704287 -16240735 -11945491 1312179 11055276 8471534 -998293 -6689571 -7782250
3139 -7782250 -11662612 -19888695 -24937918 -21665140 -14178089 -8990110 -7537974 -8122813
3131 -8122813 -9830016 -11350079 -10334768 -7188557 -5912133 -8137571 -9587100 -5692549
3123 -5692549 1890765 7550792 8446350 6054605 2838429 609188 1318363 6326039 14189864
3114 14189864 20586900 21249117 15346307 6431649 -568193 -4256781 -7564929 -12196155
3106 -12196155 -14581312 -11058915 -5343291 -5143008 -11026301 -14670243 -10123996 -1004791
3098 -1004791 6554196 12154635 17451928 19498727 14746896 6790795 2740545 2746018 134421
3089 134421 -7455761 -13781452 -13170933 -8582089 -6969527 -10096335 -13443362 -12300996 -6354624
3080 -6354624 297607 1860376 -4673333 -15941967 -24814086 -28012916 -28671128 -29363918
3072 -29363918 -26352719 -15486725 -1499230 5296740 2304950 -1895887 -415976 1709383
3064 1709383 -3942349 -14489456 -17952001 -10111119 -1143613 -2090941 -10667065 -15586048
3056 -15586048 -11384714 -3459541 56224 -3493106 -10775670 -16000452 -14703245 -7312778
3048 -7312778 683787 4479372 5186303 6584073 8099796 5571887 -1201652 -6761118
3040 -6761118 -7169771 -4619155 -3204235 -4154309 -7223991 -12592832 -18364529 -19732544 -14362088
3031 -14362088 -6332418 -1512133 -1033440 -2375041 -4752133 -9715140 -17541694 -26299459
3023 -26299459 -33709046 -37247253 -33682712 -21939975 -6074173 7617244 16568120 22896452
3015 22896452 28926104 34283511 37204619 36238153 30647292 21467473 12406064 7595888
3007 7595888 7939136 11014730 14393841 17322589 19297072 19076049 15820933 10186747 4115755
2998 4115755 199152 475676 4440209 8753840 10419077 9811648 9183016 9047050 8300838
2989 8300838 7652608 10139962 16943219 24373418 27043481 24157194 21325317 24767639
2981 24767639 33632379 39817364 36939311 27980358 21246261 19644447 18082473 12047811
2973 12047811 4031387 -1070053 -2870166 -4050586 -4906523 -3696468 -1035622 -21924
2965 -21924 -2296537 -6455871 -9558547 -8458496 -1693620 7604536 13151344 12660737 10665427
2956 10665427 10865324 9512799 1832545 -8109594 -11155407 -5742877 150477 150224 -3829701
2947 -3829701 -7075345 -8183941 -7925491 -7239235 -8146440 -12000063 -15620765 -14174612 -8884235
2938 -8884235 -6101383 -7404285 -7345501 -3399809 -773484 -3314605 -6900356 -7531306 -9370038
2929 -9370038 -17311583 -26656631 -28734595 -23811681 -19876423 -20069069 -19704214 -15716637 -11007362
2920 -11007362 -8000652 -5003279 -1189488 1130307 1986156 5631205 13346356 19483602
2912 19483602 19093069 15309814 14071611 14727688 11922964 5243245 426888 252824 211620
2903 211620 -3954339 -9035035 -9055075 -4592684 -2322613 -5569364 -9964758 -9851527 -5158614
2894 -5158614 568723 5924270 11762810 17074519 18716795 15576350 10272158 6311511
2886 6311511 5664473 8989054 15414796 21508244 23158065 19762267 14801183 11673183
2878 11673183 10942504 11948017 14220279 16105559 14688399 8902388 882216 -6920397
2870 -6920397 -13675766 -18068290 -17297663 -10637700 -1845610 4431800 6985172 6829770 4051504
2861 4051504 -1172684 -6161927 -7738172 -5958667 -3189984 -378270 2873548 5267373
2853 5267373 4285497 110071 -3731456 -4600958 -3706069 -3914659 -6037500 -8297880 -8891249
2844 -8891249 -8380744 -9294847 -12924694 -16715910 -16200077 -10118474 -2340285 2094067 1564587
2835 1564587 -2069270 -6017566 -7846788 -6144581 -1833863 2411882 5487766 8886374
2827 8886374 12835404 13903646 9535159 3228472 1156698 3803303 4855551 -354042
2819 -354042 -8390026 -12017481 -9310859 -5540781 -5609450 -7168586 -3860946 5256297 13164753
2810 13164753 13426891 7923386 2753483 -487522 -3999974 -6363789 -3150125 4513904
2802 4513904 9468975 9015282 8799073 12754555 16445760 15548703 13895680 15983582 17456392
2793 17456392 11752465 2058626 -2638784 -724763 2219148 4745801 10152354 15888987
2785 15888987 13613671 2807952 -5338582 -2245403 7499141 14437216 16043802 15068369
2777 15068369 12548554 8953353 7765612 11345107 15826872 15602521 10931302 6469084
2769 6469084 4115832 1816742 -1932689 -6524314 -11148562 -14676393 -14724112 -10397045 -5119312
2760 -5119312 -3199653 -3979771 -2728080 2544441 8081119 8756202 3339536 -5042688 -11890351
2751 -11890351 -14224218 -12004056 -7638126 -3695082 -843574 1663632 3626155 2889934
2743 2889934 -2338565 -10017861 -14574903 -12698601 -8338038 -8826130 -15310775 -20896415
2735 -20896415 -20500005 -18214584 -20542796 -25933004 -27083571 -21592834 -13721094 -6495191
2727 -6495191 886182 7501564 9757047 7591405 5189942 3751046 116559 -5289459
2719 -5289459 -6481169 -1492293 3005114 1490386 -2118051 -1511720 2064939 3263314
2711 3263314 1834560 1752196 3953139 6162029 8118294 11507260 15860479 18789364 18936233
2702 18936233 15651750 8636948 1351482 786589 8975453 18317519 20658892 17402622
2694 17402622 14629597 12115020 5218799 -4328945 -8059969 -1633767 10417462 21043150
2686 21043150 26085114 23909789 16084692 8585950 6191450 5376424 -1195991 -13041840
2678 -13041840 -21467797 -21630194 -17935503 -15491562 -13090080 -8060405 -2352340 468127
2670 468127 519198 352044 1031843 1874774 1791926 -516692 -5294732 -10029274 -11723948
2661 -11723948 -10724690 -8972735 -5452842 1692496 9088850 10293972 4671609 -1877193
2653 -1877193 -5636868 -7652443 -6630675 1972532 15989555 23856091 17911382 4417944
2645 4417944 -5473174 -9140017 -10548195 -10336302 -5964460 1290975 7291104 11486700
2637 11486700 15667085 17586130 12857856 3214158 -3487859 -2639865 2456883 5933677
2629 5933677 5025388 15524 -6927530 -11634719 -10308254 -3482674 4539590 10271574
2621 10271574 12821629 12246819 9762904 8863853 11902513 15521434 13928586 7293671
2613 7293671 2296569 3017470 5794860 5293894 1630827 -1364830 -1639527 457036 4325478
2604 4325478 8677298 11182276 11782749 14137910 19859252 23145572 16274768 362865
2596 362865 -14335829 -20049892 -18810087 -16224776 -13095751 -7678999 -2477178 -2239392
2588 -2239392 -6048756 -7785989 -5524884 -4449423 -7777035 -10498279 -7003966 -896612
2580 -896612 -1022140 -9392460 -18960080 -23219778 -22636785 -20745854 -18912504 -17113145 -16216806
2571 -16216806 -16810968 -17618153 -16765765 -13664938 -9522530 -7251652 -9593735 -14755825 -15733518
2562 -15733518 -8224465 2113831 5722694 1805661 -1516891 123798 2368982 1873458
2554 1873458 2483873 6997403 10375186 7669414 2513296 343512 -1521015 -8409784
2546 -8409784 -16773381 -17802014 -11018436 -4807433 -3220711 -1337454 4321157 8989135
2538 8989135 6925777 -604701 -8323524 -13185505 -14403653 -11573486 -6385287 -2986742
2530 -2986742 -3337406 -4536573 -3258358 -503089 415138 -1439291 -4081636 -5125072 -3343983
2521 -3343983 524897 3435096 2582997 -620263 -1525840 1497416 4264506 1895230 -5476153
2512 -5476153 -13807159 -19765932 -22205810 -20967534 -16906319 -12538302 -10599739 -11539430
2504 -11539430 -12890517 -11111844 -4615807 3952889 8943171 6671781 -1187949 -10293304
2496 -10293304 -18037502 -22919994 -21940514 -13696424 -3682279 -637711 -5664375 -9876370
2488 -9876370 -5948123 1875651 3125331 -5899057 -18087304 -23407537 -18310551 -8097215
2480 -8097215 -1706025 -3385766 -8557359 -8935856 -1763645 8167832 15393448 18923445
2472 18923445 19734161 17620557 13107625 8957420 6925706 5942486 5841768 9080499 15371917
2463 15371917 18446060 12949021 2110945 -6198369 -9215423 -10368847 -12139852 -13074520
2455 -13074520 -11748591 -9201568 -6956640 -5938084 -7114431 -9867045 -10411727 -5932455
2447 -5932455 -104049 -57138 -7024831 -13921738 -13621349 -6707323 36301 267199 -7317593
2438 -7317593 -18141246 -24733134 -23105889 -16694431 -11693296 -9024956 -4566263 2804756
2430 2804756 8310453 8102755 4619492 2338598 1532441 -565100 -4734928 -9094994 -11986357
2421 -11986357 -12850319 -11274204 -7488163 -3100763 562341 4313541 9760285 16437702
2413 16437702 21299210 20935205 14390886 4795630 -2230492 -3792650 -3200636 -5678276
2405 -5678276 -10728381 -12586902 -9228533 -6234500 -8671493 -13131564 -12439734 -5845069
2397 -5845069 505796 2149669 272196 -2927076 -7505557 -12329293 -12599251 -4846635
2389 -4846635 6859322 13152449 8708541 -2158393 -10215833 -10867915 -7615280 -6004778
2381 -6004778 -6434165 -5188076 -1248594 1721833 887778 -1835384 -3259725 -3270404 -3081032
2372 -3081032 -1811100 1705496 5293213 5150061 532309 -5927905 -11472836 -14100178
2364 -14100178 -11924678 -5427601 781677 2532510 1639447 2528109 4181299 1237464
2356 1237464 -6213456 -10243175 -5393434 3590011 8033419 5678374 1101107 -1138350
2348 -1138350 2702 2967332 4368510 864385 -6322974 -10834245 -8714420 -4406299
2340 -4406299 -4970670 -10048612 -12629059 -9269725 -4348254 -3246925 -5707569 -7664472
2332 -7664472 -6434029 -2391227 2093488 4095134 2505145 -355902 -1565997 -2113362
2324 -2113362 -5635141 -12273650 -17517235 -18663976 -18777558 -21594859 -25428656 -25499776 -20655381
2315 -20655381 -14565013 -11046069 -10870635 -12700635 -14743966 -15505698 -14728140 -13654715 -13313586
2306 -13313586 -13263080 -13242765 -14638961 -18002284 -20116316 -16750935 -8709295 -2209243 -1846877
2297 -1846877 -5236715 -6314044 -2403236 4060263 9876832 14465225 18437230 21177569
2289 21177569 21763966 21285822 21954624 23640377 23277921 18788946 12062256 6472755 2573129
2280 2573129 -1701415 -7030710 -11128320 -11438963 -7723265 -1716582 4139404 7405799
2272 7405799 6943536 4095019 1097763 -1827894 -5862157 -9954381 -10676459 -6969768 -2509692
2263 -2509692 -1505441 -4072808 -7401138 -9320788 -8634049 -4130412 3772940 11647247
2255 11647247 15992868 16702222 15403110 11787893 4552628 -4925725 -13023269 -17645169
2247 -17645169 -18727839 -15578339 -7455668 2582961 7938153 4499390 -5306992 -15532645
2239 -15532645 -22152517 -24791093 -24862108 -23298681 -19483447 -12243519 -2666639 4918024
2231 4918024 6784977 4245382 1833248 1141225 -716808 -5942522 -12295628 -15946419
2223 -15946419 -15848740 -13648973 -10936254 -8230221 -5653230 -3355070 -1754046 -1438416 -1696104
2214 -1696104 337409 6635895 14253122 17361162 14462671 10753515 11514760 15542642
2206 15542642 17282458 13623991 6420309 -308266 -3792730 -4500348 -6245443 -12531090
2198 -12531090 -21122000 -24661399 -19275920 -10263456 -5729029 -6431716 -6447111 -2971118 192953
2189 192953 210694 790743 6322746 13842966 15808437 9977191 2052488 -2011917 -2232643
2180 -2232643 -1360801 690695 5301356 10117881 10577268 6748813 4021997 5180580 6083861
2171 6083861 2580576 -1820372 -160545 7693852 14161739 13293510 6460267 -1700789
2163 -1700789 -8296669 -11679222 -10368498 -5163711 565552 4835600 8675028 12114453
2155 12114453 11788446 5107728 -5652875 -15710430 -21848369 -22426779 -16895585 -8345266
2147 -8345266 -3346678 -5403750 -10799770 -14250742 -15733628 -17499077 -17605948 -12817184
2139 -12817184 -6519999 -6600442 -14366006 -21745568 -21814654 -16858580 -12764839 -10022830 -5226151
2130 -5226151 909482 2680175 -2688224 -10160876 -12308167 -7860399 -2201902 432054
2122 432054 2176933 7017407 13408818 15427853 11115404 5353560 2910726 2579990 905094
2113 905094 -1708461 -2260221 -158624 2694502 5009937 5998794 4314393 895010 673108
2104 673108 6887155 15300128 18843046 16594394 13015548 9757177 4670518 -1338878
2096 -1338878 -3646952 -1698668 -1012616 -4722930 -8581770 -7505454 -2417552 2706571
2088 2706571 6504160 9485623 11051118 10674172 9627381 9082782 8863492 9373739 11176982
2079 11176982 11381936 5468897 -4725095 -10268329 -6374063 623039 2495746 684265
2071 684265 2264808 7699131 9926934 4680493 -4598617 -12093241 -14702541 -11960906
2063 -11960906 -5782825 -462373 1325347 2298867 6162655 10349170 8625678 850825
2055 850825 -6038133 -8068421 -9105331 -12964973 -16370863 -14351544 -8820438 -6455329
2047 -6455329 -9522873 -13388643 -13156310 -9310782 -5817406 -4833879 -4918608 -4054371 -3109884
2038 -3109884 -4883809 -9381324 -12007729 -8726241 -1994246 1492123 -1077629 -6008615
2030 -6008615 -9126190 -10616762 -12011764 -12060917 -9176320 -5779054 -6096873 -10198592 -13828983
2021 -13828983 -14449243 -14239038 -16114243 -19481206 -21552975 -20854942 -17581480 -12151628 -5823036
2012 -5823036 -1750865 -2486863 -6161128 -7733272 -4874790 -189735 3544669 7264748
2004 7264748 12063596 14598505 10801152 3282559 -364138 2209332 4587561 793541
1996 793541 -6580147 -11293967 -12585329 -13945212 -15166397 -12178215 -4962980 386420
1988 386420 -465896 -4701477 -7201730 -6825505 -4755425 -52618 8620909 18264297 23019471
1979 23019471 20973957 16414180 14260024 14625492 14511100 13224181 13507201 16872369 19811900
1970 19811900 16856356 7566767 -1600493 -4169714 -1268940 228871 -2834962 -5577631
1962 -5577631 -2041229 6283010 12425666 13209929 12172918 12565596 12057303 7506254 1526593
1953 1526593 -734597 -146336 -3239721 -12188675 -20412797 -21238683 -16796727 -14066548 -15111041
1944 -15111041 -16353821 -15745365 -14872213 -14162801 -11586216 -7030598 -2923185 743099 6728888
1935 6728888 13878252 15628597 8741628 -912999 -5289146 -3296991 648493 3247453
1927 3247453 3109664 -1076809 -7608436 -10174849 -5419276 243605 -2019055 -10936142
1919 -10936142 -17087640 -16507529 -14426956 -14838624 -14680066 -11264147 -8099377 -8803910 -10831864
1910 -10831864 -10098080 -7488620 -5937520 -4660469 -1472140 1746144 1174747 -2697261
1902 -2697261 -5743104 -6578254 -7930135 -11437629 -14972200 -16249812 -16099161 -16298734 -15902125
1893 -15902125 -11909073 -3589684 5367465 10262020 10695947 10972812 14729967 21134725
1885 21134725 27613312 33523673 38096541 37456322 28860799 16881955 9500738 7594715
1877 7594715 4301839 -3672987 -10552079 -10483393 -6121419 -3513391 -3101337 -1244154 2721134
1868 2721134 6532158 9757727 13195633 15203774 13514647 9249236 4604990 -1512958
1860 -1512958 -10256902 -16894342 -14481640 -3554810 7511029 12422699 12143707 9813658
1852 9813658 6477228 3692011 4842481 10617977 16913128 19940949 20290708 19819561 18143923
1843 18143923 14854187 11674643 9082231 3836053 -6036362 -15791515 -17964738 -11444931
1835 -11444931 -3059695 35458 -3274342 -9435156 -14854383 -17730059 -17382882 -14127107
1827 -14127107 -9740999 -6604583 -5536422 -4833902 -2238388 2079233 5352522 5428262 3170442
1818 3170442 1011402 366825 1601767 4925793 9171583 11005416 8367099 4145597
1810 4145597 3086537 5086036 5538946 3349162 4096001 12171746 23115778 28156295
1802 28156295 25132203 20749349 21683216 26742252 29183663 24742866 15677015 7571241
1794 7571241 3509791 1814310 -856966 -5066141 -8095620 -7578546 -4387876 -1657429
1786 -1657429 -1956180 -5480594 -9629357 -10246878 -5233093 2481395 7641606 9106671 10889645
1777 10889645 15310506 18487929 15853556 9386298 4838041 3453584 2017331 906462
1769 906462 5455402 16583263 25701222 24022073 13814375 5010880 2159220 461201
1761 461201 -4954373 -11577340 -14084375 -12365714 -10985009 -12368252 -14388543 -14617446 -13706251
1752 -13706251 -13356531 -13164648 -11551227 -9130068 -9066714 -13232042 -19043201 -21551163 -18647619
1743 -18647619 -12871786 -7717961 -3992705 -1235534 -779216 -4264842 -9707355 -12747030
1735 -12747030 -12663678 -13654981 -18318106 -22997088 -22218154 -15249064 -5496221 4042269 11232121
1726 11232121 13159264 8742150 1914718 -2304420 -4216451 -7362733 -10930832 -10079153
1718 -10079153 -4218314 1291077 3363826 4838372 7168564 5982324 -1317541 -8868998
1710 -8868998 -9292052 -3810190 435959 518725 -776369 -1585659 -2793328 -3931560 -3129652
1701 -3129652 -1367116 -1764174 -4262613 -5480624 -4078742 -1947718 -57718 2194084
1693 2194084 3245098 -9916 -6849532 -12510362 -14364434 -13954610 -12255789 -8247361
1685 -8247361 -3693249 -3555868 -8642096 -12739082 -10545929 -4186889 1697964 6881793
1677 6881793 12918642 17365744 16569519 12599202 11939472 17289224 24637306 28608259 27536693
1668 27536693 23257613 18865794 17143239 18961726 22543907 25173794 25204724 21806581
1660 21806581 14522321 4754934 -3970595 -9338845 -12465972 -14805712 -14687979 -9922096
1652 -9922096 -2752662 1097015 -1496365 -8084636 -13664983 -14960084 -12250010 -8885962
1644 -8885962 -8649850 -11985826 -15333199 -15419514 -12962186 -10467191 -8138962 -4779407 -1648662
1635 -1648662 -2093225 -7143325 -13908945 -18579336 -19131578 -15311337 -8306701 -1030825 2872271
1626 2872271 1229162 -5264894 -12887087 -16197239 -12180273 -4517944 -800161 -3058752
1618 -3058752 -4328299 1558279 9906582 10643131 2339603 -5821275 -6523767 -2427186 80265
1609 80265 -554880 -1951139 -2631909 -2102744 507050 4030812 4229397 -810164 -6216972
1600 -6216972 -5325142 2086910 10309268 15427372 18243372 19513921 17033812 9766412
1592 9766412 1865489 -657111 3326913 8679986 9293999 3449840 -5910219 -14470374
1584 -14470374 -19240215 -19463685 -16960459 -15569853 -18169431 -23115818 -25082701 -20931620
1576 -20931620 -13743707 -9339097 -9504596 -10528099 -8077194 -1647725 5735422 10411831
1568 10411831 10515466 7074811 2942872 -249455 -3320231 -6464427 -6796615 -2124402
1560 -2124402 3815733 4113473 -2746734 -10934808 -15057123 -16034035 -17276357 -18710686 -17648808
1551 -17648808 -13076593 -6204733 1168884 6258745 5648181 -649248 -7218417 -8669247
1543 -8669247 -5754818 -3092356 -2568198 -2838108 -3849794 -6894747 -10332107 -10423042 -7616743
1534 -7616743 -7220704 -11472696 -15067433 -11991932 -3910457 2114794 2474256 -478308 -4000579
1525 -4000579 -8540440 -14443949 -18604809 -17301677 -11058667 -4044101 1204552 6122856
1517 6122856 12496426 18590543 20721645 17595462 11012348 2984712 -5019437 -9890542
1509 -9890542 -7789595 391674 7322731 6534326 38701 -4820013 -5032994 -4166958 -5132674
1500 -5132674 -5915693 -4413633 -2814224 -3555507 -4401029 -2170318 656038 -1664925 -9305097
1491 -9305097 -15456411 -15274008 -12173792 -12527826 -16809611 -19370819 -16052488 -9032785 -3713195
1482 -3713195 -2746123 -4245256 -5172564 -5140532 -5880298 -7226163 -5729455 772212 8432093
1473 8432093 10531582 5790814 223580 -955386 -126624 -3001670 -9834214 -14852010
1465 -14852010 -13858606 -8809807 -4519462 -3770638 -6202033 -9265654 -9394771 -4582265 3184582
1456 3184582 9813816 13630030 15601669 15103253 9408456 -870285 -9554617 -11211325
1448 -11211325 -7256596 -2796621 221669 3017138 5107509 4289764 1315700 -37495
1440 -37495 1137630 645026 -4928634 -12645559 -16245914 -13683002 -9294825 -8457555 -11773843
1431 -11773843 -15393550 -16265770 -15554738 -16240497 -18749798 -20946363 -21748523 -21740582 -19923661
1422 -19923661 -13911296 -5517313 -2074683 -7882962 -16897009 -18983617 -12226126 -3866547
1414 -3866547 392933 2177981 4755821 7564653 9065400 10235901 11826920 11838696 9234927
1405 9234927 7058934 8087533 9818731 7681313 1527654 -4766587 -8830541 -11269887
1397 -11269887 -12661323 -12942814 -13485076 -16075976 -19437357 -19841681 -15846640 -9918826 -4968227
1388 -4968227 -1851805 -793133 -2379334 -5794658 -8323939 -8251625 -6723522 -5416156 -3901961
1379 -3901961 -895840 3108742 6170722 7036809 5282760 163126 -8285760 -16831492
1371 -16831492 -20241183 -16428941 -9014751 -3174716 -161610 1970813 3397232 1977980
1363 1977980 -1674118 -2632476 1923123 7483240 7405413 2031515 -1709529 276462 4593433
1354 4593433 6217482 4937572 3678835 3619363 3939080 4334287 4816736 4359663 2626333
1345 2626333 2313369 6873734 15561081 22833857 23651695 18526158 12694895 10555260 11446969
1336 11446969 11441161 8917901 6483553 6392299 6694395 4949111 3596044 6690638 11833811
1327 11833811 11224858 2243951 -8552422 -14685889 -17690853 -21764252 -25157600 -22513482
1319 -22513482 -13244300 -2397646 5385527 8548522 7002006 2348727 -1519114 -2362076
1311 -2362076 -3106729 -7390850 -12945717 -13987203 -9339316 -3662828 -1298744 -3279759
1303 -3279759 -9239651 -16758851 -19401528 -12056644 326523 5311181 -2930981 -16512179
1295 -16512179 -23509558 -20967931 -15376839 -13348476 -15256627 -16782128 -14285682 -8733259
1287 -8733259 -4720517 -5126039 -7786926 -9083399 -9048192 -9965702 -11579932 -11566192 -9445470
1278 -9445470 -5928636 -268469 6418226 7431806 -2147991 -14877102 -16754975 -5538395
1270 -5538395 5589221 6223449 1852886 3029027 9167428 11236029 5868760 -1382709
1262 -1382709 -4894876 -4656698 -4148873 -7096630 -14881008 -23604273 -25923060 -19080638 -8499071
1253 -8499071 -830239 2450854 1792292 -3799740 -11708134 -13727318 -6657968 240627
1245 240627 -3093616 -12603715 -16228825 -11545426 -6715391 -5900431 -5508198 -4933097 -8506921
1236 -8506921 -14009825 -11377326 1475641 11736569 8024019 -4013065 -10178135 -6032334
1228 -6032334 1070450 4083189 2645667 -452132 -2550537 -1768738 815878 850958 -3549346
1219 -3549346 -7860866 -7183255 -3816488 -3630314 -6528861 -6426451 -797092 5024301 4509811
1210 4509811 -2741702 -11749320 -17492963 -18232322 -15542951 -12450906 -10798651 -10032444 -8746960
1201 -8746960 -6450296 -2990070 2249934 8909950 14638249 17458051 18214833 18687274 18127129
1192 18127129 14072291 6544911 -647214 -3622891 -2777990 -2999303 -9014092 -19581364
1184 -19581364 -26904190 -23988033 -12666850 -1750935 2961753 3208074 2092425 -1267924
1176 -1267924 -7426720 -11608486 -8833429 -1816800 2042422 714760 -917798 518193
1168 518193 2667213 3099411 4065875 8571628 14851760 17818759 14636883 7193119 343439
1159 343439 -1365078 2932568 8977065 10595047 5387825 -3508246 -11115572 -14360435
1151 -14360435 -12574952 -7329830 -2731709 -3137969 -8786625 -15416356 -19459317 -21636504
1143 -21636504 -24027811 -25980387 -25509038 -23349216 -22598744 -24276387 -25542543 -23199412
1135 -23199412 -17642724 -12178964 -8805667 -6026960 -1842328 1941155 854021 -5806322
1127 -5806322 -12311166 -12962468 -9340824 -7286574 -7743657 -5823774 170491 4466860 1945007
1118 1945007 -3821288 -5518194 -2542915 -979714 -3666117 -5678320 -1441844 7371101
1110 7371101 13636406 12570654 5403777 -3848011 -12860939 -21319350 -27859087 -28902256
1102 -28902256 -22315741 -11653205 -4140235 -3318088 -5737595 -6477255 -5686841 -7040171
1094 -7040171 -11479159 -16179476 -19316456 -22170991 -25794473 -28689482 -29072768 -27042254
1086 -27042254 -23322170 -18184427 -12971878 -10301394 -10747323 -11189041 -8723500 -4808399
1078 -4808399 -3011433 -3573551 -3133380 -64116 2490957 172159 -7368318 -16043123 -21592774
1069 -21592774 -23326873 -23696557 -24906921 -26581837 -26868157 -25169599 -22846779 -21231321
1061 -21231321 -19995192 -17918741 -14374089 -9455318 -3533981 2409788 6645061 7936709
1053 7936709 6828741 5164842 4639537 6058060 9090918 12036531 12869638 11730634 11426505
1044 11426505 13695047 15532570 11702249 1665198 -8035307 -10187471 -5021988 -51016
1036 -51016 -1412069 -6790751 -8255453 -1612663 8782695 15050384 13891707 8253733
1028 8253733 2588755 -603435 9552 4962501 11947299 16284457 15780965 13215615 12085490
1019 12085490 12316176 12756450 15011316 20384262 24707069 21602742 11123958 420158
1011 420158 -4984679 -6031706 -5204967 -2033196 3753234 9119519 11585382 12814093 14466009
1002 14466009 13566431 6762337 -2790943 -7857844 -5787580 -419122 4084379 6593198
994 6593198 6063723 507151 -8773191 -15550238 -14408967 -6775938 576146 2190968 -1658015
985 -1658015 -6018640 -6155331 -2449194 -385296 -4310091 -11804536 -16528435 -16186668 -14519095
976 -14519095 -15118002 -16941064 -17384496 -16389679 -15182667 -13714921 -12085589 -12179666 -14620206
967 -14620206 -15706250 -11179401 -2715074 2908794 1933066 -1987802 -3196714 -1782124
959 -1782124 -3126136 -9762996 -16505798 -16209586 -9531367 -5124997 -8153712 -12073454 -6567189
950 -6567189 7655169 17972565 15129098 3783134 -5431805 -9297784 -12113883 -15789227
942 -15789227 -16688895 -12062582 -3883294 4599507 11390984 13837226 9257954 -39624
934 -39624 -6546444 -5601305 -606179 2908140 5144326 9427019 14030105 12830716 4857442
925 4857442 -2303281 -1636199 4297866 7123069 3276043 -3141074 -7150377 -7970189 -6554637
916 -6554637 -2603220 3126191 6678351 4935569 169596 -3242200 -5420941 -9621123
908 -9621123 -14440974 -13184777 -3472375 7230434 9676052 3486819 -4104822 -7608846
900 -7608846 -6925172 -3572775 1310405 5341268 6241318 5783727 8282488 13964531 17764820
891 17764820 16388484 12899684 11988050 13801599 15274577 15246512 15273689 16644531 18973005
882 18973005 20929503 20862823 17907209 13642539 10911245 9822599 7344160 2470353 -1242063
873 -1242063 -929640 875263 501699 -725189 408698 1722398 -2258600 -10902571 -16465237
864 -16465237 -14213951 -8025560 -3284281 518176 6110789 11782882 13694790 12335282
856 12335282 11498805 12266993 12950396 13988852 17356711 20836296 18538919 9034464 -1710985
847 -1710985 -8077136 -11442713 -15968807 -21270634 -23344064 -20456516 -13945660 -4772523
839 -4772523 6233866 15345420 17752174 13184529 6405449 1690587 49295 1787591
831 1787591 7074395 12486449 11891236 4125932 -3777985 -4891863 -1169350 284058 -2511998
822 -2511998 -5029340 -4296415 -2775036 -3037925 -3313455 -901174 3114733 5436500 5125820
813 5125820 4195286 4457044 5465520 5184749 1915448 -3712841 -8361432 -9023323 -7057795
804 -7057795 -7453626 -12824518 -19478147 -20912033 -14547707 -4202454 3212360 2981061 -3772141
795 -3772141 -10542398 -10867306 -4545223 2526470 5265762 4232924 2598391 1186192 -726532
786 -726532 -1810136 230030 4410888 6789535 5441831 2345613 -174472 -2123002 -4125257
777 -4125257 -5801646 -7396016 -10747152 -16494142 -21656894 -22133508 -17147835 -9768664 -3517568
768 -3517568 131533 1281812 394857 -1814193 -4060488 -4842724 -3389990 -461225 1904600
759 1904600 2086246 683903 86152 1707296 4074023 4354725 1651568 -1930773 -3684821
750 -3684821 -3220231 -2452653 -2852931 -3586060 -3115251 -2183856 -3792971 -9584629 -17165496
741 -17165496 -21942869 -21220874 -16025815 -9785734 -6030837 -6305281 -8912407 -10389629 -9510283
732 -9510283 -8810972 -10503483 -12449763 -11280925 -8526736 -9247672 -13973199 -16803155 -13939241
723 -13939241 -9797339 -10768155 -16279652 -21018127 -23674320 -27255951 -31118923 -29479866
715 -29479866 -20170477 -9437888 -4339465 -4240825 -3882283 -1592784 668607 3443081 9728501
706 9728501 18260710 22437053 18580666 11443330 8231712 9739622 10971871 8960681
698 8960681 5925936 4826047 5611041 7029465 8912402 10495523 8876203 2201843 -6582657
689 -6582657 -12168023 -13029694 -12433549 -12891200 -12641751 -9316782 -4548813 -2133086 -2873519
680 -2873519 -4115780 -3918149 -2894648 -1837398 -242976 2129618 4566214 6907578 9338733
671 9338733 10096642 6619578 491617 -2306606 1129619 6069384 6741183 4566226 4764125
662 4764125 6840851 5158314 -847040 -4053069 69028 6359926 7121506 1901532 -4292473
653 -4292473 -8794472 -12052727 -13334470 -11660666 -9952030 -12339562 -16984391 -16852792 -9031861
644 -9031861 1008564 6143879 5047588 1321178 -1402924 -1378439 1449871 5157374 6979455
635 6979455 6245843 4752247 3739165 2809384 2188952 2818792 3376618 1144991 -2536876
626 -2536876 -2150426 3777115 8642438 6099921 -1162801 -5802909 -5893026 -4950915 -4294575
617 -4294575 -2115622 684442 810482 -652938 1274580 6333275 7182920 182211 -7983071
608 -7983071 -9241985 -4943358 -2075234 -2185480 -576707 4929129 10709069 13089840 12212084
599 12212084 9219094 4144468 -1673337 -4766134 -3483960 -481443 593157 -859839
591 -859839 -2986707 -4200846 -3787456 -1549018 1321926 2251666 -48745 -3750606 -6289735
582 -6289735 -7809100 -10519786 -15039198 -19164629 -20564459 -19327606 -17181959 -14991037
574 -14991037 -11943796 -7332746 -2630787 -980012 -3944729 -9023633 -11351389 -8241630
566 -8241630 -1619903 3929418 4774140 327253 -6690784 -11662877 -11726081 -9333781 -10616948
557 -10616948 -18471918 -28496242 -33812359 -32974720 -30661014 -31009114 -33098466 -33399831 -29982424
548 -29982424 -23226257 -14734591 -7149430 -3261616 -3481411 -5218690 -5915489 -5241430 -3188807
539 -3188807 1537007 8528761 12978414 9990529 1458076 -5277682 -6690242 -7343194 -12608988
530 -12608988 -20164922 -22639149 -17682877 -11242642 -9735086 -12145050 -12253805 -6806313
522 -6806313 1645565 9455521 15716791 19997572 19703196 13441507 5623093 3199525 7077346
513 7077346 10776614 9497506 6711505 8438603 14092255 17820510 17486946 16852440 18312856
504 18312856 18667247 14599936 8711506 6721513 10302971 15321048 16451717 11873347
496 11873347 4119453 -2300244 -4443155 -2817536 318908 3720145 6845572 8051484
488 8051484 6094497 2990752 1726082 1172221 -2085902 -6235620 -4675466 3278596 8615909
479 8615909 4885632 -1312243 416635 8237187 10449053 2940047 -5134043 -5037422 505101
470 505101 3841797 3132594 1256049 -1005479 -4461935 -6802828 -4249581 2664495 9359521
461 9359521 13237958 15955035 19360561 22166796 21781779 17846172 12913518 9944725 9281651
452 9281651 8341269 5090736 1361981 706472 2802631 2902093 -1612805 -6804494 -6992417
443 -6992417 -2325217 1499699 536698 -3188699 -5217334 -4417387 -4020373 -7310905 -12974043
434 -12974043 -15599750 -11639764 -4016271 1167329 2138555 2851348 6458891 10870795 12552840
425 12552840 11445222 9259309 5568737 -653609 -7007125 -8919065 -4829268 2345937
417 2345937 8508031 11146973 10022080 7732783 8592661 13879138 18742597 16902545 8226244
408 8226244 -1239184 -6542519 -8003738 -8106481 -7757773 -6763463 -5319748 -3658064 -1887867
399 -1887867 -707399 -498676 219860 3022163 6275745 6613152 4106867 2539100 3329744
390 3329744 2738192 -2628137 -10339421 -14891471 -13948728 -9296247 -3384232 2039902 4871414
381 4871414 3449219 -1186004 -5725688 -7528687 -5936628 -1172856 6190950 14430102
373 14430102 20825766 23351019 21744180 16994214 10571800 4278393 41673 -852773
365 -852773 1422664 5215258 8580519 10850306 12580223 13502901 11670240 6254425 416089
356 416089 -1255103 1441880 3679012 1939540 -1518677 -2509173 -1025013 -541722 -2336948
347 -2336948 -3875082 -3158465 -1781808 -2237410 -4007060 -4180973 -1350398 2675693 5241736
338 5241736 5916131 6511822 8458203 11099778 12880210 13337019 13130646 12801481 12712652
329 12712652 13722463 16179375 18184824 16773869 11519173 5284606 582207 -2881312
321 -2881312 -5660824 -5812701 -1570215 4165716 5522213 873659 -4100875 -2553796 5383706
312 5383706 12518592 12609211 6843662 1608984 1066630 3608775 5445000 5513854 5436617
303 5436617 5969024 5736391 3464332 -303340 -4105493 -6925324 -8445188 -9110550 -9898606
294 -9898606 -10696907 -9304891 -4105926 2445683 5785604 5244345 5070823 8219783 12302760
285 12302760 13805405 13187700 12677976 11637033 8210693 4100110 3264238 6018938 8153252
276 8153252 6170956 313499 -7412879 -14525981 -17276197 -12980564 -4605443 828918
268 828918 388598 -1634927 -724357 1613314 1761304 491650 856401 1850075 -416641
259 -416641 -5747267 -9232079 -8352087 -6180964 -6009393 -6890732 -6704888 -5837925 -4752633
250 -4752633 -1214354 5909386 12284803 12421010 7646038 4878251 6888315 8610235 5105440
241 5105440 -1108101 -4028099 -2432152 -177417 55263 -809787 -1604810 -2921779 -5170488
232 -5170488 -7438282 -8993810 -9872855 -9801114 -8636993 -7653744 -7814635 -7197929 -3573306
223 -3573306 621164 492477 -3056024 -2581402 5408160 14033018 14674046 8388264 3322972
214 3322972 3368575 5630059 7959801 12086620 18258054 22850018 23698571 23160924 23398784
205 23398784 22782072 19781790 16593971 15420133 14203617 9890940 3782763 -122397
197 -122397 -678058 -99622 -183385 -1319628 -4080636 -8118654 -10139564 -6785086 429518
188 429518 6534223 9621577 12312906 16155156 18544358 16948264 12801296 8882567 5528830
179 5528830 2005949 -584523 -627832 1224435 3082029 4268646 4474753 2406455 -1430602
170 -1430602 -2255713 4101532 13894974 17640197 10955914 -525821 -8691374 -11554331
162 -11554331 -11893759 -11164270 -9007953 -6696832 -6427479 -7548080 -7188169 -4743844 -2617170
153 -2617170 -2372982 -3161303 -4140794 -5330088 -5600561 -3137331 1124908 3654907 3070180
144 3070180 1602003 652304 -1286209 -4209016 -4351789 -97649 3366565 334053 -6513766
135 -6513766 -9010013 -4789266 -165327 -731113 -4007373 -3923090 785720 5590065 5923026
126 5923026 1827645 -2316569 -1859889 3196956 7232059 4910682 -1860387 -5759928 -3542039
117 -3542039 -157862 -1432563 -6161819 -9002591 -8683695 -8706743 -10661887 -11654107 -9558011
108 -9558011 -7046151 -7966522 -11858216 -14573080 -13435420 -9739718 -6448208 -5134529 -5361027
99 -5361027 -5743539 -5186959 -3933646 -3632363 -5356318 -7242806 -5667996 -92656 4589954
90 4589954 2964315 -3808180 -8423796 -5882405 808569 4904060 3742644 -42300 -3412951
81 -3412951 -5704848 -6919438 -6640411 -5597621 -5831175 -8007196 -10332463 -11291012 -11830033
72 -11830033 -13417860 -15222250 -14987596 -12313770 -9628235 -9629264 -12414451 -15492896 -16571635
63 -16571635 -15988606 -15825853 -16791106 -17360103 -16579948 -15866209 -16312894 -15835304 -11654866 -4864339
53 -4864339 351013 1925794 1623444 1451444 1247016 438679 -407477 -644680 -34506 2085393
43 2085393 5610962 7616457 4871128 -898722 -3869502 -1477121 2688757 4793181 5506126
34 5506126 6678268 7589187 7832216 9996898 15132803 18629115 15621486 8639220 4926020
25 4926020 7026977 10447090 10199545 5685254 -664271 -5884869 -7701667 -6510953 -5905015
16 -5905015 -8365393 -11421108 -11462104 -10009942 -11714067 -16785117 -20399178 -19845031 -17339538
7 -17339538 -14945505 -11652598 -7116793 -3743808 -2851671 -2581242 -1734070
0 -1734070
##END NTUPLES=NMR SPECTRUM
##END=
