##TITLE=31Pdec_DE-60k_D2O
 D2O, 64 sc
 2.7.2024
##JCAMPDX= 6.0         $$ Bruker NMR JCAMP-DX V2.0
##DATA TYPE= NMR SPECTRUM
##DATA CLASS= NTUPLES
##ORIGIN= UXNMR, Bruker Analytische Messtechnik GmbH
##OWNER= root
$$ XWIN-NMR		Version 3.5
$$ Tue Jul  2 14:15:34 2024 Russian Standard Time (UT+4h)  she@DPX200
##.OBSERVE FREQUENCY= 81.013821
##.OBSERVE NUCLEUS= ^31P
##.ACQUISITION MODE= SIMULTANEOUS
##.ACQUISITION SCHEME= undefined
##.AVERAGES= 64
##.DIGITISER RES= 17
##SPECTROMETER/DATA SYSTEM= spect
##.PULSE SEQUENCE= zgpg30
##.SOLVENT NAME= DMSO
##.SHIFT REFERENCE= (INTERNAL, DMSO, 0, 198.062)
##AUDIT TRAIL= $$ (NUMBER, WHEN, WHO, WHERE, WHAT)
$$ ##TITLE= Audit trail, XWIN-NMR		Version 3.5
$$ ##JCAMPDX= 5.01
$$ ##ORIGIN= Bruker BioSpin GmbH
$$ ##OWNER= she
$$ F:/spectra/data/she/nmr/P31/2/pdata/1/auditp.txt
$$ ##AUDIT TRAIL=  $$ (NUMBER, WHEN, WHO, WHERE, WHAT)
(   1,<2024-07-02 14:14:01.10 +0400>,<she>,<DPX200>,
      <continue with go, POWCHK disabled, PULCHK disabled
       configuration hash MD5:
       00 E9 B6 7A A2 85 ED C7 34 08 36 98 17 FE 4E 26
       data hash MD5: 32K
       53 F7 80 DB 38 C7 00 AA 69 E1 78 BC BB 09 06 F8>)
(   2,<2024-07-02 14:14:03.43 +0400>,<she>,<DPX200>,
      <Start of raw data processing
       efp BC_mod = 2 LB = 1.5 FT_mod = 6 PKNL = 1 PHC0 = 3042.96 PHC1 = -528.5136 SI = 64K 
       data hash MD5: 64K
       EC 50 2B 1C 54 2C 47 C1 ED 14 60 70 57 76 42 E1>)
(   3,<2024-07-02 14:14:26.51 +0400>,<she>,<DPX200>,
      <pk PHC0 = 352.2978 PHC1 = -871.5994 
       data hash MD5: 64K
       18 B0 12 11 52 AB 63 C5 BA D1 EA 7B 18 11 86 E3>)
(   4,<2024-07-02 14:15:00.90 +0400>,<she>,<DPX200>,
      <pk PHC0 = -7.73103 PHC1 = 20.4 
       data hash MD5: 64K
       30 41 C1 F7 09 F2 9D 27 07 97 8F E8 88 03 D7 08>)
$$ ##END=
$$ 
$$ hash MD5
$$ 31 0D 6E F1 EB 5F BC FC A0 7F 70 8E 3E 95 56 F3
##$RELAX= 
##$RELAX= 
##$RELAX= 
##$RELAX= 
##$RELAX= 
##$RELAX= 
##$RELAX= 
##$RELAX= 
$$ Bruker specific parameters
$$ --------------------------
##$DU= <F:/spectra>
##$EXPNO= 2
##$NAME= <P31>
##$PROCNO= 1
##$TYPE= <nmr>
##$USER= <she>
##$AMP= (0..31)
100 100 100 100 100 100 100 100 100 100 100 100 100 100 100 100 100 100 
100 100 100 100 100 100 100 100 100 100 100 100 100 100 
##$AQSEQ= 0
##$AQ_mod= 1
##$AUNM= <au_zg>
##$AUTOPOS= <>
##$BF1= 81.014009
##$BF2= 200.13
##$BF3= 200.13
##$BF4= 200.13
##$BF5= 200.13
##$BF6= 200.13
##$BF7= 200.13
##$BF8= 200.13
##$BYTORDA= 1
##$CFDGTYP= 0
##$CFRGTYP= 5
##$CHEMSTR= <none>
##$CNST= (0..31)
1 1 145 1 1 1 1 1 1 1 1 1 1 1 1 1 1 1 1 1 1 1 1 1 1 1 1 1 1 1 1 1 
##$CPDPRG= <waltz16>
##$CPDPRG1= <>
##$CPDPRG2= <waltz16>
##$CPDPRG3= <>
##$CPDPRG4= <mlev>
##$CPDPRG5= <mlev>
##$CPDPRG6= <mlev>
##$CPDPRG7= <mlev>
##$CPDPRG8= <mlev>
##$CPDPRGB= <>
##$CPDPRGT= <>
##$D= (0..31)
0 1 0 0 0 0 0 0 0 0.06 0 0.03 2e-05 3e-06 0 0 0.0002 0 0 0 0 0 0 0 0 0 
0 0 0 0 0 0 
##$DATE= 1719915159
##$DBL= (0..7)
120 120 120 11 120 120 24 19 
##$DBP= (0..7)
150 150 150 150 150 150 150 150 
##$DBP07= 0
##$DBPNAM0= <>
$$ [...]
##$SUBNAM3= <"">
##$SUBNAM4= <"">
##$SUBNAM5= <"">
##$SUBNAM6= <"">
##$SUBNAM7= <"">
##$SUBNAM8= <"">
##$SUBNAM9= <"">
##$SW= 400.765351723535
##$SWIBOX= (0..15)
0 1 3 0 0 0 0 0 0 0 0 0 0 0 0 0 
##$SW_h= 32467.5324675325
##$TD= 32768
##$TD0= 1
##$TE= 0
##$TE2= 300
##$TE3= 300
##$TEG= 300
##$TL= (0..7)
0 120 53 12 22 120 120 120 
##$TP= (0..7)
150 150 150 150 150 150 150 150 
##$TP07= 0
##$TPNAME0= <>
##$TPNAME1= <>
##$TPNAME2= <>
##$TPNAME3= <>
##$TPNAME4= <>
##$TPNAME5= <>
##$TPNAME6= <>
##$TPNAME7= <>
##$TPOAL= (0..7)
0.5 0.5 0.5 0.5 0.5 0.5 0.5 0.5 
##$TPOFFS= (0..7)
0 0 0 0 0 0 0 0 
##$TUNHIN= 0
##$TUNHOUT= 0
##$TUNXOUT= 0
##$USERA1= <user>
##$USERA2= <user>
##$USERA3= <user>
##$USERA4= <user>
##$USERA5= <user>
##$V9= 5
##$VALIST= <valist>
##$VCLIST= <CCCCCCCCCCCCCCC>
##$VD= 0
##$VDLIST= <DDDDDDDDDDDDDDD>
##$VPLIST= <PPPPPPPPPPPPPPP>
##$VTLIST= <TTTTTTTTTTTTTTT>
##$WBST= 1024
##$WBSW= 4
##$XGAIN= (0..3)
0 0 0 0 
##$XL= 0
##$YL= 0
##$YMAX_a= 11671
##$YMIN_a= -3216
##$ZGOPTNS= <>
##$ZL1= 120
##$ZL2= 120
##$ZL3= 120
##$ZL4= 120
##$ABSF1= 0
##$ABSF2= 0
##$ABSG= 0
##$ABSL= 0
##$ALPHA= 0
##$AQORDER= 0
##$ASSFAC= 0
##$ASSFACI= 0
##$ASSFACX= 0
##$ASSWID= 0
##$AUNMP= <proc_1d>
##$AZFE= 0.1
##$AZFW= 0.5
##$BCFW= 0
##$BC_mod= 2
##$BYTORDP= 0
##$COROFFS= 0
##$CY= -3
##$DATMOD= 1
##$DC= 0
##$DFILT= <>
##$DTYPP= 0
##$F1P= 0
##$F2P= 0
##$FCOR= 1
##$FTSIZE= 65536
##$FT_mod= 6
##$GAMMA= 0
##$GB= 0
##$INTBC= 1
##$INTSCL= 9.790993e-09
##$ISEN= 30
##$LB= 1.5
##$LEV0= 0
##$LPBIN= 0
##$MAXI= 10000
##$MC2= 0
##$MEAN= 0
##$ME_mod= 0
##$MI= 50
##$NCOEF= 0
##$NC_proc= -9
##$NLEV= 6
##$NOISF1= 182.463
##$NOISF2= 159.3651
##$NSP= 0
##$NTH_PI= 0
##$NZP= 0
##$OFFSET= 198.0616
##$PC= 4
##$PHC0= 3387.527
##$PHC1= -1379.713
##$PH_mod= 1
##$PKNL= yes
##$PPARMOD= 0
##$PSCAL= 0
##$PSIGN= 0
##$REVERSE= no
##$SF= 81.0140089999434
##$SI= 65536
##$SIGF1= 159.3651
##$SIGF2= -187.1042
##$SINO= 113.3802
##$SIOLD= 16384
##$SREGLST= <1H.CDCl3>
##$SSB= 0
##$STSI= 65536
##$STSR= 0
##$SW_p= 32467.5324675325
##$SYMM= 0
##$S_DEV= 0
##$TDeff= 32768
##$TDoff= 0
##$TI= <>
##$TILT= no
##$TM1= 0
##$TM2= 0
##$TOPLEV= 0
##$USERP1= <user>
##$USERP2= <user>
##$USERP3= <user>
##$USERP4= <user>
##$USERP5= <user>
##$WDW= 1
##$XDIM= 65536
##$YMAX_p= 287074163
##$YMIN_p= -240100138
$$ End of Bruker specific parameters
$$ ---------------------------------
##NTUPLES= NMR SPECTRUM
##VAR_NAME=  FREQUENCY,     SPECTRUM/REAL,   SPECTRUM/IMAG
##SYMBOL=    X,             R,               I
##VAR_TYPE=  INDEPENDENT,   DEPENDENT,       DEPENDENT
##VAR_FORM=  AFFN,          ASDF,            ASDF
##VAR_DIM=   65536,         65536,           65536
##UNITS=     HZ,            ARBITRARY UNITS, ARBITRARY UNITS
##FACTOR=    0.49542278885378, 1,            1
##FIRST=     16045.7642231865, 0,            0
##LAST=      -16421.768244346, 0,            0
##MIN=       -16421.768244346, -240100138,   0
##MAX=       16045.7642231865, 287074163,    0
$$ Real data points
##PAGE= N=1
##DATA TABLE= (X++(R..R)), XYDATA
$$ [...]
7371A1046354J345443k294467l955660m069181k199786L046213Q587470P895411
7363A9401797L84813o123501n652214j197556J898770L790073O523402P680479
7355B6706063L542848m199399r731055r459489m320418J816607M216111J185195
7347I756463k709107j737122J985603J143764l869906l772573M070315R030787
7339A3898224L137153n769698o260677q04436K40481l840915n033717j445598
7331e879183J206658J207875K042249K753378j161124p028261o809607q35740
7323a4503755J681991k105895m391499p92590K726670J715999J146154N181506
7315i341419Q612143N755262o2498l187968m581795o579708n579165J403066Q264062
$$ y = [11046354, 12391797, 10097330, 6141670, 2072489, -127297, 2918916, 11506386, 19401797, 19786610, 13663109, 8010895, 6813339, 8712109, 12502182, 19025584, 26706063, 30248911, 26049512, 16318457, 6858968, 2538550, 4355157, 8571268, 9756463, 7047356, 5310234, 7295837, 8439601, 4569695, 797122, 4867437, 13898224, 17035377, 11265679, 5005002, 4200566, 4441047, 600132, -4433585, -5879183, -4672525, -3464650, -1422401, 1330977, 169853, -6858408, -13668015, -14503755, -12821764, -14927659, -19319158, -20111748, -17385078, -15669079, -14522925, -9341419, -729276, 5025986, 4963488, 1775520, -2806275, -9385983, -14965148, -13562082, -5298020]
7306e298020P055724J62628l314465q06631K228925K254789J070981Q580j741367
7297A621144k687376K98242N753359P805746M130751q94303k437390o82367J281167
7288A4188973J593652K53850j653712k232173m90433J566548P56822k831836n386780
7279E764911m106692n64788J552130P63589j082842j432988J3331J364076J458297
7270C729024J407081J982775J187723k591635o204659m968840k03185J871052
7262c790664r5064j65940M574056P846183L563733m027181o294128k430155J445189
7253F26029K496448K700041J939723j958815o264030m692132K511716P020776
7245D379756L542419l531421p154514n718484j543344L049024N025095J553646
$$ y = [-5298020, 1757704, 1920332, -1394133, -2200764, 28161, 2282950, 3353931, 3362511, 1621144, -1066232, -767990, 4985369, 12791115, 16921866, 16027563, 13590173, 12907806, 14188973, 15782625, 16036475, 14382763, 12150590, 11660157, 13226705, 13983527, 11151691, 5764911, 1658219, 1093431, 2645561, 3409150, 2326308, 893320, 906651, 2270727, 3729024, 5136105, 7118880, 8306603, 5714968, -489691, -5458531, -5661716, -3790664, -3885728, -4051668, 522388, 8368571, 11932304, 7905123, 1610995, -819160, 626029, 3122477, 5822518, 7762241, 5803426, -460604, -5152736, -2641020, 4379756, 7922175, 4390754, -2763760, -8482244, -10025588, -6976564, -1951469, -397823]
7237c97823m559563n584282N84762N708488K509279l991667l530097M104701Q994563
7228C838361N624931n19378k390810l38201J551213K276867K575497Q94782l869972
7219I643290p771664n555077J131964M330682J16801n638761m612876L382493
7211d973148J0393867R857394L134542l414834n327413l338623j532190k863570
7203A936025n543178m257742L235487J1389753J1964738M447273k269579p46631
7195B0156146N618510P393223J278358o435769q113521l063800K998312M486216
7187B4317675J105425k495289k083413J029463J690490j716011m512813k584306
7179A4751221J090846P29515l519649o015995m027644p01042O65181P05406J421226
$$ y = [-397823, -4957386, -10541668, -9956906, -4248418, -1739139, -5730806, -9260903, -5156202, 3838361, 9463292, 8943914, 6553104, 6214903, 7766116, 10042983, 12618480, 13513262, 9643290, 1871626, -3683451, -2551487, 1779195, 1895996, -3742765, -8355641, -4973148, 5420719, 15278113, 18412655, 14997821, 9670408, 6331785, 4799595, 1936025, -3607153, -7864895, -4629408, 6760345, 18725083, 23172356, 20902777, 20156146, 25774656, 33167879, 34446237, 28010468, 19896947, 16833147, 19831459, 24317675, 25423100, 22927811, 20844398, 21873861, 23564351, 21848340, 17335527, 14751221, 15842067, 16571582, 13051933, 7035938, 3008294, 2307252, 2972433, 3677839, 5099065]
7170E099065L478646O760231R674420P788626j515435j1968839j2454889j406559
7162E455266Q761646O609923l722232r031852m623818K088559M141190L080200
7154A2758882K857106K675780J41330k820965k317160Q29724J286259l497927
7146A1913029r516425j1158190p678983k628268J664154N771853R239051Q844703
7138F450924L362643k648789l638639l56011J734084O94624m2050J401371J912904
7129H871061q40823l959625m100502k960995l937706o161227o094466k998394
7121b2182677J230705N753855J0060323J1270058P030813L27476l309511l130017
7113G051025l213837n373885o846368n527331k632199R22280N852503J0455785
$$ y = [5099065, 8577711, 15337942, 25012362, 32800988, 31285553, 19316714, 6861825, 5455266, 14216912, 20826835, 17104603, 8072751, 3448933, 5537492, 9678682, 12758882, 15615988, 18291768, 18433098, 15612133, 13294973, 14124697, 15410956, 11913029, 2396604, -8761586, -16440569, -19068837, -17404683, -11632830, -2393779, 6450924, 9813567, 7164778, 3526139, 3170128, 4904212, 5598836, 5556786, 6958157, 8871061, 8030238, 4070613, -29889, -2990884, -6928590, -13089817, -19184283, -22182677, -20951972, -15198117, -5137794, 6132264, 13163077, 13490553, 10181042, 7051025, 3837188, -1536697, -8383065, -13910396, -16542595, -15620315, -9767812, 687973]
7105F87973J0244569M710194K55118K359059P662386Q052952J089578p445753
7097B7616076j0790676p937010l235218j513570l673965n933378l952227J646004
7089g773964N519119M425042J314721M69772J274483M68588j404146p21312K429642
7080F001945L426478L95132k479969j592963K58563j320432m621992m038742J050437
7071b921543M842473L419103n7377o58266J333176J885469m80227l116974l131015
7062A114819l82532K744532K850628j683461p231398o569950K202649J0309033
7054C354320P321578m822648j3083933r898011j880972J203721n05323p11037
7046a9022305J553721K117235Q48807K307409P061849R713357P249248L225240
$$ y = [687973, 10932542, 15642736, 15897854, 18256913, 25919299, 33972251, 35061829, 27616076, 16825400, 8888390, 5653172, 4139602, 465637, -5467741, -9419968, -7773964, -2254845, 2170197, 3484918, 3954690, 5229173, 5697761, 4293615, 3572303, 6001945, 9428423, 9823555, 7343586, 5750623, 6009186, 4688754, 66762, -3971980, -2921543, 1920930, 5340033, 5282656, 4624390, 5957566, 7843035, 7362808, 4245834, 1114819, 732287, 3476819, 6327447, 4643986, -2587412, -9157362, -6954713, 3354320, 10675898, 5853250, -7230683, -17128694, -19009666, -17805945, -18311268, -19022305, -17468584, -15351349, -14502542, -12195133, -5133284, 4580073, 11829321, 15054561]
7038A5054561J365200M95714j236105j997272J78274L222271M137058L217017
7030B4436718J619902k143584q790194j3595582j0555738j008267O632495O811337
7022C407087K730006N60342J026654N9094l555012n366474j753485L736887M330881
7013E175980m11689l685362j588687R16373j633016n308562k188316O456679J0612559
7004H345959N722055j643846m557968m146225l311851q0117O446337J0092294
6996A6866638N497322k582657n884035m727708m803661n111486K99829R244896
6988H799138J1185889K558571p219841q930150m588618q41245J021616K522398
6980D507758J769812l040041p751275o667104p65053M026319N075708M629432
$$ y = [15054561, 16419761, 16915475, 15679370, 13682098, 13860372, 17082643, 21219701, 24436718, 26056620, 23913036, 15122842, 1527260, -9028478, -10036745, -3404250, 3407087, 6137093, 6697435, 7724089, 7783183, 4228171, -1138303, -2891788, 845099, 5175980, 4764291, 1078929, -509758, 406615, -1226401, -6534963, -8723279, -2266600, 8345959, 14068014, 12424168, 7866200, 3719975, 408124, 328007, 6774344, 16866638, 22363960, 19781303, 13897268, 9169560, 4365899, -745587, -445758, 8799138, 19985027, 22543598, 15323757, 6393607, 1804989, 963744, 1985360, 4507758, 6277570, 3237529, -4513746, -11180850, -11945903, -7919584, -2843876, 1785556]
6972A785556M582273M461338L943273L384935K307274M43620o48104K18182J534588
6963B2012935J692866J775086K663300K099358j341828m215384l295692k128750
6955A9261891o043862j2162764j1891112l645124M381982N870028L684908K667069
6947B123016J875779j433014n412592o578727n671353n605590o024522m307128
6939c1034131j85063M340996P977324J0025397R554931P548772O869163O916686
6931B2014075K469522p404462j3835812q817965J719136M395695l054279r367763
6923a1881853p057220j945394j341002k226614J597856P695756R049682N581380
6915e27409K787101J429210k324592p194527o515480N97459O055777M165598p41889
$$ y = [1785556, 6367829, 10829167, 14772440, 18157375, 20464649, 20908269, 20260165, 20478347, 22012935, 23705801, 25480887, 28144187, 30243545, 28901717, 24686333, 21390641, 19261891, 13218029, 1055265, -10835847, -14480971, -10098989, -4228961, -544053, 2123016, 3998795, 2565781, -2846811, -9425538, -15096891, -20702481, -26727003, -31034131, -31219194, -26878198, -18900874, -8875477, 679454, 8228226, 15097389, 22014075, 24483597, 17079135, 3243323, -5574642, -3855506, 540189, -2514090, -11881853, -18939073, -20884467, -22225469, -24452083, -22854227, -15158471, -6108789, -527409, 2259692, 3688902, 1364310, -5830217, -12345697, -11748238, -5692461, -1526863, -2268752]
6906b268752k306797j463439k041765k258197J888580P591375P861451K905932
6898I908388Q68733N207782Q690941M301344l762105o205654k096057J036454
6890A7949826o95010k842492j317985J120742N65273j346711j298524q78754l507204
6881G749161p174713o579375j808082J405007P64713N90234L756935O171986L166503
6872H042369k700534m748065q18723M967346P549795N036713q14457n424134m577665
6863F512645M05522K855362q43176n708778n090660m76140J152392j794924l821706
6854f809463j872983K7914j842438m167388j221577O577328J2492677J1166616
6846A4350686M388689r98269o31120K234819Q55531n145030p943465k823265L158228
$$ y = [-2268752, -4575549, -6038988, -8080753, -10338950, -8450370, -858995, 7002456, 9908388, 10777121, 15984903, 24675844, 28977188, 25215083, 19009429, 16913372, 17949826, 17254816, 14412324, 13094339, 14215081, 14780354, 13433643, 12135119, 11256365, 7749161, 574448, -6004927, -7813009, -6408002, -5643289, -5053055, -1296120, 4875866, 8042369, 5341835, 593770, -224953, 4742393, 12292188, 17328901, 16514444, 11090310, 6512645, 6918167, 9773529, 8930353, 3221575, -1869085, -2345225, -1192833, -2987757, -6809463, -8682446, -8654532, -10496970, -14664358, -15885935, -9308607, 3184070, 14350686, 18739375, 17741106, 17109986, 19344805, 20200336, 15055306, 7111841, 4288576, 7446804]
6837G446804M43642p954684r593153o77297Q624569R450203N487972M160830M963545
6828B2352431L446302L71084q36039j259604l625608n749044m202411j745228
6820H751883l619988q264427q944951l631033L255840P797804Q898916N251537
6812I495581k612784q154715m807663L560127O171018L56192n134011l728752
6804d855007O54354K422680L057352N520524O884615L416297j922544m072563
6796A1105708m396939p419615j1322769r317358n00175P360170P600549K174302
6788d716127k852612n100332n827622m937422p25972N250800P239543K092742
6780i577002n019662n727211O59902N770728L575880j310952q50489M464247O908470
$$ y = [7446804, 7890446, -64238, -9657391, -10334688, -1710119, 7740084, 13228056, 17388886, 22352431, 25798733, 26169817, 25333778, 24074174, 20448566, 14699522, 10497111, 8751883, 5131895, -3132532, -12077483, -15708516, -12452676, -4654872, 4244044, 9495581, 6882797, -1271918, -6079581, -2519454, 3651564, 4007756, -1126255, -4855007, -4200653, -1777973, 1279379, 6799903, 13684518, 17100815, 15178271, 11105708, 6708769, -710846, -12033615, -21350973, -21851148, -14490978, -6890429, -4716127, -7568739, -12669071, -18496693, -23434115, -24160087, -18909287, -11669744, -9577002, -14596664, -20323875, -19663973, -13893245, -10317365, -11628317, -12478806, -8014559, -1106089]
6771a106089L241575j582135k944383k477158l320094m729848m413747k364434
6763a9696313M42421M084316Q036330J0136781R082232N679610J000759l516886
6755A5249250m271812J020810P206502N469042m201441j0973908p757115j198598
6747E42730j007877n118241l920711L952226R407749O536239M25526r69479L085623
6738A2933785P283326P709211M800300P88227k844332n258292n330321k499882
6730A7582022J032173R97583l583844p382031n157571r2591J17523m439769n192124
6721f118629R25148N382042J381894m809456m036153P85976L44675m438409l413974
6712a3996886N504777J1495207O292619m378123r196595m821799L079777P799987
$$ y = [-1106089, 2135486, 553351, -2391032, -4868190, -8188284, -12918132, -17331879, -19696313, -19253892, -15169576, -7133246, 3003535, 12085767, 17765377, 18766136, 15249250, 10977438, 11998248, 19204750, 24673792, 20472351, 9498443, 1741328, 542730, -465147, -5583388, -9504099, -5551873, 3855876, 10392115, 10817641, 9848162, 12933785, 20217111, 27926322, 32726622, 33514849, 30670517, 25412225, 20081904, 17582022, 18614195, 19611778, 16027934, 8645903, 3488332, 3395741, 3513264, -926505, -6118629, -5193481, 188561, 1570455, -3239001, -7275154, -6489178, -6144503, -10582912, -13996886, -8492109, 3003098, 9295717, 4917594, -4279001, -9100800, -6021023, 1778964]
6704A778964O758047J634035l730749o764981p916613p639995l873226L604637
6696a6149881Q798127N694159k172517n202023q25026L981657M011918J990603
6688A27017J400167Q69787p69324p45301K002436L385355Q68390j860338j488185
6679C790004q23490k721179l761281n26742K482442r24151p419504p663255k46189
6670a7813345O037137N009305Q18629j11876J299777o32m169527o214888l777799
6661a8923219j59935J487823K866185O449959R437742O468086j878779q271897
6653b524035q127731n262460m631575l805221K645669J2793520J8027652J3866698
6645B2982517M488839l667211p421628n854319n602N009423L478367l037275o408373
$$ y = [1778964, 8537011, 10171046, 6440297, -324684, -8241297, -15881292, -19754518, -16149881, -7351754, -1657595, -3830112, -9032135, -9857161, -5875504, -1863586, 127017, 1527184, 2396971, 1627647, 882346, 2884782, 6270137, 7138527, 5278189, 3790004, 2966514, 245335, -3515946, -4042688, -1560246, -2484397, -9903901, -17567156, -17813345, -11776208, -6766903, -5948274, -6060150, -4760373, -4761005, -8930532, -15145420, -18923219, -19083154, -17595331, -14729146, -8279187, 1158555, 7626641, 5747862, -2524035, -10651766, -15914226, -20545801, -24351022, -21705353, -8911833, 9115819, 22982517, 27471356, 23804145, 16382517, 10528198, 10522596, 15532019, 19010386, 15973111, 9564738]
6636I564738k761450K398743K342440k527856p255882q631652o067680p25318
6628a3663917L288515J364529m892018p815313l556821K847407N353850M659709
6620a2414059M350717M629448M350128M284032L689668j044664q927150j1154311
6612a2236191k422241R102831J1104197L390359l127506j820460L216184N491195
6604A2698368L607532j50638k997285k757415O6017J819709P24592J16886K483251
6595A5611017L816237l183m691530l379623J393711P32284o061122r642314n014472
6586g238995J242965J588264k215910l956782k231224O1021J499066K864810M282182
6577d104603M896540M296008K799357J417389J371591J863794k87810n680372
$$ y = [9564738, 6803288, 9202031, 11544471, 9016615, 1760733, -6870919, -12938599, -13663917, -10375402, -9010873, -13902891, -21718204, -25275025, -22427618, -17073768, -12414059, -8063342, -3433894, 916234, 5200266, 8889934, 7845270, -1081880, -12236191, -14658432, -5555601, 5548596, 8938955, 5811449, 3990989, 7207173, 12698368, 16305900, 16155262, 13157977, 10400562, 10466579, 12286288, 13010880, 13127766, 15611017, 19427254, 19424071, 14732541, 11352918, 12746629, 13478913, 7417791, -2224523, -7238995, -5996030, -4407766, -6623676, -10580458, -12811682, -12750661, -11251595, -8386785, -4104603, 791937, 5087945, 7887302, 9304691, 10676282, 12540076, 12252266, 6571894]
6569F571894q873951m594288L912368Q256721O020540K515819J503309P21708
6561A6034120k167974n361003o564111n741942k827407K215947O100995M632887
6553F321512m64069l003930j670122j395788m146919n707684l892756k243276
6545a6203032k362089m65407M245792N793723J534206j534392K524010Q098279
6537A631090O083381k644050r679563j0887230p965720k015481N976189J0827557
6529h673827Q042138J869507N41194M156664N239174J347300j156074K259232
6521A3625308P148038O800828R09896n551500q382430o756742k885118q65458
6513D042822l180273p140691p451088l072635J408797K141627P24076J226824
$$ y = [6571894, -2302057, -6896345, -2983977, 5272744, 11293284, 13809103, 15312412, 16034120, 13866146, 8505143, 1941032, -3800910, -6628317, -4412370, 1688625, 6321512, 5857443, 2853513, 1183391, -212397, -4359316, -10067000, -13959756, -16203032, -18565121, -19030528, -14784736, -8991013, -7456807, -8991199, -6467189, 1631090, 7714471, 5070421, -4609142, -15496372, -23462092, -25477573, -19501384, -8673827, -631689, 1237818, 1779012, 5935676, 11174850, 12522150, 11366076, 13625308, 20773346, 27574174, 28484070, 22932570, 14550140, 7793398, 4908280, 4042822, 862549, -6278142, -13729230, -16801865, -15393068, -13251441, -12527365, -11300541]
6505a1300541M891449R083151R884958N292253k349118p106602n024690R10374
6497D281234L888484J610219j388529n75673K449168K737354r70602m527595l593236
6488C910824J056872M382131L082629l82655j082917J720376L719824J917174
6480A8324258j185322j705889j31058j06259l110398p103155r300330p923523
6472a2241676k714874L623113O138551K901632j879334l263416k299148l129840
6464a2864992n033322l187659K506483N700810K995432m83888J103126N119524
6456d144486M475368j192230m374003m50020N547915N926576P84435k824676r94441
6447B754438K632731L547995K596902K252364P73516m385385r528987p917698
$$ y = [-11300541, -6409092, 2674059, 12559017, 17851270, 15502152, 8395550, 3370860, 4281234, 8169718, 9779937, 8391408, 7815735, 10264903, 13002257, 12031655, 7504060, 3910824, 4967696, 9349827, 12432456, 12049801, 10966884, 12687260, 16407084, 18324258, 17138936, 15433047, 15301989, 15195730, 12085332, 4982177, -4318153, -12241676, -14956550, -11333437, -5194886, -2293254, -4172588, -7436004, -9735152, -12864992, -17898314, -21085973, -18579490, -12878680, -9883248, -10367136, -9264010, -4144486, 330882, -861348, -5235351, -5685371, -137456, 5789120, 6573555, 3748879, 2754438, 5387169, 8935164, 11532066, 13784430, 14557946, 10172561, 643574, -7274124]
6439g274124k30770M957375L129228k33867Q72205L617504J735937m180369p823103
6430e429984o050237j296966L048712N066693L945203J418316J382834M036789
6422F121360L571498l202410r500022o702129K670959P941686N021600K1210j808414
6413D135338k254013l656612m065310j738561J724804N126071Q674543R574471
6405A7520731L556750o566409j1178528o577866n48463n79440l318403j799128
6397i490756K878756M603031K732980J606735J965214M23907l356843n543588
6389d180564m139123q18916K917520O426371P317463L615912j481822k574019
6381G082822l85488j349496p179008j0717559n852462K896222N709309L11323
$$ y = [-7274124, -7504894, -2547519, 581709, 347842, 1220047, 4837551, 6573488, 2393119, -5429984, -11480221, -12777187, -9728475, -4661782, -716579, 701737, 2084571, 6121360, 9692858, 6490448, -3009574, -9711703, -7040744, 900942, 5922542, 5943752, 4135338, 1881325, -1775287, -5840597, -7579158, -5854354, -728283, 7946260, 17520731, 21077481, 14511072, 3332544, -3245322, -3793785, -4373225, -7691628, -9490756, -6612000, -2008969, 724011, 2330746, 4295960, 4719867, 1363024, -4180564, -8319687, -9138603, -6221083, 205288, 7522751, 11138663, 9656841, 7082822, 6697334, 5347838, -1831170, -12548729, -18401191, -15504969, -9795660, -9484337]
6373i484337n452992l901586L622583R687598R883489O426786L631135K768179
6365A7180855K546195K486896L160309L553661J111760m454919r315676r181324
6357G087757m159914J165269K347091n55018l056640j184026L296211M295637
6349I236367l13065m352471j194419N906726P356147J131370m036762j865600
6341A1868293K486212J719265j853231j384443K230802K245323j768871l140298
6333A2403052P8882J674125j800227m992649l047665J27418j246104m993975m810727
6324f607870n21707K353883J631441N85824J473306K789117L340603L692843K802215
6315A1539655j415594o711061p164457j760852K891914J964742m75917J247155
$$ y = [-9484337, -14937329, -18838915, -15216332, -5528734, 4354755, 10781541, 14412676, 17180855, 19727050, 22213946, 25374255, 28927916, 30039676, 25584757, 16269081, 7087757, 2927843, 4093112, 6440203, 5885185, 2828545, 1644519, 4940730, 9236367, 8923302, 4570831, 3376412, 9283138, 16639285, 17770655, 13733893, 11868293, 14354505, 16073770, 14220539, 12836096, 15066898, 17312221, 15543350, 12403052, 12481934, 14156059, 12355832, 7363183, 4315518, 4442936, 3196832, -1797143, -6607870, -7129577, -4775694, -3144253, -2558429, -1085123, 1703994, 5044597, 8737440, 11539655, 10124061, 3413000, -3751457, -5512309, -2620395, -655653, -1131570, 115585]
6307A15585M438959K345569l968074o236761j804999K178964J09853l590981k210031
6298h621916K303343K504381k948118p094110l942295M663706J2064972J3463223
6290A2393186R029266K708880j549897l416036n249887p015423n200260P31331
6282B431160M529404O87137o643901q233779k253600M123359N566055M206709
6274D412544L077893J077005k113728k363091K564519P437355N842507p52336
6266A9182668n325050m686890j647600P48973K034180J745194r75537m301800
6258F774138m387316q57489J553281p74469m689839l995556J684121N241297J251539
6249A799707n607553n533122K911653R552261O099871j868620k672023M508642
$$ y = [115585, 4554544, 6900113, 2932039, -3304722, -5109721, -2930757, -2820904, -6411885, -8621916, -6318573, -3814192, -6762310, -13856420, -17798715, -13135009, -1070037, 12393186, 21422452, 24131332, 22581435, 19165399, 13915512, 6900089, 1699829, 2431160, 6960564, 7647701, 1003800, -7229979, -9483579, -5360220, 205835, 4412544, 7490437, 8567442, 6453714, 4090623, 6655142, 14092497, 19935004, 19182668, 13857618, 9170728, 7523128, 8272101, 10306281, 12051475, 11075938, 6774138, 2386822, 1529333, 3082614, 2308145, -2381694, -6377250, -4693129, 548168, 1799707, -3807846, -9340968, -6429315, 3122946, 9222817, 7354197, 4682174, 9190816]
6241I190816Q717015L508738m554549o815126m098683k225911k415679k660414
6233a353793l657827o003688n101893K961359J2263896J2108735J508504q751147
6225C974146r853587m233650Q15278K565717K538617J696756K26709o78072l68026
6216c316112k96691j385181j576620J250106N077826N246721K09411o064513q093318
6207h948371m595199L95803K208743P36285j71124J620445L692732L179290J372571
6198e08825J550621L644024M377653K419526K25730J92060J500799J775001J44558
6189A5321147k243528l756582l785982l103460k472043r45951K868707P369979
6181I252287Q368278M585577L331j681861j937795l421783m479282k600437o46010
$$ y = [9190816, 17907831, 21416569, 16862020, 10046894, 5948211, 3722300, 1306621, -1353793, -5011620, -11015308, -16117201, -13155842, -891946, 11216789, 12725293, 3974146, -5879441, -10113091, -9297813, -6732096, -4193479, -2496723, -2270014, -2948086, -3316112, -3612803, -4997984, -6574604, -5324498, -246672, 5000049, 5209460, -855053, -8948371, -13543570, -13147767, -10939024, -10202739, -10373863, -8753418, -5060686, -1881396, -508825, 1041796, 4685820, 9063473, 11482999, 11708729, 11900789, 13401588, 15176589, 15321147, 13077619, 9321037, 5535055, 2431595, -40448, -986399, 1882308, 9252287, 17620565, 22206142, 22209473, 20527612, 18589817, 15168034, 10688752, 8088315, 7442305]
6172G442305l059714p087041n258240K626448P545803L996559k090335k407233
6164A708552K289767N072189L176933k90102k658911m172716m996547m358758
6156d229593k664961j119371M39844K460595L377618J760769j43944R28255L412422
6147D221634K441895k043471l934906k38061L182072k43375p320131q936932l156064
6138a6027339K348396K088369J71133K133075N222862L160960k905954n687431
6130i495929k917099K80754Q61707K076525N562881O422005J030975n713391o710322
6121h601894k439665J200566J881083J871750K134042J185592r97418k748541
6113f514485l614957l604424j294409L066033N014508J678520k361112j247211
$$ y = [7442305, 4382591, -2704450, -7962690, -5336242, 2209561, 6206120, 4115785, 1708552, 3998319, 9070508, 12247441, 11957339, 9298428, 5125712, 129165, -4229593, -6894554, -8013925, -7574081, -5113486, -1735868, 24901, -119043, 809212, 4221634, 6663529, 4620058, 685152, 447091, 3629163, 3385788, -3934343, -12871275, -16027339, -13678943, -11590574, -11419441, -9286366, -4063504, -902544, -3808498, -9495929, -12413028, -12132274, -11270567, -9194042, -3631161, 2790844, 3821819, -1891572, -8601894, -11041559, -9840993, -7959910, -6088160, -3954118, -2768526, -3765944, -6514485, -10129442, -13733866, -15028275, -11962242, -6947734, -5269214, -7630326, -8877537]
6105h877537K451382J837620k026307j093913N775590R404432L869320m780885
6097F559702p784379m789037q01359K144879M703781N856852M257476J309788
6089A1457703j118204l589581o558654p736579n039560K76286N613925R383621
6081B688957J0012657O612604K186131J358030L054056J171044m960933p661570
6073A4460976k636114L379755K695294j882223k943037n51808q4412j817564j522903
6064I097964P53888J040532o19689o42438L34977j847486o333620p179734k665569
6055h061175K486468N121560O646045O783203K202958n822169r722053n726433
6047f091596K79344J393477r17024q17042K776341O243065P463167P070488N510393
$$ y = [-8877537, -6426155, -4588535, -6614842, -7708755, -1933165, 7471267, 11340587, 6559702, -1224677, -6013714, -6815073, -4670194, 33587, 5890439, 10147915, 11457703, 10339499, 6749918, 191264, -7545315, -12584875, -12308589, -6694664, 2688957, 12701614, 19314218, 21500349, 22858379, 25912435, 27083479, 22122546, 14460976, 11824862, 15204617, 17899911, 16017688, 13074651, 12522843, 12438431, 10620867, 9097964, 9851852, 10892384, 10272695, 9630257, 9965234, 8117748, 1784128, -5395606, -8061175, -5574707, -453147, 6192898, 12976101, 15179059, 9356890, -365163, -6091596, -5812252, -4418775, -5335799, -6152841, -3376500, 2866565, 10329732, 17400220, 22910613]
6038B2910613L192825K015938K705980K002096l250187r841594j0444894k849484
6030F441293O559209R964931O212383J80286l705138m883386m667338l834060
6022A2268180k969803l027210l888518l774516k031238j204641l434459n547496
6014a3609701j927952O785281J2234068Q255097j174239p282894o983772m010105
6006g714217j795348j27286J623252K380743J239816j246570l745208m154931
5998a3539749l15309O383365R861059N959539j018373l191401J68703K458087
5990F765921O71539M515M810860J0556319R418200P34055q593901j2486630j0736140
5981A144738o649320l210989j764338j805284j176879K016193O809250R549099
$$ y = [22910613, 26103438, 28119376, 30825356, 32827452, 29577265, 19735671, 9290777, 6441293, 13000502, 22965433, 29177816, 29358102, 25652964, 20769578, 16102240, 12268180, 9298377, 6271167, 2382649, -1391867, -3423105, -4627746, -8062205, -13609701, -15537653, -8752372, 3481696, 11736793, 10562554, 3279660, -3704112, -7714217, -9509565, -9636851, -8013599, -5632856, -4393040, -5639610, -9384818, -13539749, -13855058, -7471693, 2389366, 8348905, 7330532, 4139131, 4307834, 6765921, 7437460, 7441975, 12252835, 22809154, 32227354, 32961409, 24367508, 11880878, 1144738, -5504582, -8715571, -10479909, -12285193, -13462072, -11445879, -4636629, 4912470]
5973D912470P582718K442301j750815l237608m317867o788017p807953l784968
5965a2749739K776669N432448L274675K104840L911643K423540n640544j1831110
5957a0297578o906945M171402Q287664L037511j152730K145359P263394P594935
5949A4143012M735713K220233r23305m930433n435472j131034J399958k642741
5941G435931p522009n393288J100500K809540k184643o763323n530137m83188
5933a6530617L740409M607308J963515j575298j161916M794287J0731096J0205923
5925A6774707M721820J088453J272130R37273k347985n913296p669886q768044
5917I5172r007299n435891J980996Q245699R646988P977957N885561K450898l137340
$$ y = [4912470, 12495188, 14937489, 13186674, 9949066, 5631199, -1156818, -8964771, -12749739, -9973070, -4540622, -1265947, 838893, 4750536, 7174076, 1533532, -10297578, -17204523, -13033121, -4745457, -1707946, -2860676, -715317, 6548077, 14143012, 18878725, 21098958, 20175653, 15245220, 9809748, 8678714, 10078672, 7435931, -86078, -5479366, -4378866, -1569326, -3753969, -10517292, -16047429, -16530617, -12790208, -8182900, -6219385, -7794683, -8956599, -4162312, 6568784, 16774707, 21496527, 22584980, 23857110, 24794383, 22446398, 16533102, 8863216, 95172, -8912127, -14348018, -12367022, -4121323, 5525665, 13503622, 19389183, 21840081, 18702741]
5908A8702741p370521o287323j384742K086208J273312k629047o862201q185872
5900a0657445l869768M259284Q561108L491495n751125q055773p83717O490004
5892f315937N345712p4759l50922M651928O145176M95724n153215l880696J195862
5883B058873K933400J021125M91118K179554J835275j396353k221340K962275
5875I863927J0166149J2432122P392781j682049r681184j2719593r902341m056029
5867A813783O19856K362445J900364m57504m428362o857382l919887K803615P080778
5858I17706O243484L766221K080617j063369n899259o821737o45144O582952P402703
5849A2564174L465675J420502J762884l42917n075021p058785m412494j308484
$$ y = [18702741, 11332220, 5044897, 3660155, 5746363, 7019675, 4390628, -2471573, -10657445, -14527213, -10267929, -1706821, 1784674, -3966451, -12022224, -12805941, -6315937, -970225, -1044984, -1395906, 3256022, 9401198, 9896922, 4743707, 863011, 2058873, 4992273, 6013398, 6504516, 8684070, 10519345, 9122992, 6901652, 9863927, 20030076, 32462198, 39854979, 38172930, 28491746, 15772153, 5869812, 1813783, 2433639, 4796084, 6696448, 6238944, 1810582, -5046800, -8966687, -6163072, 917706, 7161190, 10927411, 13008028, 11944659, 6045400, -776337, -1421481, 5161471, 12564174, 16029849, 17450351, 19213235, 18870318, 13795297, 6736512, 2324018, 1015534]
5841A015534o46414o52520J05534L18044j52005M80166J590583O33157j033899
5832A658180R61024N639704N924063q19983p813920q235648l782960M11875L748102
5823b309563P574197R447937O398379P54546l269144o039013r498576j0510855
5815g452092m631752M715939Q742852N566830K536402M472890O902514M558932
5807B5412515P263j692225j976490n577534j0906089j0935999l840483L505455
5799f003587M497281N05766k820489l014785j431008N29094K060210J645155j080179
5790e112542k991814n61946M947755Q549911P639086L870090o97973n224641p502058
5781B915868m685552J400800M258106J061406k991931k332797Q73432J083964
$$ y = [1015534, 369120, -283400, -177866, 140178, -11827, 468339, 2058922, 2692079, 1658180, 2619204, 8258908, 14182971, 13362988, 5549068, -2686580, -6469540, -6057665, -2309563, 5264634, 14712571, 21110950, 21865496, 18596352, 12557339, 3058763, -7452092, -12083844, -7367905, 1374947, 6941777, 9478179, 13951069, 20853583, 25412515, 25419778, 23727553, 21751063, 16173529, 5267440, -5668559, -9509042, -6003587, -1506306, -1000540, -3821029, -6835814, -8266822, -7737728, -5677518, -4032363, -5112542, -8104356, -8666302, -3718547, 4831364, 12470450, 16340540, 15642567, 10417926, 2915868, -1769684, -368884, 3889222, 4950628, 1958697, -374100, 499332, 1583296]
5773A583296j424069j792282Q10962K463953K087498L048828N899407N844145
5765A8521738L08198o116500p903921n781599l775937k333334Q79140M937480
5757a264735N353306N23255m789446m306741K382858Q733861Q202313J858213
5749A6692884k708807r28449K913805K234386j930420k731741J542616M707834
5741A9792108K353461j984937l503373l197025l649510k914781J224174M730696
5733A2850813K375609k768895k770484K486946M155552k085327q824240p362993
5725a943019K19803M702917J884690m205330q199952q247898m621019J573761
5717a8836047P353678R254324P334314N297578N336525N181640J948554l050310
$$ y = [1583296, 159227, -1633055, -822093, 1641860, 3729358, 6778186, 12677593, 18521738, 18829936, 12713436, 4809515, -972084, -4748021, -7081355, -6202215, -1264735, 4088571, 4611826, -177620, -4484361, -2101503, 6632358, 14834671, 16692884, 13984077, 13055628, 15969433, 18203819, 16273399, 13541658, 15084274, 19792108, 22145569, 20160632, 16657259, 13460234, 9810724, 6895943, 8120117, 12850813, 15226422, 12457527, 9687043, 12173989, 16329541, 14244214, 5419974, -1943019, -1723216, 2979701, 4864391, 659061, -7540891, -15788789, -20409808, -18836047, -11482369, -2228045, 5106269, 10403847, 15740372, 20922012, 22870566, 19820256]
5709A9820256n634599m017464p06205O20652j380586n123135p533410o108319
5701a0062810r30316N037320Q471630Q392472N715691J282331l731205o408996
5693G766117m282073P77351L965926L604595K444583J965779j21480m152716n242060
5684F726022n02388M498537K881980k629795l531187Q65160K376313k266919n677822
5675B739901j997244L200930J741282m302755o436457k863669N21683R55189K349818
5666d091322O778043R430811N467828k501067p398249n953953j392001R56034
5658A296124j012398m627036n436494k000454K753442N634014P019945Q409805
5650A2036948P828622J761360q158100j4612060j2715486n741223m57642R34797
$$ y = [19820256, 14185657, 10168193, 9461988, 10082640, 8702054, 3578919, -3954491, -10062810, -10993126, -5955806, 2515824, 10908296, 16623987, 17906318, 14175113, 7766117, 3484044, 4261395, 8227321, 11831916, 14276499, 16242278, 16120798, 11968082, 6726022, 6223634, 10722171, 13604151, 10974356, 7443169, 8308329, 10684642, 8417723, 2739901, 742657, 3943587, 5684869, 1382114, -5054343, -7918012, -7396329, -6441140, -4091322, 2686721, 12117532, 17585360, 15084293, 7686044, 1732091, 340090, 1296124, 283726, -4343310, -9779804, -11780258, -9026816, -3392802, 3627143, 12036948, 19865570, 21626930, 13468830, -1143230, -13858716, -19599939, -20057581, -19122784]
5642a9122784J346238K684379K817239m86548n040272n991686j841451L368937
5634b2265948N085878L931664L940256N822848N772201K147214p61543J083955
5626D756525M800214M846133J862072J287676L545928K431096m500662j0193619
5618H835363p386873O06725M191710N15716l752562k661372J556398L250393J366206
5609F521704o77331q34858m69939j005537j652482j192183J40961J523445K535693
5600D889473K289873l90562m186105m840988m85344M196758L180199k197674m736510
5591b280880k088606o2869k844479o200476n149650k649058l599064m548554J459413
5582b7964223J1516041J4314800O128548l958816p573025o909912o699216n042904
$$ y = [-19122784, -17776546, -15092167, -12274928, -12761476, -17801748, -23793434, -25634885, -22265948, -17180070, -13248406, -9308150, -3485302, 2286899, 4434113, 3672570, 4756525, 9556739, 14402872, 16264944, 17552620, 21098548, 23529644, 19028982, 8835363, 1448490, 2055215, 6246925, 6762641, 3010079, 348707, 1905105, 5155498, 6521704, 5844373, 5009515, 4539576, 3534039, 1881557, 689374, 830335, 2353780, 4889473, 7179346, 6788784, 2602679, -2238309, -2723653, 1473105, 4653304, 2455630, -2280880, -4369486, -4432355, -7276834, -13477310, -18626960, -21276018, -24875082, -29423636, -27964223, -16448182, -2133382, 3995166, 36350, -7536675, -14446587, -21145803, -26188707]
5574b6188707O86854N611335L677529j844819k687162J998354N641300N256458
5566g848858M238959M198462K055979k977155o360441m846821r20262J743624
5558a0716513K646940K251764K3030k903389l305715o56299J442997Q43624o4642
5549a0438203P90125J456944J39260r69687L30741J961063J173173o52963r00576
5540g110123n39305j583361k148495R63792O094203P866471M069054k239642o775075
5531a402481p028291k654388L622780O958382N663816L515795L252434J275082
5523A3203129n543493j1397278q238995P66217M210461n78143l889468J08394
5515a1359176M086778O07699m851124k687529N574614J0542610R312708O710534
$$ y = [-26188707, -25501853, -19890518, -16212989, -18057808, -20744970, -18746616, -13105316, -7848858, -3609899, 588563, 2644542, -332613, -6693054, -11539875, -12460137, -10716513, -8069573, -5817809, -5794779, -8698168, -12003883, -12660182, -11217185, -10373561, -10438203, -9648078, -8191134, -8051874, -9021561, -8690820, -6729757, -5556584, -6209547, -7110123, -7649428, -9232789, -11381284, -10417492, -4323289, 3543182, 7612236, 5372594, -1402481, -8430772, -11085160, -7462380, -503998, 5159818, 8675613, 11928047, 13203129, 7659636, -3737642, -11976637, -11210420, -6999959, -7578102, -11467570, -11359176, -7272398, -6664699, -11515823, -14203352, -8628738, 1913872, 11226580, 17937114]
5507A7937114M510097m08203p067445r083020m564603L81141Q72039o43037n86427
5498A347656k40792j349396j127192L005055P329085O022877m06025n765980o374297
5489B440991m253025k329466o61005J346400K144337j24372m045789n261370j125415
5480a1868714N490349Q211846L864946l448897o434814k630185L437711O390754
5472C012996N962705N334798N460200L878524q09844n657529o100677j378619
5464I702554M185620N817213L263238M1178j538098k425100l658823l931243k078798
5455I377741L45043J568994K748031N368140P054447M137337k034433n716802
5447B2848498m305818j243759l42527j095822j245197l86145J017873L003430
$$ y = [17937114, 22447211, 22039008, 14971563, 5888543, 1323940, 1705081, 2577120, 1934083, 1347656, 1106864, -242532, -1369724, 1635331, 8964416, 14987293, 14581268, 8815288, 2440991, -1812034, -4141500, -4802505, -3456105, -1311768, -1436140, -5481929, -10743299, -11868714, -6378365, 1833481, 5698427, 2249530, -4185284, -6815469, -3377758, 3012996, 8975701, 14310499, 19770699, 23649223, 22839379, 17181850, 11081173, 9702554, 13888174, 19705387, 22968625, 23009803, 21471705, 19046605, 15387782, 11456539, 9377741, 9722784, 11291778, 14039809, 19407949, 26462396, 30599733, 28565300, 22848498, 18542680, 17298921, 16956394, 15860572, 14615375, 14229230, 15247103, 18250533]
5439A8250533M383720K753584j533113m451546l809285k502325l426484m414679
5431E250405j968241K698132N563757N693560M868207L014309j180670n925640
5423A8013819p457898n578432l722043l243301j946576R99549L012393K438792
5415B516303J245236J586680K722330K932367J728801j033155n024862p138439
5407d64739l335890M759547R123436M863482k795501n476755k814149j073518
5399B785913k324415j958955K141718M863659J797870l266630l674257N54973
5391I19876L799967L597051K716786K828109J765555j381795l277889j264921
5383I702739K043832K156235j485568n723959p887568p329669m525956j173475
$$ y = [18250533, 22634253, 25387837, 23854724, 19403178, 15593893, 13091568, 9665084, 5250405, 3282164, 5980296, 11544053, 17237613, 22105820, 25120129, 23939459, 18013819, 10555921, 4977489, 1255446, -1987855, -3934431, -2934882, 77511, 2516303, 3761539, 5348219, 8070549, 11002916, 12731717, 11698562, 6673700, -464739, -3800629, 958918, 10082354, 14945836, 12150335, 6673580, 3859431, 2785913, 461498, -1497457, 644261, 5507920, 7305790, 4039160, 364903, 919876, 4719843, 8316894, 11033680, 13861789, 15627344, 14245549, 10967660, 9702739, 11746571, 13902806, 12417238, 6693279, -1194289, -8523958, -13049914, -14223389]
5375a4223389L49750N9896J256291N773344J0196534R901959N235422L42969k555291
5366A6337485m036836m212917k871386j714305k046878j470557K239614N466749
5358G690969L133682k216407l157293O46666J707084k221269l560980K342531
5350D364983Q559904O969858O0768m930568p304962r861357r934310l634643L914661
5341a1795666L288024m566759q274865k287149N708666O926733L462313L076317
5333d462386P107108R482542O059178K39916j628153J630293M434821J708900
5325B4572219l944906n605463k186869L1291k239714l780358o9984M214411K655720
5316A3646347k057013l040865j080160k034575m906475l150431K648476M352030
$$ y = [-14223389, -13873639, -13813743, -12557452, -6784108, 3412426, 13314385, 18549807, 18892776, 16337485, 12300649, 8087732, 5216346, 3502041, 1455163, -15394, 2224220, 7690969, 10824651, 8608244, 5450951, 6097617, 7804701, 5583432, 2022452, 4364983, 12924887, 19894745, 19955513, 15024945, 7719983, -2141374, -12075684, -15710327, -11795666, -8507642, -13074401, -21349266, -23636415, -17927749, -11001016, -7538703, -4462386, 2644722, 12127264, 18186442, 18426358, 16798205, 18428498, 22863319, 24572219, 20627313, 15021850, 12834981, 12866272, 10626558, 6846200, 6776216, 10990627, 13646347, 11589334, 8548469, 7468309, 5433734, 527259, -2623172, 25304, 4377334]
5308D377334j45566l458576j495511M73688j547055l265276r61540J329944l77440
5299e069998k544814p80185K669245M298027N619028P522686N257296k970196
5291A4001089q591218l402430O701352Q781046J074234n815123m967646o47968
5283G133336J099493N89473P23291J790389K789189L079479J028635m413399r641776
5274D178110q825360j977074M078694M637151K502439K188256L153180K292393
5266A2227789N1474o2030K923744N546036M081635q36634m501027l167866J244518
5257A7507639K565726k487885r628266j1228120m817353M301399Q716576N777839
5249A0707555r57286n815585o391612n134570n129198n176224j796187L868667
$$ y = [4377334, 4231768, 773192, -722319, -248631, -1795686, -5060962, -6022502, -4692558, -5069998, -7614812, -8394997, -5725752, -1427725, 4191303, 11713989, 16971285, 14001089, 5409871, 2007441, 8708793, 17489839, 18564073, 12748950, 7781304, 7133336, 8232829, 8822302, 9545593, 11335982, 14125171, 17204650, 18233285, 13819886, 4178110, -4647250, -6624324, -2545630, 2091521, 4593960, 6782216, 9935396, 12227789, 12279263, 12217233, 15140977, 20687013, 24768648, 23932014, 19430987, 16263121, 17507639, 20073365, 17585480, 7957214, -3270906, -8088259, -3786860, 4929716, 10707555, 9750269, 3934684, -2456928, -7591498, -12720696, -17896920, -19693107, -15824440]
5241a5824440N636256J086246l643662k094698L017611M144160M42596j749633
5233h985564L62054J891420j080828m736695l342248K054743N221423L224875
5225e390820o26932j925312j20171K175678K601517O29639k920430o330375p235282
5216a9142488m224752R02529L850551K395856o47951r03593K056959N153023O723591
5207c836275P289777N781770M2297p541219j0052135m661896L006686O465505
5199c505490O181686N821698M922490R82361l925302m973831k154167m75948k478275
5190C95222n010687l938127J212571P237267R420538M971141l066134p456487
5182C765304n394086k367946l355989m351480P40296Q204998Q390719M34248o194988
$$ y = [-15824440, -10188184, -9101938, -12745600, -14840298, -11822687, -7678527, -7235931, -8985564, -8623510, -6732090, -7812918, -12549613, -15891861, -13837118, -8615695, -5390820, -6017752, -7943064, -8063235, -5887557, -3286040, -2656401, -5576831, -11907206, -19142488, -23367240, -22464711, -18614160, -16218304, -16866255, -17769848, -15712889, -10559866, -3836275, 3453502, 9235272, 9277569, 1736350, -8315785, -12977681, -9970995, -3505490, 2676196, 8497894, 13420384, 14402745, 10477443, 5503612, 3349445, 2873497, 395222, -4615465, -8553592, -7341021, -103754, 9316784, 14287925, 11221791, 3765304, -1628782, -3996728, -7352717, -11704197, -10963901, -2758903, 5631816, 6066064, -128924]
5173a28924n813271l030966k595996j734324K625840O600210N594761K343183
5165C860513K197903M136282K764473k929173q394809r920900p726767l578256
5157a9590734P80803L377051L372123K284604J700483J010021l95249n80645K245502
5148e796041O007543P121878N662487M691053M835256L282743j085163m922044
5140A9797712m771559k168534j880948n452752q695904o710100l38531M223062
5132e997554K655835k244172l960391m8670N218839O055909J653580l141514l284553
5123c092691P16517L297584R54249k504067p73989N407038Q320123M304094p96535
5114A5832323r22101R45332j045374m600745k887822K831338L702796k557585
$$ y = [-128924, -5942195, -8973161, -11569157, -13303481, -10677641, -4077431, 1517330, 3860513, 6058416, 10194698, 12959171, 10029998, 1635189, -8285711, -16012478, -19590734, -18809931, -15432880, -12060757, -9776153, -8075670, -7065649, -7460898, -8041543, -5796041, 211502, 7333380, 12995867, 17686920, 22522176, 25804919, 24719756, 19797712, 15026153, 12857619, 10976671, 5523919, -3171985, -9882085, -10220616, -5997554, -3341719, -5585891, -9546282, -9594952, -4376113, 1679796, 3333376, 191862, -3092691, -2376174, 921410, 1875659, -628408, -1402397, 4004641, 12324764, 16628858, 15832323, 14910222, 15855554, 14810180, 10209435, 7321613, 10152951, 13855747, 11298162]
5106A1298162p008550k513340N915619Q746609M578803k07916j056244N71575
5098B0324718J038703j075489l791779l399223J147636N054488K235721n839533
5090A5695242j0127100n381456K469372M014225j658871p051432o636636k649339
5082a1325995l32467q82847r49937J923905N305171M745776J94032l245874k213354
5073f781590N70852J558030K071544M097260M243769j048698o824527m859013
5065f972373L051395O475866K128188j564791J354883N377688L742457j006593
5057A2586720l013260k454157k180942j173222J875029L771745K119462L19081
5049A1850456J186037J286666j691772k340884L342697Q269621L847373n368340
$$ y = [11298162, 4289612, 1776272, 7691891, 16438500, 21017303, 20809387, 19753143, 20324718, 21363421, 20287932, 16496153, 13096930, 14244566, 19299054, 21534775, 15695242, 5568142, 186686, 2656058, 6670283, 5011412, -2040020, -8676656, -11325995, -11658462, -12541309, -13491246, -11567341, -6262170, -1516394, -1322362, -4568236, -6781590, -6210738, -4652708, -2581164, 1516096, 5759865, 4711167, -2113360, -6972373, -3920978, 2554888, 4683076, 3118285, 4473168, 9850856, 13593313, 12586720, 9573460, 7119303, 4938361, 3765139, 5640168, 9411913, 11531375, 11850456, 13036493, 14323159, 12631387, 10290503, 13633200, 21902821, 25750194, 20381854]
5041B0381854p914348l345319j664086n566628o083602J407678Q280045N330005
5033A0825599l805809q210400l728255L929881P369451M864734O91864n6387K519477
5024A4400155L143614r62248n004220l134125K405256M253738O93737k803675
5016A2992232k515196o63268j5655r2582M1356J60074Q86046K710666L000865
5007A6504538p39525m878474l308916K549216M566702J86580l558320j082329
4999A0239472L801180M851278J997472j563936n232245q767501q857890l590717
4991g122887K787710M563264J574475k369975n008716n428463j861353N035218
4983g830727R397296O501153K98447j189569K883743N518556K434952k862026
$$ y = [20381854, 12467506, 9122187, 7458101, 1891473, -4192129, -2784451, 5495594, 10825599, 7019790, -1190610, -4918865, -988984, 6380467, 11245201, 11937065, 11880678, 14400155, 17543769, 16581521, 11577301, 8443176, 10848432, 15102170, 15795907, 12992232, 10477036, 9813768, 9798113, 9705531, 9746887, 9906961, 10793007, 13503673, 16504538, 15765013, 10886539, 7577623, 10126839, 14693541, 14880121, 11321801, 10239472, 14040652, 18891930, 20889402, 19325466, 14093221, 5325720, -3532170, -7122887, -4335177, 228087, 1802562, -567413, -5576129, -11004592, -12865945, -7830727, 1566569, 8067722, 8366169, 7176600, 10060343, 15578899, 18013851, 15151825]
4975A5151825n886302p010457p626228n811267m05447M328313L695311L34145
4967c230107J054358O117675P956499K599216l513142k559143L041062M082779
4959A5549197k167359q513529q057783k447228J825348J259814k423634m814292
4951i789466k242336M505734R342502P039502L25442l293875j651210N72564N82364
4942E391221O62462J253917q99527m448220k160471O579400J0744871L008138
4934B0131791p510269p652265N05587M123521k03558l033960J292226O127208
4926A3780281L836790k770884m994096K44031P080995P657968J360348l484124
4918B2711309K33028P298444N855428m617260j0746952n424090O05204l894353
$$ y = [15151825, 9265523, 2255066, -5371162, -11182429, -11587876, -7259563, -3564252, -3230107, -2175749, 3941926, 11898425, 14497641, 10984499, 8425356, 11466418, 15549197, 13381838, 4868309, -3189474, -5636702, -3811354, -2551540, -4975174, -9789466, -12031802, -7526068, 1816434, 8855936, 9181378, 5887503, 4236293, 4808857, 5391221, 6053683, 7307600, 6408073, 1959853, -200618, 6378782, 17123653, 20131791, 12621522, 4969257, 5474844, 9598365, 9394807, 6360847, 7653073, 13780281, 17617071, 14846187, 9852091, 10096122, 17177117, 24835085, 26195433, 22711309, 22944337, 30242781, 36098209, 31480949, 20733997, 15309907, 15915111, 12020758]
4910A2020758j2291552j1427095k730057K317479J401176R12808J207450j848004
4902a0437037m195155J264606R310259Q611201J304434o26623L199412K115283
4894A0546380m286836n017669J138632L180381j396603l500989k187659o206703
4886g731066j3253084j0725445o11196J495197l669679J344159J5149890J4671445
4878c329779j986189p052623O869813J0807463j409092J4284416P6989166J20610087
4870B15783262P1290901l8302513j00416898p2490503j9163645o334462j9924189
4863C0441953j6633048J446159N176409n685882q831766j524667Q51760l368772
4855A872146k621439K845775K114069m798828p423681l279397J212428L995841
$$ y = [12020758, -270794, -11697889, -14427946, -12110467, -10709291, -9796483, -8589033, -10437037, -14632192, -13367586, -4057327, 4553874, 5858308, 5231685, 8431097, 10546380, 6259544, 1241875, 2380507, 5560888, 4164285, 663296, -1524363, -7731066, -20984150, -31709595, -32320791, -30825594, -34495273, -33151114, -18001224, -3329779, -5315968, -12368591, -5498778, 5308685, 3899593, 18184009, 95173175, 215783262, 287074163, 248771650, 148354752, 75864249, 56700604, 50366142, 30441953, 13808905, 15255064, 20431473, 14745591, 5913825, 4389158, 5240918, 1872146, -749293, 2096482, 4210551, -588277, -8011958, -11291355, -10078927, -6083086]
4847f083086O792969O412928M72413l766246M90625O538397M315296k695281m311886
4838H166129j367759j989936m957829k021748N739446Q443740L548179j470485
4830A4089737k496326l074543m947872n085883l157965k585879l219070j248141
4822a1725942L066919N269887M497264M111874M592793K903318r42206l340885
4814H433022l301501l227030l725724l288195k551465l216408l326547O55419
4806a3548429P141239R819872N127556l960314j0846079r878588q57089Q491127
4798h510705Q775493Q02876m372918j104167K665220q36907n607829j895076O800387
4789c283626Q828971K672490k251380j382156L53410l31587n21225J008553J073812
$$ y = [-6083086, 709883, 7122811, 7595224, 3828978, 4319603, 10858000, 15173296, 12478015, 8166129, 6798370, 4808434, -149395, -2171143, 3568303, 12012043, 15560222, 14089737, 11593411, 8518868, 3570996, -1514887, -4672852, -7258731, -10477801, -11725942, -8659023, -3389136, 1108128, 5220002, 9812795, 12716113, 11773907, 8433022, 5131521, 1904491, -1821233, -5109428, -7660893, -10877301, -14203848, -13548429, -6407190, 3412682, 8540238, 4579924, -6266155, -16144743, -17001832, -8510705, 264788, 1067664, -3305254, -4409421, -1744201, -2581108, -8188937, -10084013, -3283626, 5545345, 8217835, 5966455, 4584299, 4937709, 4606122, 4084897, 5093450, 6167262]
4780F167262j010748k074563j685842k442553l535968j822185J288514K341407
4772b774676L723324R107500J2614012M883064r693050j5305798p027745K493175
4764a980194K884064q05649j034550o24569l705555n187749l8940N748935M452956
4755b91251k67654n56942J450731j635468p901833q455209k317786K389265J855754
4746a5730393P70135K124139K360929q00976l588697k547182K88978J799202K643467
4737a2680398M656030O910985P201034N158885J930446j595110m886779p202558
4729e07465p592689n113661J76864N749279P898340N965251L287978K348922J724252
4720A3937071J20035j10878K669391M696276J592400m247378o561605m226565
$$ y = [6167262, 5156514, 3081951, 1396109, -1046444, -4582412, -6404597, -5116083, -2774676, 948648, 10056148, 22670160, 27553224, 17860174, 2554376, -4473369, -1980194, 903870, 98221, -936329, -1560898, -5266453, -10454202, -10493142, -4744207, -291251, -558905, -1115847, 334884, -1300584, -9202417, -17657626, -19975412, -17586147, -15730393, -14960258, -12836119, -10475190, -11276166, -14864863, -17412045, -17123067, -15323865, -12680398, -8024368, -1113383, 6087651, 11246536, 13176982, 11581872, 6695093, -507465, -8100154, -13213815, -13036951, -7287672, 610668, 6575919, 9863897, 12212819, 13937071, 14057106, 13946228, 16615619, 21311895, 22904295, 18656917, 12095312, 7868747]
4712G868747j626344o88342J188463M641649N957916L158819p17139k826769m388546
4703A2568454o532896o607518k410117L006643M863763L192065K041146L044251
4695A3165791L426043R23598k042340r04066M914400R887086P714633j161755
4687C5923390r093135r536735m184156K22028L19833j891770m008327n514413
4679B236715n253792j691262L054893M241755J532549K62840K999106M769357
4671A2152161Q04756n298301o466818k186516J895166K249301j87008m029439
4663a066698p669086o906321N31515Q369078P411706j059602n617501j078070
4655g084979L960685R59762n310980n141901O54972L283872M98289j644970o02940
$$ y = [7868747, 6242403, 5554061, 6742524, 11384173, 17342089, 20500908, 19783769, 16957000, 12568454, 6035558, -571960, -2982077, 24566, 4888329, 8080394, 10121540, 13165791, 16591834, 17515432, 15473092, 14569026, 19483426, 29370512, 37085145, 35923390, 26830255, 17293520, 13109364, 13331392, 13651225, 11759455, 7751128, 2236715, -3017077, -4708339, -1653446, 2588309, 4120858, 4383698, 7382804, 12152161, 12956917, 7658616, 1191798, -994718, 900448, 3149749, 2962741, -1066698, -8735784, -15642105, -15110590, -6741512, 670194, -389408, -6006909, -7084979, -3124294, -2164532, -7475512, -12617413, -11962441, -8678569, -8180280, -9825250, -10428190]
4646a0428190p48038l580028l950680O63108N209348N538055M557124N128477
4638B389176M021974o88163k876093K473481Q275183L751528q320089j3570916
4630d543919o073653L777493M733969r17913l853223j493561J667833K997468
4622c705506L758372M333744L638223K440237K242941J589166j873023o313735
4614F110419p400685m638813j257951J863019O505909J0768192Q891242J94415
4606B1035747p461443p278747k194363P01344N60629J680242M398528L952444
4598A5394381j416360p152860q786838p063287m755423k294578Q80647L515150
4590a1679168L803423J902873n35341j975535j325729J306747L451373K377490
$$ y = [-10428190, -11176228, -14756256, -18706936, -18043828, -12834480, -7296425, -2739301, 2389176, 6411150, 5722987, 2846894, 5320375, 13595558, 17347086, 9026997, -4543919, -10617572, -6840079, -2106110, -3024023, -6877246, -8370807, -6702974, -3705506, 52866, 4386610, 8024833, 10465070, 12708011, 14297177, 12424154, 6110419, -1290266, -5929079, -7187030, -5324011, 1181898, 11950090, 20841332, 21035747, 13574304, 6295557, 4101194, 4802538, 5363167, 7043409, 11441937, 15394381, 13978021, 6825161, -1961677, -9024964, -13780387, -16074965, -15194318, -11679168, -7875745, -5972872, -6508213, -8483748, -9809477, -8502730, -5051357, -2673867]
4582b673867q32366k314626j430027j798932m585070n386709j138614M246162
4574a5914049N630230M275501M384462N342575L827030J203110J462588L099049
4566A3310496J111098k976531j981285M285086O465370p0878o950281n200980
4558G992095J077565J635051m069893p050845k898349K949181M378790J810572
4550E824167j245957k881940j919278K709287Q882399J1046034N994296k850360
4542B5558648q815527q506507m105258m77073o85713l462353m962750l540454
4534h996987j656688j823425k529822q16611K527943L756228J624870j253229
4526i167721k453883k034645p29351J092664K424884K369454J895803K143271
$$ y = [-2673867, -3506233, -5820859, -7250886, -9049818, -13634888, -19021597, -20160211, -15914049, -10283819, -6008318, -1623856, 3718719, 7545749, 8748859, 10211447, 13310496, 14421594, 11445063, 9463778, 13748864, 20214234, 20143356, 13193075, 7992095, 9069660, 10704711, 6634818, -416027, -3314376, -365195, 4013595, 5824167, 4578210, 1696270, -223008, 2486279, 11368678, 22414712, 28409008, 25558648, 16743121, 8236614, 4131356, 3654283, 2968570, -493783, -5456533, -8996987, -10653675, -12477100, -15006922, -15823533, -13295590, -9539362, -7914492, -9167721, -11621604, -13656249, -14385600, -13292936, -10868052, -8498598, -6602795, -4459524]
4518d459524J652157j137283l500298j538157K384456J541357m160046n895715
4510a5113053J249761R205105P110822l152876r067186m011947N278401Q761484
4502B60511M767843p42962k419677m3093K880500K796212l34067k318403M42280
4493E289144N057974M457595k861504r324708p925046k014833k12523l311751
4485a0845652l059155M816917J2956482J1935642K976127m460810n415440l733337
4477E170774m015868n298896m634279k265893j37265J750289M320716O622928
4469A512506O914576N452302L850855K531760R53831l53467l08515J92162j690381
4460A9055629p177794j3038463j3457559n930354M335054P724598K33069j0722056
$$ y = [-4459524, -2807367, -3944650, -7444948, -8983105, -6598649, -5057292, -9217338, -15113053, -13863292, -4658187, 2452635, -700241, -9767427, -13779374, -8500973, 260511, 5028354, 4285392, 1865715, 1822622, 4703122, 7499334, 7165267, 4846864, 5289144, 10347118, 14804713, 11943209, 2618501, -5306545, -7321378, -7533901, -10845652, -13904807, -9087890, 3868592, 15804234, 18780361, 14319551, 8904111, 5170774, 1154906, -4143990, -8778269, -11044162, -11181427, -9431138, -5110422, 1512506, 8427082, 13879384, 17730239, 20261999, 21215830, 20862363, 20553848, 20746010, 19055629, 11877835, -1160628, -14618187, -20548541, -16213487, -8488889, -8255820, -18977876]
4452a8977876j3508688n206755N813090J0321093P417855K483711J72621J413416
4444a0071533L852061L309278j933051p062618n425566J167635K913161l791907
4436a7042540r253962l541919Q740883J4239469Q010348k557681q728910q145303
4428a8279615l153289J774118K161771r20243J89227Q582287J4363767P005742
4420A1723765o673345r315674J867239J0265090M138106p103025q356131o7509
4412c521484N822904M085693n1485j615737r97053K52397J280005O9586m452086
4403H72740q722576p696901j559804M352843N962403L931887J494769J159701
4395b04938K753472L359357P48864k581783j906302K359571M147090N03592l892430
$$ y = [-18977876, -32486564, -37693319, -31880229, -21559136, -14141281, -11657570, -11484949, -10071533, -6219472, -2910194, -4843245, -11905863, -17331429, -16163794, -13250633, -17042540, -26296502, -29838421, -21097538, -6858069, 1152279, -1405402, -10134312, -18279615, -21432904, -19658786, -17497015, -18417258, -18228031, -9645744, 4718023, 11723765, 5050420, -4265254, -2398015, 7867075, 12005181, 4902156, -3453975, -3521484, 2301420, 6387113, 6335628, 4719891, 3722838, 3975235, 5255240, 5324826, 872740, -7849836, -15546737, -17106541, -12753698, -6791295, -2859408, -1364639, -204938, 2548534, 5907891, 6656755, 4074972, 2168670, 4528241, 8675331, 9178923, 5286493]
4386E286493l859233o76980J550245J909545J089255j660293n363318n434304
4378g158590j88885M557708K967912k020165l090009J061009N427412O324568
4370G880960L753546j380977o706340p507670k477579J995476k23681m984529
4362i650794l187105N103311R934752N355756l352187p904970o169438j104661
4354a0975336M002438O818641O436406M393876K567666K06204l567689n650029
4346D232177k523689K824456L641025p60097m258138l827263l231040m674797
4338h577366l841444K520716R607235J0386663M958507o84311k886335k907895
4330H575770k673335k060599m34586J903445M215658N681119N096592J554307
$$ y = [5286493, 1427260, 750280, 2300525, 4210070, 5299325, 3639032, -1724286, -7158590, -7347475, -2789767, 178145, -1842020, -4932029, -3871020, 1556392, 7880960, 11634506, 10253529, 3547189, -3960481, -6438060, -4442584, -4666265, -9650794, -12837899, -7734588, 2200164, 7555920, 4203733, -3701237, -9870675, -10975336, -6972898, -154257, 6282149, 10676025, 13243691, 13449895, 9882206, 4232177, 1708488, 4532944, 8173969, 7413872, 3155734, -671529, -3902569, -8577366, -12418810, -9898094, -290859, 10095804, 15054311, 14370000, 11483665, 8575770, 5902435, 3841836, 3407250, 5310695, 9526353, 15207472, 20304064, 21858371]
4322B1858371l869758p636349o319933p95850L178817J054736m220973n643275
4314b394214k141544J38012j635668j993527K511817N007786j367498r920138
4306a1794974p915332M350727J3236335J1001988M189447K18824l023165q507023
4298A756827j0868964m536108N180657Q025954K644515l158817m130499k472743
4290g559178j458743n53741J499068L030121J377821l135117o798164o148179
4282a9746112j771841K132800K659873J598527K403032N199592P388273P765405
4274G629549O567408K860999l496580q302858p052447k387125j317274m482462
4266i980790n167271o56647L138186J879191J00997K891075O597071M679218j482174
$$ y = [21858371, 17988613, 10352264, 4032331, 3236481, 6415298, 7470034, 3249061, -2394214, -4535758, -4397746, -6033414, -8026941, -5515124, -507338, -1874836, -11794974, -19710306, -15359579, -2123244, 8878744, 13068191, 13287015, 10263850, 1756827, -9112137, -13648245, -8467588, -441634, 2202881, -955936, -5086435, -7559178, -9017921, -9571662, -8072594, -5042473, -3664652, -6799769, -13597933, -19746112, -21517953, -19385153, -16725280, -15126753, -12723721, -7524129, -135856, 7629549, 14196957, 17057956, 13561376, 5258518, -1793929, -4181054, -5498328, -9980790, -15148061, -15804708, -12666522, -10787331, -10686334, -7795259, -1198188, 3481030, 1998856]
4257A998856m623732j878009L136955O586586P106906L777634k950835q942318
4249D212043r865450o664264l471754j040547K962301P474555P308550O46992
4241A562426o710960p371181q70600N943099O565719J522278k952916k279278
4233d591413J757424M325271L782408K215087R82038o45356k399360k451870q97308
4224B076921k73582j334547j641587K36064K392391K917800K353059J459069q4678
4215H100910j435020p49142R45166J46972k940228k988374K883421R827082J0710493
4206B4501280M262058m452384r253951p333719j578215Q83909l785163r905632
4198f661817q638209p21486L899931M92361m274802l695166o59890q59245l039684
$$ y = [1998856, -2624876, -4502885, -1365930, 5220656, 12327562, 16105196, 13154361, 4212043, -5653407, -12317671, -15789425, -16829972, -13867671, -6393116, 915434, 1562426, -5148534, -12519715, -13390315, -7447216, -881497, 640781, -2312135, -4591413, -2833989, 1491282, 5273690, 7488777, 8470815, 7825459, 5426099, 2974229, 2076921, 1803339, 468792, -1172795, -936731, 1455660, 4373460, 6726519, 8185588, 8100910, 6665890, 5916748, 6861914, 7008886, 4068658, 1080284, 3963705, 13790787, 24501280, 28763338, 24310954, 15057003, 7723284, 6145069, 7028978, 3243815, -6661817, -15300026, -16021512, -12121581, -11629220, -15904022, -19599188, -20259078, -21118323, -24158007]
4189b4158007k099908K757726Q063522J0482448P899026Q13712m968940l231831
4181d442252K851638L572059k236542m938509q05348R50230n379198j0889457
4173b1317379p145076q65906j611915n014985j914247M431501M966851J614715
4165b6856441K263687M830302J894159l479693k389343L139993L848114N73353
4157a6175869J880466O893895O711347J077246k239105k526466m602217n491193
4149a4471896N8655M899585l64598p602352l823592K484773m920176j6262901
4141d0002502j1284337n479516l3799170p8990877p0543736J5168904J01793935
4134a23137299J04911991M1542954m336483k66427J1438797q91072j4440865n358248
$$ y = [-24158007, -26257915, -23500189, -15436667, -4954219, 2944807, 3758519, -1210421, -4442252, -1590614, 1981445, -255097, -5193606, -5998954, -5048724, -10427922, -21317379, -28462455, -29328361, -30940276, -35955261, -37869508, -33438007, -28471156, -26856441, -24592754, -19762452, -17868293, -21347986, -23737329, -20597336, -16749222, -16175869, -14295403, -7401508, -690161, 387085, -1852020, -4378486, -8980703, -14471896, -14413241, -9513656, -9878254, -17480606, -21304198, -18819425, -23739601, -40002502, -51286839, -56766355, -90565525, -169556402, -240100138, -224931234, -123137299, -18225308, 23317646, 18981163, 18714736, 30153533, 29262461, 14821596, 9463348]
4126I463348Q912714N975130l033262N02012P891455K713029p166058m953331
4118B0305037L765273J629998r482786j2745569m989654J382955J545217K933434
4110D343905P498401P449112R06842l011538J514170Q667315J0278850N078103
4102D2725160l365000j0631136j2180511o953765j134560j915734p097178p531699
4094h084423m90104O483206O617247K000730j992936m127715n235785l687424
4086h517204J938436Q151457R290510M490387j456774m266218m340336m008113
4078A282145l266814p69347K074389J499495k900736n830496k469361M781524
4070e599201R037070P318468K580385j780483m884460n791952l125726J366161
$$ y = [9463348, 18376062, 24351192, 21317930, 21819942, 29711397, 32424426, 25258368, 20305037, 24070310, 25700308, 16217522, 3471953, -1517701, -134746, 1410471, 4343905, 11842306, 19291418, 20198260, 17186722, 18700892, 27368207, 37647057, 42725160, 39360160, 28729024, 16548513, 9594748, 8460188, 6544454, -552724, -8084423, -8574527, -2091321, 4525926, 6526656, 4533720, 406005, -4829780, -8517204, -6578768, 1572689, 10863199, 15353586, 13896812, 9630594, 5290258, 1282145, -1984669, -2754016, -679627, 819868, -2080868, -7911364, -10380725, -5599201, 3437869, 10756337, 13336722, 11556239, 6671779, 879827, -2245899, -879738]
4062h79738L722623M045242O661920J1478746J1231766K167002p932708r242122
4054B1252731l767212j640346n185341n897565J006510P742484M877553m758705
4046A3630109r955137o358000r14108p60035l766045l186404K212919P207103
4038a889598Q048441O820396O795323O972336L902933k786834r492816j2723988
4030E646193j1856735q088204k929083J893655M820831N404590M035062J100445
4022B6754k282754l520578q53087L605533N428157K927293j198852l493920l068952
4013b430406j128241O11810N19303j859026m635278n246746l638641k050554j653246
4004b1511025j483473n84013J196807M218120P929593R166512N399580k12406
$$ y = [-879738, 2842885, 6888127, 13550047, 25028793, 36260559, 38427561, 30494853, 21252731, 17485519, 15845173, 10659832, 4762267, 5768777, 13511261, 18388814, 13630109, 3674972, -2683028, -3597136, -4357171, -8123216, -11309620, -9096701, -1889598, 6158843, 12979239, 19774562, 26746898, 30649831, 27862997, 18370181, 5646193, -6210542, -14298746, -17227829, -15334174, -10513343, -5108753, -1073691, 26754, -2256000, -5776578, -6629665, -3024132, 2404025, 5331318, 4132466, 638546, -2430406, -3558647, -2946837, -2427534, -4286560, -8921838, -14168584, -17807225, -19857779, -21511025, -22994498, -23578511, -22381704, -18163584, -10233991, -1067479, 4332101, 4119695]
3996D119695j483623K245189M995996L062132k40854j224767j660740l923423
3988E889605n312545k566211J717708K905489J710535J909910L122771K253219
3980A1630481L43616Q86203K009825j940284j0071647j3785213q569141k73961
3972a9770121L854914M190897M318977L577493L40118j718917J597216O209344
3964B599921M046475l867256p076869j078410M833739O82116r065979j1336629
3956b0262892k753110O574483Q200367N847230O720360R137750N967462k763166
3948A6668484q554284o182760l91670J504394r83944k756550o61950L728912P315894
3939I686526Q244247N845666L19670o662830j1802832j1570188n151763L066333
$$ y = [4119695, 2636072, 4881261, 9877257, 12939389, 12698535, 11473768, 9813028, 5889605, 577060, -1989151, -271443, 2634046, 4344581, 6254491, 9377262, 11630481, 11974097, 12860300, 14870125, 12929841, 2858194, -10927019, -19496160, -19770121, -15915207, -11724310, -7405333, -3827840, -3487722, -5206639, -3609423, 2599921, 6646396, 2779140, -4297729, -5376139, -542400, 139716, -8926263, -20262892, -23016002, -16441519, -8241152, -2393922, 4326438, 13464188, 19431650, 16668484, 8114200, 1931440, 1539770, 3044164, 2060220, -696330, -1358280, 2370632, 9686526, 17930773, 23776439, 24096109, 17433279, 5630447, -5939741, -11091504, -8025171]
3931h025171N803523N14452o263369n884107J404861O909936N330487O52339j635942
3922a192991k110376l220605l088252N85208M274565K925059j792215m013427
3914g633034k918664k639717l578521j114669N822940J1348944J0155200L650700
3906A3093179l250549p006942n756862J80324O063746N875318J59817l856602
3898E501429k380803k05821k527079o779430p189505l296045J066984L973500
3890a1836770N561271M868617J777298k21692J474739L415340J093496k803476
3882C328823j844220L251719M648211n71563n732101n050210k458447m875774
3874i303562j0775125j1532106l226511P798604J2255984P939594P09720l256012
$$ y = [-8025171, -2221648, -1707196, -7970565, -13854672, -12449811, -5539875, -209388, 442951, -1192991, -3303367, -6523972, -9612224, -9027016, -4752451, -1827392, -3619607, -7633034, -10551698, -13191415, -16769936, -17884605, -12061665, -712721, 9442479, 13093179, 9842630, 2835688, -2921174, -2740850, 3322896, 9198214, 9358031, 5501429, 3120626, 2914805, 387726, -6391704, -13581209, -16877254, -15810270, -11836770, -6275499, -1406882, 370416, 148724, 1623463, 5038803, 6132299, 3328823, 1484603, 4736322, 9384533, 8812970, 3080869, -1969341, -4427788, -9303562, -20078687, -31610793, -34837304, -27038700, -14782716, -6843122, -6133402, -9389414]
3866i389414l740628l865457l384142R69467P623111Q430753l28508r549951p518022
3857b0752791L321698Q821685L097968l830243k237684L215622L130844o71319
3849e904220O37998O872512Q500511J926375n463005p551094p361893q775877
3841a7118693q641915l158579L770203N425319K203873L79710K698480N770454
3833h671148O167588M345116K341206J245919J282535J781095J319929P9777Q31311
3824A0723328M748418P815190N294467j253217n839947o408291o293855p161342
3816A624751o362455l164904j695575l957857m857409P07547R180263J2456170
3808C930531Q857707M370628L460706M064252K493719j241455m554738n386664
$$ y = [-9389414, -13130042, -16995499, -20379641, -19410174, -11787063, -3356310, -3684818, -13234769, -20752791, -17431093, -8609408, -5511440, -9341683, -11579367, -8363745, -5232901, -5904220, -5266222, 1606290, 10106801, 12033176, 6570171, -980923, -8342816, -17118693, -25760608, -28919187, -25148984, -19723665, -17519792, -17140082, -14441602, -8671148, -2503560, 1841556, 4182762, 5428681, 6711216, 8492311, 9812240, 9892017, 10723328, 15471746, 23286936, 28581403, 27328186, 21488239, 15079948, 8786093, 1624751, -4737704, -7902608, -9598183, -13556040, -18413449, -17705902, -8525639, 3930531, 12788238, 17158866, 20619572, 24683824, 27177543, 25936088, 21381350, 15994686]
3800A5994686l028384J200877L451705R26813l316409l165262J698450M419167
3792A8181643Q12497m400177n162300l149222l395102m435617n81520P001400
3784D871602R815526M478965j646469j046118L565851M473591L49163l366687
3776B1495424l130285o48027J591759K941085K491881j066881o222818q625248
3768H826890n720747P12975O969187R837407O842551k025349j1595905j4326476
3760d79467q371452l22039K533266M83696o82681J931234N364508N526050J892247
3751G875362k758560n271343m447329j746732K71954Q28261J339421K200318J146014
3742e62634k959300o499507m869724O06657L501537R67512k098780J41093O255781
$$ y = [15994686, 12966302, 14167179, 17618884, 18545697, 15229288, 12064026, 13762476, 18181643, 18994140, 14593963, 9431663, 6282441, 2887339, -1548278, -2129798, 4871602, 14687128, 19166093, 17519624, 16473506, 20039357, 24512948, 24862111, 21495424, 18365139, 17717112, 19308871, 22249956, 24741837, 23674956, 17452138, 8826890, 3106143, 3819118, 10788305, 20625712, 27468263, 25442914, 13847009, -479467, -8850919, -9172958, -6639692, -6155996, -6838677, -4907443, 457065, 5983115, 7875362, 5116802, -154541, -4601870, -6348602, -6076648, -5248387, -3908966, -1708648, -562634, -3521934, -10021441, -14891165, -14284508, -10782971, -9815459, -11914239, -11773146, -5517365]
3733e517365R376641O070588J71044k456686m29590K927937M154117K816603O88429
3724A7801718o84607j159173j584968k901670n267889p399242o984653k732269
3716a0912753L607425P917167P099305J853366l912507o269829m266211n27061
3708e411098J201568j95186k215935k324417j457732j861427k320147P40178O751486
3699g092710R873935O755789J548212l99831k72304k167679m568527k260320L873748
3690E290313O324033J848582l817603n208677m857364p123398r609655p121510
3682b4275279r06433K982811L117575L659945N953571O007453K113233j265602
3674b612726o04164O76788k161453p012404p606983k691638K587832M266942L860363
$$ y = [-5517365, 3859276, 9929864, 10100908, 7644222, 7214632, 10142569, 14296686, 17113289, 17801718, 17117111, 15957938, 14372970, 11471300, 6203411, -1195831, -8180484, -10912753, -7305328, 611839, 7711144, 9564510, 5652003, -617826, -4884037, -5411098, -4209530, -4404716, -6620651, -8945068, -10402800, -12264227, -14584374, -13844196, -7092710, 2781225, 9537014, 11085226, 10685395, 10413091, 8245412, 3676885, 1416565, 5290313, 11614346, 13462928, 9645325, 4436648, -420716, -7544114, -17153769, -24275279, -25181712, -22198901, -19081326, -15421381, -9467810, -3460357, -1347124, -2612726, -3216890, -2540102, -4701555, -11713959, -19320942, -22012580, -19424748, -15157806, -11297443]
3665a1297443M177889N006745M965965M366434L504567N51163n466077j0814582
3657e005339r857443k038533O647801R910385O888477J259077k910612l414661
3649A479152n49777K501578J666358l391690p685431o083146N53082O286835O594883
3640A371844K154968l092741n461703l562400O65246K841449L65173l957154m739463
3631a3414781q16637L355414L946987K557788K792142M289616L241763j644352
3623D307940o441507o230238p63495N170283O786577L895991J06802j859056k701775
3614B271522m149304n690764n149342j744035K726728N297596L793110j268174
3606c912663n743113m931575N77236M505877L010842M01324K548262P152197O698423
$$ y = [-11297443, -7119554, -2112809, 2853156, 7219590, 10724157, 11275320, 5809243, -5005339, -14862782, -16901315, -10253514, -343129, 6545348, 7804425, 4893813, 1479152, 929375, 3430953, 5097311, 1705621, -5979810, -12062956, -11509874, -5223039, 1371844, 3526812, 434071, -5027632, -8590032, -7924786, -5083337, -4718164, -8675318, -13414781, -14231418, -10876004, -6929017, -4371229, -1579087, 2710529, 5952292, 4307940, -2133567, -8363805, -9127300, -3957017, 2829560, 6725551, 6832353, 4973297, 2271522, -1877782, -7568546, -12717888, -14461923, -11735195, -6437599, -2644489, -3912663, -9655776, -14587351, -14010115, -9504238, -6493396, -6092072, -3543810, 3608387, 10306810]
3597A0306810J24102n518026n840064m292781m175775k828814J736932M861152
3589e626464K082613k756092l118183k09505m76310m460670n847536j890731K309747
3580a9993131J990382n55799n83579J941795L562385L347156L813772O126739
3572c50280P411269M364612j685657n584949m799578k673965k935897l239625
3564i494070J233376Q596376J0857114N176327j685828l268690j668700j400712
3556H345193j044158K404268N573092L091036k758964m684958j356003J707617
3548A1277123J445887J21547r60318l300863o086905n845969k198252J739937
3540c807813M726628P123731O120554r95610q856125q213007L85289O024348K955355
$$ y = [10306810, 10430912, 4912886, -927178, -5219959, -9395734, -12224548, -10487616, -5626464, -3543851, -6299943, -9418126, -9627631, -10103941, -14564611, -20412147, -22302878, -19993131, -18002749, -18558548, -19142127, -17200332, -13637947, -10290791, -6477019, -350280, 7060989, 11425601, 9739944, 4154995, -644583, -3318548, -6254445, -9494070, -8260694, 335682, 11192796, 16369123, 14683295, 11414605, 9745905, 8345193, 7301035, 9705303, 15278395, 18369431, 15610467, 10925509, 9569506, 11277123, 12723010, 12844557, 11884239, 8583376, 2496471, -3349498, -5547750, -3807813, 918815, 8042546, 14163100, 13167490, 4311365, -3901642, -3516353, 2507995, 5463350]
3531E463350k267761k497334K83448J531041J713452J725093j134717o334611
3523a518039o946984k55541N634507L247857l004818m985897l426191l169843
3515a4424949k173792L830458J0219140Q651081R93108k911476j30333L086039
3507G139276L140356K799366K928498O31506l251600m065941k044285k347614
3499D929562n368762n869229k798168o57080L6844L423622P707498N302950k975514
3490C731723n687301J794616Q994204O567137o5649k126130k260607o729547j1091026
3481f872580o711755L382961P921059M102514o29273j932565k595662l831846
3473g167147l235068j832528l189380m749708j08312Q689034J1492246N436981
$$ y = [5463350, 3195589, 698255, 981703, 2512744, 4226196, 5951289, 4816572, -1518039, -8465023, -8720564, -3086057, 161800, -2843018, -7828915, -11255106, -14424949, -16598741, -12768283, -2549143, 6101938, 7095046, 4183570, 4053237, 7139276, 10279632, 13078998, 16007496, 16639002, 13387402, 9321461, 7277176, 4929562, -439200, -6308429, -9106597, -9763677, -9726833, -6303211, 1404287, 6707237, 3731723, -1955578, -160962, 8833242, 15400379, 15334730, 13208600, 10947993, 4218446, -6872580, -13584335, -10201374, -2280315, 1822199, 1192926, -739639, -3335301, -7167147, -10402215, -12234743, -15424123, -20173831, -20282143, -11593109, -100863, 5336118]
3465E336118j74567J527515N288744M258143J130135J320404K403630r55804o612693
3456A3521625q146290n122355k060552L01764M468503Q352193O502606m32491
3448A7385003n205681m471250k827553l987655m498326k19263O070905Q416033
3440A0662213N793743J792877j766053o145727j1081881j2960733q843902m64914
3432b3014377O548649O976336M69522p031790p627416N77812J0378547J2590584
3424a32133O081794j676022m158316k824253k989856n297628m828872J296721
3416a4528565Q533652R314435K093060o097697p007785j13228P059472P317560
3408F570904J113509m959356n614084j577768K439847K989405Q92199k70492J422599
$$ y = [5336118, 5161551, 6689066, 11977810, 16235953, 17366088, 18686492, 21090122, 20134318, 13521625, 5375335, 252980, -1807572, -1505808, 2962695, 11314888, 17817494, 17385003, 12179322, 7708072, 4880519, 892864, -3605462, -3824725, 2246180, 10662213, 16455956, 18248833, 16482780, 10337053, -744828, -13705561, -22549463, -23014377, -16465728, -9489392, -9019870, -16051660, -23679076, -23101264, -12722717, -132133, 5949661, 4273639, 115323, -2708930, -5698786, -10996414, -15825286, -14528565, -5994913, 3319522, 5412582, -685115, -7692900, -7806128, -746656, 6570904, 7684413, 2725057, -2889027, -4466795, -2026948, 962457, 1854656, 1584164, 3006763]
3399C006763L320193Q43310o106717j0994416p297785L152804J1133447R888053
3391F945652J947828m553957m367684Q90090N285334M131005j289124m126328
3383D862816M61109P784380P612934k511902j2521128j2172319m051016J321918
3375i213208K88455j304156P43963L209912K448190P2917j377058k368200k429013
3366i928198J744049R462773J2790961O387695l390455o084030j043646L369029
3358A3308178K452632r08306m276913q854133j3020744j1035064k030131O249258
3350a8115223P187989L515008J376188J320636N28902l71290R50548K877308K258622
3341A528688N48660J412410L704011L231325N71990J99415J887942N15065m264908
$$ y = [3006763, 6326956, 7170266, 1063549, -9930867, -17228652, -14075848, -2942401, 6945652, 8893480, 4339523, -28161, 861929, 6147263, 10278268, 8989144, 4862816, 5323925, 13108305, 20721239, 18209337, 5688209, -6484110, -10535126, -9213208, -8924753, -10228909, -9484946, -6275034, -3826844, -3753927, -5130985, -7499185, -9928198, -8184149, 1278624, 14069585, 20457280, 17066825, 10982795, 9939149, 13308178, 15760810, 14852504, 10575591, 1721458, -11299286, -22334350, -24364481, -18115223, -10927234, -7412226, -6036038, -4715402, -4186500, -4557790, -3607242, -729934, 1528688, 2077348, 3489758, 7193769, 10425094, 10997084, 11196499, 13084441, 13599506, 9334598]
3332I334598n992504k124197P82089k415614o386178l580251L429737N915012
3324a037308K444867j87022J208160K033011q21902l259602j254222K093668J584735
3315B804385j986786l755810k385378r68153j439529k332370k025189q43393M83431
3306a2448792J902511L129602L624551L697129L899893L352429O27176l507934
3298D276565o192292n790540l372935m36498K883399O335887Q092713O495393
3290A2291692K534260p94125j425964J14824J506510N54309k868803o036872n400572
3281D75259n46674M482992N102632J014280m105272p083066p415185n257302l34207
3272a3666543N706190Q588451N934605R81576j442036j714412m212713r313965
$$ y = [9334598, 3342094, 1217897, 1999986, -415628, -6801806, -10382057, -6952320, -1037308, 1407559, 1220537, 2428697, 4461708, 3639806, 380204, -874018, 1219650, 2804385, 817599, -2938211, -5323589, -6291742, -7731271, -10063641, -12088830, -12932223, -12448792, -10546281, -7416679, -3792128, -94999, 3804894, 7157323, 7784499, 4276565, -1915727, -7706267, -11079202, -11515700, -8632301, -2296414, 5796299, 12291692, 14825952, 14031827, 12605863, 12720687, 14227197, 14781506, 11912703, 5875831, 475259, -71415, 4411577, 9514209, 10528489, 6423217, -659849, -8075034, -13332336, -13666543, -7960353, 628098, 6562703, 7544279, 6102243, 4387831, 175118, -9138847]
3264i138847j1572974p954460l134610k587746m134444j902375L588840N994942
3256c0841674L540085J863964M658269P911416O959255L709548K167966J380153
3248A348982j435074m162578k799876P13576N22743l756083o347462m573991k154383
3239b2644146j586046N6511M366902O673262K862728l201946m712997j566802
3231a9752534P18906O6311j74483J770505K847971P13413j840771p84668L394440
3222a3040910O549301O210421L828885K106490J821089J688895N38320j112115
3214H590376j836597j252264m55939n53641j686873l529157n346198n357226k099782
3205a3527301K675759M842030L279737J958121M122151O776030M579925k295981
$$ y = [-9138847, -20711821, -28666281, -31800891, -34388637, -38523081, -40425456, -36836616, -30841674, -27301589, -25437625, -20779356, -12867940, -5908685, -2199137, -31171, 1348982, -86092, -4248670, -7048546, -6334970, -5812227, -9568310, -15915772, -20489763, -22644146, -24230192, -24173681, -19806779, -13133517, -10270789, -13472735, -18185732, -19752534, -19033628, -18967317, -19141800, -17371295, -14523324, -13809911, -15650682, -16435350, -13040910, -6491609, -281188, 3547697, 5654187, 7475276, 9164171, 9702491, 8590376, 6753779, 5501515, 5045576, 4491935, 2805062, -724095, -6070293, -11427519, -13527301, -10851542, -6009512, -2729775, -771654, 3350497, 10126527, 14706452, 12410471]
3197A2410471q265178r430898o476186j235503M548194O989255K591715n129612
3189c997742p298722j118080N529503M949776K6958j810174n51626j899784n871940
3180a2041831n849889J57251N287334M032513L51760J047171N483593P174225
3172E642127L348816j971127l961487k283877R0446Q33233N0998r02636j665569
3163h19076l288982n704008n962941j607123M562888O719401L858443J445064
3155g96334L286078N912106M413367K69140j259890O52420J623351j396644o896096
3146E807498j1478234j2215908p389124J216019P652528P547933L728230K049845
3138c081213K910558K005549j491184l707376l022791j707664m7384L921514P380690
$$ y = [12410471, 4145293, -5285605, -11761791, -12997294, -8449100, -1459845, 1131870, -3997742, -11296464, -12414544, -6885041, -1935265, -1908307, -3718481, -4270107, -6169891, -12041831, -17891720, -17734469, -12447135, -8414622, -8062862, -7015691, -1532098, 5642127, 8990943, 7019816, 3058329, 774452, 864898, 1698131, 1749129, 846493, -819076, -4108058, -9812066, -15775007, -17382130, -12819242, -6099841, -2241398, -796334, 2489744, 8401850, 12815217, 13084357, 11824467, 12476887, 14100238, 12703594, 5807498, -5670736, -17886644, -25275768, -24059749, -16407221, -8859288, -5131058, -3081213, -170655, 1834894, 343710, -3363666, -6386457, -8094121, -8141505, -4219991, 3160699]
3129C160699L824638n290646q498926J39159J0818072J0886368J965727m670316
3121A2334775n223051n449288p643581o612827j28699N980924O588734L951773
3113C798760J932769l69625m680214p747410m643079L992823J1696087J2590799
3105A6570910O405613j861883o285770n046786j388870J200377L095982N494041
3097A8183614N801389Q90514o301317r223213o728254l677743k190285O80492
3089b564803M871384M760533j354651o320462m102160J314642L160836K468545
3081B233864L923051N731233K738232k829264l506427P22254J572644l678525
3073F907062o668010q11992P832323R057502K893168j739691l63009K306800J158649
$$ y = [3160699, 6985337, 1694691, -6804235, -6665076, 4152996, 15039364, 17005091, 12334775, 7111724, 1662436, -5981145, -12593972, -12722671, -6741747, -153013, 3798760, 5731529, 5361904, 681690, -7065720, -11708799, -7715976, 3980111, 16570910, 22976523, 21114640, 14828870, 9782084, 8393214, 9593591, 12689573, 18183614, 23985003, 24875517, 18574200, 9350987, 2622733, -1055010, -3245295, -2564803, 2306581, 7067114, 5712463, -607999, -4710159, -3395517, -234681, 2233864, 6156915, 11888148, 14626380, 11797116, 8290689, 9012943, 10585587, 6907062, 239052, -572940, 7259383, 16316885, 19210053, 17470362, 17107353, 19414153, 20572802]
3064B0572802k038983k756688j021829r12180m203121p766657p692187m040601
3056i859444l95057N99588J61124J506793N382608Q224519N813040j077265o283060
3047D072846n090875k18850J820841k65462j421125Q62600J869194k251279o476626
3038g098736l526709M208828P254828L189673j69226K364193N446700K401373
3030A4070924m546484q828958r000084p528478m452546R50511N049123L376586
3022a0909406k025407m783418k824869N03601K801334M478721N056920L379400
3014d323124J338383J960402L872386L054078m0253r03611J204353J873345j096137
3005F939822m700064o164885n631484k479635M470380J1376215J1030788L045404
$$ y = [20572802, 18533819, 15777131, 14755302, 13843122, 9640001, 1873344, -5818843, -9859444, -10254501, -9654913, -9493789, -7986996, -2604388, 5620131, 11433171, 10355906, 4072846, -1018029, -1236879, 583962, 318500, -1102625, -240025, 1629169, -622110, -7098736, -10625445, -6416617, 838211, 4027884, 3858658, 6222851, 11669551, 14070924, 9524440, 695482, -8304602, -15833080, -20285626, -19335115, -14285992, -10909406, -12934813, -17718231, -20543100, -20039499, -17238165, -12759444, -7702524, -4323124, -2984741, -1024339, 2848047, 5902125, 5861872, 4958261, 6162614, 8035959, 6939822, 2239758, -3925127, -9556611, -12036246, -7565866, 3810349, 14841137, 17886541]
2997A7886541m275124n594615n071101o918210p122846j399514N046323M421420
2989c027126j103079k851477N80658K200100j088341l902809j750583K540029
2981h402628M567046M535650M416134L581810O80166l373981o861291q953672
2973i810766q270417l237796L946277P379959M615289Q20406K277377P916986
2965E637315J1058163Q094387J530613m935584j0113832j3299484j2312577o109800
2957b0450799K272020P789127Q253982N708620L015985O94127j944359l793934
2949A544769k418151J963347N139523L612315m85254j808246J039373L737156
2941A2324832K558745n55873j550304o47639j710310n709330q379294n776590
$$ y = [17886541, 13611417, 8016802, 2945701, -3972509, -11095355, -12494869, -7448546, -3027126, -4130205, -6981682, -6401024, -4200924, -5289265, -9192074, -10942657, -8402628, -3835582, 700068, 5116202, 8698012, 9378178, 6004197, -857094, -9810766, -18081183, -21318979, -17372702, -9992743, -5377454, -4557048, -2279671, 5637315, 16695478, 24789865, 26320478, 21384894, 11271062, -2028422, -14340999, -20450799, -18178779, -10389652, -2135670, 3572950, 6588935, 7283062, 5338703, 1544769, -873382, 1089965, 6229488, 9841803, 9356549, 7548303, 8587676, 12324832, 14883577, 14327704, 12777400, 12129761, 10419451, 4710121, -3669173, -9445763]
2933i445763j4149K671340p75956o280640o684883L28171R027670J1413215O204061
2924F443066K39178j63195L035712L304912n99802l111975q07912K054283J49093
2915A0543360m277772m212651J766936O743981M211584l794124r373499p791642
2907f183827j760305K752444L190605K023599K274824L151019J609197k667821
2899D389735o497704p529859o330572l480258J507764O607139P252269L291103
2891g90383J204265M385929O092075n74771r671376r254415M65714O924883L931697
2882B713618j105932j783767k279381o098753o947165l52267N281402J005278
2874i566967o520328m448909N289973Q702144J879404l879715p93812M757986
$$ y = [-9445763, -9459912, -6788572, -7564528, -13845168, -20530051, -20201880, -11174210, 239005, 6443066, 6682244, 6519049, 9554761, 12859673, 12259871, 9147896, 8339984, 10394267, 10543360, 6265588, 2052937, 3819873, 10563854, 14775438, 10981314, 1607815, -6183827, -7944132, -5191688, -2001083, 22516, 2297340, 5448359, 7057556, 4389735, -2107969, -9637828, -15968400, -19448658, -17940894, -11333755, -4081486, -790383, 413882, 4799811, 10891886, 10317115, 645739, -8608676, -8142962, -1218079, 2713618, 1607686, -176081, -2455462, -8554215, -15501380, -15853647, -10572245, -9566967, -16087295, -20536204, -15246231, -6544087, -4664683, -8544398, -9338210, -4580224]
2866d580224M706831J199074k22705o19239l590597p064705o127679r01553L694948
2857a3505849M293822J926716Q6537J531067N116257N770980O99247n239716n071480
2848d392419J05445K550563o08375m382008n170860n080494n024823j872243M051792
2839a9823422O615076L520059Q42142K960003N390182L551555J303184L353292
2831G712071N584695J627908n610621q039926n003509k964144m057901l374413
2823a4125840J951323P723536Q271549K863361m160076p080254l390571L206370
2815d740602O116978L663639M56476k40745m21670j568082j571528q10001l636491
2806b752026q856312p366296L395214J1320240N752563n842749q830800k603551
$$ y = [-4580224, 126607, 1325681, 1102976, 483737, -3106860, -10171565, -16299244, -17200797, -13505849, -9212027, -7285311, -7198774, -5667707, -551450, 5219530, 5918777, 679061, -4392419, -4286974, -1736411, -2344786, -6726794, -11897654, -16978148, -22002971, -23875214, -19823422, -13208346, -9688287, -8846145, -5886142, -495960, 3055595, 4358779, 7712071, 13296766, 14924674, 9314053, 1274127, -3729382, -6693526, -10751427, -14125840, -12174517, -4450981, 3820568, 6683929, 2523853, -4556401, -7946972, -4740602, 1376376, 5040015, 5496491, 5255746, 4834076, 3265994, 1694466, 884465, -2752026, -11608338, -18974634, -15579420, -4259180, 1493383, -4349366, -13180166, -15783717]
2798a5783717K163511K241791L080950M377861L07512o137922m843246L460550
2790a1132710O135823p89486n662654k41477Q104661J0205958Q429293P918053
2782B2967461N967683j85359m572464j831553K235228n12035p429748j0408828
2774F230385q684092o571940l293901M475646J2873119J3791537O651060j048019
2766B4423795m357411m917363m937772l852851j272766J724794M082649M066708
2758A4959783p88407q946920j3103830q412137J64058M281395L346319K972038
2750e527701M616090M029889n19584n152329o035301k997896K450661P827691
2742a308480Q882011L470646l639532m955703K07578M913890L819876j077871
$$ y = [-15783717, -13620206, -11378415, -8297465, -3919604, -3612092, -9750014, -14593260, -11132710, -4996887, -5786373, -11449027, -11690504, -3585843, 6620115, 15049408, 22967461, 28935144, 28749785, 24177321, 22345768, 24580996, 24068961, 16639213, 6230385, -2453707, -9025647, -12319548, -7843902, 5029217, 18820754, 25471814, 24423795, 20066384, 15149021, 10211249, 6358398, 5085632, 6810426, 10893075, 14959783, 14171376, 5224456, -7879374, -16291511, -16127453, -11846058, -8499739, -5527701, -911611, 3118278, 2598694, -2553635, -8588936, -11586832, -9136171, -1308480, 7573531, 11044177, 7404645, 2448942, 2656520, 7570410, 11390286, 10312415]
2734A0312415m488237l660603M65234M467242M383834m14824n261142n086206
2726G17713q07198K422762K493679J832054J959351J005547k448863o512318q171479
2717g508752o218348j694827K843965N037384N355730O636561R092257Q242484
2709B1786454J024773q257069j2026492q084609q40682M267664M329887l74806
2701A825120n243110l848893L694997Q191598K947405n600399o255244P81715
2693c506811N213331K991886J286743N579317J1092578J0702401M321672l164790
2685C4516327p650254o849007j160983M208966L454743j734149m038301j599504
2677A9147838j56764k458256l809135j276511J113073O33424R30870L610181L215213
$$ y = [10312415, 5824178, 2163575, 2628809, 7096051, 11479885, 11065061, 5803919, 717713, -89485, 2333277, 4826956, 6659010, 8618361, 9623908, 7175045, 662727, -7508752, -13727100, -15421927, -12577962, -7540578, -2184848, 4451713, 13543970, 21786454, 22811227, 14554158, 2527666, -5556943, -6397625, -2129961, 2199926, 1825120, -3417990, -7266883, -3571886, 4619712, 7567117, 1966718, -4288526, -3506811, 1706520, 4698406, 5985149, 11564466, 22657044, 33359445, 37681117, 34516327, 26866073, 20017066, 18856083, 23065049, 26519792, 24785643, 20747342, 19147838, 18991074, 16532818, 12723683, 11447172, 12560245, 13193669, 14124539, 17734720, 20949933]
2668B0949933k791787p191326m173458J06982k471122p907274o811353l83996
2660a0673401K195404m03726p48462K913950L377298k364172p366908n803212
2652a8873229j065671J246399J179448J249944J713340K858489O331543J0473448
2644E113711R841761L332978k432478k186010L40355j224760n907851p271041
2636c93335k749212L929808Q199030Q480212N747630K526711J148516O74136k350777
2627B5212719p839520j0215308o103784n66095n69544m674412n275287j54234
2619a0185465M597379L972672M88008j039195m28223n73950k039667k699617j456793
2610i364851K84929N12583j310551l642658m007742j718704O26000J00716k071887
$$ y = [20949933, 18158146, 10966820, 6793362, 6900344, 4429222, -3478052, -10289405, -10673401, -8477997, -8881723, -9630185, -6716235, -3338937, -5703109, -13070017, -18873229, -19938900, -18692501, -17513053, -16263109, -14549769, -11691280, -5359737, 5113711, 14955472, 18288450, 15855972, 13669962, 14010317, 12785557, 6877706, -393335, -3142547, 787261, 8986291, 17466503, 23214133, 25740844, 26889360, 27563496, 25212719, 17373199, 7157891, 1054107, 488012, -81532, -4755944, -10031231, -10185465, -5588086, -1615414, -1127406, -2166601, -2594824, -3168774, -5208441, -7908058, -9364851, -9079922, -8567339, -9877890, -13520548, -17528290, -19246994, -18620994, -18520278, -20592165]
2601b0592165j474836L303046Q038740Q100780M227926J042224J216114L200354
2593G062183L955864K144728j077166l298507l215744k223043k725497m681819
2585d059001n596828m395002k699710j095059K516112Q156559J0745166O401512
2577I973749k23967o30765N567487R222432M142884m191391o205644r65875L515785
2568B0204695J366440m478808p354255m990281o14919K004539K155354J161868
2560I454633j39178j810412l456261l741954j596826K568801O831722Q507620
2552A6618145N646818o20777n419292m129420K103745O977580O205411J772819
2544B9155029k173834m535569o047593o185042m767903l779695l656593r16159
$$ y = [-20592165, -22067001, -18763955, -10725215, -2624435, 1603491, 2645715, 3861829, 7062183, 11018047, 13162775, 12085609, 8787102, 5571358, 3348315, 622818, -4059001, -9655829, -14050831, -16750541, -17845600, -15329488, -7172929, 3572237, 9973749, 9749782, 9119017, 14686504, 23908936, 28051820, 23860429, 17654785, 16688910, 20204695, 21571135, 17092327, 9738072, 4747791, 4132872, 6137411, 8292765, 9454633, 9315455, 7505043, 4048782, 306828, -1289998, 1278803, 8110525, 16618145, 22264963, 21644186, 16224894, 12095474, 14199219, 21176799, 27382210, 29155029, 26981195, 22445626, 16398033, 10212991, 5445088, 1665393, -1991200, -2907359]
2536b907359N545048R268864M345657l905044n158919R8221J361386m135560o112722
2527a600428J588642R598754O870364k734139p457092m965850k171078j890541
2519b761368n97799K201578K465164m32892k665912k964136k964301j128316N015996
2510c831986J0494188O514670n451528j2707758q224171J19899K113292r72641
2502a1946035j797344L40597N37727j570292j075511L437800P179159O205982
2494A312083K305482p02675j916114k501843k249562K10938M068627N825500L705831
2485A0058267P81103O94678J344129k246390q211989p871599Q24708P136887K061526
2476D571320o980178o079782M223115R934018M694928k935614n331758n998708
$$ y = [-2907359, 2637689, 11906553, 16252210, 12347166, 7188247, 7286468, 8647854, 4512294, -1600428, -11786, 9586968, 16457332, 13723193, 6266101, 1300251, -870827, -2761368, -3359167, -1157589, 1307575, 874683, -1791229, -4755365, -7719666, -8847982, -3831986, 6662202, 13176872, 7725344, -4982414, -13206585, -13086686, -10973394, -11946035, -13743379, -13402782, -12865055, -14435347, -15510858, -12073058, -4893899, 1312083, 3617565, 2914890, 998776, -1503067, -3752629, -3541691, 526936, 6352436, 10058267, 10839370, 11534048, 12878177, 10631787, 2419798, -5451801, -4627093, 2509794, 4571320, -2408858, -8488640, -4265525, 5668493, 10363421, 7427807, 2096049, -3902659]
2468c902659q799929q864620k145419N306631O370063L757879L231389K638317
2460b408348k672992q798218p911316p91953M713201N492129M634524L146720
2452d596253o65134m472829l511828Q66351K216112q24428k796102p02476K069200
2443a2417387K419449J618365J156059L14860p03572n24600l95066k904187o377823
2434a7813902o332437l037621j218498j370891J405806P968889J2000796R637921
2426A240063N341924M047947L951042K108521J088936L614297N417138Q69055
2418B7678923p160938j0454077p114453l196702k997412m451236n038597n629366
2410a8363858n932976k144818O428094J2755069R822272Q19724m411973k635251
$$ y = [-3902659, -12702588, -21567208, -23712627, -18405996, -12035933, -8278054, -5046665, -2408348, -5081340, -13879558, -21790874, -22582827, -17869626, -12377497, -7742973, -4596253, -5261387, -9734216, -13246044, -12379693, -10163581, -10988009, -13784111, -14486587, -12417387, -9997938, -8379573, -7223514, -6908654, -7612226, -8136826, -8531892, -11436079, -17813902, -24146339, -27183960, -28402458, -29773349, -28367543, -20398654, -8397858, 1240063, 6581987, 10629934, 14580976, 16689497, 17778433, 21392730, 26809868, 27678923, 20517985, 10063908, 2949455, -247247, -3244659, -7695895, -12734492, -18363858, -24296834, -26441652, -20013558, -7258489, 2563783, 3383507, -1028466, -3663717]
2402c663717n16376l191615o306297m015666N88232K59220m067203m100110K709800
2393b2303732R093834Q923178M637372N93531l406103p106001n542207L164668
2385a1945460J1034390R056843m23754p190404o328421j344839L013706M179376
$$ y = [-3663717, -4180093, -7371708, -13678005, -17693671, -17105439, -16846219, -20913422, -25013532, -22303732, -13209898, -4286720, 350652, 944183, -2461920, -9567921, -15110128, -11945460, -911070, 8145773, 7722019, 531615, -5796806, -7141645, -4127939, 51437]
$$ [...]
##END NTUPLES=NMR SPECTRUM
##END=
