##TITLE=31Pdec_DE-60k_D2O'
 D2O, 64 sc
 2.7.2024
##JCAMPDX= 6.0         $$ Bruker NMR JCAMP-DX V2.0
##DATA TYPE= NMR SPECTRUM
##DATA CLASS= NTUPLES
##ORIGIN= UXNMR, Bruker Analytische Messtechnik GmbH
##OWNER= root
$$ XWIN-NMR		Version 3.5
$$ Tue Jul  2 14:33:11 2024 Russian Standard Time (UT+4h)  she@DPX200
##.OBSERVE FREQUENCY= 81.013821
##.OBSERVE NUCLEUS= ^31P
##.ACQUISITION MODE= SIMULTANEOUS
##.ACQUISITION SCHEME= undefined
##.AVERAGES= 64
##.DIGITISER RES= 17
##SPECTROMETER/DATA SYSTEM= spect
##.PULSE SEQUENCE= zgpg30
##.SOLVENT NAME= DMSO
##.SHIFT REFERENCE= (INTERNAL, DMSO, 0, 198.062)
##AUDIT TRAIL= $$ (NUMBER, WHEN, WHO, WHERE, WHAT)
$$ ##TITLE= Audit trail, XWIN-NMR		Version 3.5
$$ ##JCAMPDX= 5.01
$$ ##ORIGIN= Bruker BioSpin GmbH
$$ ##OWNER= she
$$ F:/spectra/data/she/nmr/P31/2/pdata/1/auditp.txt
$$ ##AUDIT TRAIL=  $$ (NUMBER, WHEN, WHO, WHERE, WHAT)
(   1,<2024-07-02 14:32:05.20 +0400>,<she>,<DPX200>,
      <created by zg, POWCHK disabled, PULCHK disabled
       configuration hash MD5:
       00 E9 B6 7A A2 85 ED C7 34 08 36 98 17 FE 4E 26
       data hash MD5: 32K
       A9 9C 6E DA B2 2D 88 E6 0B 13 DB 3D 1E 57 87 7F>)
(   2,<2024-07-02 14:32:12.51 +0400>,<she>,<DPX200>,
      <Start of raw data processing
       efp BC_mod = 2 LB = 1.5 FT_mod = 6 PKNL = 1 PHC0 = 3387.527 PHC1 = -1379.713 SI = 64K 
       data hash MD5: 64K
       63 3F 52 21 9A 54 40 3E 86 65 15 CC 79 FB 1B 80>)
(   3,<2024-07-02 14:32:42.79 +0400>,<she>,<DPX200>,
      <pk PHC0 = -378.0501 PHC1 = 911.1993 
       data hash MD5: 64K
       CF F8 5E E9 5C 1C 5A 65 E8 00 FD 8C 40 9E 4C 0D>)
(   4,<2024-07-02 14:32:46.20 +0400>,<she>,<DPX200>,
      <abs ABSG = 5 
       data hash MD5: 64K
       D2 3E 7B 0E 2D DA 2C 53 BD BE 57 EF 4D 56 77 49>)
$$ ##END=
$$ 
$$ hash MD5
$$ E5 8A 31 1E CD 7F BA 27 F1 EA 9B 77 F3 47 1F E1
##$RELAX= 
##$RELAX= 
##$RELAX= 
##$RELAX= 
##$RELAX= 
##$RELAX= 
##$RELAX= 
##$RELAX= 
$$ Bruker specific parameters
$$ --------------------------
##$DU= <F:/spectra>
##$EXPNO= 2
##$NAME= <P31>
##$PROCNO= 1
##$TYPE= <nmr>
##$USER= <she>
##$AMP= (0..31)
100 100 100 100 100 100 100 100 100 100 100 100 100 100 100 100 100 100 
100 100 100 100 100 100 100 100 100 100 100 100 100 100 
##$AQSEQ= 0
##$AQ_mod= 1
##$AUNM= <au_zg>
##$AUTOPOS= <>
##$BF1= 81.014009
##$BF2= 200.13
##$BF3= 200.13
##$BF4= 200.13
##$BF5= 200.13
##$BF6= 200.13
##$BF7= 200.13
##$BF8= 200.13
##$BYTORDA= 1
##$CFDGTYP= 0
##$CFRGTYP= 5
##$CHEMSTR= <none>
##$CNST= (0..31)
1 1 145 1 1 1 1 1 1 1 1 1 1 1 1 1 1 1 1 1 1 1 1 1 1 1 1 1 1 1 1 1 
##$CPDPRG= <waltz16>
##$CPDPRG1= <>
##$CPDPRG2= <waltz16>
##$CPDPRG3= <>
##$CPDPRG4= <mlev>
##$CPDPRG5= <mlev>
##$CPDPRG6= <mlev>
##$CPDPRG7= <mlev>
##$CPDPRG8= <mlev>
##$CPDPRGB= <>
##$CPDPRGT= <>
##$D= (0..31)
0 1 0 0 0 0 0 0 0 0.06 0 0.03 2e-05 3e-06 0 0 0.0002 0 0 0 0 0 0 0 0 0 
0 0 0 0 0 0 
##$DATE= 1719916324
##$DBL= (0..7)
120 120 120 11 120 120 24 19 
##$DBP= (0..7)
150 150 150 150 150 150 150 150 
##$DBP07= 0
##$DBPNAM0= <>
##$DBPNAM1= <>
$$ [...]
##$SUBNAM3= <"">
##$SUBNAM4= <"">
##$SUBNAM5= <"">
##$SUBNAM6= <"">
##$SUBNAM7= <"">
##$SUBNAM8= <"">
##$SUBNAM9= <"">
##$SW= 400.765351723535
##$SWIBOX= (0..15)
0 1 3 0 0 0 0 0 0 0 0 0 0 0 0 0 
##$SW_h= 32467.5324675325
##$TD= 32768
##$TD0= 1
##$TE= 0
##$TE2= 300
##$TE3= 300
##$TEG= 300
##$TL= (0..7)
0 120 53 12 22 120 120 120 
##$TP= (0..7)
150 150 150 150 150 150 150 150 
##$TP07= 0
##$TPNAME0= <>
##$TPNAME1= <>
##$TPNAME2= <>
##$TPNAME3= <>
##$TPNAME4= <>
##$TPNAME5= <>
##$TPNAME6= <>
##$TPNAME7= <>
##$TPOAL= (0..7)
0.5 0.5 0.5 0.5 0.5 0.5 0.5 0.5 
##$TPOFFS= (0..7)
0 0 0 0 0 0 0 0 
##$TUNHIN= 0
##$TUNHOUT= 0
##$TUNXOUT= 0
##$USERA1= <user>
##$USERA2= <user>
##$USERA3= <user>
##$USERA4= <user>
##$USERA5= <user>
##$V9= 5
##$VALIST= <valist>
##$VCLIST= <CCCCCCCCCCCCCCC>
##$VD= 0
##$VDLIST= <DDDDDDDDDDDDDDD>
##$VPLIST= <PPPPPPPPPPPPPPP>
##$VTLIST= <TTTTTTTTTTTTTTT>
##$WBST= 1024
##$WBSW= 4
##$XGAIN= (0..3)
0 0 0 0 
##$XL= 0
##$YL= 0
##$YMAX_a= 4105
##$YMIN_a= -3502
##$ZGOPTNS= <>
##$ZL1= 120
##$ZL2= 120
##$ZL3= 120
##$ZL4= 120
##$ABSF1= 198.0616
##$ABSF2= -202.7028
##$ABSG= 5
##$ABSL= 3
##$ALPHA= 0
##$AQORDER= 0
##$ASSFAC= 0
##$ASSFACI= 0
##$ASSFACX= 0
##$ASSWID= 0
##$AUNMP= <proc_1d>
##$AZFE= 0.1
##$AZFW= 0.5
##$BCFW= 0
##$BC_mod= 2
##$BYTORDP= 0
##$COROFFS= 0
##$CY= -3
##$DATMOD= 1
##$DC= 0
##$DFILT= <>
##$DTYPP= 0
##$F1P= 0
##$F2P= 0
##$FCOR= 1
##$FTSIZE= 65536
##$FT_mod= 6
##$GAMMA= 0
##$GB= 0
##$INTBC= 1
##$INTSCL= 9.790993e-09
##$ISEN= 30
##$LB= 1.5
##$LEV0= 0
##$LPBIN= 0
##$MAXI= 10000
##$MC2= 0
##$MEAN= 0
##$ME_mod= 0
##$MI= 50
##$NCOEF= 0
##$NC_proc= -10
##$NLEV= 6
##$NOISF1= 182.463
##$NOISF2= 159.3651
##$NSP= 0
##$NTH_PI= 0
##$NZP= 0
##$OFFSET= 198.0616
##$PC= 4
##$PHC0= 3009.477
##$PHC1= -468.5137
##$PH_mod= 1
##$PKNL= yes
##$PPARMOD= 0
##$PSCAL= 0
##$PSIGN= 0
##$REVERSE= no
##$SF= 81.0140089999434
##$SI= 65536
##$SIGF1= 159.3651
##$SIGF2= -187.1042
##$SINO= 113.3802
##$SIOLD= 16384
##$SREGLST= <1H.CDCl3>
##$SSB= 0
##$STSI= 65536
##$STSR= 0
##$SW_p= 32467.5324675325
##$SYMM= 0
##$S_DEV= 0
##$TDeff= 32768
##$TDoff= 0
##$TI= <>
##$TILT= no
##$TM1= 0
##$TM2= 0
##$TOPLEV= 0
##$USERP1= <user>
##$USERP2= <user>
##$USERP3= <user>
##$USERP4= <user>
##$USERP5= <user>
##$WDW= 1
##$XDIM= 65536
##$YMAX_p= 355469892
##$YMIN_p= -412743469
$$ End of Bruker specific parameters
$$ ---------------------------------
##NTUPLES= NMR SPECTRUM
##VAR_NAME=  FREQUENCY,     SPECTRUM/REAL,   SPECTRUM/IMAG
##SYMBOL=    X,             R,               I
##VAR_TYPE=  INDEPENDENT,   DEPENDENT,       DEPENDENT
##VAR_FORM=  AFFN,          ASDF,            ASDF
##VAR_DIM=   65536,         65536,           65536
##UNITS=     HZ,            ARBITRARY UNITS, ARBITRARY UNITS
##FACTOR=    0.49542278885378, 1,            1
##FIRST=     16045.7642231865, 0,            0
##LAST=      -16421.768244346, 0,            0
##MIN=       -16421.768244346, -412743469,   0
##MAX=       16045.7642231865, 355469892,    0
$$ Real data points
##PAGE= N=1
##DATA TABLE= (X++(R..R)), XYDATA
$$ [...]
$$ plain form
7261 -6332597 -12777187 -22918179 -37120149 -41660268 -27819705 -9484074 -6503761 -16328820
7253 -16328820 -18754951 -7423970 680369 -8725317 -26956607 -36833450 -35989800 -34327292
7245 -34327292 -35508062 -34039852 -28389140 -24482318 -24625676 -23730135 -20365934 -21534748
7237 -21534748 -29478378 -32144010 -17495100 6839099 20129368 14716722 4208401 2738645
7229 2738645 7465768 8506764 6643755 10476584 20875779 28922999 27771205 18012485
7221 18012485 2933372 -12586338 -19527218 -11374114 5130068 14999095 13226713 9700918
7213 9700918 13574990 21971465 28177905 31474336 32258770 25769854 9747334 -6539602
7205 -6539602 -9904862 1606428 17157358 25278317 23538766 18580546 19906154 30335358
$$ packed form
7261f332597o444590j0140992j4201970m540119J3840563J8335631K980313r825059
7253a6328820k426131J1330981Q104339r405686j8231290r876843Q43650J662508
7245c4327292j180770J468210N650712L906822j43358Q95541L364201j168814
7237b1534748p943630k665632J4648910K4334199J3290269n412646j0508321j469756
7229B738645M727123J040996j863009L832829J0399195Q047220j151794r758720
7221A8012485j5079113j5519710o940880Q153104J6504182R869027j772382l525795
7213I700918L874072Q396475O206440L296431P84434o488916j6022520j6286936
7205f539602l365260J1511290J5550930Q120959j739551m958220J325608J0429204
$$ plain form
7197 30335358 40158218 36234395 20016718 8840435 13967712 26386352 32992441 37449577
7189 37449577 51337783 70466460 76592947 62759450 42366106 30477655 28544639
7182 28544639 30514813 31419088 25297041 7233128 -15086220 -22532870 -6542436 17755156
7174 17755156 29298897 25297455 18370733 15681193 12809654 6411255 1511571 3929830
7166 3929830 12935338 24050534 34236530 42480024 48912619 54408409 58048379 54964253
7158 54964253 40629737 18467839 -21381 -4952418 2828821 12795682 14473104 6833275
7150 6833275 -991708 958231 12621246 23289983 22264847 8634337 -9709158 -23932507
7142 -23932507 -29748079 -27952026 -22249780 -15712027 -8481595 -267745 5631712 4639299
$$ packed form
7197C0335358R822860l923823j6217677j1176283N127277J2418640O606089M457136
7189C7449577J3888206J9128677O126487j3833497k0393344j1888451j933016
7182B8544639J970174R04275o122047j8063913k2319348p446650J5990434K4297592
7174A7755156J1543741m001442o926722k689540k871539o398399m899684K418259
7166C929830R005508J1115196J0185996Q243494O432595N495790L639970l084126
7158E4964253j4334516k2161898j8489220m931037P781239R966861J677422p639829
7150F833275p824983J949939J1663015J0668737j025136j3630510j8343495j4223349
7142b3932507n815572J796053N702246O537753P230432Q213850N899457r92413
$$ plain form
7134 4639299 -2357964 -9219531 -12716897 -15205387 -17430695 -15522957 -9055153 -4961436
7126 -4961436 -7156576 -8557421 -1657542 7782304 7349211 -4138360 -15039168 -16565311
7118 -16565311 -11280506 -6137681 -5721853 -12574286 -24915442 -32653172 -25037454 -5044864
7110 -5044864 12418524 19439743 23110593 30911340 38039902 35864919 24878906 11675541
7102 11675541 -716301 -12249920 -20991494 -25363637 -25858899 -19090649 1534873 30795149
7094 30795149 46476339 32588871 2462023 -15613778 -12757897 -4290276 -1518804 2906856
7086 2906856 16371844 29500133 28300258 12613700 -7044366 -22863814 -31413363 -29973435
7078 -29973435 -20985018 -14190975 -15139214 -16818485 -11182891 -2276213 2689206 8349429
$$ packed form
7134D639299o997263o861567l497366k488490k225308J907738O467804M093717
7126d961436k195140j400845O899879R439846m33093j1487571j0900808j526143
7118a6565311N284805N142825M15828o852433j2341156p737730P615718J9992590
7110e044864J7463388P021219L670850P800747P128562k174983j0986013j3203365
7102A1675541j2391842j1533619q741574m372143m95262O768250K0625522K9260276
7094C0795149J5681190j3887468l0126848j8075801K855881Q467621K771472M425660
7086B906856J3464988J3128289j199875j5686558j9658066j5819448q549549J439928
7078b9973435Q988417O794043r48239j679271N635594Q906678M965419N660223
$$ plain form
7070 8349429 22889131 39145769 41736117 33871443 38386699 64603766 89851101 86223452
7062 86223452 55680464 25777390 17065464 27414071 43989392 55889849 54325335
7055 54325335 34404656 3440699 -20442196 -24608802 -13286525 224335 7424330
7048 7424330 7030701 -201387 -11700640 -20678202 -20797322 -13622212 -6337511 -1979834
7040 -1979834 2687943 8885314 11808508 8198234 2601810 1075428 2253419 343264
7032 343264 -5496530 -11164851 -15452008 -20225731 -22556595 -15506716 -265038 10632657
7024 10632657 8459518 590425 133443 7746688 12602089 9259477 4178811 4755856
7016 4755856 9937504 13909145 12932967 6620684 -2202600 -7691368 -6596685 -4269155
$$ packed form
7070H349429J4539702J6256638K590348p864674M515256K6217067K5247335l627649
7062H6223452l0542988k9903074q711926J0348607J6575321J1900457j564514
7055E4325335j9920679l0963957k3882895m166606J1322277J3510860P199995
7048G424330l93629p232088j1499253q977562j19120P175110P284701M357677
7040a979834M667777O197371K923194l610274n596424j526382J177991j910155
7032C43264n839794n668321m287157m773723k330864P049879J5241678J0897695
7024A0632657k173139p869093m56982P613245M855401l342612n080666N77045
7016D755856N181648L971641r76178o312283q823284n488768J094683K327530
$$ plain form
7008 -4269155 -8395207 -16256278 -17020034 -8901919 -3567373 -8021593 -12651795 -6419797
7000 -6419797 4756573 6963700 267389 -2004401 5230711 11375185 6943316 -3330552
6992 -3330552 -9293010 -8983470 -7241164 -6195980 -3695202 859257 3911673 1205102
6984 1205102 -7658186 -17895540 -23444999 -23687685 -24413586 -29125515 -32280223 -26826248
6976 -26826248 -16239966 -10736832 -11098248 -5843558 11289012 29388848 33194202 22798155
6968 22798155 12402655 11298708 13845896 9596029 -2558898 -14045162 -17974350 -16851666
6960 -16851666 -17801090 -22390191 -24659236 -19730892 -10357332 -2002830 4985599 13465539
6952 13465539 22229928 26471336 24173791 16326217 2899517 -13531111 -21856284 -11377015
$$ packed form
7008d269155m126052p861071p63756Q118115N334546m454220m630202O231998
7000f419797J1176370K207127o696311k271790P235112O144474m431869j0273868
6992c330552n962458L09540J742306J045184K500778M554459L052416k706571
6984A205102q863288j0237354n549459k42686p25901m711929l154708N453975
6976b6826248J0586282N503134l61416N254690J7132570J8099836L805354j0396047
6968B2798155j0395500j103947K547188m249867j2154927j1486264l929188J122684
6960a6851666r49424m589101k269045M928344R373560Q354502O988429Q479940
6952A3465539Q764389M241408k297545p847574j3426700j6430628q325173J0479269
$$ plain form
6944 -11377015 11076292 24237532 17714290 3756935 -2886947 -5398061 -13881982 -23429782
6936 -23429782 -19634706 -3460573 5771956 -4207363 -22954482 -33253976 -33044873 -33015689
6928 -33015689 -38122284 -41253187 -35146799 -23224076 -14803762 -12544723 -9460148 356792
6920 356792 11940319 15083023 8482687 1810959 1912776 3732189 -262997 -7252162
6912 -7252162 -7529042 2568404 18120546 33453594 44849745 46904503 35072641 13603333
6904 13603333 -5943439 -16580649 -21265144 -25230346 -29112510 -32170889 -36207471 -41719536
6896 -41719536 -44197224 -39362120 -30350776 -25173742 -26763121 -28593674 -21931485 -6661361
6888 -6661361 7096764 9454362 1186533 -9253487 -17355965 -24665127 -28379445 -18147248
$$ packed form
6944a1377015K2453307J3161240o523242j3957355o643882k511114q483921r547800
6936b3429782L795076J6174133R232529r979319j8747119j0299494K09103K9184
6928c3015689n106595l130903O106388J1922723Q420314K259039L084575R816940
6920C56792J1583527L142704o600336o671728J01817J819413l995186o989165
6912g252162k76880J0097446J5552142J5333048J1396151K054758j1831862k1469308
6904A3603333j9546772j0637210m684495l965202l882164l058379m036582n512065
6896d1719536k477688M835104R011344N177034j589379j830553O662189J5270124
6888f661361J3758125K357598q267829j0440020q102478p309162l714318J0232197
$$ plain form
6880 -18147248 9731948 41146490 56491579 51653803 38991714 30128890 26454315 24925727
6872 24925727 23708673 21626533 19827003 23570115 34517269 42903907 37159151 20210388
6864 20210388 5383304 -2551967 -8724168 -11094717 24184 20433290 28483118 13757189
6856 13757189 -5975190 -9549645 -951229 2178431 -2676235 -4001910 601525 1381859
6848 1381859 -5583145 -14255423 -22264619 -33186750 -44285671 -46746696 -40441915 -34771417
6840 -34771417 -32045197 -23989352 -9186189 60826 -4303704 -13057703 -13655262 -8061387
6832 -8061387 -7080236 -13436458 -19876904 -20169501 -14114096 -4131284 6902200 16159121
6824 16159121 23418214 30978391 38572796 42241260 40446969 35713335 27374716 10301628
$$ packed form
6880a8147248K7879196L1414542J5345089m837776j2662089q862824l674575j528588
6872B4925727j217054k082140j799530L743112J0947154Q386638n744756j6948763
6864B0210388j4827084p935271o172201k370549J1118901K0409106Q049828j4725929
6856A3757189j9732379l574455Q598416L129660m854666j325675M603435P80334
6848A381859o965004q672278q009196j0922131j1098921k461025O304781N670498
6840c4771417K726220Q055845J4803163R247015m364530q753999n97559N593875
6832h061387R81151o356222o440446k92597O055405R982812J1033484R256921
6824A6159121P259093P560177P594405L668464j794291m733634q338619j7073088
$$ plain form
6816 10301628 -13676139 -30706775 -29636113 -16399374 -4860403 1957755 10786514 21270201
6808 21270201 23387947 13805456 3261420 2157439 7405904 10538926 12342596 20275821
6800 20275821 33642405 40485672 31797806 13396115 -109422 -742364 6747880 13073658
6792 13073658 14906099 15736156 18537261 20627403 16672378 5492417 -7752067 -17000687
6784 -17000687 -22412552 -29884726 -41603390 -49113557 -40790429 -17415235 4720492 9812080
6776 9812080 -2111779 -19523312 -33946213 -43202849 -44122336 -32640197 -12335165 5975095
6768 5975095 15949311 20006098 20287204 14458677 4444739 -191435 5419392 13246764
6760 13246764 14087109 10664166 10507001 12493024 11312742 10122426 15718595 23376304
$$ packed form
6816A0301628k3977767j7030636J070662J3236739J1538971O818158Q828759J0483687
6808B1270201K117746r582491j0544036j103981N248465L133022J803670P933225
6800B0275821J3366584O843267q687866j8401691j3505537o32942P490244O325778
6792A3073658J832441Q30057K801105K090142l955025j1179961j3244484r248620
6784a7000687n411865p472174j1718664p510167Q323128K3375194K2135727N091588
6776I812080j1923859j7411533j4422901r256636r19487J1482139K0305032J8310260
6768E975095R974216M056787K81106n828527j0013938m636174N610827P827372
6760A3246764Q40345l422943j57165J986023j180282j190316N596169P657709
$$ plain form
6752 23376304 20457438 6375498 -4091352 -1025370 8811128 15079343 16955505 15734192
6744 15734192 5413584 -17830809 -43298865 -54972214 -50576851 -41318875 -34382060 -26435026
6736 -26435026 -14913245 -4305926 3212422 13751830 30467274 42627249 36169996
6729 36169996 14003990 -4163391 -5628723 -358297 -5820117 -21135315 -27042006 -12739743
6721 -12739743 7830066 13578522 3262265 -5154138 461056 13027291 19628489 18064922
6713 18064922 14427489 11390617 6394309 -1966756 -12025329 -21519263 -27081305 -23597014
6705 -23597014 -9576526 7929711 18505951 17805109 8604281 -4659312 -17094071 -21807724
6697 -21807724 -14826647 -1696761 7596307 11007596 15075654 22533038 27820694 28275621
$$ packed form
6752B3376304k918866j4081940j0466850L065982R836498O268215J876162j221313
6744A5734192j0320608k3244393k5468056j1673349M395363R257976O936815P947034
6736b6435026J1521781J0607319P518348J0539408J6715444J2159975o457253
6729C6169996k2166006j8167381j465332N270426n461820j5315198n906691J4302263
6721a2739743K0569809N748456j0316257q416403N615194J2566235O601198j563567
6713A8064922l637433l036872m996308q361065j0058573r493934n562042L484291
6705b3597014J4020488J7506237J0576240p00842r200828j3263593j2434759m713653
6697b1807724O981077J3129886R293068L411289M068058P457384N287656M54927
$$ plain form
6689 28275621 30862514 40601076 48729715 41848916 20337324 -1190294 -11401302 -11940158
6681 -11940158 -8556950 -1374105 11062208 24077885 30174145 28261382 24381955 23669116
6673 23669116 25573325 26803272 24949865 18538468 7356282 -5360285 -13859044 -15272637
6665 -15272637 -12294053 -8833478 -5567509 -2411584 -2492945 -8752689 -17604701 -21658456
6657 -21658456 -19758478 -18737222 -22541370 -25110942 -19096226 -7702043 -1103471 -2438039
6649 -2438039 -4342680 -483134 5681918 6759901 1727150 -3635965 -4669608 -2947582
6641 -2947582 -3870615 -10622181 -20036597 -24403726 -19114424 -8596403 -2144430 -3497588
6633 -3497588 -7623536 -8360784 -4982439 671605 8668104 18354693 24795187 23375474
$$ packed form
6689B8275621K586893R738562Q128639o880799k1511592k1527618j0211008n38856
6681a1940158L383208P182845J2436313J3015677O096260j912763l879427p12839
6673B3669116J904209J229947j853407o411397j1182186j2716567q498759j413593
6665a5272637K978584L460575L265969L155925q1361o259744q852012m053755
6657b1658456J899978J021256l804148k569572O014716J1394183O598572j334568
6649b438039j904641L859546O165052J077983n032751n363115j033643J722026
6641b947582r23033o751566r414416m367129N289302J0518021O451973j353158
6633c497588m125948p37248L378345N654044P996499R686589O440494j419713
$$ plain form
6625 23375474 16794739 12631897 14095532 17297652 18018492 17467768 20343211 29774889
6617 29774889 44702004 59713802 66969142 60985206 43204429 21202724 3353960
6610 3353960 -5352326 -4437268 1923041 6548607 4574675 -1992330 -6918210 -6738904 -2871006
6601 -2871006 2573643 9537120 17888834 25634212 30724802 32849430 32682768 31072830
6593 31072830 29301574 28191934 26545043 22252061 15225515 7664873 1562235 -2522045
6585 -2522045 -4812130 -5953571 -6018726 -2597238 6811955 17496427 17400407 1060662 -19339650
6576 -19339650 -25496351 -14714199 -990901 5588624 9159748 14531688 15561595 5444154
6568 5444154 -9903460 -18316776 -15830466 -6240257 8456435 27770486 46893973 60986446
$$ packed form
6625B3375474o580735m162842J463635L202120P20840n50724K875443R431678
6617B9774889J4927115J5011798P255340n983936j7780777k2001705j7848764
6610C353960q706286R15058O360309M625566j973932o567005m925880J79306L867898
6601b871006N444649O963477Q351714P745378N090590K124628j66662j609938
6593C1072830j771256j109640j646891m292982p026546p560642o102638m084280
6585b522045k290085j141441o5155L421488R409193J0684472r6020j6339745k0400312
6576a9339650o156701J0782152J3723298O579525L571124N371940J029907j0117441
6568E444154j5347614q413316K486310R590209J4696692J9314051J9123487J4092473
$$ plain form
6560 60986446 72521796 84624960 89753564 76742829 49243759 25552848 17516455
6553 17516455 19722075 22661134 25653613 30442550 31354756 21447962 4207129 -8971312
6545 -8971312 -11211693 -4407481 6781240 18962105 28376928 30744310 24816727 14046718
6537 14046718 3772572 -2474316 -4165116 -2369231 2436549 10604573 20909717 29600831
6529 29600831 34122880 36591612 40585985 45300109 46230868 41121819 31847949 21320931
6521 21320931 12459432 8928721 11672577 15217700 12766599 4404145 -5236909 -15403433
6513 -15403433 -27008473 -33539797 -25973502 -8854313 1023838 -2763559 -7068645 -71827
6505 -71827 10900177 13473596 11079549 14823077 22135223 20740417 10688636 4872630
$$ packed form
6560F0986446J1535350J2103164N128604j3010735k7499070k3690911q036393
6553A7516455K205620K939059K992479M788937R12206r906794j7240833j3178441
6545h971312k240381O804212J1188721J2180865R414823K367382n927583j0770009
6537A4046718j0274146o246888j690800J795885M805780Q168024J0305144Q691114
6529B9600831M522049K468732L994373M714124R30759n109049r273870j0527018
6521B1320931q861499l530711K743856L545123k451101q362454r641054j0166524
6513a5403433j1605040o531324P566295J7119189R878151l787397m305086O996818
6505g1827J0972004K573419k394047L743528P312146j394806j0051781n816006
$$ plain form
6497 4872630 6825253 4783702 -7809302 -20900408 -24068861 -21824569 -23753411 -28699809
6489 -28699809 -28331234 -20309740 -9525680 -877712 2075990 -3964076 -16942166 -27081875
6481 -27081875 -27124658 -22047033 -21336710 -24201072 -20616810 -6409408 10333681 18802951
6473 18802951 15487337 4024138 -9146993 -17689624 -19218100 -18099992 -20093593 -22940563
6465 -22940563 -17519165 -920713 16790361 23414336 18969804 14338947 17474347 26173713
6457 26173713 34174624 38786926 40219080 37459545 28774915 14851551 -1710972 -19205753
6449 -19205753 -35955361 -47128703 -46895154 -36130050 -25144210 -25051132 -36410791 -48363100
6441 -48363100 -49246060 -37402507 -22224331 -15322281 -19721406 -27270812 -28220182 -23124080
$$ packed form
6497D872630J952623k041551j2593004j3091106l168453K244292j928842m946398
6489b8699809L68575Q021494J0784060Q647968K953702o040066j2978090j0139709
6481b7081875m2783N077625P10323k864362L584262J4207402J6743089Q469270
6473A8802951l315614j1463199j3171131q542631j528476J118108j993601k846970
6465b2940563N421398J6598452J7711074O623975m444532m630857L135400Q699366
6457B6173713Q000911M612302J432154k759535q684630j3923364j6562523j7494781
6449a9205753j6749608j1173342K33549J0765104J0985840R3078j1359659j1952309
6441d8363100q82960J1843553J5178176O902050m399125p549406r49370N096102
$$ plain form
6433 -23124080 -21358420 -26577505 -29664740 -21299612 -6285397 3198096 5800360 11371456
6425 11371456 22075826 25250990 11502557 -9512832 -20537136 -17702684 -10279183 -4261814
6417 -4261814 1748482 5869296 1801664 -7929890 -9474783 3975039 19743952 20941932
6409 20941932 8734066 -982035 -338456 2758952 922002 -279946 7409678 20148371
6401 20148371 26163425 20806685 9038850 -4967620 -21026254 -34463547 -34251824 -15922463
6393 -15922463 8983871 23170054 21219921 12068520 6274581 6803182 11324560 16661244
6385 16661244 19120753 15934700 9700143 7810217 13868595 21758838 21776133 12000182
6377 12000182 668941 -3108013 1281117 7379006 11240636 16270244 26084563 34861077
$$ packed form
6433b3124080J765660n219085l087235Q365128J5014215R483493K602264N571096
6425A1371456J0704370L175164j3748433k1015389j1024304K834452P423501O017369
6417d261814O010296M120814m067632r731554j544893J3449822J5768913J197980
6409B0941932j2207866r716101O43579L097408j836950j201948P689624J2738693
6401B0148371O015054n356740j1767835j4006470j6058634j3437293K11723J8329361
6393a5922463K4906334J4186183j950133r151401n793939N28601M521378N336684
6385A6661244K459509l186053o234557j889926O058378P890243J7295r775951
6377A2000182j1331241l776954M389130O097889L861630N029608R814319Q776514
$$ plain form
6369 34861077 30822871 11622555 -9096342 -15908080 -9592013 -5142579 -13442033 -31094129
6361 -31094129 -47505338 -54537593 -48102067 -28309624 -2528706 16924890 22953624 19272199
6353 19272199 14361063 14034927 21139909 35783801 51659836 57968092 50584731 37389991
6345 37389991 28071920 23544378 20639934 21270677 28558501 37357768 37580009 26111758
6337 26111758 8623968 -8610851 -21365121 -24511937 -16499473 -6957378 -9643996 -25160501
6329 -25160501 -39546287 -43344013 -43003571 -48116250 -55947164 -56992101 -50364869 -43956188
6321 -43956188 -40716388 -33432262 -15276326 9793450 30250277 38329189 35876548 29758243
6313 29758243 23752747 16658373 7723146 415050 -1600870 567562 3836798 8303879
$$ packed form
6369C4861077m038206j9200316k0718897o811738O316067M449434q299454j7652096
6361c1094129j6411209p032255O435526J9792443K5780918J9453596O028734l681425
6353A9272199m911136l26136P104982J4643892J5876035O308256p383361j3194740
6345C7389991r318071m527542k904444O30743P287824Q799267K22241j1468251
6337B6111758j7487790j7234819j2754270l146816Q012464R542095k686618j5516505
6329b5160501j4385786l797726L40442n112679p830914j044937O627232O408681
6321d3956188L239800P284126J8155936K5069776K0456827Q078912k452641o118305
6313B9758243o005496p094374q935227p308096k015920K168432L269236M467081
$$ plain form
6305 8303879 14237638 16230493 8508609 -3420592 -5371619 7645925 23784489 29503299
6297 29503299 25467102 21243770 20747799 21450869 23522511 29492986 35731158 33910228
6289 33910228 23187508 13755515 14819448 23601156 29429579 25913195 16544795 9617479
6281 9617479 9050729 10409424 7102886 360650 -1365301 4417983 7655672 -533568
6273 -533568 -11816329 -8871378 10682848 29958601 35720426 34493374 38500553 45073398
6265 45073398 41889621 28276087 18106522 20108241 26220301 24356905 14722269 6759709
6257 6759709 5177969 6910117 9478827 13602485 16363589 10176000 -6273540 -21584707
6249 -21584707 -23333359 -13921039 -7265038 -9821541 -13150324 -8297174 400508 2387491
$$ packed form
6305H303879N933759J992855p721884j1929201j951027J3017544J6138564N718810
6297B9503299m036197m223332m95971P03070K071642N970475O238172j820930
6289C3910228j0722720r431993J063933Q781708N828423l516384r368400o927316
6281I617479n66750J358695l306538o742236j725951N783284L237689q189240
6273e33568j1282761K944951J9554226J9275753N761825j227052M007179O572845
6265D5073398l183777j3613534j0169565K001719O112060j863396r634636p962560
6257F759709j581740J732148K568710M123658K761104o187589j6449540j5311167
6249b1584707j748652R412320O656001k556503l328783M853150Q697682J986983
$$ plain form
6241 2387491 -3716671 -10196557 -13085420 -15802230 -19688302 -19786998 -13313758 -5594268 -3330663
6232 -3330663 -6776068 -12292669 -17965033 -22558561 -23570575 -21603609 -23081318 -32871425
6224 -32871425 -46597029 -55393669 -55538004 -47801831 -31085653 -5572313 19017682 28625362
6216 28625362 21061312 8859282 2588646 -570673 -6772575 -12625543 -11158260 -5331536
6208 -5331536 -5122971 -12175443 -16517870 -10030108 3813126 15520940 19080034 14070434
6200 14070434 4031634 -4641624 -7076043 -5981856 -9007657 -17792015 -24963957 -25212579
6192 -25212579 -23216517 -25217707 -28252012 -25247172 -17151696 -11477809 -10552037 -10112319
6184 -10112319 -9327886 -12518140 -18632577 -18522117 -7913041 4315423 7306967 2249256
$$ packed form
6241B387491o104162o479886k888863k716810l886072r8696O473240P719490K263605
6232c330663l445405n516601n672364m593528j012014J966966j477709r790107
6224c2871425j3725604q796640j44335P736173J6716178K5513340K4589995R607680
6216B8625362p564050j2202030o270636l159319o201902n852968J467283N826724
6208e331536K08565p052472m342427O487762J3843234J1707814L559094n009600
6200A4070434j0038800q673258k434419J094187l025801q784358p171942k48622
6192b5212579J996062k001190l034305L004840Q095476N673887R25772M39718
6184a0112319P84433l190254o114437J10460J0609076J2228464K991544n057711
$$ plain form
6176 2249256 -1600248 -705182 493436 -1230913 -4052418 -6184317 -8447652 -11068275
6168 -11068275 -12779306 -13485572 -13616346 -11279845 -4875716 1914795 3326311 -95357
6160 -95357 -2119444 -404365 1172365 1220408 4054484 9962792 9173648 -7600556 -36018754
6151 -36018754 -61117141 -70877578 -62503265 -39673299 -11079034 10166416 14076600 2998823
6143 2998823 -11248385 -20267756 -24807775 -27616808 -27064789 -21420790 -15187380 -15927654
6135 -15927654 -25046826 -34923707 -36510439 -28795517 -19086790 -13187524 -7485964 5330846
6127 5330846 23218910 33809766 29720147 18774097 13038438 12852856 10200249 4393660
6119 4393660 3419189 9667931 15471468 15780245 15267485 18413571 22044780 23735552 28593889
$$ packed form
6176B249256l849504Q95066J198618j724349k821505k131899k263335k620623
6168a1068275j711031p06266j30774K336501O404129O790511J411516l421668
6160i5357k024087J715079J576730M8043K834076N908308p89144j6774204k8418198
6151c6018754k5098387r760437Q374313K2829966K8594265K1245450L910184j1077777
6143B998823j4247208r019371m540019k809033N52019N643999O233410p40274
6135a5927654r119172r876881j586732P714922R708727N899266N701560J2816810
6127E330846J7888064J0590856m089619j0946050n735659j85582k652607n806589
6119D393660r74471O248742N803537L08777n12760L146086L631209J690772M858337
$$ plain form
6110 28593889 39486375 47735648 42951594 27282599 11330222 551229 -5571549 -6049714
6102 -6049714 -838712 3179800 523010 -1484413 7006541 18246279 13074081 -10222829
6094 -10222829 -29553803 -28272030 -15974120 -10246452 -10865545 -5849464 5973221 13856642
6086 13856642 12245699 5035095 -5102814 -18285689 -28310996 -24737157 -7156884 12007696
6078 12007696 21599527 20668840 12310770 -1347171 -14439265 -17278057 -7433595 5167794
6070 5167794 9681209 6099372 1420399 -443905 10654 1629929 2144027 -1893642 -9164929
6061 -9164929 -11409659 -3315134 8399008 12268429 6542066 -84446 -1105967 990746
6053 990746 743578 -3609386 -10811269 -18691997 -23493428 -21286796 -12634809 -3114336 2629400
$$ packed form
6110B8593889J0892486Q249273m784054j5668995j5952377j0778993o122778m78165
6102f049714N211002M018512k656790k007423Q490954J1239738n172198k3296910
6094a0222829j9330974J281773J2297910N727668o19093N016081J1822685P883421
6086A3856642j610943p210604j0137909j3182875j0025307L573839J7580273J9164580
6078A2007696R591831r30687q358070j3657941j3092094k838792R844462J2601389
6070E167794M513415l581837m678973j864304M54559J619275N14098m037669p271287
6061i164929k244730Q094525J1714142L869421n726363o626512j021521K096713
6053I90746k47168m352964p201883p880728m801431K206632Q651987R520473N743736
$$ plain form
6044 2629400 4874871 5513128 3957745 -660161 -4874518 -2041148 10597306 26979271
6036 26979271 36015077 31997136 21470404 17547353 25784819 37829834 41564237 35093675
6028 35093675 26364556 20672672 15097491 6457072 -1904877 -5457999 -6065087 -9112457
6020 -9112457 -15744275 -22880721 -28877814 -33557496 -33718122 -25319264 -11363702 -1214574
6012 -1214574 1265438 3612873 13955999 28331736 35399208 32307437 28654289 33104417
6004 33104417 42108445 45534132 39480946 29265282 22115843 21174504 25344633 30624626
5996 30624626 31636957 25806509 16915366 11529663 11330366 12283484 12153543 14243829 20475500
5987 20475500 24628602 18475969 4418949 -3818486 3665834 20213975 29247540 23082081
$$ packed form
6044B629400K245471O38257j555383m617906m214357K833370J2638454J6381965
6036B6979271R035806m017941j0526732l923051Q237466J2045015L734403o470562
6028C5093675q729119n691884n575181q640419q361949l553122o07088l047370
6020i112457o631818p136446n997093m679682j60626Q398858J3955562J0149128
6012a214574K480012K347435J0343126J4375737P067472l091771l653148M450128
6004C3104417R004028L425687o053186j0215664p149439r41339M170129N279993
5996C0624626J012331n830448q891143n385703j99297R53118j29941K090286O231671
5987B0475500M153102o152633j4057020q237435P484320J6548141R033565o165459
$$ plain form
5979 23082081 11123799 7963439 16623379 26612052 26490741 14253077 -4002927 -20458823
5971 -20458823 -28960709 -26952001 -18071888 -10301284 -8017109 -7938594 -5829005 -3675459
5963 -3675459 -5192234 -7201486 -2736302 7666056 14840303 12455695 3633270 -5115007
5955 -5115007 -10109490 -8776394 882631 14737518 22470571 18376642 7900468 -895668
5947 -895668 -7071034 -12519426 -13588653 -5187035 9637150 22193122 28686716 30911565
5939 30911565 28129261 17247566 1617273 -9505712 -13350374 -17614985 -27453433 -35260905
5931 -35260905 -30321755 -14750219 -2024830 127436 -1344199 4292982 16287401 23045370
5923 23045370 17088273 4163316 -4671692 -5561311 -1863310 4759290 15523296 27353403
$$ packed form
5979B3082081j1958282l160360Q659940R988673j21311j2237664j8256004j6455896
5971b0458823q501886K008708Q880113P770604K284175P8515K109589K153546
5963c675459j516775k009252M465184J0402358P174247k384608q822425q748277
5955e115007m994483J333096R659025J3854887P733053m093929j0476174q796136
5947h95668o175366n448392j069227Q401618J4824185J2555972O493594K224849
5939C0911565k782304j0881695j5630293j1122985l844662m264611r838448p807472
5931c5260905M939150J5571536J2725389K152266j471635N637181J1994419O757969
5923B3045370n957097j2924957q835008q89619L698001O622600J0764006J1830107
$$ plain form
5915 27353403 33499492 33801905 35377402 38573750 32150337 10909875 -10397162 -12683949
5907 -12683949 2885646 18069031 21897554 18746581 14062889 7314947 1251977 3506221
5899 3506221 13531591 20105550 17835391 14800540 17056651 17063443 6701683 -7989842
5891 -7989842 -15679075 -15727979 -14448149 -11546811 -2023660 11850642 21177716 21592407 15734536
5882 15734536 7210195 -140946 -606407 6734514 12704816 8730744 72493 -1614798
5874 -1614798 3770053 6059259 3049897 4309722 14447668 24742490 26295166 21743371
5866 21743371 18522364 18628718 20256055 21994081 19900152 7687546 -13510786 -31363452
5858 -31363452 -35122777 -27634880 -18359327 -9496443 2587821 15225426 18751962 9507204
$$ packed form
5915B7353403O146089L02413J575497L196348o423413k1240462k1307037k286787
5907a2683949J5569595J5183385L828523l150973m683692o747942o062970K254244
5899C506221J0025370O573959k270159l034851K256111O792j0361760j4691525
5891g989842p689233m8904J279830K901338R523151J3874302R327074M14691n857871
5882A5734536q524341p351141m65461P340921N970302l974072q658251j687291
5874a614798N384851K289206l009362J259825J0137946J0294822J552676m551795
5866B1743371l221007J06354J627337J738026k093929j2212606k1198332j7852666
5858c1363452l759325P487897R275553Q862884J2084264J2637605L526536r244758
$$ plain form
5850 9507204 -3862091 -10641828 -10066659 -9183619 -11335077 -11624184 -4652758 6947321
5842 6947321 15365789 18050492 20554438 26907746 31608741 26320550 12630917 2314546
5834 2314546 4295520 15754871 27082229 31820878 30680211 29013686 31147849 34428665
5826 34428665 29421180 10434657 -13878431 -25516371 -14665792 11124594 35917071
5819 35917071 49203327 50025616 43052174 34123647 26826622 20926147 15247046 10994298
5811 10994298 8487676 2445515 -12571150 -31904202 -44035147 -46016919 -47054110 -52768356
5803 -52768356 -54860623 -43449313 -22572183 -4533999 6724621 17315844 30364467
5796 30364467 40133406 40272356 31945945 22174519 17558007 20022707 26099859 30412628
$$ packed form
5850I507204j3369295o779737N75169Q83040k151458k89107O971426J1600079
5842F947321Q418468K684703K503946O353308M700995n288191j3689633j0316371
5834B314546J980974J1459351J1327358M738649j140667j666525K134163L280816
5826C4428665n007485j8986523k4313088j1637940J0850579K5790386K4792477
5819C5917071J3286256Q22289o973442q928527p297025n900475n679101m252748
5811A0994298k506622o042161j5016665j9333052j2130945j981772j037191n714246
5803e2768356k092267J1411310K0877130J8038184J1258620J0591223J3048623
5796C0364467R768939J38950q326411r771426m616512K464700O077152M312769
$$ plain form
5788 30412628 31023554 29582244 25720646 16043038 1389542 -10286637 -13152057 -10984425
5780 -10984425 -9462442 -5009565 10845550 37155725 60560530 67547174 55938844 34933783
5772 34933783 17294956 10156473 10101345 8531494 3454736 1891376 8198135 16263254
5764 16263254 18061969 13517962 6041848 -3998555 -13177457 -11010266 5767171 21671784
5756 21671784 19887939 6687470 2164562 9383377 11690867 1522700 -8771314 -10349839
5748 -10349839 -11563260 -17890595 -17205322 -541001 17146271 15369508 -2049737 -13721390
5740 -13721390 -11467008 -6541912 -7891177 -11681360 -13424310 -15190567 -17509026 -16572467
5732 -16572467 -12997952 -12430178 -14250445 -10866098 -2701835 -2634230 -18006506 -36970629
$$ packed form
5788C0412628O10926j441310l861598r677608j4653496j1676179k865420K167632
5780a0984425J521983M452877J5855115K6310175K3404805O986644j1608330k1005061
5772C4933783j7638827p138483n5128j569851n076758j563360O306759Q065119
5764A6263254J798715m544007p476114j0040403r178902K167191J6777437J5904613
5756B1671784j783845j3200469m522908P218815K307490j0168167j0294014j578525
5748a0349839j213421o327335O85273J6664321J7687272j776763j7419245j1671653
5740a3721390K254382M925096j349265l790183j742950j766257k318459R36559
5732a6572467L574515N67774j820267L384347Q164263O7605j5372276j8964123
$$ plain form
5724 -36970629 -41925025 -31368523 -19655509 -17913660 -23637427 -28773909 -30114112 -28409865
5716 -28409865 -22249853 -8619921 10323023 25592675 30256156 28559268 31459029 42179440
5708 42179440 51109454 47668934 32539854 14492300 344187 -6369033 -2256356 11417262
5700 11417262 23704308 23173062 12222739 3909879 4558262 8597225 11312119 16144022
5692 16144022 26005687 37170612 46478647 55496258 62261730 58603754 42960126 26525536
5684 26525536 17396732 7663890 -11313173 -28288615 -23591169 353370 16956206 8161851
5676 8161851 -14430489 -27608372 -24194218 -13992811 -6360006 -3294404 -5414902 -13225484
5668 -13225484 -22062517 -24432062 -19880818 -17167706 -24289025 -39712034 -54563788 -60009767
$$ packed form
5724c6970629m954396J0556502J1713014J741849n723767n136482j340203J704247
5716b8409865O160012J3629932J8942944J5269652M663481j696888K899761J0720411
5708D2179440Q930014l440520j5129080j8047554j4148113o713220M112677J3673618
5700A1417262J2287046n31246j0950323q312860O48383M038963K714894M831903
5692A6144022R861665J1164925R308035R017611O765472l657976j5643628j6434590
5684B6525536r128804r732842j8977063j6975442M697446K3944539J6602836q794355
5676H161851k2592340j3177883L414154J0201407P632805L065602k120498p810582
5668a3225484q837033k369545M551244K713112p121319j5423009j4851754n445979
$$ plain form
5660 -60009767 -51598256 -30966808 -6703068 9315075 11232034 5358878 3906818 11167341
5652 11167341 18179335 13567557 -1689975 -14344331 -14940454 -9682612 -11898026 -23785269
5644 -23785269 -33220919 -30259494 -20268720 -15249571 -16129303 -11586531 5129372 25295098
5636 25295098 34248842 27595274 13805834 3282515 -827283 -2106580 -5418883 -12259109
5628 -12259109 -18622875 -17694321 -7811469 2576967 2371614 -8388438 -16470943 -9934097
5620 -9934097 8760994 27291696 37483590 39684571 35504834 23417634 3698303 -16617297
5612 -16617297 -26704286 -19013245 5721128 36896669 57858259 57068895 38576500 18298301
5604 18298301 7992913 6200829 6063896 6161844 9471701 16589593 25702729 35882332
$$ packed form
5660f0009767Q411511K0631448K4263740J6018143J916959n873156j452060P260523
5652A1167341P011994m611778j5257532j2654356n96123N257842k215414j1887243
5644b3785269r435650K961425R990774N019149q79732M542772J6715903K0165726
5636B5295098Q953744o653568j3789440j0523319m109798j279297l312303o840226
5628a2259109o363766R28554R882852J0388436k05353j0760052q082505O536846
5620i934097J8695091J8530702J0191894K200981m179737j2087200j9719331k0315600
5612a6617297j0086989P691041K4734373L1175541K0961590p89364j8492395k0278199
5604A8298301j0305388j792084j36933R7948L309857P117892R113136J0179603
$$ plain form
5596 35882332 44768745 46380291 37883887 25788265 18081932 12936424 4226127 -4048322
5588 -4048322 -1207433 10967883 16141890 6297893 -5616099 -5073412 2431504 1294224
5580 1294224 -10084362 -19016172 -18593466 -14063854 -10265597 -6519577 -5297612 -12314201
5572 -12314201 -23903299 -26579355 -15160016 -862620 5031063 5199776 6053617 3902652
5564 3902652 -7072951 -20239939 -23161171 -15811484 -9970750 -11055661 -11594711 -4183007
5556 -4183007 8292190 17748915 19151609 11898097 -640620 -11260984 -13935717 -9606518
5548 -9606518 -2679758 6335097 17900350 25683073 21919197 10532075 3838839 4547972
5540 4547972 3174253 -3047596 -2536593 11409881 26577459 28934657 23990344 26839938
$$ packed form
5596C5882332Q886413J611546q496404j2095622p706333n145508q710297q274449
5588d048322K840889J2175316N174007r843997j1913992N42687P504916j137280
5580A294224j1378586q931810M22706M529612L798257L746020J221965p016589
5572a2314201j1589098k676056J1419339J4297396N893683J68713Q53841k150965
5564C902652j0975603j3166988k921232P349687N840734j084911n39050P411704
5556d183007J2475197R456725J402694p253512j2538717j0620364k674733M329199
5548i606518O926760R014855J1565253P782723l763876j1387122o693236P09133
5540D547972j373719o221849N11003J3946474J5167578K357198m944313K849594
$$ plain form
5532 26839938 37177426 39697958 27200518 8577793 -6860845 -19329499 -29702443
5525 -29702443 -33098053 -27479373 -20128587 -19383801 -25318335 -32388056 -35681115 -31466816
5517 -31466816 -18197899 -1504244 7405443 3402365 -6354694 -11619018 -10340025 -7238338
5509 -7238338 -5771602 -6105016 -7476284 -7977195 -4521954 3263918 11430765 16544548 18887742
5500 18887742 18499664 12762596 1813844 -8263643 -12832217 -15666974 -22906527 -32643102
5492 -32643102 -36341579 -29538305 -16650466 -6101478 -3777053 -9021040 -13750987 -8539653
5484 -8539653 6526626 20173461 22707123 15936431 6137223 -5797907 -18956707 -23858390
5476 -23858390 -12178215 7150155 15006357 6675259 -2899479 -1365532 5988085 9005749
$$ packed form
5532B6839938J0337488K520532j2497440j8622725j5438638j2468654j0372944
5525b9702443l395610N618680P350786P44786n934534p069721l293059M214299
5517c1466816J3268917J6693655Q909687m003078r757059n264324J278993L101687
5509g238338J466736l33414j371268n00911L455241P785872Q166847N113783K343194
5500A8887742l88078n737068j0948752j0077487m568574k834757p239553r736575
5492c2643102l698477O803274J2887839J0548988K324425n243987m729947N211334
5484h539653J5066279J3646835K533662o770692r799208j1935130j3158800m901683
5476b3858390J1680175J9328370P856202q331098r574738J533947P353617L017664
$$ plain form
5468 9005749 8695393 11559661 16718923 19022682 19347216 21617946 23089466 17648571 7736951
5459 7736951 4110905 12846925 29080584 44269322 53831024 56636514 52409995 42284150
5451 42284150 29666663 19547971 17408165 26086465 40777460 50092100 46728856 35256209
5443 35256209 25030634 18153315 10280782 881516 -5186670 -6168427 -5913818 -6761598
5435 -6761598 -6717015 -4993584 -3327644 -2995 9819001 24851016 36394032 40106091
5427 40106091 40889218 40724746 30878640 5767408 -22017522 -32429257 -21271208 -2229130
5419 -2229130 12540956 22016408 26351486 21092577 7047680 -4758894 -5973488 -1452915
5411 -1452915 501385 1416429 6985557 13713179 12561877 3880849 -2535184 -2922993 -4634113
$$ packed form
5468I005749l10356K864268N159262K303759L24534K270730J471520n440895r911620
5459G736951l626046Q736020J6233659J5188738R561702K805490m226519j0125845
5451D2284150j2617487j0118692k139806Q678300J4690995R314640l363244j1472647
5443C5256209j0225575o877319p872533r399266o068186r81757K54609q47780
5435f761598M4583J723431J665940L324649R821996J5032015J1543016L712059
5427D0106091P83127j64472r846106k5111232k7784930j0411735J1158049J9042078
5419b229130J4770086R475452M335078n258909j4044897j1806574j214594M520573
5411a452915J954300R15044N569128O727622j151302q681028o416033l87809j711120
$$ plain form
5402 -4634113 -13130328 -23448080 -28876856 -29482975 -26482928 -16744898 -1303871 7423755
5394 7423755 -1929167 -22680057 -36188656 -34563122 -26965319 -22143325 -16208302 -3214597
5386 -3214597 11880053 19849851 21241973 24438509 32148191 38447931 38737789 34685453
5378 34685453 28342567 18810556 7389741 -214808 -505890 3748540 9390321 17497281
5370 17497281 27215860 30126152 18940483 373263 -9032843 -1803743 12218372 19296031
5362 19296031 17375268 13646705 11743276 8678978 2874290 -2117441 -3349426 -2693011
5354 -2693011 -3265985 -5721771 -9921059 -15989851 -21192125 -20400862 -13933785 -11099323 -20152511
5345 -20152511 -36591531 -47248441 -45256662 -35171417 -23470696 -11008698 2739871
$$ packed form
5402d634113q496215j0317752n428776o06119L000047R738030J5441027Q727626
5394G423755r352922k0750890j3508599J625534P597803M821994N935023J2993705
5386c214597J5094650P969798J392122L196536P709682O299740K89858m052336
5378C4685453o342886r532011j1420815p604549k91082M254430N641781Q106960
5370A7497281R718579K910292j1185669j8567220r406106P229100J4022115P077659
5362A9296031j920763l728563j903429l064298n804688m991731j231985O56415
5354b693011n72974k455786m199288o068792n202274P91263O467077K834462r053188
5345b0152511j6439020j0656910J991779J0085245J1700721J2461998J3748569
$$ plain form
5338 2739871 14326717 20246236 22970262 28267087 37216188 43661332 39568983 22711873
5330 22711873 911126 -11750665 -7033217 8083992 18467056 18559493 17402811 23443078
5322 23443078 31515202 30837229 20089951 6911735 -3094246 -8002807 -3932657 10759314
5314 10759314 25843017 25781573 9877152 -3846831 -593153 13177104 20549899 16934728
5306 16934728 13535946 20589132 34997462 45366549 44245097 33766811 21806714 14145575
5298 14145575 10376084 7525808 5993041 8718160 15050697 20086908 21157040 20395858
5290 20395858 19364993 16291857 11200408 8534087 11040127 15568755 18387252 19607643
5282 19607643 18500649 10690173 -3909067 -15956224 -17008767 -10461999 -3972501 4600923
$$ packed form
5338B739871J1586846N919519K724026N296825Q949101O445144m092349j6857110
5330B2711873k1800747j2661791M717448J5117209J0383064R2437j156682O040267
5322B3443078Q072124o77973j0747278j3178216j0005981m908561M070150J4691971
5314A0759314J5083703o1444j5904421j3723983L253678J3770257P372795l615171
5306A6934728l398782P053186J4408330J0369087j121452j0478286j1960097p661139
5298A4145575l769491k850276j532767K725119O332537N036211J070132p61182
5290B0395858j030865l073136n091449k666321K506040M528628K818497J220391
5282A9607643j106994p810476j4599240j2047157j052543O546768O489498Q573424
$$ plain form
5274 4600923 23019987 48514366 67744161 74234665 74719469 74458906 66730926 44123573
5266 44123573 13480837 -8612024 -12989318 -5287139 2187218 1968071 -4127460 -8909446
5258 -8909446 -7658692 -2037112 4539204 12937346 25461131 38641129 45534093 46036008
5250 46036008 48093141 55941397 63142548 61223491 50800683 40445267 37906975 44923034
5242 44923034 56650418 63723002 59150823 45810825 33233710 25914344 20788575 17327090
5234 17327090 20625459 29523304 31340084 17368015 -3344168 -15882547 -20265500 -29153806
5226 -29153806 -46997012 -62684305 -63909371 -50010758 -28943942 -8781094 5881441
5219 5881441 14671329 20200656 22918294 19096179 8396616 -757409 -1310847 300567
$$ packed form
5274D600923J8419064K5494379J9229795O490504M84804k60563p727980k2607353
5266D4123573l0642736k2092861m377294P702179P474357k19147o095531m781986
5258h909446J250754N621580O576316Q398142J2523785J3179998O892964N01915
5250D6036008K057133P848256P201151j919057j0422808j0355416k538292P016059
5242D4923034J1727384P072584m572179j3339998j2577115p319366n125769l461485
5234A7327090L298369Q897845J816780j3972069k0712183j2538379m382953q888306
5226b9153806j7843206j5687293j225066J3898613K1066816K0162848J4662535
5219E881441Q789888N529327K717638l822115j0699563r154025n53438J611414
$$ plain form
5211 300567 -7602324 -23191903 -32283917 -28816917 -22001206 -20253782 -20200475 -16708992 -12266000
5202 -12266000 -9179934 -2792177 8616298 15782555 10521074 -526815 -4478689 172893
5194 172893 4543141 3930375 517134 -6165641 -19616438 -35907912 -42872475 -33587418
5186 -33587418 -14627825 1615762 7900146 4021424 -6565869 -18758025 -27558491 -30639684
5178 -30639684 -28854753 -24897909 -22656878 -25476571 -32270019 -37718548 -38975309 -38173238
5170 -38173238 -34648382 -21308384 2968703 22746967 20323715 -140360 -15327716
5163 -15327716 -11801829 -145179 4372133 2466802 3093539 5396381 1822034 -5024892
5155 -5024892 -2183053 15373362 35823772 43585068 35624823 21756076 12952449 12413510
$$ packed form
5211C00567p902891j5589579r092014L467000O815711J747424N3307L491483M442992
5202a2266000L086066O387757J1408475P166257n261481j1047889l951874M651582
5194A72893M370248o12766l413241o682775j3450797j6291474o964563R285057
5186c3587418J8959593J6243587O284384l878722j0587293j2192156q800466l081193
5178c0639684J784931L956844K241031k819693o793448n448529j256761Q02071
5170c8173238L524856J3339998K4277087J9778264k423252k0464075j5187356
5163a5327716L525887J1656650M517312j905331O26737K302842l574347o846926
5155e024892K841839J7556415K0450410P761296p960245j3868747q803627n38939
$$ plain form
5147 12413510 15362387 14397380 5617438 -8655817 -22605542 -32132628 -37157869 -39411307
5139 -39411307 -38851313 -32652993 -18526768 128984 13987780 15825630 8627000 2227055
5131 2227055 1610377 2764991 960568 -2600390 -5470107 -9662384 -17428349 -25477766
5123 -25477766 -29408089 -30592767 -31786416 -28453716 -13157964 11237849 31167046 37509564
5115 37509564 34259468 29530184 25218403 20032479 16245810 17032874 21095999 25538096
5107 25538096 30129968 32864715 26187698 6700959 -14005728 -18989472 -7067645 6213735
5099 6213735 11104111 15349024 27113024 37987931 35009928 22116668 14967039 17142425
5091 17142425 16768165 8088236 1145265 4540912 12469472 17678016 24949712 39365400
$$ packed form
5147A2413510K948877r65007q779942j4273255j3949725r527086n025241k253438
5139c9411307N59994O198320J4126225J8655752J3858796J837850p198630o399945
5131B227055o16678J154614j804423l560958k869717m192277p765965q049417
5123b5477766l930323j184678j193649L332700J5295752K4395813J9929197O342518
5115C7509564l250096m729284m311781n185924l786669P87064M063125M442097
5107B5538096M591872K734747o677017j9486739k0706687m983744J1921827J3281380
5099F213735M890376M244913J1764000J0874907k978003j2893260p149629K175386
5091A7142425l74260q679929o942971L395647P928560N208544P271696J4415688
$$ plain form
5083 39365400 50789949 45488748 28066250 16051056 14929218 15025214 13332153 19434259
5075 19434259 33362560 35786444 13873080 -15189269 -22734860 -4938164 14793187
5068 14793187 18090704 11643997 11904210 21575574 28494101 22255262 5511035 -9955041
5060 -9955041 -14738471 -8938115 934476 10209413 18608253 25214368 26392562 21440023
5052 21440023 15172350 10670532 4565900 -4707713 -9027178 842853 21493843 39813900
5044 39813900 47844350 46709039 38156568 22815082 7108924 756316 4056918 6748874
5036 6748874 2841791 -2519297 -4871152 -8989147 -18982437 -28630487 -29980909 -24653420
5028 -24653420 -17756788 -7020429 11082693 28680413 32514897 22107989 10349940
$$ packed form
5083C9365400J1424549n301201j7422498j2015194j121838R5996j693061O102106
5075A9434259J3928301K423884k1913364k9062349p545591J7796696J9731351
5068A4793187L297517o446707K60213R671364O918527o238839j6744227j5466076
5060i955041m783430N800356R872591R274937Q398840O606115J178194m952539
5052B1440023o267673m501818o104632r273613m319465R870031K0650990J8320057
5044C9813900Q030450j135311q552471j5341486j5706158o352608L300602K691956
5036F748874l907083n361088k351855m117995r993290r648050j350422N327489
5028b4653420O896632J0736359J8103122J7597720L834484j0406908j1758049
$$ plain form
5021 10349940 4249973 -3887145 -21667292 -42502785 -53357028 -50385239 -39478076 -25432768
5013 -25432768 -8772442 8041545 19237804 22450822 21502553 20413212 19104368 17454843
5005 17454843 18859177 25128807 30907181 28931139 19997210 12171587 9893873 9618893
4997 9618893 7558589 5374273 4933326 3606370 158575 322609 9550522 23180301
4989 23180301 30749498 28205101 19369856 7750217 -4990976 -13821501 -13134003 -5828992
4981 -5828992 -1076845 -1555877 -1470243 1366674 1977667 360901 5835397 22058912 37388466
4972 37388466 39739936 34010413 34352311 43729807 51310530 47422556 31844523 9437795
4964 9437795 -12896513 -25562338 -21962805 -6836550 7208010 12540067 11336509 8599790
$$ packed form
5021A0349940o099967q137118j7780147k0835493j0854243K971789J0907163J4045308
5013b5432768J6660326J6813987J1196259L213018r48269j089341j308844j649525
5005A7454843J404334O269630N778374j976042q933929p825623k277714k74980
4997I618893k060304k184316m40947j326956l447795J64034R227913J3629779
4989B3180301P569197k544397q835245j1619639j2741193q830525O87498P305011
4981e828992M752147m79032Q5634K836917O10993j616766N474496J6223515J5329554
4972C7388466K351470n729523L41898R377496P580723l887974j5578033k2406728
4964I437795k2334308j2665825L599533J5126255J4044560N332057j203558k736719
$$ plain form
4956 8599790 6208212 3659613 -517492 -7776505 -15851892 -18357817 -13363505 -9034980
4948 -9034980 -13318846 -20817610 -19162457 -7212729 3174924 3971239 -723555 -5000891
4940 -5000891 -8917582 -11579286 -6481292 9018073 26162590 33651558 29763304 20720645
4932 20720645 11909169 5992141 4760467 6265284 3469208 -7642981 -20498718 -24393266
4924 -24393266 -17496381 -8237909 -4355063 -5567744 -7337006 -7161750 -5564606 -4199242
4916 -4199242 -5156877 -10326939 -19394524 -28980690 -35006032 -35716112 -31631365 -23329544 -11476971
4907 -11476971 550032 7362002 8001329 9609444 20072816 37424846 51067505 53360533
4899 53360533 45239887 31429357 17326595 10507702 15840767 26958298 32363681 32360586
$$ packed form
4956H599790k391578k548599m177105p259013q075387k505925M994312M328525
4948i034980m283866p498764J655153J1949728J0387653P96315m694794m277336
4940e000891l916691k661704N097994J5499365J7144517P488968l888254r042659
4932B0720645q811476n917028j231674J504817k796076j1112189j2855737l894548
4924b4393266O896885R258472L882846j212681j769262J75256J597144J365364
4916d199242r57635n170062r067585r586166o025342p10080M084747Q301821J1852573
4907a1476971J2027003O811970O39327J608115J0463372J7352030J3642659K293028
4899E3360533q120646j3810530j4102762o818893N333065J1117531N405383l095
$$ plain form
4891 32360586 37745017 48174620 48175655 33131328 21480609 27298569 38076098 37794818
4883 37794818 34747084 43011969 52702235 48270521 42541067 56914408 78739213 81222985
4875 81222985 77455713 97474013 106276458 15641379 -184952833 -368304156 -399508885
4868 -399508885 -292077728 -175908572 -134410487 -138991996 -134692801 -116791188 -103726655
4861 -103726655 -92428845 -74540718 -61777296 -64958227 -71329477 -66211348 -57049839 -55506501
4853 -55506501 -54424228 -43103128 -29757543 -28841542 -38245540 -46513279 -51527885 -55898598
4845 -55898598 -54699250 -44430881 -35364394 -39052268 -50330647 -55724019 -53285307 -50713347
4837 -50713347 -49293345 -42642907 -28412660 -11876189 -946646 -2610003 -17148817 -31684754
$$ packed form
4891C2360586N384431J0429603J035j5044327j1650719N817960J0777529k81280
4883C7794818l047734Q264885R690266m431714n729454J4373341K1824805K483772
4875H1222985l767272K0018300Q802445r0635079k00594212j83351323l1204729
4868c99508885J07431157J16169156M1498085m581509M299195J7901613J3064533
4861a03726655J1297810J7888127J2763422l180931o371250N118129R161509J543338
4853e5506501J082273J1321100J3345585R16001r403998q267739n014606m370713
4845e5898598J199348J0268369R066487l687874j1278379n393372K438712K571960
4837e0713347J420002O650438J4230247J6536471J0929543j663357j4538814j4535937
$$ plain form
4829 -31684754 -30552397 -17411825 -12567788 -21045271 -22189876 -3933107 13373828 8218836
4821 8218836 -4965652 2405035 25774785 33125139 13964507 -8462982 -16201125 -17842719
4813 -17842719 -22347333 -18806386 2643322 29575746 43198607 41988642 35744445 28010022
4805 28010022 18288873 12168594 14968761 21122760 21854125 18764919 19083732 21569244
4797 21569244 18119632 7475199 -2474671 -5960972 -5280707 -5062565 -6464226 -7514390
4789 -7514390 -4818377 4842024 20409599 33942523 35713515 22905753 1831008 -18013660
4781 -18013660 -30849172 -36839277 -39387950 -40396102 -38424100 -32439259 -25630092 -21888237
4773 -21888237 -19259988 -12147572 -1218032 4640604 155384 -6577502 -1775827 17000150
$$ packed form
4829c1684754J132357J3140572M844037q477483j144605J8256769J7306935n154992
4821H218836j3184488P370687K3369750P350354j9160632k2427489p738143j641594
4813a7842719m504614L540947K1449708K6932424J3622861j209965o244197p734423
4805B8010022r721149o120279K800167O153999P31365l089206L18813K485512
4797B1569244l449612j0644433r949870l486301O80265K18142j401661j050164
4789g514390K696013R660401J5567575J3532924J770992j2807762k1074745j9844668
4781a8013660j2835512n990105k548673j008152J972002N984841O809167L741855
4773b1888237K628249P112416J0929540N858636m485220o732886M801675J8775977
$$ plain form
4765 17000150 35513408 36291641 16726363 -7020181 -15068173 -3415439 12593436 15307952
4757 15307952 2911433 -12120283 -19882546 -22634403 -27203407 -33268224 -32514298 -17763155
4749 -17763155 8678570 35139384 49304452 48009550 37714839 25222453 11865479
4742 11865479 -808087 -5556766 3191610 19426078 30928103 33533714 32437934 30330679
4734 30330679 23895200 13841635 8723358 13849648 23232711 27370494 23580786 14670881
4726 14670881 3405548 -6686177 -10563891 -8006653 -6924659 -14203120 -25532577 -29628163
4718 -29628163 -20943294 -3968803 12875334 22785955 21816143 10537792 -4442881 -14389241
4710 -14389241 -15661849 -11890630 -8855822 -8544338 -8542068 -6585555 -4933068 -8632177 -18129142
$$ packed form
4765A7000150J8513258P78233j9565278k3746544q047992J1652734J6008875K714516
4757A5307952j2396519j5031716p762263k751857m569004o064817P53926J4751143
4749a7763155K6441725K6460814J4165068j294902j0294711j2492386j3356974
4742A1865479j2673566m748679Q748376J6234468J1502025K605611j095780k107255
4734C0330679o435479j0053565n118277N126290R383063M137783l789708q909905
4726A4670881j1265333j0091725l877714K557238J081994p278461j1329457m095586
4718b9628163Q684869J6974491J6844137R910621r69812j1278351j4980673r946360
4710a4389241j272608L771219L034808L11484K270J956513J652487l699109r496965
$$ plain form
4701 -18129142 -25492059 -21412925 -5711539 12245352 23360120 25706179 22064989 15079115
4693 15079115 6174307 -3711128 -13302972 -19476279 -18645767 -13063617 -12359496 -22369606
4685 -22369606 -34782218 -36016656 -24968611 -12116886 -1490513 13517308 32719416
4678 32719416 41188997 27871167 2431939 -16897628 -25324823 -30527443 -34895908 -31117727
4670 -31117727 -14944463 7478604 26723033 38463798 44305211 49008299 56408452 63885259
4662 63885259 62248592 45530553 19539012 -3375742 -16511459 -22349486 -26481926 -31964657
4654 -31964657 -37339916 -36847361 -25506853 -6802676 8949635 16503542 19491123 19025084
4646 19025084 8643966 -11086266 -23156993 -13241778 7491259 14132266 763840
$$ packed form
4701a8129142p362917M079134J5701386J7956891J1114768K346059l641190o985874
4693A5079115q904808r885435r591844o173307Q30512N582150P04121j0010110
4685b2369606j2412612j234438J1048045J2851725J0626373J5007821J9202108
4678C2719416Q469581j3317830k5439228j9329567q427195n202620m368465L778181
4670c1117727J6173264K2423067J9244429J1740765N841413M703088P400153P476807
4662F3885259j636667j6718039k5991541k2914754j3135717n838027m132440n482731
4654c1964657n375259M92555J1340508J8704177J5752311P553907K987581m66039
4646A9025084j0381118j9730232j2070727R915215K0733037O641007j3368426
$$ plain form
4639 763840 -13700218 -13222208 -3390892 1180179 -4997436 -18031148 -30937388 -34021711
4631 -34021711 -19579471 6227213 24668341 24855463 15324948 8811372 4530366 -5189186
4623 -5189186 -18604127 -26826214 -28024547 -27629986 -26459628 -20097640 -10072590 -4604813
4615 -4604813 -6017993 -7143820 -3642429 -682617 -2183215 -1929313 6640587 17652719
4607 17652719 19181375 9805570 -236008 -3808635 -3943909 -5055954 -6059269 -5608565
4599 -5608565 -5940669 -6471197 -1451197 8972228 12800762 1197756 -15877787 -20857165
4591 -20857165 -12577713 -6356433 -10769488 -18354884 -21750326 -24653601 -30815247 -35027461
4583 -35027461 -33023568 -29164063 -25796658 -16171493 1756533 15119266 12148231 -595520
$$ packed form
4639G63840j4464058M78010R831316M571071o177615j3033712j2906240l084323
4631c4021711J4442240K5806684J8441128J87122r530515o513576m281006r719552
4623e189186j3414941q222087j198333L94561J170358O361988J0025050N467777
4615d604813j413180j125827L501391K959812j500598K53902Q569900J1012132
4607A7652719J528656r375805j0041578l572627j35274j112045j003315M50704
4599e608565l32104n30528N020000J0423425L828534j1603006j7075543m979378
4591b0857165Q279452O221280m413055p585396l395442k903275o161646m212214
4583c5027461K003893L859505L367405R625165J7928026J3362733k971035j2743751
$$ plain form
4575 -595520 -10186636 -17627928 -30242483 -40933949 -34207724 -10886155 11026584 20351635
4567 20351635 21052939 16313475 2856632 -14839269 -22541393 -16091503 -8547718 -9466127
4559 -9466127 -10620670 -1828211 10973361 14586914 6883931 -3985761 -12030908 -15907430
4551 -15907430 -14470003 -8143377 -876483 5016239 11404420 17546427 17265659 8147212
4543 8147212 -2547197 -6221510 -1945362 5634914 10194568 3890884 -15649726 -34999281
4535 -34999281 -34307533 -13237337 5395191 5491800 -3041063 -4817424 -2774741 -6192180
4527 -6192180 -9209778 -1203344 11308565 14456065 11818231 16658998 23391156 12285227
4519 12285227 -15167771 -30651845 -17492266 5998514 13634238 5344915 74426 6766216
$$ packed form
4575e95520r591116p441292j2614555j0691466O726225K3321569K1912739R325051
4567B0351635P01304m739464j3456843j7695901p702124O449890P543785r18409
4559i466127j154543Q792459J2801572L613553p702983j0869692q045147l876522
4551a5907430J437427O326626P266894N892722O388181O142007k80768r118447
4543H147212j0694409l674313M276148P580276M559654o303684j9540610j9349555
4535c4999281O91748K1070196J8632528R6609q532863j776361K042683l417439
4527f192180l017598Q006434J2511909L147500k637834M840767O732158j1105929
4519A2285227k7452998j5484074J3159579K3490780P635724q289323n270489O691790
$$ plain form
4511 6766216 17545686 23198868 21807092 14318324 2226738 -9652007 -14457694 -8845973
4503 -8845973 4120935 16404620 20023298 15064968 12037211 19706570 30972425 30127909
4495 30127909 16043876 7128289 17394108 37263151 46599928 39604413 27232097 19863765
4487 19863765 17926577 17930267 18294811 17990477 16008712 13963903 15085901 19765735 25116562
4478 25116562 28642247 29114746 24540563 13504227 -616652 -10174424 -9950358 -2060183
4470 -2060183 6767306 11886655 14098069 17146525 22918429 29303011 32152650 28914178
4462 28914178 21347210 15864166 19371053 31296453 40882026 37992498 26984208 22253420
4454 22253420 27302794 27830971 12857330 -6363450 -10231282 2379145 15100359 18797051
$$ packed form
4511F766216J0779470N653182j391776p488768j2091586j1878745m805687N611721
4503h845973J2966908J2283685L618678m958330l027757P669359J1265855q44516
4495C0127909j4084033q915587J0265819J9869043R336777o995515j2372316p368332
4487A9863765j937188L690L64544l04334j981765k044809J121998M679834N350827
4478B5116562L525685M72499m574183j1036336j4120879r557772K24066P890175
4470b060183Q827489N119349K211414L048456N771904O384582K849639l238472
4462B8914178p566968n483044L506887J1925400R585573k889528j1008290m730788
4454B2253420N049374N28177j4973641j9220780l867832J2610427J2721214L696692
$$ plain form
4446 18797051 19557667 21325939 17236947 4151161 -8125327 -10556842 -7375134 -7046741
4438 -7046741 -10219270 -14337310 -20652614 -27825451 -27675432 -17311412 -7255343 -6844044
4430 -6844044 -9764398 -6469934 -2869339 -10526489 -23122542 -21487598 -3106870 11010608
4422 11010608 4805810 -11426202 -16380026 -4723891 9825305 12329789 459669 -15618159
4414 -15618159 -22354361 -15348721 -5838482 -10165605 -30053279 -48923004 -51256133 -39441175
4406 -39441175 -26576646 -19009955 -13881377 -10277319 -13312118 -25518981 -40016400 -45289393
4398 -45289393 -35184147 -13788251 7927854 20359448 21724193 16896149 10697890 4526073
4390 4526073 -768172 -3200570 -3169799 -4392096 -7186118 -4253747 10763603 31465050
$$ packed form
4446A8797051P60616J768272m088992j3085786j2276488k431515L181708L28393
4438g046741l172529m118040o315304p172837J50019J0364020J0056069M11299
4430f844044k920354L294464L600595p657150j2596053J634944J8380728J4117478
4422A1010608o204798j6232012m953824J1656135J4549196K504484j1870120j6077828
4414a5618159o736202P005640R510239m327123j9887674j8869725k333129J1814958
4406c9441175J2864529P566691N128578L604058l034799j2206863j4497419n272993
4398d5289393J0105246K1395896K1716105J2431594J364745m828044o198259o171817
4390D526073n294245k432398L0771j222297k794022K932371J5017350K0701447
$$ plain form
4382 31465050 41766820 32693633 11885598 -5782978 -13468863 -15322642 -17149854 -18953914
4374 -18953914 -17348801 -11999619 -6996271 -6131904 -8531845 -9872109 -7294738 -1877789
4366 -1877789 3893441 9654214 16900370 25740322 33238239 35330067 30169835 20143489
4358 20143489 11013215 7811547 10199731 13046496 13463575 15450088 23537576 32674113
4350 32674113 31103284 16514160 3167990 5967110 20617673 28240641 19528463 4927915
4342 4927915 -2378375 -4172387 -10157813 -19792505 -22291013 -13795535 -4147153 -3377029
4334 -3377029 -9178999 -12823804 -12085744 -11852257 -14363739 -15663435 -12918706 -10322072 -13985301
4325 -13985301 -22527098 -26905972 -21458049 -12315226 -10465961 -16634303 -18702163 -7328065
$$ packed form
4382C1465050J0301770r073187k0808035j7668576p685885j853779j827212j804060
4374a8953914J605113N349182N003348Q64367k399941j340264K577371N416949
4366a877789N771230N760773P246156Q839952P497917K091828n160232j0026346
4358B0143489r130274l201668K388184K846765M17079J986513Q087488R136537
4350C2674113j570829j4589124j3346170K799120J4650563P622968q712178j4600548
4342D927915p306290j794012n985426r634692k498508Q495478R648382P70124
4334c377029n801970l644805P38060K33487k511482j299696K744729K596634l663229
4325a3985301q541797m378874N447923R142823J849265o168342k067860J1374098
$$ plain form
4317 -7328065 10918183 22005058 22820579 23089173 29259162 35342876 33258648 25115696
4309 25115696 19378142 19080062 19872120 17582105 12154757 4761823 -4045352 -12264518
4301 -12264518 -15634455 -10593209 2326332 17663685 27411324 26336531 16796298 7095462
4293 7095462 3476176 4625182 4989516 1892018 -1870366 -965258 7782314 21452183
4285 21452183 30848714 27383872 12485537 -2144215 -5976051 636987 10046073 17475566
4277 17475566 23900128 30538655 34840847 32798080 23539616 11521723 4499767 7513686
4269 7513686 17464428 25270195 24797852 18160421 11578046 8769014 9522359 11088918 8564458
4260 8564458 -2611654 -21121314 -38980855 -48872433 -49829278 -43995727 -32472112 -18206191
$$ packed form
4317g328065J8246248J1086875Q15521K68594O169989O083714k084228q142952
4309B5115696n737554k98080P92058k290015n427348p392934q807175q219166
4301a2264518l369937N041246J2919541J5337353R747639j074793r540233r700836
4293G095462l619286J149006L64334l097498l762384R05108Q747572J3669869
4285B1452183R396531l464842j4898335j4629752l831836O613038R409086P429493
4277A7475566O424562O638527M302192k042767r258464j2017893p021956L013919
4269G513686R950742P805767m72343o637431o582375k809032P53345J566559k524460
4260H564458j1176112j8509660j7859541r891578r56845N833551J1523615J4265921
$$ plain form
4252 -18206191 -8244643 -7031091 -10144278 -10475319 -8443288 -10133792 -17138002 -24743022
4244 -24743022 -29175822 -29950401 -25548771 -14266076 -371589 8030759 9933333 13544396
4236 13544396 23693377 33055833 31294271 18756712 4846821 -5138329 -14923125 -28413972
4228 -28413972 -41693531 -47273926 -43548110 -36044565 -29736810 -23876934 -15973098 -7769674
4220 -7769674 -3873460 -5731801 -10552293 -15670740 -20037454 -21424385 -17250569 -9960715
4212 -9960715 -6664629 -9972660 -12809529 -6370242 8929230 23872466 30282028 27894464
4204 27894464 23124904 23248234 30188358 38303984 39848063 33408138 25076971 21980677
4196 21980677 27985348 43608778 63344562 74228353 66780921 49017910 39363036 42731365
$$ packed form
4252a8206191R961548J213552l113187l31041K032031j690504p004210p605020
4244b4743022m432800p74579M401630J1282695J3894487Q402348J902574L611063
4236A3544396J0148981R362456j761562j2537559j3909891r985150r784796j3490847
4228b8413972j3279559n580395L725816P503545O307755N859876P903836Q203424
4220g769674L896214j858341m820492n118447m366714j386931M173816P289854
4212i960715L296086l308031k836869O439287J5299472J4943236O409562k387564
4204B7894464m769560J23330O940124Q115626J544079o439925q331167l096294
4196B1980677O004671J5623430J9735784J0883791p447432j7763011r654874L368329
$$ plain form
4188 42731365 45185953 36812825 26046476 22813744 21658999 14579171 8140427 11089673
4180 11089673 14139866 1289699 -23172206 -37400754 -30429942 -11972070 4706873
4173 4706873 13862401 12478822 1237180 -8715830 -5115060 8382028 18197963 21878792
4165 21878792 26501990 28442336 15956788 -6174677 -16625690 -8051370 2286801 -633631
4157 -633631 -10988613 -17485503 -18244907 -12130399 5716126 29962313 44012323 41487866
4149 41487866 32191306 21760898 6506581 -7298445 -6270227 1491608 -6205700 -20924760
4141 -20924760 -11216886 3888961 -55699185 -218842864 -382779131 -412743469 -303558044
4134 -303558044 -175796071 -119014951 -109563377 -91117476 -61687701 -46332224 -40602215
$$ packed form
4188D2731365K454588q373128j0766349l232732j154745p079828o438744K949246
4180A1089673L050193j2850167k4461905j4228548O970812J8457872J6678943
4173D706873R155528j383579j1241642r953010L600770J3497088R815935L680829
4165B1878792M623198J940346j2485548k2131465j0451013Q574320J0338171k920432
4157f33631j0354982o496890p59404O114508J7846525K4246187J4050010k524457
4149D1487866r296560j0430408j5254317j3805026J028218P761835p697308j4719060
4141b0924760R707874J5105847n9588146j63143679j63936267k9964338J09185425
4134c03558044J27761973N6781120R451574J8445901K9429775J5355477N730009
$$ plain form
4127 -40602215 -27527289 -16117213 -21217497 -29051760 -19357666 -2873665 -3214239 -16784840
4119 -16784840 -22269591 -17336618 -15524174 -16781696 -10894045 -2995584 -7018296 -18372482
4111 -18372482 -20192381 -13342852 -13224421 -18359923 -10356343 11864107 24727150 14590525
4103 14590525 -3328587 -10584370 -10313630 -14047926 -19104069 -13243797 6608425 31034894
4095 31034894 48370954 52017697 43141472 30952678 25386577 26729363 27374233 23649391
4087 23649391 18063843 10202172 -3601605 -18998078 -23371563 -12476627 1483654 4301789
4079 4301789 -4838509 -17402661 -27458585 -33470787 -34519725 -31685294 -29173719 -28446416
4071 -28446416 -24796592 -14797997 -3667576 361274 -2911208 -5217455 -325646 7964535
$$ packed form
4127d0602215J3074926J1410076n100284p834263R694094J6484001l40574j3570601
4119a6784840n484751M932973J812444j257522N887651P898461m022712j1354186
4111a8372482j819899O849529J18431n135502Q003580K2220450J2863043j0136625
4103A4590525j7919112p255783K70740l734296n056143N860272J9852222K4426469
4095C1034894J7336060L646743q876225j2188794n566101J342786O44870l724842
4087B3649391n585548p861671j3803777j5396473m373485J0894936J3960281K818135
4079D301789r140298j2564152j0055924o012202j048938K834431K511575P27303
4071b8446416L649824R998595J1130421M028850l272482k306247M891809Q290181
$$ plain form
4063 7964535 8916060 -4212594 -25611110 -40737720 -41329029 -34742914 -34125297 -41486781
4055 -41486781 -47226980 -45417402 -40611369 -37424981 -32498794 -22401666 -12939202 -13497780
4047 -13497780 -25026212 -38915213 -46031357 -43294699 -33546945 -22549799 -15016490 -11578870
4039 -11578870 -10723928 -13231314 -20529841 -28242130 -27510086 -15975121 -2630086 1804739
4031 1804739 -4819425 -18178366 -33936873 -46994522 -49732195 -38755485 -21347758 -8576437
4023 -8576437 -2951218 1328411 7115212 10384863 8524180 5841947 7217310 10543685
4015 10543685 10096537 5817191 4766991 12111346 23300754 27905755 20784944 6721693
4007 6721693 -6694679 -17342726 -27006859 -34708739 -36524224 -30936767 -19711403 -4628320
$$ packed form
4063G964535R51525j3128654k1398516j5126610n91309O586115O17617p361484
4055d1486781n740199J809578M806033L186388M926187J0097128R462464n58578
4047a3497780j1528432j3889001p116144K736658R747754J0997146P533309L437620
4039a1578870Q54942k507386p298527p712289P32044J1534965J3345035M434825
4031A804739o624164j3358941j5758507j3057649k737673J0976710J7407727J2771321
4023h576437N625219M279629N786801L269651j860683k682233J375363L326375
4015A0543685m47148m279346j050200P344355J1189408M605001p120811j4063251
4007F721693j3416372j0648047r664133p701880j815485N587457J1225364J5083083
$$ plain form
3999 -4628320 10977665 18676885 11412886 -4628777 -13128797 -6968395 2875462 3180925
3991 3180925 -3796091 -5844646 1253309 9681664 10565755 1750290 -12683383 -23799877
3983 -23799877 -21975814 -7590279 5360413 5038211 -1916449 -833800 6208881 828739
3975 828739 -22818997 -44045911 -40086972 -15281805 4986286 4187736 -11847058 -28226838
3967 -28226838 -36815373 -37537453 -32704009 -24856208 -16890916 -10797562 -6361107 -1317464
3959 -1317464 7518579 21614063 37377738 46751652 43220269 26820393 3089600 -20073374
3951 -20073374 -33634710 -30853259 -14535419 1915774 6455616 823499 -3444148 -451418
3943 -451418 3982136 1896053 -6846211 -16308083 -21774134 -22274913 -18791320 -13273975 -8342543
$$ packed form
3999d628320J5605985P699220p263999j6041663q500020O160402R843857L05463
3991C180925o977016k048555P097955Q428355Q84091q815465j4433673j1116494
3983b3799877J824063J4385535J2950692l22202o954660J082649P042681n380142
3975H28739k3647736k1226914L958939K4805167K0268091p98550j6034794j6379780
3967b8226838q588535p22080M833444P847801P965292O093354M436455N043643
3959a317464Q836043J4095484J5763675R373914l531383j6399876k3730793k3162974
3951b0073374j3561336K781451J6317840J6451193M539842n632117m267647K992730
3943d51418M433554k086083q742264r461872n466051n00779L483593N517345M931432
$$ plain form
3934 -8342543 -5649516 -4566975 -2877838 1960131 11444686 23359798 30654439 26912220
3926 26912220 14890035 6422283 10496247 22753870 29861657 24075049 11078525 2890729
3918 2890729 4620308 9407827 6352004 -7329271 -23118999 -30515783 -27888931 -22174534
3910 -22174534 -19219095 -18267650 -16696831 -15988475 -19346658 -24793913 -24567965 -13290817
3902 -13290817 4032986 14268359 8865111 -5191038 -10475194 1747716 20348951
3895 20348951 27341992 19770409 10880527 9799018 10744654 7057934 5127619 13919222
3887 13919222 27382438 30498278 21305691 14243668 19588458 30862624 37118410 37941402
3879 37941402 39615880 43660912 46439822 45011419 36796850 18551254 -6643232 -25550503
$$ packed form
3934h342543K693027J082541J689137M837969R484555J1915112P294641l742219
3926B6912220j2022185q467752M073964J2257623P107787n786608j2996524q187796
3918B890729J729579M787519l055823j3681275j5789728p396784K626852N714397
3910b2174534K955439R51445J570819P08356l358183n447255K25948J1277148
3902a3290817J7323803J0235373n403248j4056149n284156J2222910J8601235
3895B0348951O993041p571583q889882j081509R45636l686720j930315Q791603
3887A3919222J3463216L115840r192587p062023N344790J1274166O255786Q22992
3879C7941402J674478M045032K778910j428403q214569j8245596k5194486j8907271
$$ plain form
3871 -25550503 -27096359 -16844514 -10593917 -14301919 -19387634 -18431501 -15167640 -14943841
3863 -14943841 -14753165 -10078631 -5083148 -7054633 -13942207 -16276072 -10821050 -4223705
3855 -4223705 -2092937 -2111138 -757534 202570 -1185032 -1105394 4228279 10049382 7526720
3846 7526720 -4186342 -17084399 -25486600 -31010011 -34986366 -33809557 -26408666 -19896383
3838 -19896383 -20921272 -25220092 -23100070 -13454425 -4876890 -2780468 -2472303 2880358
3830 2880358 12810018 20976504 22706380 19068768 15646642 17559915 23045946 23297959
3822 23297959 13534108 2793978 4839033 18274240 25250478 14934428 -416106 -1497150
3814 -1497150 11262127 17275839 1373170 -28690663 -51785656 -54373226 -39945557 -22311190
$$ packed form
3871b5550503j545856J0251845O250597l708002n085715R56133L263861K23799
3863a4943841J90676M674534M995483j971485o887574k333865N455022O597345
3855d223705K130768j8201J353604R60104j387602P9638N333673N821103k522662
3846G526720j1713062j2898057q402201n523411l976355J176809P400891O512283
3838a9896383j024889m298820K120022R645645Q577535K096422L08165N352661
3830B880358R929660Q166486J729876l637612l422126J913273N486031K52013
3822B3297959r763851j0740130K045055J3435207O976238j0316050j5350534j081044
3814a497150J2759277O013712j5902669l0063833k3094993k587570J4427669J7634367
$$ plain form
3806 -22311190 -12805528 -12769454 -16393337 -18763750 -18407289 -13221736 -890700 13299636
3798 13299636 15870096 -627597 -26558093 -44997321 -49253279 -44004917 -33655576 -19720568
3790 -19720568 -7763937 -5349608 -11341951 -16703309 -17902142 -20177269 -24973672 -24507998
3782 -24507998 -14202179 -1836649 2451053 -933961 -4023522 -1393457 8355020 25274102
3774 25274102 45353236 59299284 60343624 50432054 34694333 14788869 -7237595
3767 -7237595 -24118755 -29318565 -24428007 -15756777 -8153915 -6131804 -13012841 -21957649
3759 -21957649 -16998832 6224324 28842185 31454442 21802067 22855219 36960286 42039533
3751 42039533 25813495 4088230 -2519939 6728112 21131928 36590084 52024842
$$ packed form
3806b2311190R505662L6074l623883k370413L56461N185553J2331036J4190336
3798A3299636K570460j6497693k5930496j8439228m255958N248362J0349341J3935008
3790a9720568J1956631K414329n992343n361358j198833k275127m796403M65674
3782b4507998J0305819J2365530M287702l385014l089561K630065R748477J6919082
3774B5274102K0079134J3946048J044340r911570j5737721j9905464k2026464
3767g237595j6881160n199810M890558Q671230P602862K022111o881037q944808
3759b1957649M958817K3223156K2617861K612257r652375J053152J4105067N079247
3751D2039533j6226038k1725265o608169R248051J4403816J5458156J5434758
$$ plain form
3744 52024842 59146470 50791139 33289903 18067522 6369795 -5828155 -13568512 -7904399
3736 -7904399 7319669 17566072 16537766 10679452 4329890 -6237615 -20272224 -26376297
3728 -26376297 -16334001 2520015 15787992 18296020 16642405 19018985 27009968 35680037
3720 35680037 39249529 37650902 36865180 40047687 40729501 30690675 12957203 -744586
3712 -744586 -5053944 -4744340 -3161181 2377438 10991108 15681676 15872658 21206323 34833631
3703 34833631 43585501 35710716 19700728 12304775 13797652 9878072 -4110709 -15442339
3695 -15442339 -12000283 3760209 21237547 32090181 31891780 21052753 7740254 2251253
3687 2251253 5366168 8522778 6515848 2322795 -1281243 -5167018 -6887406 -1157343
$$ packed form
3744E2024842P121628q355331j7501236j5222381j1697727j2197950p740357N664113
3736g904399J5224068J0246403j028306n858314o349562j0567505j4034609o104073
3728b6376297J0042296J8854016J3267977K508028j653615K376580P990983Q670069
3720C5680037L569492j598627p85722L182507O81814j0038826j7733472j3701789
3712g44586m309358L09604J583159N538619Q613670M690568J90982N333665J3627308
3703C4833631Q751870p874785j6009988p395953J492877l919580j3988781j1331630
3695a5442339L442056J5760492J7477338J0852634j98401j0839027j3312499n489001
3687B251253L114915L156610k006930m193053l604038l885775j720388N730063
$$ plain form
3679 -1157343 8285042 7949366 -7416004 -24917572 -29326493 -21567554 -13544555 -10797020
3671 -10797020 -8761356 -1858110 11190069 27303745 38100634 33963740 16169681 411008
3663 411008 777028 14056961 26570664 31422528 30976902 27557818 21893044 17576998
3655 17576998 16939718 14480553 4030413 -9317911 -14351451 -9836519 -5623143 -7803876
3647 -7803876 -12210915 -13125630 -9670335 -3153448 3518194 3822021 -6319763 -20517917
3639 -20517917 -28276312 -28056362 -24696174 -16790771 84458 18495981 23220942 13076765
3631 13076765 3795710 4822594 8280194 6646579 5081757 7084230 3614466 -10886341
3623 -10886341 -24848371 -26302336 -22463943 -27301825 -38402269 -42628045 -38242584 -34130798
$$ packed form
3679a157343R442385l35676j5365370j7501568m408921P758939Q022999K747535
3671a0797020K035664O903246J3048179J6113676J0796889m136894j7794059j5758673
3663D11008L66020J3279933J2513703M851864m45626l419084n664774m316046
3655A7576998o37280k459165j0450140j3348324n033540M514932M213376k180733
3647g803876m407039r14715L455295O516887O671642L03827j0141784j4198154
3639b0517917p758395K19950L360188P905403J6875229J8411523M724961j0144177
3631A3076765r281055J026884L457600j633615j564822K002473l469764j4500807
3623a0886341j3962030j453965L838393m837882j1100444m225776M385461M111786
$$ plain form
3615 -34130798 -30920529 -20609636 -4509286 4962064 2668331 -2983078 -4894367 -5527408
3607 -5527408 -6755361 -3718824 5586845 14177439 15201465 9842762 1800967 -8817880
3599 -8817880 -21379606 -30674101 -31675358 -23981914 -9186847 10100484 25691203 25692400
3591 25692400 7338686 -16106405 -27435779 -22906108 -13197624 -8552462 -8228529 -6080162
3583 -6080162 -2259774 -3760038 -12244596 -17253142 -8406595 7864840 13300541 1288378
3575 1288378 -14489722 -19275674 -14622047 -9134543 -2501138 9614426 22734994 28909278
3567 28909278 29232975 28019312 20800500 3906587 -9454973 -2273883 18661828 28972424
3559 28972424 22103620 16650932 22974214 25640007 10884159 -8728050 -13388376 -4522794
$$ packed form
3615c4130798L210269J0310893J6100350R471350k293733n651409j911289o33041
3607e527408j227953L036537R305669Q590594J024026n358703q041795j0618847
3599h817880j2561726r294495j001257P693444J4795067J9287331J5590719J197
3591B5692400j8353714k3445091j1329374M529671R708484M645162L23933K148367
3583f080162L820388j500264q484558n008546Q846547J6271435N435701j2012163
3575A288378j5778100m785952M653627N487504O633405J2115564J3120568O174284
3567B8909278L23697j213663p218812j6893913j3361560P181090K0935711J0310596
3559B8972424o868804n452688O323282K665793j4755848j9612209m660326Q865582
$$ plain form
3551 -4522794 3134318 6148200 11073191 17053311 17985375 17300353 23812758 35111879
3543 35111879 39839589 35273883 29418318 26624928 24075281 22487010 27502816 38106563
3535 38106563 43924686 36967921 19009778 -3114105 -22344619 -32236475 -31147191 -25875762
3527 -25875762 -24393082 -25991679 -25302958 -23058256 -23718575 -24684820 -18403575 -4595657
3519 -4595657 9734737 21840321 33908383 42581760 40504571 30491028 25593939 30678166
3511 30678166 35170939 29395709 17609486 8768258 4456898 3256009 7491104 16349263
3503 16349263 19837499 9952452 -6873980 -17832299 -20243467 -20458859 -19400908 -10498974
3495 -10498974 7000538 22353353 24945447 15728150 3533367 -5345680 -9793449 -9540180
$$ packed form
3551d522794P657112L013882M924991N980120R32064o85022O512405J1299121
3543C5111879M727710m565706n855565k793390k549647j588271N015806J0603747
3535C8106563N818123o956765j7958143k2123883j9230514r891856J089284N271429
3527b5875762J482680j598597O88721K244702o60319r66245O281245J3807918
3519d595657J4330394J2105584J2068062Q673377k077189j0013543m897089N084227
3511C0678166M492773n775230j1786223q841228m311360j200889M235095Q858159
3503A6349263L488236r885047j6826432j0958319k411168k15392J057951Q901934
3495a0498974J7499512J5352815K592094r217297j2194783q879047m447769K53269
$$ plain form
3487 -9540180 -3943669 4610219 10697122 12143759 13881614 21484849 31601748 33885211
3479 33885211 23891375 8960033 -1694262 -7323217 -11242352 -11745669 -5483474 3372738
3471 3372738 6684580 4356294 3943464 7866265 9745700 4918089 -3783990 -12697736
3463 -12697736 -21525787 -28693797 -31140151 -31517869 -36709780 -45896940 -49542203 -44014470
3455 -44014470 -36634248 -31427710 -22558160 -9781024 -6529702 -19580111 -32405573 -25753078
3447 -25753078 -6841197 985729 -6626485 -11130884 -2671575 5815849 2319374 -5623508
3439 -5623508 -7015564 -7068110 -17004785 -34122074 -45611115 -46034987 -39200131 -28165442
3431 -28165442 -15460145 -8701796 -12660137 -17838320 -10619602 4958459 9451658 -4813928
$$ packed form
3487i540180N596511Q553888O086903J446637J737855P603235J0116899K283463
3479C3885211r993836j4931342j0654295n628955l919135n03317O262195Q856212
3471C372738L311842k328286m12830L922801J879435m827611q702079q913746
3463a2697736q828051p168010k446354l77718n191911r187160l645263N527733
3455d4014470P380222N206538Q869550J2777136L251322j3050409j2825462O652495
3447b5753078J8911881P826926p612214m504399Q459309Q487424l496475p942882
3439e623508j392056n2546r936675j7117289j1489041m23872O834856J1034689
3431b8165442J2705297O758349l958341n178183P218718J5578061M493199j4265586
$$ plain form
3423 -4813928 -22139312 -25199229 -16282925 -7560359 -441875 11988779 26997500 31057864
3415 31057864 17789369 -3658510 -20854206 -30418539 -35251450 -37207744 -37112385 -36635501
3407 -36635501 -35792527 -32346613 -26444472 -21409434 -17410312 -9754280 3084821 15190526
3399 15190526 20730867 19862542 13252636 -972525 -17546693 -19954016 1934689 34641086
3391 34641086 54126623 53861244 47105136 42645210 34041686 16589148 -218283 -5671567
3383 -5671567 -2598315 -340064 -1255077 -2585683 -4331057 -6243462 -2995923 8403032
3375 8403032 20775339 24813869 20983610 15415305 8673113 -1417742 -8944832 -3603007
3367 -3603007 13711818 28307598 27865585 15683499 5708537 8006275 19845153 28704516
$$ packed form
3423d813928j7325384l059917Q916304Q722566P118484J2430654J5008721M060364
3415C1057864j3268495k1447879j7195696r564333m832911j956294R5359M76884
3407c6635501Q42974L445914N902141N035038L999122P656032J2839101J2105705
3399A5190526N540341q68325o609906j4225161j6574168k407323K1888705L2706397
3391C4641086J9485537k65379o756108m459926q603524j7452538j6807431n453284
3383e671567L073252K258251r15013j330606j745374j912405L247539J1398955
3375H403032J2372307M038530l830259n568305o742192j0090855p527090N341825
3367c603007J7314825J4595780m42013j2182086r974962K297738J1838878Q859363
$$ plain form
3359 28704516 24970037 13055044 6240765 8661660 9664386 1164058 -8346295 -6909619
3351 -6909619 1416211 3604169 -658547 -45839 7073180 9321567 2913059 -1035187
3343 -1035187 3965282 7996265 1631089 -8355197 -11622174 -12155047 -20096692 -32691271
3335 -32691271 -37608210 -32157369 -25767882 -23303674 -17852815 -3073725 16201143 29667348
3327 29667348 31952758 24299049 10992670 -2314602 -10306404 -12005533 -12162421 -16445374
3319 -16445374 -25310453 -33266657 -33902943 -25571868 -12564631 -899364 6720391 11662584
3311 11662584 16678272 24060881 34476537 44084223 44151099 28822222 4113649 -15610182
3303 -15610182 -21736304 -18012568 -12428328 -8137916 -4506990 -1013578 4073703 14276218
$$ packed form
3359B8704516l734479j1914993o814279K420895J002726q500328r510353J436676
3351f909619Q325830K187958m262716O12708P119019K248387o408508l948246
3343a035187N000469M030983o365176r986286l266977n32873p941645j2594579
3335c2691271m916939N450841O389487K464208N450859J4779090J9274868J3466205
3327B9667348K285410p653709j3306379j3307272p991802j699129j56888m282953
3319a6445374q865079p956204o36286Q331075J3007237J1665267P619755M942193
3311A1662584N015688P382609J0415656R607686O6876j5328877k4708573j9723831
3303a5610182o126122L723736N584240M290412L630926L493412N087281J0202515
$$ plain form
3295 14276218 29578336 43489984 48781868 43634232 30947520 16526696 9384931 16376288
3287 16376288 32293617 42187567 38607368 29837874 26115950 26563034 27256435 32084322
3279 32084322 43361929 49646846 38536319 17797602 7654483 12916501 18922318 16509330
3271 16509330 13928263 18673692 23656018 20751725 15167080 15200929 17559887 14739608
3263 14739608 10010228 12930569 23682552 32431211 32505744 26053362 18551901 14815452
3255 14815452 17917035 24942397 26386885 16978914 4416239 -255785 2031788 1796547
3247 1796547 -2273548 -969935 9747206 20684297 20902493 10194088 -3347316 -12210027
3239 -12210027 -12945533 -6764787 -363020 -1367981 -9692054 -17543426 -20028130 -20101572 -20245381
$$ packed form
3295A4276218J5302118J3911648N291884n147636j2686712j4420824p141765O991357
3287A6376288J5917329R893950l580199q769494l721924M47084O93401M827887
3279C2084322J1277607O284917j1110527k0738717j0143119N262018O005817k412988
3271A6509330k581067M745429M982326k904293n584645L3849K358958k820279
3263A4739608m729380K920341J0751983Q748659P4533o452382p501461l736449
3255A4815452L101583P025362J444488r407971j2562675m672024K287573k35241
3247A796547m070095J303613J0717141J0937091K18196j0708405j3541404q862711
3239a2210027p35506O180746O401767j004961q324073p851372k484704p3442j43809
$$ plain form
3230 -20245381 -16206078 -4546391 9181786 16749063 17997628 18227070 17749076 12199251
3222 12199251 2386725 -4648320 -6160482 -8122157 -15929393 -26433833 -33210686 -34936601
3214 -34936601 -33380092 -26562705 -10717552 11018351 27757970 31454122 25499036 20103725
3206 20103725 20333316 21190705 14913759 1469067 -10128620 -11639194 -5314653 -1423837
3198 -1423837 -6166520 -15517311 -22881233 -28612017 -36609041 -43871417 -41697641 -29357145
3190 -29357145 -18616265 -18562753 -21401407 -11866710 11329379 32559461 38638169 32264190
3182 32264190 22618307 11097267 -5874428 -24644111 -34518724 -30786072 -20962185 -15781956
3174 -15781956 -17925443 -21680362 -20868135 -14929390 -8718395 -7937138 -14127418 -23189896
$$ packed form
3230b0245381M039303J1659687J3728177P567277J248565K29442m77994n549825
3222A2199251r812526p035045j512162j961675p807236j0504440o776853j725915
3214c4936601J556509O817387J5845153K1735903J6739619L696152n955086n395311
3206B0103725K29591Q57389o276946j3444692j1597687j510574O324541L890816
3198a423837m742683r350791p363922n730784p997024p262376K173776J2340496
3190b9357145J0740880N3512k838654R534697K3196089K1230082O078708o373979
3182C2264190r645883j1521040j6971695j8769683r874613L732652R823887N180229
3174a5781956k143487l754919Q12227N938745O210995P81257o190280r062478
$$ plain form
3166 -23189896 -28707130 -26611314 -17224871 -4822730 4129939 5116723 241218 -3198269
3158 -3198269 -897198 4064776 7120239 8512810 9501105 6486329 -4123216 -17533487
3150 -17533487 -25043717 -26081591 -27025998 -27493799 -17988208 4874133 29748139 42916888
3142 42916888 42155085 32747894 17585914 -719805 -14229049 -16077869 -9517860 -2727132
3134 -2727132 1827844 4961145 2741814 -7890656 -18381613 -16430147 -4977816 -579557
3126 -579557 -10022822 -20700671 -19274455 -8898069 -875971 1650226 3423324 7238770
3118 7238770 12544573 19272147 26508864 31543439 35089992 41504192 48630835 45612567
3110 45612567 29070676 13659129 15273576 29221391 37399921 33369397 26637589 23590914
$$ packed form
3166b3189896n517234K095816R386443J2402141Q952669R86784m875505l439487
3158c198269K301071M961974L055463J392571R88295l014776j0609545j3410271
3150a7533487p510230j037874r44407m67801R505591K2862341K4874006J3168749
3142D2916888p61803r407191j5161980j8305719j3509244j848820O560009O790728
3134b727132M554976L133301k219331j0632470j0490957J951466J1452331M398259
3126e79557r443265j0677849J426216J0376386Q022098K526197J773098L815446
3118G238770N305803O727574P236717N034575L546553O414200P126643l018268
3110D5612567j6541891j5411547J614447J3947815Q178530m030524o731808l046675
$$ plain form
3102 23590914 19208997 10285487 3232051 3213427 6144215 7107237 7375982 7525314 2955836
3093 2955836 -6931000 -13842617 -12921307 -12129586 -19841269 -29570137 -28385409 -16761928
3085 -16761928 -7875913 -7381195 -5284679 8769094 30553101 46189464 46674724 33493249
3077 33493249 13863759 -5040160 -18710598 -25856263 -27398685 -24893559 -20357388 -16689007
3069 -16689007 -16192585 -18456677 -21027844 -22113780 -21539984 -19579280 -16265038 -11820795
3061 -11820795 -7203579 -4579024 -6585818 -12918599 -18108487 -16649208 -10957863 -9048569
3053 -9048569 -12380110 -12942104 -7442151 -6923617 -22264302 -44072146 -49941896 -33600078
3045 -33600078 -15117539 -15820828 -31514808 -39468682 -27647076 -7568440 1794116 -5046898
$$ packed form
3102B3590914m381917q923510p053436j8624K930788R63022K68745J49332m569478
3093B955836r886836o911617R21310P91721p711683r728868J184728J1623481
3085a6761928Q886015M94718K096516J4053773K1784007J5636363M85260j3181475
3077C3493249j9629490j8903919j3670438p145665j542422K505126M536171L668381
3069a6689007M96422k264092k571167j085936N73796J960704L314242M444243
3061a1820795M617216K624555k006794o332781n189888J459279N691345J909294
3053i048569l331541n61994N499953N18534j5340685k1807844n869750J6341818
3045c3600078J8482539p03289j5693980p953874J1821606K0078636R362556o841014
$$ plain form
3037 -5046898 -18307943 -26675745 -27352358 -23631507 -18092731 -11498217 -5971633 -4300464
3029 -4300464 -5113661 -2971909 4013041 9985149 8566365 1785109 -2733685 -1719081
3021 -1719081 1834986 5587676 10157023 13541261 9875828 -2442278 -15421873 -18265907
3013 -18265907 -7863917 9249008 22923938 25889036 17735068 5614434 -846975 2011595
3005 2011595 9146105 12990701 10206454 2012654 -8140401 -14983378 -13255617 -2971187
2997 -2971187 8797648 14372496 12800226 9360610 9979806 17649978 30845096 42107107
2989 42107107 41196678 24584943 1176663 -15097220 -18003264 -11621598 -2150997 7817459
2981 7817459 16590446 20388019 16589725 7874575 151746 -3274577 -3790924 -4011471 -4002732
$$ packed form
3037e046898j3261045q367802o76613L720851N538776O594514N526584J671169
3029d300464q13197K141752O984950N972108j418784o781256m518794J014604
3021a719081L554067L752690M569347L384238l665433j2318106j2979595k844034
3013a8265907J0401990J7112925J3674930K965098q153968j2120634o461409K858570
3005B011595P134510L844596k784247q193800j0153055o842977J727761J0284430
2997b971187J1768835N574848j572270l439616O19196P670172J3195118J1262011
2989D2107107r10429j6611735k3408280j6273883k906044O381666R470601R968456
2981G817459Q772987L797573l798294q715150p722829l426323n16347k20547Q739
$$ plain form
2972 -4002732 -1870665 2767790 7589533 10434216 11962208 13891993 15410718 13521318
2964 13521318 7135324 -915782 -6200117 -5717323 586854 8607412 10582416 764711
2956 764711 -17233740 -31111585 -30517182 -16736877 -1141125 5125870 -17303 -9087392
2948 -9087392 -12539351 -7590177 840374 8517940 18076709 33167272 49334834 57174169
2940 57174169 53987697 45489447 35518647 22028054 5803242 -4997686 -4244558 4012064
2932 4012064 11610793 15121711 14106610 7047068 -4377873 -12306247 -11524111 -7326323
2924 -7326323 -7266124 -9055056 -5219769 3026075 6281170 1287021 -3669498 721883 14893116
2915 14893116 31944328 43922355 46060041 39296738 28945908 18165845 5206639
$$ packed form
2972d002732K132067M638455M821743K844683J527992J929785J518725j889400
2964A3521318o385994q051106n284335M82794O304177Q020558J975004r817705
2956G64711j7998451j3877845N94403J3780305J5595752O266995n143173r070089
2948i087392l451959M949174Q430551P677566R558769J5090563J6167562P839335
2940E7174169l186472q498250r970800j3490593j6224812j0800928P53128Q256622
2932D012064P598729L510918j015101p059542j1424941p928374P82136M197788
2924g326323O0199j788932L835287Q245844L255095m994149m956519M391381J4171233
2915A4893116J7051212J1978027K137686o763303j0350830j0780063j2959206
$$ plain form
2908 5206639 -9353596 -17716831 -14292814 -5874869 -3428999 -6428057 -5130064 3343100
2900 3343100 11992860 16414716 18626445 17427852 7344681 -9303070 -21066457 -23471824
2892 -23471824 -25703366 -34448114 -41192827 -35083432 -21424102 -16816716 -28322941 -45437492
2884 -45437492 -52624916 -45482185 -34585536 -34114514 -44443936 -47823774 -28099918 5900266
2876 5900266 26454090 18564871 -4978996 -23770473 -32353892 -34780367 -29254209 -12279909
2868 -12279909 8216302 18153154 14686857 8219622 7927686 13832869 22063710 29313950
2860 29313950 31851246 27540393 20278322 17649994 23466693 34993298 45670217 48515663
2852 48515663 41130518 30472426 27089628 30601314 28065573 12642222 -4399656 -9139212
$$ packed form
2908E206639j4560235q363235L424017Q417945K445870k999058J297993Q473164
2900C343100Q649760M421856K211729j198593j0083171j6647751j1763387k405367
2892b3471824k231542q744748o744713O109395J3659330M607386j1506225j7114551
2884d5437492p187424P142731J0896649M71022j0329422l379838J9723856L4000184
2876E900266K0553824p889219k3543867j8791477q583419k426475N526158J6974300
2868a2279909K0496211R936852l466297o467235k91936N905183Q230841P250240
2860B9313950K537296m310853p262071k628328N816699J1526605J0676919K845446
2852D8515663p385145j0658092l382798L511686k535741j5423351j7041878m739556
$$ plain form
2844 -9139212 -4835352 -4748467 -10579544 -11239992 -1013855 13336875 23389406 26389919
2836 26389919 21821621 10672582 -1060823 -6340452 -4638684 853266 10193595 22426014
2828 22426014 29265842 24964020 18932991 24707298 37928584 39908604 23332815 241616
2820 241616 -15998832 -21731694 -15584954 2345249 20340082 22076730 10142219 5516286
2812 5516286 16335183 25380219 18966443 9454856 13337903 22532714 17016408 -3756451
2804 -3756451 -21456367 -25666233 -22991442 -22375420 -26185756 -33899044 -41550353 -39691635
2796 -39691635 -24533133 -9105640 -10550735 -27112833 -39665139 -35812243 -21483429
2789 -21483429 -9141030 -5709242 -12309427 -24661586 -32083093 -25868099 -10788469 -684410
$$ packed form
2844i139212M303860Q6885n831077o60448J0226137J4350730J0052531L000513
2836B6389919m568298j1149039j1733405n279629J701768N491950R340329J2232419
2828B2426014O839828m301822o031029N774307J3221286J980020j6575789k3091199
2820B41616j6240448n732862O146740J7930203J7994833J736648j1934511m625933
2812E516286J0818897R045036o413776r511587L883047R194811n516306k0772859
2804c756451j7699916m209866K674791O16022l810336p713288p651309J858718
2796c9691635J5158502J5427493j445095j6562098j2552306L852896J4328814
2789b1483429J2342399L431788o600185j2352159p421507O214994J5079630J0104059
$$ plain form
2781 -684410 -2245340 -10472670 -18754990 -24420227 -25613041 -22798654 -22903811 -31819723 -43390525
2772 -43390525 -46678441 -43266201 -44542273 -51678150 -53371473 -46411400 -42071605 -44824682
2764 -44824682 -40414048 -17322366 11388635 22220666 11165408 -3685753 -6397668
2757 -6397668 1855389 11453508 17155768 19477268 20182661 20167765 19387121 17603299 16228612
2748 16228612 18398486 25426332 33986295 37743612 30927506 11774098 -13419954 -30429757
2740 -30429757 -28102797 -11564185 1672061 1972823 -2322960 465104 7436435 5843942
2732 5843942 -7579650 -20806481 -21102098 -9632417 1317291 3486055 2252294 9278143
2724 9278143 25356879 35052451 24313745 1194438 -10233450 1510966 22103622
$$ packed form
2781f84410j560930q227330q282320n665237j192814K814387j05157q915912j1570802
2772d3390525l287916L412240j276072p135877j693323O960073M339795k753077
2764d4824682M410634K3091682K8711001J0832031j1055258j4851161k711915
2757f397668Q253057R598119N702260K321500P05393j4896p80644j783822j374687
2748A6228612K169874P027846Q559963L757317o816106j9153408k5194052j7009803
2740c0429757K326960J6538612J3236246L00762m295783K788064O971331j592493
2732E843942j3423592j3226831k95617J1469681J0949708K168764j233761P025849
2724I278143J6078736R695572j0738706k3119307j1427888J1744416K0592656
$$ plain form
2717 22103622 31061372 24856174 12763569 -1174356 -19257116 -36921896 -42103458 -30345085
2709 -30345085 -11370165 2918868 10601612 16778696 23674605 27488040 22637106 7274798
2701 7274798 -13370510 -28749177 -31146663 -23158245 -14779241 -12629827 -14337327 -13575634
2693 -13575634 -7758680 21946 4400798 2156830 -5194761 -12342955 -14069424 -8219318
2685 -8219318 4163908 18789092 27901256 24694426 10974505 -3025164 -9770058 -11752029
2677 -11752029 -14034674 -14581174 -8922015 -985372 -285102 -8515123 -17072929 -18968291
2669 -18968291 -15424148 -8777603 2606965 17531689 27159794 24359548 14576415 10545220
2661 10545220 16744774 24376115 22866267 13093865 7103343 14898832 32348423 44003241
$$ packed form
2717B2103622Q957750o205198j2092605j3937925j8082760j7664780n181562J1758373
2709c0345085J8974920J4289033P682744O177084O895909L813435m850934j5362308
2701G274798k0645308j5378667k397486P988418Q379004K149414j707500P61693
2693a3575634N816954P780626M378852k243968p351591p148194j726469N850106
2685h219318J2383226J4625184R112164l206830j3719921j3999669o744894j981971
2677a1752029k282645n46500N659159P936643P00270q230021q557806j895362
2669a8968291L544143O646545J1384568J4924724R628105k800246r783133m031195
2661A0545220O199554P631341j509848r772402n990522P795489J7449591J1654818
$$ plain form
2653 44003241 39734296 26898742 22202576 32121836 46416624 51661849 44999849 31751448
2645 31751448 16300983 1975251 -4377781 3159238 19592574 30149314 24693010 8063653
2637 8063653 -5917285 -8470579 -2311737 3828761 4646217 1891135 -640685 -4043218
2629 -4043218 -13220016 -27781276 -38060526 -35132665 -23363520 -17062317 -23573871 -35127265
2621 -35127265 -40045706 -36797130 -32049382 -28479493 -21579029 -8892183 3320700 5639486
2613 5639486 -4392653 -19214674 -27102759 -21286658 -5927357 6408812 6077891 -3586661
2605 -3586661 -9951294 -5791435 2891500 5588396 -81139 -8376601 -14944568 -20040497
2597 -20040497 -22469559 -17295091 -3591720 9734396 11888163 3628190 -2560059 2003806
$$ packed form
2653D4003241m268945j2835554m696166R919260J4294788N245225o662000j3248401
2645C1751448j5450465j4325732o353032P537019J6433336J0556740n456304j6629357
2637H063653j3980938k553294O158842O140498Q17456k755082k531820l402533
2629d043218r176798j4561260j0279250K927861J1769145O301203o511554j1553394
2621c5127265m918441L248576M747748L569889O900464J2686846J2212883K318786
2613E639486j0032139j4822021p888085N816101J5359301J2336169l30921r664552
2605c586661o364633M159859Q682935K696896n669535q295462o567967n095929
2597b0040497k429062N174468J3703371J3326116K153767q259973o188249M563865
$$ plain form
2589 2003806 10814958 11297817 3127857 -150218 9836917 23245797 25147359 16807291
2581 16807291 13430458 21272502 28554256 23317056 10166329 1735470 1131818 2182919
2573 2182919 2084562 3683454 7505716 10806540 13471309 16462319 15627232 6294405 -6013766
2564 -6013766 -9006231 416747 11612855 13377180 4781434 -7342799 -13730278 -6100167
2556 -6100167 14201881 30237137 24349430 1896585 -12467173 -6300342 6789935 10897633
2548 10897633 9182632 10133940 7829014 -6892279 -25722015 -32294432 -26814495 -23054528
2540 -23054528 -24036310 -19660723 -8441243 -2214920 -4946965 -4482920 6782044 17718248
2532 17718248 15112778 3548533 -2352286 1684488 7328605 7517504 3616842 526694
$$ packed form
2589B003806Q811152M82859q169960l278075R987135J3408880J901562q340068
2581A6807291l376833P842044P281754n237200j3150727q430859o03652J051101
2573B182919r8357J598892L822262L300824K664769K991010q35087r332827j2308171
2564f013766k992465R422978J1196108J764325q595746j2124233o387479P630111
2556f100167K0302048J6035256n887707k2452845j4363758O166831J3090277M107698
2548A0897633j715001R51308k304926j4721293j8829736o572417N479937L759967
2540b3054528r81782M375587J1219480O226323k732045M64045J1264964J0936204
2532A7718248k605470j1564245n900819M036774N644117J88899l900662l090148
$$ plain form
2524 526694 1007246 3788903 3512936 -5142953 -20007139 -31050134 -30789032 -22066511 -12610070
2515 -12610070 -5916895 -1607277 -728275 -4482812 -9180572 -8560731 -2108200 3449277
2507 3449277 3120685 969869 4805340 14451364 19999848 14253846 2895592 -3284651
2499 -3284651 -3792768 -7455115 -15546550 -17014013 -6373658 3895358 -836632 -16094575
2491 -16094575 -24785053 -20582437 -12126784 -6217287 -559893 6086634 9812256 10805361
2483 10805361 15307903 24361006 30544050 29634949 25828272 21822601 14321957 4392238
2475 4392238 1741594 11650000 26098021 34663313 36514380 35151168 29409426 17601963
$$ packed form
2524E26694M80552K781657k75967q655889j4864186j1042995K61102Q722521R456441
2515a2610070O693175M309618Q79002l754537m697760O19841O452531N557477
2507C449277l28592k150816L835471R646024N548484n746002j1358254o180243
2499c284651n08117l662347q091435j467463J0640355J0269016m731990j5257943
2491a6094575q690478M202616Q455653N909497N657394O646527L725622R93105
2483A0805361M502542R053103O183044r09101l806677m005671p500644r929719
2475D392238k650644R908406J4448021Q565292J851067j363212n741742j1807463
$$ [...]
##END NTUPLES=NMR SPECTRUM
##END=
