##TITLE=31Pdec_DE-60_EA_d6'
 DMSO-d6, 64 sc
 3.7.2024
##JCAMPDX= 6.0         $$ Bruker NMR JCAMP-DX V2.0
##DATA TYPE= NMR SPECTRUM
##DATA CLASS= NTUPLES
##ORIGIN= UXNMR, Bruker Analytische Messtechnik GmbH
##OWNER= root
$$ XWIN-NMR		Version 3.5
$$ Wed Jul  3 14:33:36 2024 Russian Standard Time (UT+4h)  she@DPX200
##.OBSERVE FREQUENCY= 81.013821
##.OBSERVE NUCLEUS= ^31P
##.ACQUISITION MODE= SIMULTANEOUS
##.ACQUISITION SCHEME= undefined
##.AVERAGES= 64
##.DIGITISER RES= 17
##SPECTROMETER/DATA SYSTEM= spect
##.PULSE SEQUENCE= zgpg30
##.SOLVENT NAME= DMSO
##.SHIFT REFERENCE= (INTERNAL, DMSO, 0, 198.062)
##AUDIT TRAIL= $$ (NUMBER, WHEN, WHO, WHERE, WHAT)
$$ ##TITLE= Audit trail, XWIN-NMR		Version 3.5
$$ ##JCAMPDX= 5.01
$$ ##ORIGIN= Bruker BioSpin GmbH
$$ ##OWNER= she
$$ F:/spectra/data/she/nmr/P31/2/pdata/1/auditp.txt
$$ ##AUDIT TRAIL=  $$ (NUMBER, WHEN, WHO, WHERE, WHAT)
(   1,<2024-07-03 14:32:40.37 +0400>,<she>,<DPX200>,
      <created by zg, POWCHK disabled, PULCHK disabled
       configuration hash MD5:
       00 E9 B6 7A A2 85 ED C7 34 08 36 98 17 FE 4E 26
       data hash MD5: 32K
       4C C5 CF 0B AC 54 18 14 C7 D2 F8 85 22 4E 2F 1C>)
(   2,<2024-07-03 14:32:49.46 +0400>,<she>,<DPX200>,
      <Start of raw data processing
       efp BC_mod = 2 LB = 1.5 FT_mod = 6 PKNL = 1 PHC0 = 3009.477 PHC1 = -468.5137 SI = 64K 
       data hash MD5: 64K
       71 3C FE 58 8F CB 8C A2 EC 6B F8 72 DE CF 74 F7>)
(   3,<2024-07-03 14:33:03.64 +0400>,<she>,<DPX200>,
      <pk PHC0 = -1.874592 PHC1 = 0 
       data hash MD5: 64K
       2E 98 9F B1 C5 D0 DD 68 F9 F5 4D A2 53 33 B3 DA>)
(   4,<2024-07-03 14:33:08.39 +0400>,<she>,<DPX200>,
      <abs ABSG = 5 
       data hash MD5: 64K
       0B 66 03 57 D1 E5 BE B1 8E 29 FB BB D2 BC 50 C5>)
$$ ##END=
$$ 
$$ hash MD5
$$ 25 94 24 C9 7F 4C 3D A1 BB D9 10 89 6F F0 DC A2
##$RELAX= 
##$RELAX= 
##$RELAX= 
##$RELAX= 
##$RELAX= 
##$RELAX= 
##$RELAX= 
##$RELAX= 
$$ Bruker specific parameters
$$ --------------------------
##$DU= <F:/spectra>
##$EXPNO= 2
##$NAME= <P31>
##$PROCNO= 1
##$TYPE= <nmr>
##$USER= <she>
##$AMP= (0..31)
100 100 100 100 100 100 100 100 100 100 100 100 100 100 100 100 100 100 
100 100 100 100 100 100 100 100 100 100 100 100 100 100 
##$AQSEQ= 0
##$AQ_mod= 1
##$AUNM= <au_zg>
##$AUTOPOS= <>
##$BF1= 81.014009
##$BF2= 200.13
##$BF3= 200.13
##$BF4= 200.13
##$BF5= 200.13
##$BF6= 200.13
##$BF7= 200.13
##$BF8= 200.13
##$BYTORDA= 1
##$CFDGTYP= 0
##$CFRGTYP= 5
##$CHEMSTR= <none>
##$CNST= (0..31)
1 1 145 1 1 1 1 1 1 1 1 1 1 1 1 1 1 1 1 1 1 1 1 1 1 1 1 1 1 1 1 1 
##$CPDPRG= <waltz16>
##$CPDPRG1= <>
##$CPDPRG2= <waltz16>
##$CPDPRG3= <>
##$CPDPRG4= <mlev>
##$CPDPRG5= <mlev>
##$CPDPRG6= <mlev>
##$CPDPRG7= <mlev>
##$CPDPRG8= <mlev>
##$CPDPRGB= <>
##$CPDPRGT= <>
##$D= (0..31)
0 1 0 0 0 0 0 0 0 0.06 0 0.03 2e-05 3e-06 0 0 0.0002 0 0 0 0 0 0 0 0 0 
0 0 0 0 0 0 
##$DATE= 1720002759
##$DBL= (0..7)
120 120 120 11 120 120 24 19 
##$DBP= (0..7)
150 150 150 150 150 150 150 150 
##$DBP07= 0
##$DBPNAM0= <>
##$DBPNAM1= <>
$$ [...]
##$SUBNAM4= <"">
##$SUBNAM5= <"">
##$SUBNAM6= <"">
##$SUBNAM7= <"">
##$SUBNAM8= <"">
##$SUBNAM9= <"">
##$SW= 400.765351723535
##$SWIBOX= (0..15)
0 1 3 0 0 0 0 0 0 0 0 0 0 0 0 0 
##$SW_h= 32467.5324675325
##$TD= 32768
##$TD0= 1
##$TE= 0
##$TE2= 300
##$TE3= 300
##$TEG= 300
##$TL= (0..7)
0 120 53 12 22 120 120 120 
##$TP= (0..7)
150 150 150 150 150 150 150 150 
##$TP07= 0
##$TPNAME0= <>
##$TPNAME1= <>
##$TPNAME2= <>
##$TPNAME3= <>
##$TPNAME4= <>
##$TPNAME5= <>
##$TPNAME6= <>
##$TPNAME7= <>
##$TPOAL= (0..7)
0.5 0.5 0.5 0.5 0.5 0.5 0.5 0.5 
##$TPOFFS= (0..7)
0 0 0 0 0 0 0 0 
##$TUNHIN= 0
##$TUNHOUT= 0
##$TUNXOUT= 0
##$USERA1= <user>
##$USERA2= <user>
##$USERA3= <user>
##$USERA4= <user>
##$USERA5= <user>
##$V9= 5
##$VALIST= <valist>
##$VCLIST= <CCCCCCCCCCCCCCC>
##$VD= 0
##$VDLIST= <DDDDDDDDDDDDDDD>
##$VPLIST= <PPPPPPPPPPPPPPP>
##$VTLIST= <TTTTTTTTTTTTTTT>
##$WBST= 1024
##$WBSW= 4
##$XGAIN= (0..3)
0 0 0 0 
##$XL= 0
##$YL= 0
##$YMAX_a= 3853
##$YMIN_a= -11604
##$ZGOPTNS= <>
##$ZL1= 120
##$ZL2= 120
##$ZL3= 120
##$ZL4= 120
##$ABSF1= 198.0616
##$ABSF2= -202.7028
##$ABSG= 5
##$ABSL= 3
##$ALPHA= 0
##$AQORDER= 0
##$ASSFAC= 0
##$ASSFACI= 0
##$ASSFACX= 0
##$ASSWID= 0
##$AUNMP= <proc_1d>
##$AZFE= 0.1
##$AZFW= 0.5
##$BCFW= 0
##$BC_mod= 2
##$BYTORDP= 0
##$COROFFS= 0
##$CY= -3
##$DATMOD= 1
##$DC= 0
##$DFILT= <>
##$DTYPP= 0
##$F1P= 0
##$F2P= 0
##$FCOR= 1
##$FTSIZE= 65536
##$FT_mod= 6
##$GAMMA= 0
##$GB= 0
##$INTBC= 1
##$INTSCL= 9.790993e-09
##$ISEN= 30
##$LB= 1.5
##$LEV0= 0
##$LPBIN= 0
##$MAXI= 10000
##$MC2= 0
##$MEAN= 0
##$ME_mod= 0
##$MI= 50
##$NCOEF= 0
##$NC_proc= -10
##$NLEV= 6
##$NOISF1= 182.463
##$NOISF2= 159.3651
##$NSP= 0
##$NTH_PI= 0
##$NZP= 0
##$OFFSET= 198.0616
##$PC= 4
##$PHC0= 3007.603
##$PHC1= -468.5137
##$PH_mod= 1
##$PKNL= yes
##$PPARMOD= 0
##$PSCAL= 0
##$PSIGN= 0
##$REVERSE= no
##$SF= 81.0140089999434
##$SI= 65536
##$SIGF1= 159.3651
##$SIGF2= -187.1042
##$SINO= 113.3802
##$SIOLD= 16384
##$SREGLST= <1H.CDCl3>
##$SSB= 0
##$STSI= 65536
##$STSR= 0
##$SW_p= 32467.5324675325
##$SYMM= 0
##$S_DEV= 0
##$TDeff= 32768
##$TDoff= 0
##$TI= <>
##$TILT= no
##$TM1= 0
##$TM2= 0
##$TOPLEV= 0
##$USERP1= <user>
##$USERP2= <user>
##$USERP3= <user>
##$USERP4= <user>
##$USERP5= <user>
##$WDW= 1
##$XDIM= 65536
##$YMAX_p= 469271539
##$YMIN_p= -124945035
$$ End of Bruker specific parameters
$$ ---------------------------------
##NTUPLES= NMR SPECTRUM
##VAR_NAME=  FREQUENCY,     SPECTRUM/REAL,   SPECTRUM/IMAG
##SYMBOL=    X,             R,               I
##VAR_TYPE=  INDEPENDENT,   DEPENDENT,       DEPENDENT
##VAR_FORM=  AFFN,          ASDF,            ASDF
##VAR_DIM=   65536,         65536,           65536
##UNITS=     HZ,            ARBITRARY UNITS, ARBITRARY UNITS
##FACTOR=    0.49542278885378, 1,            1
##FIRST=     16045.7642231865, 0,            0
##LAST=      -16421.768244346, 0,            0
##MIN=       -16421.768244346, -124945035,   0
##MAX=       16045.7642231865, 469271539,    0
$$ Real data points
##PAGE= N=1
##DATA TABLE= (X++(R..R)), XYDATA
$$ [...]
6525C659667j6562918j2815058m663365l182546j689808R521999K0553684J6784702
6517A1606357N794674N025263J0403780M055630j0783788j2086026J818056N795209
6509B1629155j0157065k1202488o503889J6118565J6684508k715750j5293665
6502a440629j1303440o217480r494861j0375960o56884Q602753M411413p164874
6494c3639962r902659l45730R833311J1755605R144748Q844154R913305P262144
6486A2864916J534446j533762q47806j642656m788342k146330J0137749J9651396
6478C3229611J0626138j2602129k7924528k3663620j1465665n761216m303529
6471d1864938P79812N384191J994128k951874K109134J2289307J2136086K004490
$$ y = [3659667, -12903251, -25718309, -30381674, -33564220, -35254028, -25732029, -5178345, 11606357, 17401031, 22426294, 32830074, 36885704, 26101916, 14015890, 15833946, 21629155, 11472090, -9730398, -16234287, -115722, 16568786, 13853036, -1440629, -12744069, -18961549, -28456410, -38832370, -39489254, -30886501, -26475088, -33639962, -43542621, -43888351, -34055040, -22299435, -13154687, -4310533, 5602772, 12864916, 14399362, 12865600, 12017794, 10375138, 5586796, 3440466, 13578215, 33229611, 43855749, 31253620, 3329092, -20334528, -31800193, -37561409, -41864938, -41085126, -35700935, -33706807, -36658681, -34549547, -22260240, -10124154, -8119664]
6463h119664j033550Q275478J3604502L731266q944893q698674n12765J226324
6455d71976l079702k398512L438873L918235l116404q803227r588508j1204418
6447c1305639j4483441j1477096k0100J0250857J1976664R482170Q312584N717209
6439a1546792j221748p323242p709745o552835q196950o798040M106980J7021067
6431b8221305J8123698P436921q46782J606469Q397376J1242135J0213657O963029
6423C4915198j699678j6284907k8079054k7890314j7057060l918532O155143J1387156
6415d2472048R467476R85982n877176k708903P386134J2554279P111618k636851
6407a6189489p987693o636731l79945R088299J8064157J9396954Q753693q442121
$$ y = [-8119664, -9153214, -877736, 12726766, 16458032, 7513139, -1185535, -1698300, -471976, -3551678, -5950190, -2511317, 1406918, -1709486, -10512713, -20101221, -31305639, -45789080, -57266176, -57286276, -47035419, -35058755, -25576585, -17264001, -11546792, -12768540, -20091782, -27801527, -34354362, -42551312, -49349352, -45242372, -28221305, -10097607, -2660686, -3507468, -1900999, 6496377, 17738512, 27952169, 34915198, 33215520, 16930613, -11148441, -39038755, -56095815, -60014347, -53859204, -42472048, -33004572, -32018590, -37895766, -40604669, -33218535, -20664256, -13552638, -16189489, -24177182, -30813913, -31193858, -22105559, -4041402, 15355552, 24109245, 15667124]
6399A5667124j9646342j5969355q73749J1466574Q766794n784907j5019306p206002
6391b8599169Q524682J2931592J690205r411718o640029L574575N172888n070671
6383a7827645j4077277r960924L713176J2851078R338016O89585J498084J4318213
6375E42306K3621031J4945527l898865j1913169m552063L94371q722710j8883058
6367h466630j3507432J243539P112515J674549k323700n25911q21321m652213
6359b0266604l615128K269769J002107j0128433j5804604m787062J2141690J7428535
6351b1759730J0339027L869465M727061P619196O253555P85004m844820p229614
6343b40856n994441m619889o188992p541109l010761N338080R084047O774517
$$ y = [15667124, -3979218, -19948573, -20822322, -9355748, -588954, -6373861, -21393167, -28599169, -20074487, -7142895, -5452690, -14864408, -21504437, -17929862, -12756974, -17827645, -31904922, -41865846, -38152670, -25301592, -15963576, -15273991, -13775907, 542306, 24163337, 39108864, 35209999, 23296830, 18744767, 19139138, 10416428, -8466630, -21974062, -20730523, -13618008, -11943459, -14267159, -14793070, -15614391, -20266604, -23881732, -21611963, -20609856, -30738289, -46542893, -51329955, -39188265, -21759730, -11420703, -7551238, -2824177, 4795019, 11048574, 11833578, 6988758, -240856, -6235297, -10855186, -17044178, -24585287, -27596048, -22257968, -13173921, -6399404]
6335f399404O051639Q949625O489227n400519j5641509j3123101l068343J899456
6327b0242929m83909l541603l966671k260235K823354R804352J0697116K291284
6319d879241n521705l928436J39436l082896o940103P33817J3564249J3695524
6311C780645Q07577o758542j334456M094422k56174o783004p642670q098719j2708156
6302c4899077j3593746m040658Q492934J3985052J3791839J2816259Q627825j88347
6294D992081m634206K914236J4570485J6615116P868344k142611p722375r159054
6286B3302016n893234J101869M308112j741164r822006q469557J420375Q568959
6278A2775370P778252M138552J779105j496838p283674j2084325j1425034m108569
$$ y = [-6399404, -347765, 8601860, 15091087, 9690568, -5950941, -19074042, -22142385, -20242929, -20726838, -24268441, -28235112, -30495347, -27671993, -17867641, -7170525, -4879241, -10400946, -14329382, -14189946, -17272842, -24212945, -23479128, -9914879, 3780645, 4588222, -2170320, -3504776, 589646, 333472, -6449532, -14092202, -22190921, -34899077, -48492823, -52533481, -44040547, -30055495, -16263656, -3447397, 5180428, 4992081, 357875, 3272111, 17842596, 34457712, 42326056, 40183445, 32461070, 23302016, 17408782, 18510651, 22818763, 21077599, 11255593, 2786036, 4206411, 12775370, 20553622, 24692174, 26471279, 24974441, 17690767, 5606442, -5818592, -9927161]
6270i927161O780612J3972809J1131374J915722k319918P27654j240526j5087609
6262E952957k6802792k0156116k829845L952026k271457l334794Q617488J8828260
6254a8044273J4332647K767355k096585P37235M372838N448554J544564j0743036
6246a680701k4879696k3432789r60681K1815850K1529866L328220o893929K104716
6238i069144J4990221J3741335o45595j4067478j6265318p201857N804918J2953744
6230B40826R331725M51191l705354j046357J482989o52176m320557o802809j0710936
6221a5731458j5869093j3803993J328877K0164939K5673106J3536744k347587
6214A2951535o822419L0897O787904O141349Q43978l596959n745057o643537o421515
$$ y = [-9927161, -3146549, 10826260, 21957634, 23873356, 21553438, 22281092, 21040566, 5952957, -20849835, -41005951, -43835796, -39883770, -42155227, -45490021, -36872533, -18044273, -3711626, -944271, -3040856, -2303621, 2069217, 7517771, 9062335, -1680701, -26560397, -49993186, -50953867, -29138017, -7608151, -4279931, -11173860, -9069144, 5921077, 19662412, 19016817, 4949339, -11315979, -18517836, -12712918, 240826, 9572551, 10023742, 6318388, 5272031, 6755020, 6102844, 1782287, -5020522, -15731458, -31600551, -45404544, -44075667, -23910728, 1762378, 15299122, 12951535, 6129116, 6160013, 12947917, 19089266, 19933244, 16336285, 10591228, 3947691, -2473824]
6205b473824n321280m865260m983929k605967L486153Q747795Q096711L402647
6197C483046P72733J267167K28559l779849n988487l499996K57146K841928P759936
6188C342183J5883285J7963323N450512j3540978k0096980q528186N117354L936280
6180I526793q148232j3850809p067513O58965j162369o837275l990298P592267
6172b3278471J4721956P904562o512216j3507963n799006Q667901J4635117N060827
6164A892707j0424127j4766528l414943R029107P453217l085682n477144K986283
6156a5807110P063101l82586n753669J655034R269688J345102j2574287j1263500
6148b6448227K659018N979436o523770j3179643j651631J1557046J0565130N811783
$$ y = [-2473824, -7795104, -12660364, -17644293, -20250260, -16764107, -8016312, 80399, 3483046, 4255779, 5522946, 5751505, 1971656, -4016831, -7516827, -7259681, -4417753, 3342183, 19225468, 37188791, 42639303, 29098325, 9001345, 473159, 5590513, 9526793, 1378561, -12472248, -19539761, -18880796, -20043165, -26880440, -30870738, -23278471, -8556515, -651953, -7164169, -20672132, -26471138, -17803237, -3168120, 1892707, -8531420, -23297948, -26712891, -17683784, -10230567, -13316249, -18793393, -15807110, -8744009, -9126595, -14880264, -13225230, -3955542, -2610440, -15184727, -26448227, -23789209, -17809773, -24333543, -37513186, -39164817, -27607771, -17042641, -11230858]
6140a1230858J2009379J9889465J2902016k029041o032798j843954q682452k6148605
6132a1166848l0150129r205675J7828235K7807283J9070982M043374p387898r228284
6124A611040P43334J3546389J4068221J172379r437037q453113m455110m951592
6116C844511l076529N423318Q949016n06995r445921l071006Q761684P048063
6108A7926141m127479m860471N783504P949790m800660j4369082q143900J548693
6100c093464j063460j1499827j5323417q987201J767362J3411810K2395209K0826297
6092A8433309P312117m925334l562163M481432L060672q494252j4424312o096909
6084d215440O165859Q070302j211349j0945907j1973750m054007N904652J0025474
$$ y = [-11230858, 778521, 20667986, 33570002, 31540961, 25508163, 23664209, 14981757, -11166848, -41316977, -50522652, -32694417, -4887134, 14183848, 18227222, 10839324, 1611040, 2354374, 15900763, 29968984, 31141363, 21704326, 13251213, 8796103, 3844511, 767982, 6191300, 15140316, 14633321, 5187400, 2116394, 10878078, 17926141, 13798662, 8938191, 14721695, 22671485, 17870825, 3501743, -4642157, -3093464, -4156924, -15656751, -30980168, -39967369, -38200007, -24788197, -2392988, 18433309, 25745426, 20820092, 17257929, 21739361, 24800033, 16305781, 1881469, -4215440, 1950419, 10020721, 8809372, -2136535, -14110285, -18164292, -12259640, -2234166]
6076b234166O153382m42244l516182k718861j291829M05187L631914N173493j75594
6067D985100r970553j4015528p286964K470639M510192j380626o111187l877757
6059c0676684J813293M713141L799631K653928L574474N165050N281769M065419
6051C90021L170567L253591L541823L472857L567720M645249O816626Q874223
6043C7732677Q280445L452975k348729j917387P090540J5624896J1416247n200607
6035G4131057j9487126j9281729q576673n6548Q75894j502928l267528n387285
6027A7447134q323701q794319m122238L927560J1001947J3369678R575146K173820
6019C6255027k558078m62763M801872N410911j250507j0208928j5328159j4153610
$$ y = [-2234166, 3919216, 3476972, -39210, -2758071, -4049900, -3644713, -12799, 5160694, 4985100, -4985453, -19000981, -26287945, -23817306, -19307114, -20687740, -26798927, -30676684, -28863391, -24150250, -20350619, -17696691, -14122217, -8957167, -3675398, 390021, 3560588, 6814179, 10356002, 13828859, 17396579, 22041828, 28858454, 37732677, 46013122, 49466097, 47117368, 45199981, 52290521, 67915417, 79331664, 74131057, 54643931, 35362202, 26785529, 26728981, 27604875, 26101947, 22834419, 17447134, 9123433, 329114, -3793124, 134436, 11136383, 24506061, 34081207, 36255027, 33696949, 33234186, 38036058, 43446969, 42196462, 31987534, 16659375, 2505765]
6011B505765p298733J624448N591076M1009r345997j0829202r53281J0872368
6003g792547J4610770J0325297L635038k289515n007759o02582Q579021J0009424
5995C1467147m248910k1905681k2011016k774258J4579848J3523840J670375m778573
5987E522772m552045o759300j0336921m716180R260736J5461886N517638p443896
5979A954690p804390q7508J51856q355262j1647300l692669M944241N315417L253953
5970a5966972O954678J2511482J1593360N304338l09953o115215j5082028j9978357
5962b1088667j0074347R681573J9521066Q849886j0704878k0696132j5770153
5955d0281652l511921P480175J2927570J1955331P275438L318064N77917m308570
$$ y = [2505765, -4792968, -3168520, 2422556, 2463565, -6882432, -17711634, -18664915, -7792547, 6818223, 17143520, 20778558, 18489043, 13481284, 12878702, 21457723, 31467147, 27218237, 5312556, -16698460, -19472718, -4892870, 8630970, 10301345, 5522772, 970727, -5788573, -16125494, -20841674, -11580938, 3880948, 9398586, 1954690, -5849700, -5937208, -5785352, -14140614, -25787914, -29480583, -24536342, -19220925, -15966972, -9012294, 3499188, 15092548, 20396886, 20086933, 13971718, -1110310, -21088667, -31163014, -21481441, -1960375, 6889511, -3815367, -24511499, -40281652, -43793573, -36313398, -23385828, -11430497, -4155059, -836995, -259078, -4567648]
5947d567648j0420997j0659633k244218P140409R519015P475389P970370R974799
5939A4187486O663793k230827q470226o051191J973819P919005O560515j587519
5931A8964855j0140926j1213168m046127K329516l31851p978050q865078J052125
5923b0228704J2922731J5553246O545660p400091j7010733j6794106q642361K75906
5915c4778452N472992R513445J5326123J8373635J2040516k66918o311421n84741
5907A8785179P688636O309577m043702j0747356n444372M671053M727646q795098
5899A3151563k1039809j5637743L438749J5300039R061678k844482m236612K382026
5891d24591L813721j623859m560480l120226m949598j0916894j2446948p525830
$$ y = [-4567648, -14988645, -25648278, -27892496, -20752087, -11233072, -3757683, 4212687, 14187486, 20851279, 18620452, 10150226, 4099035, 6072854, 13991859, 20552374, 18964855, 8823929, -2389239, -6435366, -4105850, -4437701, -12415751, -21280829, -20228704, -7305973, 8247273, 14792933, 7392842, -9617891, -26411997, -35054358, -34778452, -29305460, -19792015, -4465892, 13907743, 25948259, 25681341, 19369920, 18785179, 26473815, 32783392, 28739690, 17992334, 12547962, 17219015, 21946661, 13151563, -7888246, -23525989, -20087240, -4787201, 4274477, 1429995, -2806617, -424591, 3389130, 1765271, -2795209, -5915435, -10865033, -21781927, -34228875, -41754705]
5883d1754705m325968m834585j95488J1197788J6370319Q237781o00309K889295
5875a3015872J0885247P546286n533378j2818794q581768j218134L718124R339709
5867i678580J5894984J7216025J1220325L211184l142196q603337j1674036r441431
5859E002938n602309o421249p945453k89387J2914583J4319241j533038j6928778
5851f483452j5441992n006957l077763q595869n757342Q480301J8276329J2356838
5843e249907o86955n961103q33654O452043R509801Q483231O088527M343023L082105
5834B5227111j087183j1187822k2772285k4847612j2164265O668019J7919493
5827b2244544J7107261J0136996L055443k667447n594847l037771K897873M150475
$$ y = [-41754705, -46080673, -50915258, -51110746, -39912958, -23542639, -15304858, -15905167, -13015872, -2130625, 5415661, -117717, -12936511, -21518279, -22736413, -19018289, -9678580, 6216404, 23432429, 34652754, 37863938, 34721742, 26118405, 14444369, 5002938, -599371, -7020620, -14966073, -15255460, -2340877, 11978364, 10445326, -6483452, -21925444, -26932401, -30010164, -38606033, -44363375, -35883074, -17606745, -5249907, -5936862, -11897965, -12731619, -6279576, 3230225, 11713456, 17801983, 22145006, 25227111, 24139928, 12952106, -9820179, -34667791, -46832056, -40164037, -22244544, -5137283, 4999713, 8055156, 5387709, -207138, -3244909, -347036, 3803439]
5819C803439l541528j3141043j3492044k583915J0316644J5061313R884288R96889
5811G304043l749930j053910M952124O151850m89968q133951q011591j388923
5803d420256J713371l360618r081014o441520K490688Q015349N847683O90206
5795d546111k579201n287261j0287972j4776718j1914966N9356J2776642J4713635
5787b1842596M446263n519913j936829J2916173K3121908J8206717M559878n134369
5779B8817232p657181q515077j0158599r332489n029979j202461l85178q89342
5771a4353074j884153n340878j0336254j0638312j938568J1352669J9650389J7020087
5763C531906N366891p453362j2477815o063544O024014J3203889J0710953L581602
$$ y = [3803439, 261911, -12879132, -26371176, -28955091, -18638447, -3577134, 6307154, 7304043, 3554113, 2500203, 7452327, 13604177, 13114209, 4980258, -3031333, -4420256, -2706885, -6067503, -15148517, -21590037, -19099349, -11084000, -5236317, -4546111, -7125312, -12412573, -22700545, -37477263, -49392229, -49332873, -36556231, -21842596, -17396333, -22916246, -24853075, -11936902, 11185006, 29391723, 33951601, 28817232, 21160051, 12644974, 2486375, -6846114, -11876093, -13078554, -13463732, -14353074, -16237227, -21578105, -31914359, -42552671, -44491239, -33138570, -13488181, 3531906, 8898797, 1445435, -11032380, -17095924, -11071910, 2131979, 12842932, 16424534]
5755A6424534j151152k787368m659014o482489l834389M425293J1790611R939149
5747B3665175j130987j1047903r795193j37937M797410j762399j0875240r973946
5739a6261020O6262P350442N859822R05801j735589k126435q0478O566112J3636017
5730A4180934J1132285j589373j0993008p904898j644089n125053j4017098j4236446
5722c0196746n000247Q27344j955777m306397M05799O901875R278913R486584
5714a4558652Q962950L250882p373724j1661813j589601J3465668J6408554L099613
5706A0003877j4097839k0735728j2158788N542198J9644422J8585412K769836
5699I553390j3500592j6435969p538768R89405K635496J362568J759337K616772
$$ y = [16424534, 15273382, 12486014, 7827000, 1344511, -2489878, 1935415, 13726026, 23665175, 22534188, 11486285, 1691092, 1553155, 6350565, 4588166, -6287074, -16261020, -16194758, -8844316, -2984494, -2078693, -3814282, -5940717, -6021195, 544917, 14180934, 25313219, 23723846, 12730838, 4825940, 3181851, -1943202, -15960300, -30196746, -35196993, -34369649, -36325426, -40631823, -40226024, -33324149, -24045236, -14558652, -5595702, -2344820, -9718544, -21380357, -22969958, -9504290, 6904264, 10003877, -4093962, -24829690, -36988478, -31446280, -11801858, 6783554, 9553390, -3947202, -20383171, -27921939, -26932534, -24297038, -22934470, -21175133, -18558361]
5691a8558361J535597n13188j473392q83472R17343K924995L044283J339416K406162
5682i260617Q952117J3937687O677280j1576272k5392034k2127382n491630J1416351
5674c2864500K0537968K1054058J3176592j194941j3297505j2472377O82457J2567529
5666H189281J2350326M840039K014160N105076L645598o888888j6036928j3308636
5658h9972n095031o070532j6395823k0047811q285900P227455J1189406M463980
5650c3104228j717282k909070j721329K505734J0957107J5849629Q135281n573643
5642g577801p955296M813811J7080986J5999217P069166J497854j9279k700726
5634B8207932o657168r570782j2944033j7221158j7196008j0184463k353921Q95958
$$ y = [-18558361, -17022764, -17535952, -19009344, -19892816, -18975473, -16050478, -13006195, -11666779, -9260617, -308500, 13629187, 20306467, 8730195, -16661839, -38789221, -44280851, -32864500, -12326532, 8727526, 21904118, 20709177, 7411672, -5060705, -4378248, 8189281, 20539607, 25379646, 27393806, 32498882, 36144480, 29255592, 13218664, -89972, -5185003, -11255535, -27651358, -47699169, -55985069, -48757614, -37568208, -33104228, -34821510, -37730580, -39451909, -36946175, -25989068, -10139439, -2004158, -7577801, -15533097, -10719286, 6361700, 22360917, 29430083, 30927937, 30908658, 28207932, 21550764, 11979982, -964051, -18185209, -35381217, -45565680, -47919601, -47023643]
5626d7023643L929385J1393465J6688688J0917452j369176o837720j566609N518260
5618h349898O203935J273116l959631n244772j753737J795651j339725r485925
5610b0860986j1964830n179802j65840m497821p380082K678869J5171837J2075115
5602b0123540j555292m495871N376243Q187852k356908o887560O376827K0499763
5594E021514J6978500L760316j891757j737753o955209j2830757o338315P503495
5586C510034R847060k101096r727287j067121J2384318J3329611J247265j0039907
5578A7382877j0415562k894663K381454N48077j966522L822765J4500152J5442706
5570C8801284J545748j2131185r781247K416017N593650m224837j2445981r341272
$$ y = [-47023643, -43094258, -31700793, -15012105, -4094653, -5463829, -12301549, -13868158, -8349898, -2145963, -872847, -4832478, -10077250, -11830987, -10035336, -11375061, -20860986, -32825816, -38005618, -38171458, -42669279, -50049361, -47370492, -32198655, -20123540, -21678832, -26174703, -20798460, -12610608, -14967516, -21855076, -15478249, 5021514, 22000014, 25760330, 23868573, 22130820, 15175611, 2344854, -3993461, 3510034, 13357094, 11255998, 1528711, 461590, 12845908, 26175519, 27422784, 17382877, 6967315, 4072652, 6454106, 7002183, 5035661, 8858426, 23358578, 38801284, 40347032, 28215847, 18434600, 20850617, 26444267, 22219430, 9773449, 432177]
5562D32177k561116k459788p056503q125364l947696R04075L569161M866475N701080
5553h677499N491414L453867l8830l031474l626474k825218l423281m830649k986029
5544b0494173K354047N713610M839947M804999P909120P580766N17119l500853
5536I724582M175165J3663291Q208003r944276k0873233j4063157O18691J0281375
5528A790441J2479363Q390422k168432j2786638j1064872M562566J8998494J9038568
5520C9239912Q454848k229135j0696544j8572626k1275276j3542883m57272O794789
5512a2284187M126807k830895o685447m199983K095159M492107k746928j3521561
5504c1554928j4117671j790089R248395P282868l8944J696275J0975781J3061236
$$ y = [432177, -2128939, -4588727, -11645230, -19770594, -23718290, -22814215, -19245054, -14378579, -8677499, -3186085, 267782, 228952, -2802522, -6428996, -9254214, -12677495, -17508144, -20494173, -18140126, -12426516, -7586569, -2781570, 5127550, 12708316, 13225435, 9724582, 13899747, 27563038, 35771041, 25826765, 4953532, -9109625, -8490934, 1790441, 14269804, 22660226, 20491794, 7705156, -3359716, 1202850, 20201344, 39239912, 47694760, 45465625, 34769081, 16196455, -5078821, -18621704, -19078976, -12284187, -8157380, -10988275, -17673722, -21873705, -19778546, -15286439, -18033367, -31554928, -45672599, -47462688, -38214293, -30931425, -30970369, -29274094, -18298313, -5237077]
5496e237077K960524o979893m512134O941641J4120621R626843j739812r240210
5488E940503o443304L386859J1244792J1841547P817493M174346J547842k929224
5480C6580854j0374505j7797413j9645948j1789989L122209J5167621J6890148
5473A2152977J2683606J1644101J1942592K864052j5250813k5677265j7310520
5466f951270j188533N250528J607962l01096J896944m47361q835026j3168247
5458b2136099q366744k740085m148224p692828m682432K995359O351776M154765
5450c6264512N103299J3409223J9628181J2159707n051597j4604104p591406M281906
5442h929303M717917n284091j1146613o595067L21721K845084M045808O519527
$$ y = [-5237077, -2276553, -9256446, -13768580, -6826939, 7293682, 16920525, 15180713, 5940503, -502801, 2884058, 14128850, 25970397, 33787890, 37962236, 39510078, 36580854, 26206349, 8408936, -11237012, -23027001, -19904792, -4737171, 12152977, 24836583, 36480684, 48423276, 51287328, 36036515, 10359250, -6951270, -8139803, -2889275, -1281313, -1582409, 314535, -132826, -8967852, -22136099, -30502843, -33242928, -37391152, -45083980, -49766412, -46771053, -40419277, -36264512, -31161213, -17751990, 1876191, 14035898, 8984301, -5619803, -13211209, -8929303, -4211386, -9495477, -20642090, -27237157, -26915436, -24070352, -20024544, -13505017]
5434a3505017O066925J419915r72954J200994J31431q308621j5134869j1818297
5426d0920493l444521J615015M966735R525855Q252475l495597j3290851o888728
5418d3680110P924676J1529332K860184o30349O983380J1351429L572366n118757
5410e207849k927269M667380P156643N660877N617503L461616o298803j7242401
5402e112303j6960296m535829P703890R549571K988113l324653m450171k549292
5394a6690970j974794k424562J072831R500532J4504813P560527o904044j4898632
5386a0254299j0156276r98810J793844k722355p876676p755302p54374R571025
5378b9153223J4824292Q788252l084334o974047K978707J6521331J9160637Q449728
$$ y = [-13505017, -7438092, -6018177, -6991131, -5790137, -5658706, -13967327, -29102196, -40920493, -44365014, -42749999, -37783264, -28257409, -20004934, -23500531, -36791382, -43680110, -35755434, -24226102, -21365918, -21996267, -15012887, -3661458, -89092, -5207849, -8135118, -3467738, 3688905, 9349782, 14967285, 18428901, 12130098, -5112303, -22072599, -26608428, -18904538, -9354967, -6366854, -9691507, -14141678, -16690970, -18665764, -21090326, -20017495, -10516963, 3987850, 11548377, 4644333, -10254299, -20410575, -21409385, -19615541, -22337896, -30214572, -37969874, -38724248, -29153223, -14328931, -5540679, -8625013, -15599060, -12620353, 3900978, 23061615, 31511343]
5370C1511343m795028q792657k077898N576008L070193r163812j7947142j2635938
5362a5254931J231144R314706O621850O75476j150403J659503P367659J3050187
5354B3515191J1387017k226520j8138815k0043437p108008L560860J041983n110467
5346a3122196j531681R322607J5490193J3094940Q015352N264817M538624K727543
5338D3800199l874351j5175979k2435493j5472065J857858J2898259R781591L183950
5330A4563969L999122P129355L409180l327856l981429o26961j288257m316244
5322A5560879k293785K662209K265092j455836J729974J0956220J1993074j291179
5314D0126648j5650677j5841515m699115K421379j164398o042868j058098J0387545
$$ y = [31511343, 26716315, 17923658, 15845760, 21421768, 24491961, 15328149, -2618993, -15254931, -14023787, -4709081, 1912769, 2588245, 1437842, 3097345, 10465004, 23515191, 34902208, 32675688, 14536873, -5506564, -12614572, -9053712, -8011729, -13122196, -14653877, -5331270, 10158923, 23253863, 31269215, 36534032, 41072656, 43800199, 39925848, 24749869, 2314376, -13157689, -11299831, 1598428, 11380019, 14563969, 18563091, 25692446, 29101626, 25773770, 21792341, 21165380, 19877123, 15560879, 13267094, 15929303, 18194395, 16738559, 18468533, 29424753, 41417827, 40126648, 24475971, 8634456, 3935341, 6356720, 5192322, -850546, -1908644, 8478901]
5306H478901J3343209J083114j3583562j3077170J512558J1502530O169650m240040
5298A1189190o035418q87368J888168J626588K685906J843507o811156j8038994
5290a2539577j9612909r160174L860626J1419202J2244876O801287j805040m523784
5282a3315493L595281J2001023O836864o674789r572917K045139J0536090L775605
5274I226803p921899j0362197o055208m708514n221102j093849M252078K124071
5266a9759817n516147q142558l273059J024363N96089Q71963N248041P612345
5258b1338780J994655o851175q859029j423541Q557846J3708995J2415294O626142
5250D830407j465594q709594j0752269o055752J088300M398730K014893k836629
$$ y = [8478901, 21822110, 22905224, 9321662, -3755508, -2242950, 9259580, 15429230, 11189190, 5153772, 4266404, 6154572, 7781160, 10467066, 12310573, 5499417, -12539577, -32152486, -41312660, -37452034, -26032832, -13787956, -6986669, -8791709, -13315493, -9720212, 2280811, 9117675, 2442886, -7130031, -5084892, 5451198, 9226803, 1304904, -9057293, -15112501, -19821015, -25042117, -26135966, -21883888, -19759817, -25275964, -33418522, -36691581, -35667218, -35071129, -34199166, -28951125, -21338780, -19344125, -26195300, -35054329, -36477870, -27920024, -14211029, -1795735, 4830407, 3364813, -5344781, -16097050, -22152802, -21064502, -16665772, -14650879, -17487508]
5242a7487508o238112n944919j044873O525669J0935375P854926R12042k339307
5234f826707q10433J5128j432455m05097M138372O435060M931512O527571J3373903
5225B5946854J5323749M791158r391726j3798157q712348k812704K855823J0698458
5217B4901107J2633171o23917j7881651j5822171O667910K1937169J0337245j3142339
5209B9006524k1477362j1417780j146794r15121l464933j455925J438270N572
5201i427549l308313l840376k080182o24722J137704M222295N516467K060895
5193f343781j524039L032431J4078907J7239611K855707j7673347k2449573o246473
5185a7030557J2559325J5407469M385240o012715q623607o387324k829450j75537
$$ y = [-17487508, -23725620, -29670539, -30715412, -24189743, -13254368, -5399442, -4487400, -6826707, -7637140, -7622012, -9054467, -9459564, -5321192, 1113868, 6045380, 12572951, 25946854, 41270603, 46061761, 36670035, 22871878, 14159530, 11346826, 14202649, 24901107, 37534278, 36910361, 19028710, 3206539, 9874449, 31811618, 42148863, 29006524, 7529162, -3888618, -5035412, -5950533, -9415466, -10871391, -9433121, -9427549, -12735862, -16576238, -18656420, -19281142, -18143438, -13921143, -8404676, -6343781, -7867820, -4835389, 9243518, 26483129, 29338836, 11665489, -10784084, -17030557, -4471232, 10936237, 15321477, 9308762, 685155, -5702169, -8531619, -8707156]
5177h707156j821757o641492n770725M512285J2514234O521688m990259m509121
5169h892303O390219Q698385l554258j3892231r454664J576791O451190N565097
5161g111774M142849R14415l697417j114703J1038424J8978016J0440952o320918
5153B7269844j4179093j0455583n948799p004001j1118362j5069776j5430621
5146e1936391o399707J0510930K0167428J1068960n435703q214123M005228J2032709
5138a4200669N035480o375792q811598k796922M513354J0243934J2722525Q576690
5130H907002L56945k118662M612017J0995597Q824318L568713K853023Q36493
5122C8835446j2073955k7625483k4321597K114310K6427101K2353549l714869
$$ y = [-8707156, -10528913, -17170405, -22941130, -18428845, -5914611, 607077, -4383182, -8892303, -2502084, 6196301, 2642043, -11250188, -20704852, -19128061, -12676871, -7111774, -2968925, -2054510, -5751927, -6866630, 4171794, 23149810, 33590762, 27269844, 13090751, 2635168, -3313631, -10317632, -21435994, -36505770, -51936391, -58336098, -47825168, -27657740, -16588780, -22024483, -30238606, -26233378, -14200669, -9165189, -15540981, -24352579, -27149501, -22636147, -12392213, 330312, 8907002, 9263947, 7145285, 11757302, 22752899, 31577217, 35145930, 37998953, 38835446, 26761491, -863992, -25185589, -23071279, 3355822, 25709371, 21994502]
5115B1994502j9868275q194752J4985405K2534430R674079n642675r274579n010702
5107B1197433k274920k295623j916458k089859n013379q324857r047307q947414
5099a8712384r473259o000721M872323J5791932J5713139N317716l594506m200662
5091b86422j130918N93846L598862J0585630J6248981J3210744J917205j0660162
5083C4077766j8996947k1017588j5642465m612177M773162N415858j19110j433615
5075a7555116O072006J3950802J0926883k470658j4053417j3862619l731489P033889
5067a3689719J1160067P279690j481304r712159j2835441j0634202o309033j411994
5059c7634095M619073Q808098N008817n447746j0031708k55008J3738793J4348852
$$ y = [21994502, 2126227, -6068525, 8916880, 31451310, 41125389, 35482714, 26208135, 21197433, 18922513, 16626890, 14710432, 12620573, 7607194, -717663, -9764970, -18712384, -28185643, -34186364, -29314041, -13522109, 2191030, 7508746, 3914240, -286422, -1417340, -823494, 2775368, 13360998, 29609979, 42820723, 44737928, 34077766, 15080819, -5936769, -21579234, -26191411, -21418249, -16002391, -16121501, -17555116, -11483110, 2467692, 13394575, 10923917, -3129500, -16992119, -20723608, -13689719, -2529652, 4750038, 3268734, -6443425, -19278866, -29913068, -36222101, -37634095, -33015022, -24206924, -19198107, -24645853, -34677561, -34932569, -21193776, -6844924]
5051f844924P76968r429853m734887N929407P904417Q0591p921991j0521345r524777
5042c4286394o952810k826889J215147K353275M91235k057074l744964l631698
5034d9440172O1983P687166J5563692J8491357J4282531M662772o337929j3602518
5026h631118j3205635n714122L966686J0618884J1276941N412987l578069q447012
5018h300458n153232N49426l75248p376277j1014893o766775J24979M756049Q084900
5009b5471529R599553M705373n287499r928634l327598O578281R454607O077095
5001g600351K989835Q01939l048139n184636j0443R647051J3939068P737479m132800
4992A5139003j2162539r426017L174909J5495781J5866988L665526r749144j4833693
$$ y = [-6844924, -6067956, -15497809, -20232696, -14303289, -6398872, -6318281, -14240272, -24761617, -34286394, -41239204, -44066093, -42850946, -40497671, -40006436, -42063510, -45808474, -49440172, -49378189, -41691023, -26127331, -7635974, 6646557, 11309329, 4971400, -8631118, -21836753, -27550875, -23584189, -12965305, -1688364, 3724623, 146554, -8300458, -13453690, -12904264, -13279512, -20655789, -31670682, -38437457, -38312478, -33556429, -25471529, -15871976, -11166603, -16454102, -26382736, -29710334, -23132053, -13677446, -7600351, -4610516, -3808577, -6856716, -12041352, -12051795, -2404744, 11534324, 19271803, 15139003, 2976464, -6449553, -3274644, 12221137, 28088125, 31753651, 22004507, 7170814]
4984G170814j2983988r876574p377792n541602m663051j540541P565134J6542952
4976a0704648J3002895k211036j1455751m541273N846609L893184n708792p289620
4968a9168432J877795J1574026J5615619J4811518Q516220l176053j3078696j4915850
4960B056147j3233629j4351950j3673925m222994Q734832J5023949J5323247J5633390
4952A1289067J2549284j5459j4642664j8080421j1994471r359826j2209253r734162
4944e2197905J771647J2782577J5449561J1702075O446309L900117Q426988J7835857
4936B6117226K0203452R149170m432067r159465j1928363k2277553k8695619j4229127
4928c5252346J1432027K2206047J4736971R556997J3543020J0638988n448889
$$ y = [7170814, -5813174, -15689748, -23067540, -28609142, -33272193, -34812734, -27247600, -10704648, 2298247, 87211, -11368540, -15909813, -10063204, -6170020, -11878812, -19168432, -17290637, -5716611, 9899008, 24710526, 33226746, 30050693, 16971997, 2056147, -11177482, -25529432, -39203357, -43426351, -34691519, -19667570, -4344323, 11289067, 23838351, 23822892, 9180228, -8900193, -20894664, -30254490, -42463743, -52197905, -50426258, -37643681, -22194120, -10492045, -4045736, -145619, 8281369, 26117226, 46320678, 55469848, 51037781, 41878316, 29949953, 7672400, -21023219, -35252346, -23820319, -1614272, 13122699, 22679696, 36222716, 46861704, 41412815]
4921D1412815j7794284j4364781m922924l22952K577933O001488L040682n652664
4913I975313p373305P81130N268917K56320j998383N511816J1446559P150734
4905C1019101J130755J583482L358101K673386N580150J1376401P313188r040794
4897E4993770k1179995j7958385p810946p650P549534J3390207Q470768l257213
4889C4190090m200542P264354J1704788J939763o862323q859802j6036039k4823462
4881e683173j3073492J5238876K5293508R506398J739111J1328208K867475k2757716
4873B4459195J962322R7557391J59160304Q3144190o9289270j38748750q0735454
4866G7509928n493462j448221k8621031k0329564Q149134J0587197l953951j675173
$$ y = [41412815, 23618531, 9253750, 4330826, 4007874, 6585807, 12587295, 15627977, 9975313, 2602008, 3383138, 8652055, 8908375, 6909992, 12421808, 23868367, 31019101, 32149856, 33733338, 37091439, 39764825, 45344975, 56721376, 64034564, 54993770, 33813775, 15855390, 8044444, 8036794, 15586328, 28976535, 37447303, 34190090, 29989548, 37253902, 48958690, 50898453, 44036130, 35176328, 19140289, -5683173, -18756665, -3517789, 21775719, 31282117, 33021228, 44349436, 47216911, 24459195, 26421517, 123978908, 283139212, 366283402, 296994132, 158245382, 77509928, 72016466, 70568245, 41947214, 21617650, 29766784, 40353981, 36400030, 34724857]
4858C4724857Q613238K6641j5743037j1567098K404898k39704j0359797p94787
4850G065211K0614875K1762660J11529j6058087j4600052j0230944j1022850q009072
4842a0366730R50380N220488J483115k101497j614091P59708O459039J4689673
4834A5480085J4051028r32914j3399470n687646J0683808J0289600o854925j6467113
4826G162453p973184L853704O260445M038332L684329K542743n46889n34921K684330
4817B1171342K504465j427170j901103J435054K3905p598795j0629618j878849
4809A699231J1355220J7034821J1612314Q49143o455904m984158J311987J635804
4801C4058458p774536j6509677j4030751m796431L85388J370406M330499O486426
$$ y = [34724857, 43338095, 43364736, 27621699, 16054601, 18459499, 18219795, 7859998, 7065211, 27680086, 49442746, 49554275, 33496188, 18896136, 8665192, -2357658, -10366730, -9416350, -4195862, -2712747, -4814244, -6428335, -5668627, 790412, 15480085, 29531113, 28598199, 15198729, 9511083, 20194891, 30484491, 23629566, 7162453, -810731, 3042973, 9303418, 13341750, 17026079, 19568822, 19021933, 18487012, 21171342, 23675807, 22248637, 20347534, 21782588, 21806493, 14207698, 3578080, 1699231, 13054451, 30089272, 41701586, 42550729, 36094825, 31110667, 32422654, 34058458, 26283922, 9774245, -4256506, -9052937, -8667549, -7297143, -2966644, 3519782]
4793C519782R90682o296641k149779J1819116J8746936J0602640k373975r449561
4785B5409200j1849931j2644467q302148K116390J0208013Q683038J233010l942179
4777A0910926m207753j809997Q77726K040478J587301K927590P526586Q263510
4769B8116367k685645j8650376k1952728o134292J4854936K4076355J9545271
4762C7169888R976314J042060p421287j5865390k2487317k3721477j5864258p48041
4754c7919508J0596798P804953m238778r496463j343674J0665384J6919622J8593009
4746A1581343J7388923Q170760q061465j5777228m076845J3064478J1933990q034420
4738B6189536k2460616j4875598L260775J1296109O179505Q21696K686016N359659
$$ y = [3519782, 4510464, -1786177, -3935956, 7883160, 26630096, 37232736, 34858761, 25409200, 13559269, 914802, -7387346, -5270956, 4937057, 13620095, 14853105, 10910926, 6703173, 4893176, 5770902, 7811380, 9398681, 12326271, 19852857, 28116367, 25430722, 6780346, -15172382, -21306674, -6451738, 17624617, 37169888, 47146202, 48188262, 40766975, 24901585, 2414268, -21307209, -37171467, -37919508, -27322710, -19517757, -23756535, -33252998, -34596672, -23931288, -7011666, 11581343, 28970266, 37141026, 29079561, 13302333, 9225488, 22289966, 34223956, 26189536, 3728920, -11146678, -7885903, 3410206, 9589711, 10411407, 13097423, 18457082]
4730A8457082R45043p838217j1522564o087410K388013N037555L19716m491768
4722b792550k189578N385976R483492N546279r65668j925831K902800O469355
4714B1914275M481046Q7250k262587k713316l017721k010315J390504L523025
4706B1392161k25877q039972j3107507j2049245p287751j615502M124762P755745
4698i053186O090923N3728n427228p648546p242612l068710O699004J6949075
4690b647552J7818160Q590443J219158M110330R848627O642062m159868j1023662
4682C0397698q856380l484863j071203j185910n36349K390297O448146P595133
4674C1696569J490726r414187j4808870q432597K166456M751430j370345o109910
$$ y = [18457082, 19402125, 11563908, 41344, -6046066, -3658053, 1379502, 1699218, -2792550, -4982128, 403848, 9887340, 15433619, 14467951, 12542120, 15444920, 21914275, 26395321, 26482571, 24219984, 21506668, 18488947, 16478632, 17869136, 21392161, 21166284, 13126312, 18805, -12030440, -19318191, -20933693, -16808931, -9053186, -2962263, -2908535, -8335763, -15984309, -23226921, -26295631, -19596627, -2647552, 15170608, 23761051, 24980209, 29090539, 38939166, 45581228, 41421360, 30397698, 21541318, 18056455, 16985252, 15799342, 15262993, 17653290, 24101436, 31696569, 33187295, 23773108, 8964238, 531641, 2698097, 7449527, 6079182, -30728]
4666c0728l882654N82861J843840P56451M9967j57762N9537J927318M844692O149516
4656A2143038N519199N567199O936767O636852K295668m991615j2144152j5580408
4648F382548j2545264m805444Q04270M13798m26887N224446J2949013J1007697
4640A9004177j760372j1185105n622220P962986J2121961J03750j6789439k2578055
4632a8742317j3226015J317980R297794Q476554M727978K723303K456066L575163
4624F06506O224418O227527k331104j5240187j7283448j162758J9315822K4659197
4616B1015973J3287499p67214q808821j2509410j0766141J198533J6212667J5485953
4608C4349039n851085k6031135k1976777M81266J5207470J0813427K594881P309763
$$ y = [-30728, -3913382, -3330521, -1486681, -730230, -680263, -838025, -778488, 1148830, 5993522, 12143038, 17662237, 23229436, 30166203, 36803055, 39098723, 34107108, 21962956, 6382548, -6162716, -10968160, -10163890, -9750092, -10176979, -4952533, 7996480, 19004177, 17243805, 6058700, 436480, 8399466, 20521427, 20625177, 3835738, -18742317, -31968332, -30650352, -21352558, -12876004, -8148026, -5424723, -2968657, 606506, 6830924, 13058451, 10727347, -4512840, -21796288, -22959046, -3643224, 21015973, 34303472, 33536258, 24727437, 12218027, 1451886, 2650419, 18863086, 34349039, 28497954, 2466819, -19509958, -19028692, -3821222, 6992205, 9587086, 16896849]
4600A6896849J9052126J9160035L478779j1905342j2881948m982467k506041p381703
4592A8930288r766143o794163o751615j1471942q969983P047796K1981972J8140932
4584B2347142K48614j1795566j1089848q228426q973160n498251N738021J3366855
4576c884619O936625p833933j8177037j9947212j6158713p710971N223143J7540927
4568d4011790K3288959K2600697J8748247J1960150K115860n977209o727870j433474
4560B0563570L702346N757032O274830N720135K592937j429055r78301N137753
4552D7341247Q727334J57799j7584146k8069186j9970532l289068J686604q237900
4544a9237848j4254127k943500J3875339J7529103J0121091P700725J2019122
$$ y = [16896849, 35948975, 55109010, 58587789, 46682447, 33800499, 28818032, 26311991, 18930288, 9164145, 2369982, -4381633, -15853575, -24823558, -17775762, 4206210, 22347142, 22595756, 10800190, -289658, -8518084, -17491244, -22989495, -17251474, -3884619, 3052006, -4781927, -22958964, -42906176, -59064889, -66775860, -61552717, -44011790, -20722831, 1877866, 20626113, 32586263, 34702123, 28724914, 21997044, 20563570, 24265916, 30022948, 36297778, 42017913, 44610850, 43181795, 42203494, 47341247, 56068581, 56226380, 38642234, 10573048, -9397484, -12686552, -10999948, -19237848, -33491975, -36435475, -22560136, -5031033, 5090058, 12790783, 24809905]
4537B4809905Q469385p688677k1852642k1826396j3146774n710747Q27110R392584
4529b6726252J4989355J2211672N220729J476447K044321M699049R051416J2087408
4521C5054145P200834m586482j0862312m188943N401463M089370o113586j2040710
4513A3953779q715483l080768j152018j513667r16988J228187L482179K662209
4505E947430l866991j2034496j2308615k660495N863231L774500l059106l331847
4497b1676389K102991L967157J455690K067299N881400L791817o213958j3156022
4489b1780015q383470K531077Q868628Q430330O006590L743057K5077m532024
4481e090750o075591k466419M424791J1235868J4816389J1525618q67199j7776807
$$ y = [24809905, 33279290, 25590613, 3737971, -18088425, -31235199, -36945946, -36118836, -26726252, -11736897, 474775, 5695504, 7171951, 9216272, 13915321, 22966737, 35054145, 42254979, 37668497, 26806185, 22617242, 28018705, 32108075, 25994489, 13953779, 5238296, 2157528, 1005510, -508157, -1425145, -196958, 3285221, 5947430, 2080439, -9954057, -22262672, -24923167, -19059936, -15285436, -18344542, -21676389, -19573398, -15606241, -14150551, -12083252, -6201852, -2410035, -8623993, -21780015, -30163485, -27632408, -18763780, -10333450, -4326860, -583803, -558726, -5090750, -11166341, -13632760, -9207969, 2027899, 16844288, 28369906, 27502707, 9725900]
4473I725900k7401659k1277161n392609N112606M568154L419510J1388475K1449977
4465A593193K0201377R143012K637946N497477O370964l356294j6556605k1801361
4457C729709j7281087p188170N914215J7929388K1318945J4401905N502377R88419
4449D5315701l107424j0451083j4261280p474723L833030P417227O30353r234836
4441A2666965j5400956j4540034n178590Q019581J3825459P167142k894761o037667
4433b372861m689542n627323n453466K580020J2879660J3148037L432456l725221
4425A0171760j506057M403528O777841M146895k118128q355818p821237J182065
4417F880849R076719P047064J346413L294202Q990766M482715j0154953j8782189
$$ y = [9725900, -17675759, -38952920, -44345529, -39232923, -34664769, -31245259, -19856784, 1593193, 21794570, 30937582, 33575528, 39073005, 45443969, 42087675, 25531070, 3729709, -13551378, -20739548, -14825333, 3104055, 24423000, 38824905, 44327282, 45315701, 42208277, 31757194, 17495914, 10021191, 13854221, 21271448, 21901801, 12666965, -2733991, -17274025, -22452615, -14433034, -607575, 6559567, 3664806, -2372861, -7062403, -12689726, -18143192, -15563172, -2683512, 10464525, 13896981, 10171760, 8665703, 13069231, 19847072, 23993967, 21875839, 13520021, 5698784, 6880849, 15957568, 23004632, 24351045, 27645247, 36636013, 41118728, 30963775, 12181586]
4409A2181586j3489500m972337l944407o659135n417125r66993K963283P007935
4401a3296693J0678691Q673531N134p009518n981106j998238l346536r559986
4393b1834721j4000260j3290698q327665k50241Q941797J4767931J3839440P325948
4385a2828469j028255p472011q387283k958470K955856J344617p288975j3241755
4377d8904745j0051230j932709M342420R003385J5472375K1078200J8233730N082887
4369A2324313r315947j3092667m498629N541079O003237r40556m124263j49835
4361h253268K232420k783765p982121m751740L443943Q005567Q626133R698104
4353H235273R399525L862676k486186k975006j474089o392763j4476776j3972788
$$ y = [12181586, -1307914, -6280251, -10224658, -16883793, -22300918, -23267911, -20304628, -13296693, -2618002, 6055529, 6060663, -948855, -6929961, -8928199, -12274735, -21834721, -35834981, -49125679, -57453344, -57703585, -48761788, -33993857, -20154417, -12828469, -13856724, -21328735, -29716018, -32674488, -29718632, -28374015, -35662990, -48904745, -58955975, -60888684, -56546264, -47542879, -32070504, -10992304, 7241426, 12324313, 3008366, -10084301, -14582930, -9041851, -3038614, -3979170, -8103433, -8253268, -6020848, -8804613, -16786734, -21538474, -18094531, -10088964, -1462831, 8235273, 17634798, 21497474, 19011288, 16036282, 14562193, 8169430, -6307346, -20280134]
4345b0280134l027242P896315J1728708J0724272P188380R59719l773670j784359
4337I631989K668715Q74811n108141n353623M97968L336123J902646L596653O676769
4328A8723910k38299j6348575k3901783j2710429N293066J3649296J0713526M739089
4320h0199J774547M342093J0584407J0598696l605623k1438818k2087766l265912
4312b3178575J4739063J7654257J1423291L427921q220215j8341623j1754697
4305a4250578R745435K0146060N813364j1773234r078182M261604O289408j2544
4297A1141333J810338P066676j924892j9936850k2070036k891186J4905598J4920899
4289C021880O940349N962215J0279181Q889686j704524j4290413j7197952l842260
$$ y = [-20280134, -23307376, -15411061, -3682353, 7041919, 14230299, 15190018, 11416348, 9631989, 12300704, 13175515, 8067374, 2713751, 3211719, 6547842, 8450488, 12047141, 18723910, 18485611, 2137036, -21764747, -34475176, -29182110, -15532814, -4819288, -80199, 1694348, 6036441, 16620848, 27219544, 23613921, 2175103, -19912663, -23178575, -8439512, 9214745, 20638036, 24065957, 15845742, -2495881, -14250578, -4505143, 15640917, 21454281, 9681047, 602865, 4864469, 11153877, 11141333, 12951671, 20018347, 18093455, -1843395, -23913431, -26804617, -11899019, 3021880, 9962229, 15924444, 26203625, 35093311, 33388787, 19098374, 1900422, -1941838]
4281a941838J6286656K1092195J769341k0861491k0683580j123754J2255633R470425
4273A6263587M607447O601768N011273q111774k1882505k2594538j1835267R43339
4265c0996670J2067218K0726094K2567007J5528876N000181l770178j1632688
4258B9489840j8414368j7899649p203485N222991Q824826M286069Q48028K935965
4250H090217N856257M095104j583641o809492r717250j0996274r082796o71586
4242b0819461J1267505J5796047P334928l937812n385599j897521p558812j8296838
4234b3497563j3176973J0992314K8040988J8663184j154707n988678J571514J773898
4226A7223977o910097r072073j837065K781088K000865M275214Q093930K864343
$$ y = [-1941838, 14344818, 35437013, 37206354, 16344863, -4338717, -5462471, 6793162, 16263587, 20871034, 27472802, 32484075, 24372301, 2489796, -20104742, -31940009, -30996670, -18929452, 1796642, 24363649, 39892525, 44892706, 41122528, 29489840, 11075472, -6824177, -14027662, -8804671, 20155, 4306224, 5154252, 8090217, 13946474, 18041578, 16457937, 9648445, -68805, -11065079, -20147875, -20819461, -9551956, 6244091, 13579019, 9641207, 4255608, 2358087, -5200725, -23497563, -36674536, -25682222, 2358766, 21021950, 19867243, 13878565, 15450079, 17223977, 10313880, 1241807, -595258, 2185830, 4186695, 8461909, 16555839, 19420182]
4218A9420182p977238q745630M60678J615335r650512j4576679k894668R051138
4210a3297394N429355l622457n38942J0834802J3528875M960176j959737q50344
4202A4484334R66307k538469o338163l355651L969162O400881O39080n285822
4194H941659k726891M098665L064474o677702j1425731m211890K861207k328258
4186h404467j1948735j0809713Q29792J2160147K0205578K6223467K2871114N144067
4178E6271250j2987955j4509026o228532p079218j4924840j0629132P328864J9082739
4170A6324150J4777933M393331m514277j3405518j6710150n987743Q931276J0224309
4162A4033311L118147O892540J6720349R937029r430125j2704995L252233J1348897
$$ y = [19420182, 11442944, 2697314, 3157992, 4773327, -4877185, -19453864, -22348532, -13297394, -7868039, -11490496, -12029438, -1194636, 12334239, 17294415, 15334678, 14484334, 15450641, 12912172, 6574009, 3218358, 7187520, 13588401, 14227481, 8941659, 6214768, 10313433, 13377907, 6700205, -4725526, -8937416, -6076209, -8404467, -20353202, -31162915, -30333123, -18172976, 2032602, 28256069, 51127183, 56271250, 43283295, 28774269, 22545737, 15466519, 541679, -10087453, -2758589, 16324150, 31102083, 35495414, 30981137, 17575619, 865469, -5122274, 3809002, 14033311, 17151458, 24043998, 40764347, 50701376, 41271251, 28566256, 31818489, 43167386]
4154D3167386N334645P398833J7923135J5517188J8943919P4873379J52408032
4147C35566517J33705022k5039156j92774081k10926741r5451370K341843N990329
4140d6587637k0499121j0186694J4613314J5072717P536043J5422894J8200779
4133f427705k194748j7071929r07923J8483230P337685j3449223m404668K4221256
4125E585975L0332887P943738j0084756p716404j689292m584036q069475m928183
4117F790454K91350M781163R740869R477070k480507j8193810k3622902j8576762
4109c1793075j2126348m545510P557023J4801603N752338r251145p754793J0686086
4101b6673821K1482681R809639j0839669k0854450j8326391j2466179o961672
$$ y = [43167386, 48502031, 55900864, 73823999, 89341187, 108285106, 183158485, 335566517, 469271539, 444232383, 251458302, 40531561, -54919809, -52577966, -46587637, -67086758, -77273452, -62660138, -47587421, -40051378, -24628484, -6427705, -8622453, -25694382, -26602305, -8119075, -781390, -14230613, -18635281, 5585975, 35918862, 43862600, 33777844, 26061440, 24372148, 19788112, 11718637, 6790454, 7081804, 11862967, 21603836, 31080906, 28600399, 10406589, -13216313, -31793075, -43919423, -48464933, -40907910, -26106307, -20353969, -29605114, -37359907, -26673821, -5191140, 4618499, -6221170, -27075620, -45402011, -57868190, -64829862]
4094f4829862j81286O461773R644877R722234R338881Q890403O811766K816988
4086a1324226q14093p30232L790019Q150859O614225L16298l715490l321538m139572
4077e173750q487992r892238m697672k92688l085280o275787m61114R892694J2759137
4068a5714690P040432K275953K620569L698568L938880O054610P029388j85006
4060A6758704j2420818j5955630n064474R120676J3445791P934847R98446k694211
4052A2123331l450842j930715L30676J02130k661993l284056l70102k19549o757480
4043f118600j1664245l923764J1844108J6934153K229511j7860678k2272540r090745
4035c9922800M673316P276604M834290O281538P328089l39750j0945442r694072
$$ y = [-64829862, -65011148, -58549375, -48904498, -39182264, -29843383, -20952980, -14141214, -11324226, -12138319, -12868551, -9078532, -927673, 5686552, 6002850, 2287360, -1034178, -5173750, -13661742, -23553980, -28251652, -28544340, -31629620, -37905407, -38366521, -28473827, -15714690, -8674258, -6398305, -3777736, -79168, 3859712, 9914322, 16943710, 16758704, 4337886, -11617744, -16682218, -7561542, 5884249, 13819096, 14817542, 12123331, 8672489, 6741774, 7072450, 7174580, 4512587, 1228531, 858429, 638880, -6118600, -17782845, -21706609, -9862501, 7071652, 9301163, -8559515, -30832055, -39922800, -35249484, -27972880, -23138590, -16857052, -9528963, -9868713, -20814155, -30508227]
4027c0508227M830788J6694443J4318456M456452j127816k198210m877634q628592
4019g040340q959881p676919r627647j2189591q284742J314928Q082675P907842
4011c6473675M625530J520128j774124l205947J286785Q725422R662765K186672
4003a3446444l080697J786309Q909395N037812r171870j9194940j4850816r14844
3995d4926095J0829141J3593025Q397158R47860j749306L405639J0693646J0044051
3987A1235119k48881r521647p931279L64832L533593j128770m718617r51637N319857
3978d047430O268622R68324o179820j0971352r929943j413754R477179J2944325
3970b883849O507849n32927K065L913489K937074j946437m304605m337070o902271
$$ y = [-30508227, -25677439, -8982996, 5335460, 9791912, 8664096, 6465886, 1588252, -7040340, -16000221, -23677140, -33304787, -45494378, -53779120, -52464192, -44381517, -36473675, -31848145, -30328017, -32102141, -35308088, -34021303, -25295881, -15633116, -13446444, -16527141, -14740832, -5831437, -793625, -9965495, -29160435, -44011251, -44926095, -34096954, -20503929, -12106771, -11158911, -12908217, -9502578, 1191068, 11235119, 10986238, 1464591, -6466688, -6101856, -2568263, -3697033, -8415650, -9367287, -4047430, 2221192, 3189516, -2990304, -13961656, -23891599, -25305353, -15828174, -2883849, 3624000, 3091073, 3093138, 7006627, 9943701, 7997264, 3692659, -644411, -7546682]
3961g546682j0409837q140110L28888Q307316J2085680J3447465J2898709Q615081
3953B9586510J533952n554318j1897387j5147613r157956N182462J3561086N689087
3945A3795823p101519p681168o56774l799173j5437595j5099056J332974J3133527
3937b1512961Q672115K417845O414192R033557j630307j4339798j3641460m858642
3929b9445459r49321J48652N418963Q562630K852026r31056Q336544J8540396
3921A2533375J1493518n849795j1871011m528610R270k600434k156027J913429
3913a056285j71700n711771j644765R243946R474686k700758q789454q55734P137488
3904D925653N197964J412304K443809K090592j844841n14747O577425N863188
$$ y = [-7546682, -17956519, -26096629, -25767741, -17460425, -5374745, 8072720, 20971429, 29586510, 31120462, 25566144, 13668757, -1478856, -10636812, -5454350, 8106736, 13795823, 6694304, -986864, -1643638, -5442811, -20880406, -35979462, -34646488, -21512961, -12840846, -10423001, -4008809, 5024748, 3394441, -10945357, -24586817, -29445459, -30394780, -30246128, -24827165, -16264535, -13412509, -14343565, -6007021, 12533375, 24026893, 18177098, 6306087, 1777477, 1786747, -813687, -2969714, -1056285, -1227985, -6939756, -8584521, 659425, 10134111, 7433353, -1356101, -2211835, 4925653, 10123617, 11535921, 13979730, 16070322, 14225481, 13710734, 20288159, 26151347]
3896B6151347o194246j3636430p103846N51108k643734q654930p444816n015433
3888b3990980p582245n699823P913721K0384222J7193400N385221K88932J620586
3880A5513034P54846o21077J881277P66558j0162735j8349080r237640Q165386
3872a1289431J3865349P574416M774478Q101331N946130l257540p907051m069721
3864A3737961O15288L407722P757353R457897J465666q525282o398175K883566
3856B4401996P59181j2810974j7445519o992793j86269p445668j2006365J348361
3848c0378050J9766572K2075908R255611k415556o828449r955371j4721560j8347980
3840c1548875j8345375j0517163J0195399L5954229M3848435K2086319r555021
$$ y = [26151347, 19957101, 6320671, -783175, -232067, -2875801, -11530731, -18975547, -23990980, -31573225, -37273048, -29359327, -8975105, 8218295, 13603516, 13892448, 15513034, 16267880, 15646803, 17528080, 18294638, 8131903, -10217177, -19454817, -11289431, 2575918, 10150334, 14924812, 23026143, 28972273, 25714733, 17807682, 13737961, 14353249, 17760971, 25518324, 34976221, 36441887, 27916605, 21518430, 24401996, 25161177, 12350203, -5095316, -12088109, -12274378, -19720046, -31726411, -30378050, -10611478, 11464430, 20720041, 18304485, 11476036, 1520665, -13200895, -31548875, -49894250, -60411413, -50216014, -14261785, 29586650, 51672969, 42117948]
3833D2117948k0838434p467760Q156673Q534409j869434j0249300j1722847q857421
3825b196166m935023j698718J030328M452276O869630L813427m005056p951832
3817d621134k535498N863774P891401L541150j421783n155344p382341l867228
3809g687003O163558J2657033O913341l047736k467617P529951J1598364L970019
3801C5629910m179137l562057Q88492J350324j173154k725702m258266o908844
3793A5061566p161815l238202j30608k183880n637361m228262J451642N114124
3785i52796L012779k308812n095977k087510L325355L918846j622789n338405
3777g149309j773675J784322l741111j2202336r571054K866144Q462341J043249
$$ y = [42117948, 21279514, 13811754, 21968427, 30502836, 28633402, 18384102, 6661255, -2196166, -7131189, -8829907, -7799579, -3347303, 3522327, 7335754, 3330698, -4621134, -7156632, -1292858, 6598543, 10139693, 8717910, 3562566, -3819775, -7687003, -1523445, 11133588, 18046929, 14999193, 12531576, 20061527, 31659891, 35629910, 31450773, 27888716, 28777208, 30127532, 28954378, 26228676, 21970410, 15061566, 7899751, 4661549, 4530941, 2347061, -3290300, -7518562, -6066920, -952796, 2059983, -248829, -5344806, -7432316, -4106961, -188115, -1810904, -7149309, -8922984, -7138662, -10879773, -23082109, -32653163, -29787019, -21324678, -20281429]
3769b0281429n866045k153095L214311M52301k254180O625897J9774043K0696037
3761B0207840Q858831j709176m963959p413299j1666790j1680127n950108j259750
3753a5576538m72534R49759L422536O59120p213942r752577j315297R799039J3528802
3744e971632J0595684O524934J594148n441124j0377458q987260n107019n355450
3736b2525177q529650p393302M25371R219755J2179284P331966k175336r817026
3728b1284115r185889J77238J1024656J5306704J1950238N905806J796904J275781
3720A6967323M110899P867414P821747J309629p752030j1776383p607005K06915
3712A1148509M712021L585854m9905k902574n373248q538802r295078l476022
$$ y = [-20281429, -26147474, -28300569, -25086258, -24633957, -26888137, -20262240, -488197, 20207840, 29066671, 27357495, 22393536, 14980237, 3313447, -8366680, -14316788, -15576538, -16049072, -15099313, -11676777, -11017657, -18231599, -27984176, -29299473, -19500434, -5971632, 4624052, 11148986, 12743134, 7302010, -3075448, -12062708, -17169727, -22525177, -31054827, -38448129, -38022758, -28803003, -16623719, -9291753, -11467089, -21284115, -30470004, -30292766, -19268110, -3961406, 7988832, 13894638, 15691542, 16967323, 21078222, 28945636, 36767383, 38077012, 30324982, 18548599, 10941594, 11148509, 15860530, 19446384, 19396479, 16493905, 11120657, 2581855, -6713223, -10189245]
3704a0189245N386459O930433k185555j1649373j1627511p318670q919435j1902729
3696e1475626k241120J8537989K9704736J8484368k686294j3959540j1427489
3689a5062976l665189L890442R489374Q698217K79044p185369n978873j354940
3681a0890270j970283m318049K16817P742508O443962l119746p290404L37616
3673a2847849J0986261J4527772R502675j322808j3220010j6731903n873633R372210
3665e607285J2392758L693674K79345Q148957J2585017K774321j0927287j4820888
3657H518612j1643621r603430n146158P743125K1063714K1933062J1677576J354884
3649D5897764n449556j0899000j0836771j439753O832493N93350j3038246j3740334
$$ y = [-10189245, -4802786, 2127647, -57908, -11707281, -23334792, -30653462, -39572897, -51475626, -53716746, -35178757, -5474021, 13010347, 10324053, -3635487, -15062976, -18728165, -14837723, -5348349, 3349868, 3628912, -3556457, -9535330, -10890270, -12860553, -17178602, -16961785, -9219277, -2775315, -5895061, -13185465, -12847849, -1861588, 12666184, 22168859, 20846051, 7626041, -9105862, -14979495, -5607285, 6785473, 10479147, 10758492, 18907449, 31492466, 34266787, 23339500, 8518612, -3125009, -12728439, -17874597, -10131472, 10932242, 32865304, 44542880, 45897764, 40448208, 29549208, 18712437, 17272684, 24105177, 24698527, 11660281, -2080053]
3641b080053K54107P892143j935898j2871006o510191J0725202J9410178J4117206
3633B9001688M398738l157674r144280j1793462p441592m08050o07944q981039
3625h133615j4377900q436406L315212R527777P428219L888923L956958L921841
3617A091009j722329r564332r239130K109911J2768703R810141l415068j1212724
3609i373819o686569L56084n86610o328665p937171n184302m128242n181863l382381
3600d8433538J448404L934588K380132Q87329J767456L051360M323156P813870
3592b2827243J2214697J2489430Q070493M442567L939294K102914l158470o387998
3584A0885684m170020k660265p358804j0931672k039088J5430109K3327946J2204951
$$ y = [-2080053, -1825946, 6066197, 4130299, -8740707, -15250898, -4525696, 14884482, 29001688, 33400426, 30242752, 21098472, 9305010, 1863418, 1455368, 847424, -8133615, -22511515, -30947921, -27632709, -18104932, -10676713, -6787790, -2830832, 1091009, -631320, -10195652, -19434782, -17324871, -4556168, 5253973, 1838905, -9373819, -16060388, -15704304, -16290914, -22619579, -30556750, -35741052, -39869294, -45051157, -48433538, -46985134, -43050546, -40670414, -39783085, -38015629, -34964269, -30641113, -22827243, -10612546, 1876884, 9947377, 14389944, 18329238, 20432152, 17273682, 10885684, 6715664, 4055399, -3303405, -14235077, -16274165, -844056, 22483890, 34688841]
3576C4688841n737695j1898079l321203O780634P124003L72442k757808L404714
3568B8655849J3841193J8177923J0789667l514320j4128210j5660778j2722034
3561B5439290j1886366j1491931m692115P408099J2921489M426222q193295q612283
3553E319110L661033J1868042N565557m761631m361300L052624J841860r999758
3545A2185537j6781665q822183L726225P294557L401682J388773K154417Q84198
3537E431541n63367K909021P288188L706344n974616j0550578p000945l927554
3529h681966n309919l940272L933592R543553M854983m490633p656902k764777
3521a4512341M879880J1763833J5533405J1734865j72138j2120769j6361551j4670807
$$ y = [34688841, 28951146, 17053067, 13731864, 20512498, 27636501, 28008943, 25251135, 28655849, 42497042, 60674965, 71464632, 67950312, 53822102, 38161324, 25439290, 13552924, 2060993, -2631122, 4776977, 17698466, 22124688, 13931393, 5319110, 8980143, 20848185, 26413742, 21652111, 17290811, 20343435, 22185295, 12185537, -4596128, -13418311, -9692086, -2397529, 1004153, 2392926, 4547343, 5431541, 4868174, 7777195, 15065383, 18771727, 12797111, 2246533, -4754412, -8681966, -13991885, -17932157, -13998565, -4455012, 399971, -4090662, -11747564, -14512341, -9632461, 2131372, 17664777, 29399642, 29227504, 17106735, 745184, -13925623]
3513a3925623j1949315o694171L506601J2619283J2826330P091205M858492P697428
3505A6030230R106039O316356J954303m177449j3625122k0180989j4394557Q89662
3497a8081527J0584613O461665l132150o381943k373976J918270J810177k561687
3489a1756558q643165j2670843j1949692p309583l60703R538358K0205346K2728068
3481b18772J2228387n32884p92218Q026100Q316442m003115j2134739m455735
3473F433466P768820Q119515k582832j2385604j5767315j3864040o771159K584931
3465b6464218N162750j784060o711435k99958P995357M043390p196097q763571
3457c4017842R61412N822778k326011j1798863r463806K339401J3135506J8014225
$$ y = [-13925623, -25874938, -32569109, -29062508, -16443225, -3616895, 3474310, 8332802, 16030230, 25136269, 31452625, 33406928, 29229479, 15604357, -4576632, -18971189, -18081527, -7496914, -1035249, -4167399, -10549342, -12923318, -11005048, -9194871, -11756558, -20399723, -33070566, -45020258, -52329841, -52690544, -43152186, -22946840, -218772, 12009615, 11476731, 10684513, 18710613, 27027055, 23023940, 10889201, 6433466, 14202286, 22321801, 19738969, 7353365, -8413950, -22277990, -29049149, -26464218, -21301468, -23085528, -29796963, -30096921, -22101564, -18058174, -25254271, -34017842, -33056430, -27233652, -29559663, -41358526, -50822332, -48482931, -35347425, -17333200]
3449a7333200J7455402J1504439J248718q227783j1667540q505021j909009M618085
3441a2815909Q945418J1077288J1911947R464379l34048j4980358k2101236j2442632
3433b1275151O102262J5658867R076014l886540j0688973q810596l999604k629910
3425b0453631o658548j0900247o425784P300082J6503109Q329987r722922j6699832
3417c8727786n240339R868454J3279270P589565M122367N275902N262571K555873
3409C985877K097886O534146J1925124J2691310P428165m61358o467298r357688
3401B8376164j1559348j4524685j5961153j3887202j0096263n718868K379573
3394d0991782J4528805K1826500J5756213J957627n431579k378490K104125J381452
$$ y = [-17333200, 122202, 11626641, 12875359, 4647576, -7019964, -15524985, -17433994, -12815909, -3870491, 7206797, 19118744, 28583123, 28249075, 13268717, -8832519, -21275151, -15172889, 485978, 9561992, 5675452, -5013521, -13824117, -17823721, -20453631, -27112179, -38012426, -44438210, -37138128, -20635019, -12305032, -22027954, -38727786, -43968125, -34099671, -20820401, -13230836, -9108469, -3832567, 1430004, 3985877, 6083763, 12617909, 24543033, 37234343, 44662508, 44201150, 37733852, 28376164, 16816816, 2292131, -13669022, -27556224, -37652487, -43371355, -40991782, -26462977, -4636477, 11119736, 13077363, 7645784, 5267294, 7371419, 8752871]
3386H752871j394111k468028k902504k433504J150369L785084k011433j2386447
3378i907703j2965600j31902J1310182R485741J854399J24916O91610o235754
3370e774111j6489810j6226233k629017J2896493K0583634K0220982J4517551
3363B7099489N214329l823651q238769q631552q310001o993100l134066j79866
3355f997187k898956q759990j0082741l895343O213848J5818816K0967747J7114044
3347B7480238M651451p067647r482929o130865n635176o754740j652886P665192
3339C072638R463333N92179p887279p401629k697972n73433J180744N774047P775446
3330I298074J603814o506781n839075K232523N031448l765015j5238698j6260947
$$ y = [8752871, 7358760, 4890732, 1988228, -445276, 705093, 4490177, 2478744, -9907703, -22873303, -23005205, -11695023, -2209282, -354883, -229967, 461643, -5774111, -22263921, -38490154, -41119171, -28222678, -7639044, 12581938, 27099489, 32313818, 28490167, 20251398, 11619846, 3309845, -3683255, -6817321, -6997187, -9896143, -18656133, -28738874, -32634217, -26420369, -10601553, 10366194, 27480238, 32131689, 25064042, 15581113, 9450248, 3815072, -2939668, -4592554, 3072638, 12535971, 13128150, 5240871, -2160758, -4858730, -5432163, -4251419, 1522628, 9298074, 10901888, 4395107, -1443968, 788555, 5820003, 2054988, -13183710, -29444657]
3322b9444657m434736J0200731J5610836Q684737k557141p312432l305619J674862
3314a0883419O85165l259234k730080K312010M573913J159753j606821K054881
3306g693832Q504162J0586782Q536346Q340811J0567910Q243512k079345j3233038
3298C1773308j5765457r816225m083440m690600r134923j0593379n067587N282010
3290b2096293J3608741J4200074Q766842M956077O475696Q020927L618987l758881
3282C3792170o369789k435174L682399R337385J3885425J3030388K465201j2118027
3274E5269978j7893350j0476132P45513N091811J353014n541853j0726939j0207715
3266G614327l585549J973166q60613o701209k758838J0582378J7809245J2110497
$$ y = [-29444657, -33879393, -23678662, -8067826, 616911, -1940230, -9252662, -12558281, -10883419, -10198254, -13457488, -16187568, -13875558, -9301645, -8141892, -9748713, -7693832, 810330, 11397112, 19933458, 28274269, 38842179, 47085691, 45006346, 31773308, 16007851, 6191626, 2108186, -2582414, -11717337, -22310716, -27378303, -22096293, -8487552, 5712522, 14479364, 19435441, 25911137, 33932064, 37551051, 33792170, 27422381, 24987207, 28669606, 38006991, 51892416, 64922804, 67388005, 55269978, 37376628, 26900496, 27646009, 32737820, 34090834, 28548981, 17822042, 7614327, 4028778, 6001944, 5141331, -1559878, -4318716, 6263662, 24072907, 36183404]
3258C6183404O490482J1949173J8731435J2334380l423839j4231300j6815821
3251E1217914j6736877j2570164k50047J1667486R727392k993891j0519431q509971
3243B1032411p713607j2177033j2650918n688551j142101l469892k175163R218241
3235a4766613J8860687J3420677j241408q789249m742892J440527J881830k338622
3227C724937o359815n879942J127699J0384138J2192209K766534q835936j1750669
3219b630845p506232n449990p263881n859542O67575M416948P78496k308408M480974
3210b0674905J5781944J5696376q97155j8861096j9881034m492882J0137876J2385348
3202a0805528P138689L700294L091318K634119L717423O481786M256572o371717
$$ y = [36183404, 42673886, 54623059, 73354494, 85688874, 82265035, 68033735, 51217914, 34481037, 21910873, 21660826, 33328312, 43055704, 40061813, 29542382, 21032411, 13318804, 1141771, -11509147, -17197698, -18339799, -21809691, -23984854, -14766613, 4094074, 17514751, 16273343, 7484094, 2741202, 4181729, 6063559, 3724937, -2634878, -8514820, -7387121, 2997017, 15189226, 17955760, 9119824, -2630845, -10137077, -15587067, -22850948, -28710490, -28042915, -23625967, -22847471, -25155879, -20674905, -4892961, 10803415, 9906260, -8954836, -28835870, -33328752, -23190876, -10805528, -3666839, 33455, 3124773, 5758892, 9476315, 15958101, 20214673, 13842956]
3194A3842956j5797251j3322823m085340p02663j679111N338140J8786840K0232538
3186B2613286K138390j7725537j9409371n694439O833473J0983433J0905336Q642928
3178A9287499K344510n155907p263549k716667L573275P238509O347230J10246
3170B3765146p878362r291998j690924M333185k290419j6013253k0394873j0656220
3162d0117718L5615l77099o767542n689204N482143J5435755J3715837L262862
3154a5019351l459237J363785J2651667J8363758J2148254j110970j1201432j1812672
3146A923802m424530M042915O854816L147522j411619j529031Q79495L8775m377835
3137E144310o560458m027955j828041m106530o473723j803700Q908654J6617199
$$ y = [13842956, -1954295, -15277118, -19362458, -20065121, -21744232, -16406092, 2380748, 22613286, 24751676, 7026139, -12383232, -18077671, -11244198, -260765, 10644571, 19287499, 21632009, 16476102, 9212553, 6495886, 10069161, 17307670, 23654900, 23765146, 15886784, 6594786, 4903862, 9237047, 6946628, -9066625, -29461498, -40117718, -40082103, -40459202, -47226744, -52915948, -47433805, -31998050, -18282213, -15019351, -18478588, -17114803, -4463136, 13900622, 26048876, 24937906, 13736474, 1923802, -2500728, 1542187, 8397003, 11544525, 10132906, 8603875, 9483370, 9522145, 5144310, -1416148, -5444103, -7272144, -11378674, -17852397, -19656097, -10747443, 5869756]
3129E869756J5055847P775390K950873L178514L237606j125247n323306j740274
3121B9879159P248003R548460j03255j1504057j3221757q446181p543041j0515023
3113d657692q583200l74800N750515N061738Q80307m126009r678007j1105354
3105b6832502l372667P212351Q315939K92080l860551P91239N418843N613996
3097f421272Q466426J5482722J5697868M977653l928914j664427K445594k202792
3089C2852858r112066p939238l183687l947346o211513j829835M244852K401173
3081G275198m096852o278203o025892q530121o602976Q003471K4099920K3039028
3073C0883573P625976k240057j296480m113807j6553931k3807201j3777534M935019
$$ y = [5869756, 20925603, 28700993, 31651866, 34830380, 38067986, 36942739, 31619433, 29879159, 37127162, 46675622, 46572367, 35068310, 21846553, 13400372, 5857331, -4657692, -13240892, -13615692, -7865177, -2803439, -1923132, -6049141, -15727148, -26832502, -30205169, -22992818, -14676879, -14384799, -18245350, -17454111, -12035268, -6421272, 2045154, 17527876, 33225744, 38203397, 34274483, 32610056, 35055650, 32852858, 23740792, 15801554, 12617867, 8670521, 2459008, 629173, 4874025, 7275198, 3178346, -3099857, -9125749, -17655870, -24258846, -16255375, 7844545, 30883573, 38509549, 36269492, 34973012, 30859205, 14305274, -9501927, -23279461, -18344442]
3065a8344442J6405233J5714905P832767k97144j762452N451337J1897331N315609
3057D2213144j1723940k3573852k2334915j4926675q092038m08763P329128Q054069
3049b3463842P54071n081112l305417J020397K414276K835676L730893R53246
3041b0141812o473394j1708794r367197j446702Q732194J9076112K3511939J6102007
3033A8284353L262522q67482N014571P095033o98208o883837k832239K400785
3025B4775498j767329r695203j0087847l705764J455483L642129M681378K393821
3017A1692166l169955m262080K383188O342304j007830r979772o319884M657234
3009C35371M399398j0349580k1609966j5146053J924769J3365557J3781385R974994
$$ y = [-18344442, -1939209, 13775696, 21608463, 21311319, 19548867, 25000204, 36897535, 42213144, 30489204, 6915352, -15419563, -30346238, -38438276, -38847039, -31517911, -23463842, -22709771, -27790883, -31096300, -30075903, -27661627, -24825951, -21095058, -20141812, -26615206, -38324000, -47691197, -49137899, -40405705, -21329593, 2182346, 18284353, 21546875, 20679393, 25693964, 32788997, 32090789, 25206952, 22374713, 24775498, 23008169, 13312966, 3225119, -480645, 974838, 4616967, 9298345, 11692166, 8522211, 4260131, 6643319, 12985623, 11977793, 1998021, -4321863, 335371, 4734769, -5614811, -27224777, -42370830, -40446061, -27080504, -13299119, -3324125]
3001c324125Q124646O445778M45311q128461j0926119l301288P847293J1542294
2993H725329O558398J041031q32814k776526o226063o917156m577177m957388
2985i962366p793157m460912O332847J2937654R053787N120527J0635282J6967849
2977C8831511J1525908n56890m412853J500343N956803M209932J380463q03972
2969E7631245n697046j0853880r438155l318246k194846p999420j1423166o294591
2961D11895K284443O482694M332019j622920o980476o517408J29150M450406j291144
2952A678659j1386763j2702340l020457O405953P483905M488132M080769N320154
2944B348012M007251J97598l161156m619349l921381o85820M106954P428930O398048
$$ y = [-3324125, 4800521, 11246299, 11691610, 3563149, -7362970, -10664258, -2816965, 8725329, 15283727, 16324758, 15491944, 12715418, 6489355, -427801, -5004978, -9962366, -17755523, -22216435, -15883588, -2945934, 6107853, 11228380, 21863662, 38831511, 50357419, 49800529, 45387676, 46888019, 52844822, 57054754, 58435217, 57631245, 51934199, 41080319, 31642164, 28323918, 26129072, 18129652, 6706486, 411895, 2696338, 9179032, 13511051, 11888131, 4907655, -1609753, -1480603, 2969803, 1678659, -9708104, -22410444, -25430901, -19024948, -11541043, -7052911, -2972142, 2348012, 6355263, 6552861, 3391705, -1227644, -5149025, -5834845, -1727891, 5701039, 12099087]
2935A2099087O76604o023764o464881L770872J8017129K1879646R116591j0517211
2927D2554073k3128244k4398112j7482010n867120M886119P429175L707475O547579
2919e751065J9348140K4506435P156750j8335220k4424309p883232Q812302J1351059
2911A4780860P249444M126136l012714j5215024k0032387j0244402K290035L490023
2903a6568029k977506l842387L757704J0875893J0156911K480912o219213r517361
2895a1853076n270128J505919M517563M757658O811301Q501155M318387j893307
2887A1395472n52988O512413O909311j553906o335877j276935L704625R95275
2879A9797390k974122l647838r172168k2251714k6631768q760714J8061570K8829919
$$ y = [12099087, 12775691, 6751927, 287046, 4057918, 22075047, 43954693, 53071284, 42554073, 19425829, -4972283, -22454293, -28321413, -23435294, -16006119, -12298644, -5751065, 13597075, 38103510, 45260260, 26925040, 2500731, -5382501, 3429801, 14780860, 22030304, 26156440, 23143726, 7928702, -12103685, -22348087, -20058052, -16568029, -19545535, -23387922, -19630218, -8754325, 1402586, 3883498, -2335715, -11853076, -17123204, -15617285, -11099722, -6342064, 469237, 8970392, 13288779, 11395472, 10842484, 17354897, 24264208, 22710302, 16374425, 15097490, 18802115, 19797390, 16823268, 13175430, 4003262, -18248452, -44880220, -53640934, -35579364, -6749445]
2871f749445J8789322M187143k449232j708778K603568O140205M26869j6801441
2863D438211k9767906j9861728P333087K6154635K3292999J0540784K766041k09310
2855B4686813l445980l822722K332864Q773808P548975J616937m87542J346481
2847C8549634m80451p775572j2390575q044062o67397j807615j2556210j9288854
2839b4461102r491645J0724951K2068205J6273197O414028P375777J4073608R952204
2831E2929223o757511j8771771j3892685j609576J003721p927554j4863383r819189
2823a9708725K637332J1449978J1615441N854304k043573j0340735j5958556j3274626
2815b9769160n84005J4267809J9910006J3606888L171674l669200o528680p640229
$$ y = [-6749445, 12039877, 16227020, 13777788, 12069010, 14672578, 20812783, 21239652, 4438211, -25329695, -45191423, -37858336, -11703701, 11589298, 22130082, 24896123, 24686813, 21240833, 17418111, 19750975, 28524783, 36073758, 37690695, 37203153, 38549634, 38069183, 30293611, 17903036, 9858974, 9191577, 7383962, -5172248, -24461102, -33952747, -23227796, -1159591, 15113606, 21527634, 28903411, 42977019, 52929223, 46171712, 27399941, 13507256, 11897680, 12901401, 4973847, -9889536, -19708725, -17071393, -5621415, 5994026, 11848330, 9804757, -535978, -16494534, -29769160, -30353165, -16085356, 3824650, 17431538, 20603212, 16934012, 10405332, 2765103]
2807B765103o535942l436922k101194l717609k797656M224886J0407530O699351
2799E507547l005184m632347O629521J7730629J3199764n420830k0703424j8619432
2791i313756k796935J1306683J3821044Q862222N536616N442455L751115m76279
2783C6133165k779168k052785k370469l796463k36947Q763120J2525010K898091
2775D9083554j2886529k0925490j7368730q913379j493826L001277K743544k091432
2767h851011n822454l904416m70051j374485l455954j57876N736613O163678K139967
2758i995989J675606M296961J252026p377875r679654m42322R713607R960213
2750e97427L639540K66892J965247M715542N723730L315190l692405j1067001
$$ y = [2765103, -3770839, -7207761, -9308955, -13026564, -15824220, -11599334, -1191804, 5507547, 2502363, -2129984, 4499537, 22230166, 35429930, 30009100, 9305676, -9313756, -12110691, -804008, 13017036, 21879258, 27415874, 32858329, 36609444, 36133165, 33353997, 31301212, 28930743, 25134280, 24897333, 33660453, 46185463, 49083554, 36197025, 15271535, -2097195, -11010574, -12504400, -9503123, -6759579, -8851011, -14673465, -18577881, -19047932, -20422417, -23878371, -24036247, -18299634, -12135956, -9995989, -8320383, -4023422, -2771396, -10149271, -19828925, -20271247, -10557640, -597427, 3042113, 3309005, 5274252, 9989794, 15713524, 19028714, 15336309, 4269308]
2742D269308j0798516k836091K849738J459327J069686P607688J2428130N990480
2734B2039750m666095n911036N78513R79383p785300j3491924q214994J433870
2726a5037833P398253J1076888J5133672J4728371M992693r179654j8031146j7609442
2718f528198j0589499j000268O843050Q524671M196338p0774p5025J074056j87600
2709B186751m15314M801394J1136526J0016866J173974p178808j0063060r702284
2701A956045p824888k992316K366264J373734o229512j0118578k662876R647221
2693a4484906J4729317J0375295M133724J078656m98632k257323j867936K739514
2685A3947709R290792J2270545O875636n748568j5708145j2195984J819591R299947
$$ y = [4269308, -6529208, -9365299, -6515561, -5056234, -3986548, 3621140, 16049270, 22039750, 17373655, 11462619, 12041132, 13020515, 5235215, -8256709, -16471703, -15037833, -7639580, 3437308, 18570980, 33299351, 38292044, 29112390, 11081244, -6528198, -17117697, -18117965, -11274915, -2750244, 1446094, 1375320, 1300295, 2374351, 2186751, 1771437, 6572831, 17709357, 27726223, 28900197, 21721389, 11658329, 1956045, -5868843, -8861159, -6494895, -5121161, -11350673, -21469251, -24132127, -14484906, 244411, 10619706, 14753430, 15832086, 15333454, 13076131, 11208195, 13947709, 23238501, 35509046, 42384682, 36636114, 20927969, 8731985, 10551576, 19851523]
2677A9851523L93034j2738185j2291497j55372O492928J697456l003970L58485
2669F04402N167313N033702M494601P259755P168078M85851m365621l53397M780933
2660C0275617O77070q374636j1226925q254012p939284r650166m881629N402635
2652a3971330R126116J208962q395543q834330j746318L811543L378681l94271
2644a5816490l465457m792225n410359m324323K443878J4925709K3137665J6481818
2636B3180216M93225p024530j214342J885348q257459j6901005o405361J3467667
2628g76241J8582135P178356J96608N810398P814684m915538j8959970j7103413
2620b172981k374413J0344430J4388867J1660950L113207r044799j6226638j1616058
$$ y = [19851523, 20244557, 7506372, -4785125, -4940497, 1552431, 3249887, 245917, 604402, 5771715, 10805417, 15300018, 22559773, 29727851, 30213702, 25848081, 25494684, 30275617, 30952687, 22578051, 11351126, 3097114, -4842170, -14492336, -19373965, -13971330, -4845214, -3636252, -12031795, -20866125, -22612443, -18800900, -15422219, -15816490, -19281947, -24074172, -29484531, -33808854, -31364976, -16439267, 6698398, 23180216, 23673441, 16648911, 15434569, 17319917, 9062458, -7838547, -14243908, -776241, 17805894, 24984250, 25180858, 30991256, 38805940, 33890402, 14930432, -2172981, -4547394, 5797036, 20185903, 31846853, 34960060, 25915261, 9688623, -1927435]
2612a927435l56161O057425L204202l480482o627784m012421j4916j258586q189635
2603a6605793j3049678j1194679r613244j4596911j6302092j097208K2627604
2596e9832001L0157315J5270071k46896O69603P585142M402466m034077l866134
2588i894511K718289L126777l218103n971209k615797j12268m36150J517573O862208
2579h023191J1118034J2287085J0946298N115504n560849j4095749j4126436r486637
2571a1825941o362504j585764R605488J9572620J6208870K119681q165706q975885
2563A0590859p874922r690051j0300230p939043p122987p843589k997835Q656473
2555c4521325J7267399J4860091N358183k863429p086743q543838p048684k099810
$$ y = [-1927435, -2283596, 3773829, 6978031, 3497549, -3130235, -7142656, -7157572, -8416158, -16605793, -29655471, -40850150, -50463394, -65060305, -81362397, -82459605, -59832001, -29674686, -14404615, -14651511, -13981908, -6396766, -1994300, -6028377, -9894511, -7176222, -4049445, -7267548, -13238757, -15854554, -15966822, -16402972, -14885399, -8023191, 3094843, 15381928, 26328226, 31443730, 25882881, 11787132, -2339304, -11825941, -18188445, -19774209, -10168721, 9403899, 25612769, 27732450, 19566744, 10590859, 2715937, -6974114, -17274344, -25213387, -32336374, -40179963, -43177798, -34521325, -17253926, -2393835, 2964348, 100919, -6985824, -15529662, -22578346, -24678156]
2547b4678156M490060R702730J0326536L544232q709108j7347973j4494609l436723
2539d0603011O042094J0214201J1388950Q245239k175394j2917182j0935064L393562
2531b7346605J2618003M960416r171753j2069010k618328M877834J861889m880786
2523c1768340n152303J346959P248293Q537994Q286056R620059R498945L077647
2515A0695310p661568j4787622j4203957r130683k879492M771426J1230678R619806
2507a2346102l60372p628727l489788O097142R892719O400544P74170n770967
2499f431381j2330827j1247178J735849J5569642J6485938P965520L240859L170434
2491A8158856m69319m310635J706580J0031304J588618j9861596k6169196p270958
$$ y = [-24678156, -20188096, -10485366, -158830, 3385402, -5323706, -22671679, -37166288, -40603011, -34560917, -24346716, -12957766, -4712527, -6887921, -19805103, -30740167, -27346605, -14728602, -9768186, -18939939, -31008949, -33627277, -28749443, -26887554, -31768340, -36920643, -35573684, -28325391, -19787397, -11501341, -1881282, 7617663, 10695310, 3033742, -11753880, -25957837, -35088520, -37968012, -33196586, -21965908, -12346102, -12706474, -20335201, -23824989, -17727847, -7835128, -1434584, -660414, -6431381, -18762208, -30009386, -28273537, -12703895, 3782043, 11747563, 14988422, 18158856, 17689537, 13378902, 15085482, 25116786, 26705404, 6843808, -19325388, -26596346]
2483b6596346J0986105O683646n237767j211762J0942523P825935p613426j0711044
2475a4932136L354095J2308655L606458p568622n030679M969001Q314085M829258
2467I850115K491875J020919n238941j3950754j6081286q602304K446558J0507043
2459a7556775J3628949J1957212O401575O48437m73980L262855O444571M671014
2451B8983858k82891m414421q074635j4078666k0012123j8683375q888220J44107
2443d5306366N93720j993757L623840J6491692K2112062J0940253q740906k0015548
2435b2295010j5180555j652223P032318M382752l049487l133183O614648J4324286
2427a2956454Q432385o743534j6351622j2479174P84752J5272594K2487260J4557328
$$ y = [-26596346, -15610241, -8926595, -14164362, -15376124, -4433601, 3392334, -4221092, -14932136, -11578041, 730614, 4337072, -3231550, -8262229, -3293228, 5020857, 9850115, 12341990, 13362909, 8123968, -5826786, -21908072, -30510376, -28063818, -17556775, -3927826, 8029386, 14430961, 15079398, 14605418, 17868273, 24312844, 28983858, 28700967, 24286546, 16211911, 2133245, -17878878, -36562253, -45450473, -45306366, -44712646, -46706403, -43082563, -26590871, -4478809, 6461444, -2279462, -22295010, -37475565, -39127788, -32095470, -27712718, -30762205, -33895388, -27280740, -12956454, -4524069, -11267603, -27619225, -40098399, -39313647, -24041053, -1553793, 13003535]
2419A3003535n761023j9521917j0956707R480820J7821865J0691722O381973J0986522
2411C2126790Q668676o455823j4880959l567707R770783M652650q861613q603474
2403A2849323K556581M128479o725759j3518878r276964k620889K484215R695460
2395d28432J3969971N379349r718530j3615145n447413k011802p246221n372580
2387b4490803Q168634J3790869q17057j7418411j2773468P909255K0955586J6577854
2379A1902459L883443q310318j7945716k0868568j2015668L631837J3213147J1109805
2371a5399579L872936n07300q28758P60091L596869P140306Q842601O411411J078639
2362A4967216l031824l143657q25334O37830J595867N233666J0147935R253641
$$ y = [13003535, 7242512, -12279405, -23236112, -13755292, 4066573, 14758295, 21140268, 32126790, 40795466, 34339643, 19458684, 15890977, 25661760, 30314410, 21452797, 12849323, 15405904, 19534383, 12808624, -710254, -9987218, -12608107, -10123892, -428432, 13541539, 18920888, 9202358, -4412787, -9860200, -11872002, -19118223, -24490803, -16322169, -2531300, -3348357, -20766768, -33540236, -25630981, -4675395, 11902459, 15785902, 7475584, -10470132, -31338700, -43354368, -39722531, -26509384, -15399579, -11526643, -12033943, -12862701, -12102610, -8505741, -1365435, 7477166, 13888577, 14967216, 11935392, 8791735, 7966401, 8604231, 10200098, 15433764, 25581699, 34835340]
2354C4835340M15251p530998o204508M708J665462n32345O18783L832153J468227
2345B8572073m489220l396052N267334Q597922p0620j1646989j6590559j6544043
2337a0300154j4304802n782707Q608170J6242052P762115p392939j1820157j484190
2329a8472612J2361133J7971826J2594966J550608o106369n031489l81232j642087
2321A2844744q004146r158916l112464l84548m886841n227497N171619J3499905
2313G41856O678024o972346j1183171p306822q551788j5175118j4585504l954394
2305f0309263N307555O547306N657182P600093Q956512P264451O145645P517894
2297e312625Q152720O598331N173713L700452m12153n097482n221938j840884
$$ y = [34835340, 35250591, 27719593, 21515085, 21519793, 23185255, 22652910, 23271693, 27103846, 28572073, 24082853, 20686801, 25954135, 34552057, 34481437, 22834448, 6243889, -10300154, -24604956, -30387663, -21779493, -5537441, 2224674, -5168265, -16988422, -18472612, -6111479, 11860347, 24455313, 26005921, 19899552, 14868063, 14486831, 12844744, 4840598, -4318318, -7430782, -7815330, -12702171, -17929668, -12758049, 741856, 7419880, 447534, -10735637, -18042459, -26594247, -41769365, -56354869, -60309263, -55001708, -48454402, -42797220, -35197127, -26240615, -18976164, -12830519, -5312625, 2840095, 9438426, 14612139, 18312591, 17900438, 12802956, 7581018, 5740134]
2289E740134j300141m669620o666337n209233k992805N03504Q623900J8065272
2281A2094674J9606417J0538610j751428r750173j1545685p159875J202636N552956
2273A8788132l04319r136353p983391J529969M017034n588372j3287474p652083
2265a9616857L260995N769222N34175j773501K761059Q673977J0245200N506688
2257A5360958m425787j3804120j4615250n806416M483795R757479J2025744J4064367
2249A7040770J2751138N804578k128562o195228p510447p523695m228149L67614
2241H378019j575139j0483220j3874274l595440J0213109J3075525O052430N9256
2233H250266j948727l940552m727973j529113j86867o146936r747817J606121
$$ y = [5740134, 4439993, -229627, -6895964, -12105197, -15098002, -14594498, -5970598, 12094674, 31701091, 42239701, 40488273, 30738100, 19192415, 12032540, 13235176, 18788132, 18483813, 9347460, 1364069, 2894038, 6911072, 1322700, -11964774, -19616857, -16355862, -10586640, -10052465, -11825966, -9064907, -390930, 9854270, 15360958, 10935171, -2868949, -17484199, -23290615, -18806820, -9049341, 2976403, 17040770, 29791908, 35596486, 33467924, 27272696, 19762249, 12238554, 8010405, 8378019, 6802880, -3680340, -17554614, -21150054, -10936945, 2138580, 8191010, 8250266, 6301539, 2360987, -2366986, -3896099, -4082966, -10229902, -19977719, -18371598]
2225a8371598J8806178J8605921k091170j9375899j5676913j321623O207789O918131
2217f299184Q972512R208668l9858j3099291j6525885q563649J083124Q004474
2209a7259089J5494358K1222349J6279154P86920j1762783j1217026k662632L624311
2201A4505562N584480O192490M612351n25341m129095j043786L067185j841045
2193B6422801j2686020j4142304j351128R789933M003648j0782136j4898095n388921
2185a9032222K607528J786065K097322R152462J0935308j847290j5980271j2884261
2177b3165359K902405J0445005L542449l481485r38308L990566M108580L754558
2169A158411O156047M776783l067639p634558l107889j05107q233117j6767834
$$ y = [-18371598, 434580, 19040501, 16949331, -2426568, -18103481, -19425104, -13217315, -6299184, 2673328, 11881996, 11842138, -1257153, -17783038, -26346687, -25263563, -17259089, -1764731, 19457618, 35736772, 36523692, 24760909, 13543883, 10881251, 14505562, 20090042, 26282532, 30894883, 30369542, 26240447, 25196661, 28263846, 26422801, 13736781, -405523, -1756651, 8033282, 12036930, 1254794, -13643301, -19032222, -16424694, -14638629, -12541307, -3388845, 7546463, 5699173, -10281098, -23165359, -20262954, -9817949, -6275500, -9756985, -10695293, -6704727, -2596147, 1158411, 7314458, 12091241, 9023602, 1389044, -1718845, -1823952, -10057069, -26824903]
2161b6824903r135114J0320180K1456786J6777126P588411K761220j004274n172874
2153A6766558k769950P489451J4372777R904241J177129j950086j399680m028688
2145C9561752q411162q566894n087320k862974k118499p46708j464898p096203
2137C207094j1922287p894550K180212P603472N237417K025368J925898R62523
2129C325147k712255m456708k835026l695016q827993r768461o73917J0260431
2121a9383798J1607087N274789J966370L826959L036971l209028p747269n441550
2113a0069469k25508L146568N484955P142684M250320l328836q080808n664907
2105g345001k318133l433450k412995P803879J8222465J3756227k160432r251342
$$ y = [-26824903, -35960017, -25639837, -4183051, 12594075, 20182486, 22943706, 21939432, 16766558, 13996608, 21486059, 35858836, 45763077, 46940206, 44990120, 43590440, 39561752, 31150590, 22583696, 17496376, 14633402, 12514903, 11768195, 10303297, 3207094, -8715193, -16609743, -14429531, -6826059, -1588642, 436726, 2362624, 3325147, 612892, -3843816, -6678842, -10373858, -19201851, -28970312, -29644229, -19383798, -7776711, -2501922, -535552, 3291407, 6328378, 3119350, -4627919, -10069469, -10294977, -7148409, -1663454, 5479230, 9729550, 6400714, -1680094, -7345001, -9663134, -13096584, -15509579, -7705700, 10516765, 24272992, 22112560, 12861218]
2097A2861218N93819J1939770J0031785J325395q79683J711848m73207n169321
2089C1941624k818977L786077K012404q835412j4838841r213144j485579k48694
2081B99458j070004J591795L709399J935793K796119J0659983J6220787R592018
2073D5735348k171201m088852M448630R743233M517143l964027p180803n773881
2065D1265590m209129l696444l601560m076841n152064o853675r662333j1388299
2057g374755p081434K459914O979700k81361j0682955j1497600m579008q16976
2049c2874475L90659R421670K4034210K7314466J3589172o46411q46600N018571
2041D5401262J214514j2198927k2716158k3306873j5469697k140158J1245433
$$ y = [12861218, 13455037, 25394807, 35426592, 36751987, 35872304, 37584152, 37110945, 31941624, 29122647, 32908724, 34921128, 26085716, 11246875, 2033731, 548152, 299458, -770546, 821249, 4530648, 6466441, 9262560, 19922543, 36143330, 45735348, 43564147, 39475295, 43923925, 53667158, 58184301, 54220274, 47039471, 41265590, 37056461, 33360017, 29758457, 25681616, 20529552, 13675877, 4013544, -7374755, -14456189, -11996275, -5016575, -5297936, -15980891, -27478491, -32057499, -32874475, -32483816, -23062146, 972064, 28286530, 41875702, 41229291, 40382691, 45401262, 46615776, 34416849, 11700691, -11606182, -27075879, -29216037, -17970604]
2034a7970604J5543068Q705355J441688J966404K804122n532442j5911366j4347262
2026b3301037k464139N703667N627910M642416M420760j462369j1236792j2923570
2018c0993154k824909Q054988J0746567Q824386P579522N200591N72170j532923
2010E627238L92617J92320m816351p456264j781331P656627J3220606J2841785
2002B5877247O729679n085415j6571678j7209276o362323L551791M950819N355928
1994A236772J1743972J6655289J1383105K282738r8803M53579o021244j5135066
1986B2500342j3168819k81174Q272995N021604j020346j404951L5421k468514
1978A7486558o257557o389728l546145o68907J249336N90721m217587q653700
$$ y = [-17970604, -2427536, 6277819, 7719507, 9685911, 12490033, 6957591, -8953775, -23301037, -25765176, -20061509, -14433599, -9791183, -5370423, -6832792, -18069584, -30993154, -33818063, -25763075, -15016508, -6192122, 1387400, 6587991, 7160161, 5627238, 6019855, 6212175, 1395824, -6060440, -7841771, -185144, 13035462, 25877247, 32606926, 27521511, 10949833, -6259443, -12621766, -9069975, -4119156, 1236772, 12980744, 29636033, 41019138, 43301876, 43203073, 43656652, 37635408, 22500342, 9331523, 9050349, 17323344, 22344948, 21324602, 19919651, 19955072, 17486558, 11229001, 4839273, 1293128, 624221, 1873557, 2464278, -1753309, -10407009]
1970a0407009n296883L369589M767948n769028j6056865j3672444l412277J496323
1962d4980646m14819P64431P832286J0604178J773203j0317426j1115304J873075
1954d3981022J6119012J8702507R485877j444921o026716m758580k603183k733567
1946a7240593n203125p847317o505972J729488J2562682J6050167Q616956m11281
1938A751005j73520P154722J0244516M402367m948805j2837710j8704148j9577820
1930c2689393j0559759M569605J3544504J1431966P010150P756573Q271625J763124
1922A1098395n889383m540931L592207P359305L682921p370P02263J621311j394423
1913A6224295o913673j2176204j5434412j3571742n082622L922433M915483l61930
$$ y = [-10407009, -15703892, -12334303, -7566355, -13335383, -29392248, -43064692, -46476969, -44980646, -45395465, -44631034, -36798748, -26194570, -24421367, -34738793, -45854097, -43981022, -27862010, -9159503, 326374, -1118547, -7145263, -11903843, -14507026, -17240593, -22443718, -30291035, -36797007, -35067519, -22504837, -6454670, 2162286, 1751005, 1577485, 8732207, 18976723, 23379090, 18430285, 5592575, -13111573, -32689393, -43249152, -38679547, -25135043, -13703077, -6692927, 1063646, 9335271, 11098395, 5209012, 668081, 4260288, 11619593, 15302514, 15295144, 15997407, 17618718, 16224295, 9310622, -2865582, -18299994, -31871736, -36954358, -33031925, -28116442, -28478372]
1905b8478372r10259P194253J4126489J0495446N66255m707683k067362L015513
1897g65720N353231L645194j925633r277327j2963265q646663J099005R246095
1889a4235083J1940602J0351537O053107j109614r843683j5308334j2483641j884286
1881b6519395Q576632R419896k50392r850151q755497J56552M445515K5595l081953
1872b5833198L401041J2872150J3758079O018650j304780m499678o877303q390757
1864a0855796m508504M068894J0454529J2087827J3119163J4028712Q481980m933926
1856D1942879j6379307j6565612q798340k934931k047409j354073K807417Q501306
1848E171930J0770363N327920p289866j8592741j7935655n348143O386815P010618
$$ y = [-28478372, -29388631, -22194378, -8067889, 2427557, 2993812, -1713871, -3781233, -765720, 4587511, 8232705, 6307072, -2970255, -15933520, -24580183, -23481178, -14235083, -2294481, 8057056, 14110163, 13000549, 3156866, -12151468, -24635109, -26519395, -17942763, -8522867, -8773259, -18623410, -27378907, -27222355, -22776840, -22751245, -25833198, -22432157, -9560007, 4198072, 10216722, 8911942, 4412264, -2465039, -10855796, -15364300, -11295406, -840877, 11246950, 24366113, 38394825, 46876805, 41942879, 25563572, 8997960, 199620, -2735311, -4782720, -6136793, -3329376, 5171930, 15942293, 21270213, 13980347, -4612394, -22548049, -27896192, -21509377, -14498759]
1840a4498759P82513k220037o37981K21333j55697J795003L925471j09790q963732
1831a9861676j2336678l884941J1187315K2818082K4500462J4951600j197256
1824C6176908j3019100j1034969J811118J2541494J3209169P584292J755849l876042
1816D5148719r829757j2483838r303394l799574l85901J068830J447454j185698
1808A0676841n893669n085164N953815J8706766J8599811K792402j4841013j7911288
1800A2998501l941303J3639206J8423199O908306p781146j0260405q75586N613112
1792C4723884K90264q742871j0109137n943895n983194j0438336j0405859l728814
1784b0337958J615878J806526L376522J0088524J3753953O619869m114081m709253
$$ y = [-14498759, -13716246, -15936283, -16574264, -16352931, -16508628, -14713625, -10788154, -10897944, -19861676, -32198354, -36083295, -24895980, -2077898, 22422564, 37374164, 36176908, 23157808, 12122839, 13933957, 26475451, 39684620, 47268912, 49024761, 45148719, 35318962, 22835124, 13531730, 9732156, 9346255, 10415085, 11862539, 10676841, 4783172, -301992, 5651823, 24358589, 42958400, 45750802, 30909789, 12998501, 9057198, 22696404, 41119603, 48027909, 40246763, 29986358, 29110772, 34723884, 35014148, 26271277, 16162140, 10218245, 4235051, -6203285, -16609144, -20337958, -18722080, -16915554, -13539032, -3450508, 10303445, 16923314, 12809233, 8099980]
1776H099980N281343J2436200Q941543J960752k3412j32856m837525j0660953
1768B1065072j0060398o188375q626537j4826317j0458637P273025K1103686J7624019
1760A6905538O878080M897503P521497n37867j7008018k3308233j3818040l097952
1752b1567492l98972K358800R715468J0536672k95753o486668N235407J9128488
$$ y = [8099980, 13381323, 25817523, 34759066, 36719818, 36696406, 36563550, 31726025, 21065072, 11004674, 4816299, -3810238, -18636555, -29095192, -21822167, -718481, 16905538, 23783618, 28681121, 36202618, 35664751, 18656733, -4651500, -18469540, -21567492, -21966464, -19607664, -9892196, 644476, 348723, -6137945, -902538, 18225950]
$$ [...]
##END NTUPLES=NMR SPECTRUM
##END=
