##TITLE=31Pdec_DE-60_EA
 D2O, 64 sc
 1.7.2024
##JCAMPDX= 6.0         $$ Bruker NMR JCAMP-DX V2.0
##DATA TYPE= NMR SPECTRUM
##DATA CLASS= NTUPLES
##ORIGIN= UXNMR, Bruker Analytische Messtechnik GmbH
##OWNER= root
$$ XWIN-NMR		Version 3.5
$$ Mon Jul  1 16:37:27 2024 Russian Standard Time (UT+4h)  she@DPX200
##.OBSERVE FREQUENCY= 81.013821
##.OBSERVE NUCLEUS= ^31P
##.ACQUISITION MODE= SIMULTANEOUS
##.ACQUISITION SCHEME= undefined
##.AVERAGES= 64
##.DIGITISER RES= 17
##SPECTROMETER/DATA SYSTEM= spect
##.PULSE SEQUENCE= zgpg30
##.SOLVENT NAME= DMSO
##.SHIFT REFERENCE= (INTERNAL, DMSO, 0, 198.062)
##AUDIT TRAIL= $$ (NUMBER, WHEN, WHO, WHERE, WHAT)
$$ ##TITLE= Audit trail, XWIN-NMR		Version 3.5
$$ ##JCAMPDX= 5.01
$$ ##ORIGIN= Bruker BioSpin GmbH
$$ ##OWNER= she
$$ F:/spectra/data/she/nmr/P31/2/pdata/1/auditp.txt
$$ ##AUDIT TRAIL=  $$ (NUMBER, WHEN, WHO, WHERE, WHAT)
(   1,<2024-07-01 16:35:56.31 +0400>,<she>,<DPX200>,
      <continue with go, POWCHK disabled, PULCHK disabled
       configuration hash MD5:
       00 E9 B6 7A A2 85 ED C7 34 08 36 98 17 FE 4E 26
       data hash MD5: 32K
       0C 22 49 04 72 AF F7 FB 44 64 24 53 14 B5 DD 70>)
(   2,<2024-07-01 16:35:58.82 +0400>,<she>,<DPX200>,
      <Start of raw data processing
       efp BC_mod = 2 LB = 1.5 FT_mod = 6 PKNL = 1 PHC0 = 2831.406 PHC1 = -20.11368 SI = 64K 
       data hash MD5: 64K
       74 17 B6 CE C0 4E C1 3B 23 C6 5B DF 25 B6 54 16>)
(   3,<2024-07-01 16:36:18.18 +0400>,<she>,<DPX200>,
      <pk PHC0 = 167.9678 PHC1 = -421.5999 
       data hash MD5: 64K
       35 79 FD 77 F3 43 67 6A C5 73 5F 76 81 60 A3 C5>)
(   4,<2024-07-01 16:36:23.84 +0400>,<she>,<DPX200>,
      <abs ABSG = 5 
       data hash MD5: 64K
       7D 30 E7 F6 E1 AF 49 59 D4 75 80 01 0A CC 1A 60>)
$$ ##END=
$$ 
$$ hash MD5
$$ EE FE D6 65 3C 3B AC C6 00 7C 36 89 6D 58 DD 88
##$RELAX= 
##$RELAX= 
##$RELAX= 
##$RELAX= 
##$RELAX= 
##$RELAX= 
##$RELAX= 
##$RELAX= 
$$ Bruker specific parameters
$$ --------------------------
##$DU= <F:/spectra>
##$EXPNO= 2
##$NAME= <P31>
##$PROCNO= 1
##$TYPE= <nmr>
##$USER= <she>
##$AMP= (0..31)
100 100 100 100 100 100 100 100 100 100 100 100 100 100 100 100 100 100 
100 100 100 100 100 100 100 100 100 100 100 100 100 100 
##$AQSEQ= 0
##$AQ_mod= 1
##$AUNM= <au_zg>
##$AUTOPOS= <>
##$BF1= 81.014009
##$BF2= 200.13
##$BF3= 200.13
##$BF4= 200.13
##$BF5= 200.13
##$BF6= 200.13
##$BF7= 200.13
##$BF8= 200.13
##$BYTORDA= 1
##$CFDGTYP= 0
##$CFRGTYP= 5
##$CHEMSTR= <none>
##$CNST= (0..31)
1 1 145 1 1 1 1 1 1 1 1 1 1 1 1 1 1 1 1 1 1 1 1 1 1 1 1 1 1 1 1 1 
##$CPDPRG= <waltz16>
##$CPDPRG1= <>
##$CPDPRG2= <waltz16>
##$CPDPRG3= <>
##$CPDPRG4= <mlev>
##$CPDPRG5= <mlev>
##$CPDPRG6= <mlev>
##$CPDPRG7= <mlev>
##$CPDPRG8= <mlev>
##$CPDPRGB= <>
##$CPDPRGT= <>
##$D= (0..31)
0 1 0 0 0 0 0 0 0 0.06 0 0.03 2e-05 3e-06 0 0 0.0002 0 0 0 0 0 0 0 0 0 
0 0 0 0 0 0 
##$DATE= 1719837273
##$DBL= (0..7)
120 120 120 11 120 120 24 19 
##$DBP= (0..7)
150 150 150 150 150 150 150 150 
##$DBP07= 0
##$DBPNAM0= <>
##$DBPNAM1= <>
$$ [...]
##$SUBNAM3= <"">
##$SUBNAM4= <"">
##$SUBNAM5= <"">
##$SUBNAM6= <"">
##$SUBNAM7= <"">
##$SUBNAM8= <"">
##$SUBNAM9= <"">
##$SW= 400.765351723535
##$SWIBOX= (0..15)
0 1 3 0 0 0 0 0 0 0 0 0 0 0 0 0 
##$SW_h= 32467.5324675325
##$TD= 32768
##$TD0= 1
##$TE= 0
##$TE2= 300
##$TE3= 300
##$TEG= 300
##$TL= (0..7)
0 120 53 12 22 120 120 120 
##$TP= (0..7)
150 150 150 150 150 150 150 150 
##$TP07= 0
##$TPNAME0= <>
##$TPNAME1= <>
##$TPNAME2= <>
##$TPNAME3= <>
##$TPNAME4= <>
##$TPNAME5= <>
##$TPNAME6= <>
##$TPNAME7= <>
##$TPOAL= (0..7)
0.5 0.5 0.5 0.5 0.5 0.5 0.5 0.5 
##$TPOFFS= (0..7)
0 0 0 0 0 0 0 0 
##$TUNHIN= 0
##$TUNHOUT= 0
##$TUNXOUT= 0
##$USERA1= <user>
##$USERA2= <user>
##$USERA3= <user>
##$USERA4= <user>
##$USERA5= <user>
##$V9= 5
##$VALIST= <valist>
##$VCLIST= <CCCCCCCCCCCCCCC>
##$VD= 0
##$VDLIST= <DDDDDDDDDDDDDDD>
##$VPLIST= <PPPPPPPPPPPPPPP>
##$VTLIST= <TTTTTTTTTTTTTTT>
##$WBST= 1024
##$WBSW= 4
##$XGAIN= (0..3)
0 0 0 0 
##$XL= 0
##$YL= 0
##$YMAX_a= 3589
##$YMIN_a= -4112
##$ZGOPTNS= <>
##$ZL1= 120
##$ZL2= 120
##$ZL3= 120
##$ZL4= 120
##$ABSF1= 198.0616
##$ABSF2= -202.7028
##$ABSG= 5
##$ABSL= 3
##$ALPHA= 0
##$AQORDER= 0
##$ASSFAC= 0
##$ASSFACI= 0
##$ASSFACX= 0
##$ASSWID= 0
##$AUNMP= <proc_1d>
##$AZFE= 0.1
##$AZFW= 0.5
##$BCFW= 0
##$BC_mod= 2
##$BYTORDP= 0
##$COROFFS= 0
##$CY= -3
##$DATMOD= 1
##$DC= 0
##$DFILT= <>
##$DTYPP= 0
##$F1P= 0
##$F2P= 0
##$FCOR= 1
##$FTSIZE= 65536
##$FT_mod= 6
##$GAMMA= 0
##$GB= 0
##$INTBC= 1
##$INTSCL= 9.790993e-09
##$ISEN= 30
##$LB= 1.5
##$LEV0= 0
##$LPBIN= 0
##$MAXI= 10000
##$MC2= 0
##$MEAN= 0
##$ME_mod= 0
##$MI= 50
##$NCOEF= 0
##$NC_proc= -9
##$NLEV= 6
##$NOISF1= 182.463
##$NOISF2= 159.3651
##$NSP= 0
##$NTH_PI= 0
##$NZP= 0
##$OFFSET= 198.0616
##$PC= 4
##$PHC0= 2999.374
##$PHC1= -441.7136
##$PH_mod= 1
##$PKNL= yes
##$PPARMOD= 0
##$PSCAL= 0
##$PSIGN= 0
##$REVERSE= no
##$SF= 81.0140089999434
##$SI= 65536
##$SIGF1= 159.3651
##$SIGF2= -187.1042
##$SINO= 113.3802
##$SIOLD= 16384
##$SREGLST= <1H.CDCl3>
##$SSB= 0
##$STSI= 65536
##$STSR= 0
##$SW_p= 32467.5324675325
##$SYMM= 0
##$S_DEV= 0
##$TDeff= 32768
##$TDoff= 0
##$TI= <>
##$TILT= no
##$TM1= 0
##$TM2= 0
##$TOPLEV= 0
##$USERP1= <user>
##$USERP2= <user>
##$USERP3= <user>
##$USERP4= <user>
##$USERP5= <user>
##$WDW= 1
##$XDIM= 65536
##$YMAX_p= 480622125
##$YMIN_p= -47848414
$$ End of Bruker specific parameters
$$ ---------------------------------
##NTUPLES= NMR SPECTRUM
##VAR_NAME=  FREQUENCY,     SPECTRUM/REAL,   SPECTRUM/IMAG
##SYMBOL=    X,             R,               I
##VAR_TYPE=  INDEPENDENT,   DEPENDENT,       DEPENDENT
##VAR_FORM=  AFFN,          ASDF,            ASDF
##VAR_DIM=   65536,         65536,           65536
##UNITS=     HZ,            ARBITRARY UNITS, ARBITRARY UNITS
##FACTOR=    0.49542278885378, 1,            1
##FIRST=     16045.7642231865, 0,            0
##LAST=      -16421.768244346, 0,            0
##MIN=       -16421.768244346, -47848414,    0
##MAX=       16045.7642231865, 480622125,    0
$$ Real data points
##PAGE= N=1
##DATA TABLE= (X++(R..R)), XYDATA
$$ [...]
43468 -25744270 -29481718 -36025605 -40607766 -33441071 -18100478 -9961900 -14841421 -22137767
43460 -22137767 -22272203 -18553980 -16712649 -14141764 -7072570 333315 2356784 1131199
43452 1131199 2109810 4705380 4423706 834488 -3045889 -6812502 -12375539 -19379537
43444 -19379537 -25664471 -30667605 -34391670 -34991142 -31356562 -26124427 -22159912 -18016205
43436 -18016205 -11112145 -3717570 -995817 -3543336 -6136737 -4405626 333063 3505818
43428 3505818 2422323 -1375211 -3505824 -507954 6959975 15014062 20527178 22620835
43420 22620835 20540526 13535499 4218420 -1385645 324538 6847769 13316849 16917163
43412 16917163 15957263 8945322 -1704794 -8609933 -6812040 -327973 2612515 -978925
43404 -978925 -7643305 -13113013 -14812104 -11208483 -3941401 899979 -1235410 -7222432
43396 -7222432 -10875318 -11733691 -13144177 -13352320 -6672181 5814514 14858556 14901590 10327136
43387 10327136 6951239 4512891 1898495 2621740 8532366 13444792 10591101 3034402
43379 3034402 -788830 453323 734001 -2298526 -4286088 -2855769 -1452467 -2149628
43371 -2149628 -1787259 1052751 1552500 -3843912 -10434374 -11608860 -8526518 -7040021
43363 -7040021 -7466862 -4717741 1934257 6622548 5894005 3306351 2296577 720429
43355 720429 -3063752 -4114050 2534455 12299161 15287035 9414136 2464255 322712
43347 322712 128409 -1956057 -2608175 3252968 12511812 15898389 9580351 -409462 -5977630
43338 -5977630 -4979247 -278867 5073086 9100959 10188023 8521658 7217030 9134357
43330 9134357 12835169 14160409 11998671 10082577 12065241 16636182 18966982 15921171
43322 15921171 8551956 453695 -4765806 -5108290 -1376460 2937913 4278318 1826000
43314 1826000 -2941147 -8489747 -13219006 -14356027 -10399646 -5142208 -5520876 -13561124
43306 -13561124 -23463309 -28937178 -30491382 -32591140 -36444489 -39377924 -39145517 -34728442
43298 -34728442 -24909679 -11065755 7465 1902559 -2829929 -5599389 -3651539 -2833443
43290 -2833443 -7179492 -12597761 -14253162 -14078359 -16132895 -19283165 -19839490 -17786057
43282 -17786057 -14914330 -9822688 -730558 8806949 13173780 12748476 12807340 14597957
43274 14597957 13392831 6424409 -2464100 -7934985 -8750193 -6308218 -1386309 4877237
43266 4877237 9186074 8209631 2017039 -5825301 -11162284 -12121055 -10056994 -7759908
43258 -7759908 -6246759 -4308787 -1999087 -2218407 -6233207 -9560977 -6206477 3476738
43250 3476738 12607427 15330464 11542522 4698924 -1341184 -3370117 -794379 2574238
43242 2574238 1842247 -3284742 -8843725 -12078384 -12872034 -10648586 -5228596 -917225
43234 -917225 -3283108 -9877107 -10524311 -482291 12164241 16687254 12565232 7132396
43226 7132396 4673258 4041170 4109103 4590525 2633039 -4446858 -12453821 -12528937 -2104341
43217 -2104341 11058422 18170155 18953666 19081671 21096252 21669676 17139058 8715776
43209 8715776 1297061 -1691051 -1352929 -1376362 -3749599 -7121260 -9138918 -9108537 -7915296
43200 -7915296 -6709397 -6616356 -8472458 -11479548 -12956265 -10803270 -5931422 -1626474
43192 -1626474 -1081536 -5465972 -12572986 -16884677 -13660222 -4799750 1551211 -429065
43184 -429065 -7795416 -13276160 -14167086 -13595236 -14344812 -15357996 -14343294 -10524662 -4340221
43175 -4340221 2789982 7852346 8024355 3995791 -430302 -2599970 -2942563 -2293551 256964
43166 256964 5470737 11465915 14632560 12770804 7094629 1628761 165173 2671140
43158 2671140 5108268 4088397 1090939 373956 3324960 7096860 8642208 7691330
43150 7691330 5440785 2597082 -546496 -3894056 -7971789 -12876263 -16424503 -15282369
43142 -15282369 -8652948 679850 9287590 15280828 17478759 15154061 9957755 5934499
43134 5934499 5713006 7814993 9103308 8735133 8222797 8533815 8979875 9085580 10297729
43125 10297729 14858560 22677995 29821551 31410815 26552848 19033035 12349573 6230124
43117 6230124 -70594 -3703494 -1336247 5057756 9943152 11159391 10296164 6522567
43109 6522567 -3306929 -16334662 -22391801 -16058513 -5198854 -1375748 -4917413 -6259295
43101 -6259295 -637405 5944000 6574449 2954749 1832067 5863314 11531896 14164514
43093 14164514 12268618 7949791 5006897 5962409 9677569 12509513 12537469 11514114
43085 11514114 11730632 12366323 10619685 5685364 -298583 -5259302 -9389008 -13635356
43077 -13635356 -17368162 -19006900 -18533942 -17776336 -17766024 -17216224 -14660893 -10997853 -8312908
43068 -8312908 -6850761 -5204276 -3435991 -3556518 -5880053 -7032453 -3691181 2403485
43060 2403485 5089791 68470 -9792048 -15830773 -11206455 1917035 13612087 16199005
43052 16199005 12171762 9833865 12136853 13950560 10618127 4040059 -1977455 -7286897
43044 -7286897 -12183173 -13050208 -7302233 -332232 -891552 -9728681 -18605618 -21148238
43036 -21148238 -19126473 -16703323 -14196475 -10616418 -7996665 -9187245 -13613510 -18250786
43028 -18250786 -21128286 -21598287 -18907446 -12802192 -4457764 4424670 11862614 14511934
43020 14511934 9619725 -357977 -8682790 -12339628 -15345152 -20719060 -23545130 -17882600
43012 -17882600 -7652845 -2997128 -6010520 -7912763 -2698463 3654240 2530167 -4071447
43004 -4071447 -6403189 -839089 6021941 7616215 5804676 6260681 9628726 11481201
42996 11481201 9498403 6516335 5738166 5847405 2796136 -4825820 -14068817 -20910751
42988 -20910751 -23663570 -22971772 -20025240 -15783697 -11187151 -7111820 -4308004 -3734392
42980 -3734392 -6102332 -10162572 -12287843 -9504907 -3149224 1870106 2069949 -1207964
42972 -1207964 -3926352 -4106439 -3762820 -6453887 -13275948 -20981155 -24163628 -20260607
42964 -20260607 -12605899 -7315907 -6634820 -6960053 -4623987 -1621168 -2795517 -8327753
42956 -8327753 -12910760 -13315100 -13001266 -16435404 -21421578 -21063617 -12700210 -1226867
42948 -1226867 6901519 9813974 9447860 7744238 5624654 3659275 1551360 -1830272
42940 -1830272 -6296394 -9602845 -10425594 -10233650 -9975101 -6857783 2028606 13656929
42932 13656929 20621363 19607782 15276544 14399182 18450693 23384531 24808784 21811789
42924 21811789 16893056 13330748 11896481 9927618 4921646 -1187050 -3738574 -1727441
42916 -1727441 452483 -1054305 -4747629 -6909540 -6940434 -6861288 -7488637 -8047720 -8130019
42907 -8130019 -7173445 -3448782 3138839 8360348 7574259 2032535 -2417671 -3062814 -2973606
42898 -2973606 -5290827 -8848290 -11148212 -12123221 -12473521 -11126288 -7362771 -3543582
42890 -3543582 -2573009 -3671928 -3551115 -1308453 621998 690908 1039741 4859675 11856075
42881 11856075 17329259 16225493 8722742 1602607 2218163 9919770 15264556 10063225
42873 10063225 -2751807 -12023576 -10968349 -3922055 304731 -1127643 -3467764 -1336243
42865 -1336243 5540387 13194245 17604278 17625813 15647380 16054886 21293040 28133501 29249720
42856 29249720 20580919 6809178 -2475107 -2432847 2825903 6111518 5026653 2397792
42848 2397792 862304 219380 -87390 646274 1798558 -308178 -8517536 -19717025
42840 -19717025 -26411994 -24424794 -17396593 -12437111 -12526066 -14830753 -15639464 -14265854
42832 -14265854 -11311581 -5770653 3229646 12541453 16113248 11244011 1771510 -6376718
42824 -6376718 -11221997 -14690761 -18116760 -20494033 -21017325 -20853331 -21424308 -22252278 -21375153
42815 -21375153 -17353309 -10632029 -3435787 1773954 4255069 5064779 4882524 3047653
42807 3047653 -146299 -1980501 -558028 1689033 939434 -2043043 -2643537 364918
42799 364918 2342816 -599848 -6003714 -8829078 -8130972 -6723557 -6094321 -5322637 -4275359
42790 -4275359 -4316416 -5512348 -5966048 -4855284 -4152581 -6112724 -9966139 -11993102 -8875780
42781 -8875780 -1128728 6719504 10097545 8874092 6864244 6529921 5963059 2413475
42773 2413475 -2901868 -5715634 -3791432 782616 4230170 4725931 3516382 3202632
42765 3202632 4748900 6234690 5450565 3050326 845033 -2401900 -9347337 -17487680
42757 -17487680 -19475164 -13002778 -5473566 -4310437 -6928172 -6084254 -1491409 1149657
42749 1149657 457384 724636 3614809 6431333 8918912 13479128 17219305 12640904
42741 12640904 -279329 -10701905 -10250184 -2740422 4227627 9986889 16479000 19973316
42733 19973316 16034497 8895193 7164596 12143898 17902285 21071228 22861952 22740956
42725 22740956 18403010 12090335 9029409 8574442 4326812 -5254912 -13405738 -14552014
42717 -14552014 -10820676 -6492463 -2384642 881949 218565 -4730003 -8542876 -6813478
42709 -6813478 -2119485 798925 1622564 1749934 -614063 -6902743 -13067165 -14403694
42701 -14403694 -13300117 -15498760 -19865818 -19193929 -11901201 -5931730 -8113025 -14777374
42693 -14777374 -16705684 -10275246 -404194 5567752 4206684 -2372319 -8902642 -11816151
42685 -11816151 -12965034 -17180190 -25044747 -30215773 -26098748 -13719481 -627509 6828064
42677 6828064 7471488 2741861 -5612491 -14135822 -17668623 -14000965 -7251975 -3841788
42669 -3841788 -5496898 -8641462 -10430163 -12245332 -16103522 -20481083 -22235216 -21075091
42661 -21075091 -19248244 -17307860 -13089326 -5557235 2415565 6248584 3724180 -3409837
42653 -3409837 -10800157 -14469253 -14000400 -13032251 -15098353 -18885727 -19617365 -15507892 -10246662
42644 -10246662 -7649745 -6224954 -1515314 7362649 15948487 18935825 14842206 6600368
42636 6600368 -1028680 -4978323 -6166883 -8021544 -11770449 -14094550 -11073481 -3808960
42628 -3808960 1996731 2253764 -1458573 -4482352 -4159734 -1485222 1064676 1881426 504854
42619 504854 -3211054 -9086687 -15527822 -19365893 -18147410 -12899067 -7704423 -5998080
42611 -5998080 -7729282 -10209445 -10924600 -9519855 -8125036 -9644225 -14127611 -16840985
42603 -16840985 -12334362 -1289815 9130209 13149179 12010631 9832044 7034315 1890355
42595 1890355 -3250470 -2623264 5092143 13550856 15545967 10791621 5026932 2974599
42587 2974599 4292601 5909113 6270846 6256885 6525798 5549667 1544051 -4274823 -8318666
42578 -8318666 -8784753 -7250594 -5785345 -5092258 -6278492 -10774236 -16238994 -16450865 -9222411
42569 -9222411 -1342388 -809934 -6574577 -11528740 -13543877 -16269615 -19328092 -16031920
42561 -16031920 -3686733 10334225 16621411 13228036 4320386 -5556854 -12421780 -13196005
42553 -13196005 -9637576 -7917972 -10174192 -10902428 -6322268 -2079296 -4926159 -11097136
42545 -11097136 -11525055 -6356143 -4910354 -11017852 -17409882 -16962199 -11576580 -6253159
42537 -6253159 -1311059 4252293 6712378 1092691 -11361525 -23657839 -29833782 -28439838
42529 -28439838 -21346185 -12459264 -6209835 -4097540 -3323802 -865141 2402193 3659270
42521 3659270 2508287 890992 135317 681060 3307927 7667355 10635734 9288831
42513 9288831 5065400 2085677 1622145 1101001 -1454842 -4867892 -7061443 -7309885 -5669261
42504 -5669261 -2389455 1505161 4894523 8016426 11274914 12801594 9979910 3708948
42496 3708948 -1972542 -5454329 -9475565 -15722278 -20598203 -19209692 -11707062 -3043827
42488 -3043827 2323526 3442901 2148777 1653490 4418462 8985289 10211121 5053474
42480 5053474 -3355424 -9920157 -13786012 -16877975 -18562101 -16920302 -14076846 -14009003
42472 -14009003 -14917174 -10724140 -2000272 1940090 -4021664 -12219790 -12325889 -4930655
42464 -4930655 1679923 4157945 5671431 7597488 8303519 9227346 13322607 17092286
42456 17092286 13438286 4496752 2072649 10854885 19995812 17919013 8071624 1781019
42448 1781019 1328898 82352 -3740450 -4267292 673707 4788551 2715852 -2667924
42440 -2667924 -5573709 -4840484 -3182478 -2918525 -5002580 -8926393 -11531189 -9148502
42432 -9148502 -2756673 2087636 1917651 -1408568 -5314090 -9883297 -14251581 -14169381 -7264573
42423 -7264573 2083878 7055086 5825550 1728344 -1931648 -3984189 -4113001 -2893894
42415 -2893894 -2133253 -2627105 -2908570 -2394466 -3571544 -8145243 -13293448 -15286717 -14684200
42406 -14684200 -13829878 -11374398 -4797917 2527447 3063703 -4848018 -13812397 -16353991
42398 -16353991 -13068606 -9687544 -9518901 -11246116 -11604220 -8146205 -1517885 3653387
42390 3653387 2775677 -2512502 -5371606 -2642732 1102081 1009026 -616301 1486126 7066881
42381 7066881 11344387 12530446 12637475 11450446 5996561 -2547249 -6996552 -2420747
42373 -2420747 7234595 13753782 13247889 7620775 356501 -5642785 -7960434 -6258610
42365 -6258610 -3256666 -1112207 2075775 8562735 14702018 13338973 3521386 -6704347
42357 -6704347 -9655238 -6672323 -4483395 -5935201 -8215947 -8428744 -6712666 -4433959
42349 -4433959 -3021458 -4370506 -8731730 -12109234 -9588782 -1863013 5353530 9146796
42341 9146796 12140385 15838636 16583314 11978569 6825950 7015814 10095552 8102151
42333 8102151 -930383 -10087635 -12718621 -9385859 -4580876 -1262624 -534274 -2578161
42325 -2578161 -5402191 -5742349 -3273253 -1064419 -415395 936130 3414997 3014710 -2336881
42316 -2336881 -8208033 -10454640 -12737480 -20407217 -28973113 -26950968 -11438044 6279729
42308 6279729 13749528 10553063 5077064 3130414 4674922 8416326 13743511 18872380
42300 18872380 21652930 22478309 23369860 24536406 24719256 24121330 23455176 20720349 13351308
42291 13351308 3941690 -998818 303991 2093433 -252547 -3113537 -464442 6586962
42283 6586962 11736561 13326965 16061716 22369501 27625074 26158171 18091514 8100982
42275 8100982 803905 -676971 4479822 12186920 14834853 9187567 783075 -3158732
42267 -3158732 -2969436 -4213979 -7901367 -8838785 -4254778 1248571 1623604 -3277676 -8617377
42258 -8617377 -10403642 -8423980 -5168179 -3476777 -4073940 -4700678 -3045491 -436646
42250 -436646 -244302 -2528091 -3458950 -1010878 1893310 1353883 -3156278 -9712644 -16204002
42241 -16204002 -20158961 -19459807 -15057166 -10017271 -4557910 3932416 14204399 19888297
42233 19888297 18450865 15833986 16891236 16602224 8310811 -3344571 -7113039 -1231108
42225 -1231108 4848197 5387857 5326536 9524974 14098454 13534210 9343844 5708050 2051256
42216 2051256 -3696346 -8726939 -9067558 -6957186 -7781218 -10928295 -10123858 -3048646 4954111
42207 4954111 8116107 6986848 6179268 8292084 11891760 13932567 12858653 9852597
42199 9852597 7325945 6168891 5536768 5668469 8612697 14398106 18572390 16248692
42191 16248692 7519442 -3366796 -12874535 -19746239 -23165940 -22681721 -19650172 -16119507
42183 -16119507 -12536563 -8695734 -5973309 -5731670 -6193847 -4275684 -594376 626516
42175 626516 -2641058 -7428094 -10018150 -10728380 -12727643 -17138771 -20785323 -19181360
42167 -19181360 -11884176 -4407727 -3214392 -8395280 -13422704 -13045658 -8684811 -4537714
42159 -4537714 -2056341 -1290888 -3848376 -9735725 -14097673 -12603801 -8082833 -6085016
42151 -6085016 -5898484 -2952115 1228336 -5636 -6961079 -12015274 -11748787 -11707106 -15171742
42142 -15171742 -16395188 -11522832 -8004360 -13871146 -23144092 -22396363 -9519978 4030096
42134 4030096 9488598 9945469 11689601 14956749 16989271 17628517 17071177 12761697 3724951
42125 3724951 -4802705 -6167554 -809909 4158532 3998609 1546386 2266240 6610827
42117 6610827 9409901 6024517 -2758772 -11919861 -16448062 -13827606 -4595783 7206003
42109 7206003 15198276 15169172 8748988 872672 -5738974 -11093657 -14203597 -13398722 -10712600
42100 -10712600 -10937978 -14530092 -16245455 -13411548 -10621396 -12431353 -16017860 -16110073
42092 -16110073 -13417700 -12151191 -11716444 -7440888 1231570 9158236 12326274 11602400
42084 11602400 9596604 7973328 7848893 9084136 9501423 8104387 7620356 9860580
42076 9860580 10839927 6204473 -180769 -27 7523716 14600350 16447990 16430411 17732787
42067 17732787 17228179 11141830 965873 -9898860 -20374519 -29139390 -32598811 -29225109
42059 -29225109 -22226332 -14930124 -7223790 1058501 7593225 11068210 12890391 13043490
42051 13043490 9156010 2151694 -2823582 -4069465 -5637951 -8442050 -6527213 2213167
42043 2213167 9000457 5657210 -2656415 -4832281 531182 5927444 7906711 9464106
42035 9464106 11266021 10135292 6135274 2764588 89305 -4526064 -9328870 -10240905
42027 -10240905 -9728134 -14184626 -21583926 -21846950 -12307704 -3028958 -2152051 -4679396
42019 -4679396 -1650260 6869008 14438065 17960055 18262442 15954775 13226455 15451360
42011 15451360 24110801 31431596 29058561 19741063 13479702 13584805 13750754 8892918
42003 8892918 1972221 -1595980 -769880 2299080 5995457 8869831 8460398 3681141
41995 3681141 -2766241 -6770934 -7374562 -7329903 -8879174 -10338342 -8214394 -2448835 2459629
41986 2459629 2908388 1082657 1885773 5981172 9169449 8491160 5218272 1251444 -3229385
41977 -3229385 -6849736 -6017305 92192 6546868 7883062 4151847 -864072 -4881940
41969 -4881940 -7474889 -7768858 -5766982 -4520768 -7223020 -12823979 -17396899 -18778640
41961 -18778640 -17159938 -12770995 -6477934 -1377417 -19058 -848880 -952763 -1211218
41953 -1211218 -4453269 -9197694 -10287401 -6299525 -1433387 1397225 4578338 10261965
41945 10261965 14846344 12963710 5090237 -2331520 -3871366 42506 4797369 6240904
41937 6240904 3739606 -157220 -2969091 -5314057 -9768029 -16462134 -21621843 -21874247
41929 -21874247 -18579603 -15864005 -15223000 -14661971 -13205683 -13127035 -15905078 -18527800 -17288109
41920 -17288109 -14256484 -15491394 -21682994 -25154065 -19580315 -9172046 -3244968 -3885485
41912 -3885485 -5109312 -3512319 -2543412 -4630490 -6230034 -4439249 -2387693 -3175880
41904 -3175880 -3930650 -1881023 -1318618 -6709382 -12487334 -9172824 1386932 6768992
41896 6768992 1509998 -5512509 -5196916 -1376790 -3324742 -10893986 -15214143 -12034202
41888 -12034202 -6901815 -6277765 -9012292 -9148324 -4225892 1988310 4417409 2457333
41880 2457333 92799 868147 4174179 7143427 8606976 9257746 8877440 5938472 -91509
41871 -91509 -8031285 -16130231 -21770695 -21139963 -12906912 -2305403 2411519 -1064540
41863 -1064540 -6564132 -6800229 -401844 8916802 16496758 18845030 15542409 11089586
41855 11089586 11448352 16679970 20359631 18215866 13278192 9778605 6590814 1085005
41847 1085005 -4553954 -6803854 -8252358 -14993095 -26722151 -35252276 -34251402 -26011188
41839 -26011188 -16789951 -9242231 -2182392 4491609 7946385 5691153 -900192 -7458049
41831 -7458049 -11169599 -13537356 -17359606 -21806634 -23216793 -21010750 -19284939 -20826953
41823 -20826953 -22905666 -21677013 -17793995 -14324704 -11731593 -8834560 -6543267 -6107818
41815 -6107818 -5244416 -998860 4284698 5061644 839416 -2705309 -1869335 436409 -191236
41806 -191236 -3907294 -7885321 -9821269 -8312172 -3125434 2811615 4943162 3062954
41798 3062954 2691462 7456904 12798067 11257993 2803815 -4203804 -2807483 4641697
41790 4641697 9491494 6033338 -3464908 -12170139 -15717262 -15232712 -14094790 -13534130
41782 -13534130 -12501974 -10426725 -7988030 -5746097 -4225525 -5076305 -9583008 -15707797
41774 -15707797 -19195044 -18507708 -16489433 -16195840 -17223560 -17300604 -15405664 -11842716 -7098678
41765 -7098678 -2455457 -451837 -2865310 -8604121 -14473621 -17514972 -16513863 -12739941
41757 -12739941 -9769413 -10839221 -15251126 -18659196 -17905103 -14472772 -12323573 -13249301
41749 -13249301 -14953874 -13100933 -5567627 4272956 9667307 8081229 5174945 7375953
41741 7375953 11640765 8532053 -3510679 -13593135 -11665169 -870580 8337961 11777448
41733 11777448 12873653 13612695 11742818 6628723 1348060 -2083938 -4541621 -5956570
41725 -5956570 -4461610 -620914 1974701 1996886 2201179 4122160 4836285 1340213 -5131403
41716 -5131403 -11389061 -15630034 -16116400 -10133949 2032430 14576203 21564226 23295405
41708 23295405 23589912 22298744 15388034 2765790 -8729181 -12661211 -10705904 -10329854
41700 -10329854 -15870448 -24257188 -29458534 -29088447 -25561476 -22009518 -19267475 -17407577
41692 -17407577 -17935207 -21681610 -25019904 -21749579 -10615259 1439392 6278957 3628618
41684 3628618 273676 946158 3603203 4360137 3185625 1968221 -463356 -7393178
41676 -7393178 -18688881 -29589261 -35537568 -35433528 -29610683 -18465865 -5500675 1877647
41668 1877647 -759136 -8603148 -13098941 -13313211 -16160650 -24045862 -28966990 -23737228
41660 -23737228 -14083161 -12221828 -20100967 -26712427 -23255799 -14156088 -9625438 -12547339
41652 -12547339 -17694913 -20834364 -22904223 -25541200 -27223371 -25618160 -21407779 -17852610
41644 -17852610 -16821406 -16036871 -11085850 -1099367 8318099 10396763 5867701 2921643
41636 2921643 6518571 11362949 9585118 2813012 738310 7751990 16806968 18630769
41628 18630769 12449173 4549057 -93367 -767425 1847874 6667777 10660133 10428130
41620 10428130 6410115 2952194 3224962 5940358 7796458 7292456 5165547 2674564
41612 2674564 669975 -739299 -2615517 -6277189 -10971503 -13540796 -11754723 -7255982
41604 -7255982 -3723181 -2432694 -1124788 2608042 8148280 12684221 14379009 13822248
41596 13822248 12392990 9974466 5334948 -747167 -3955260 -267202 8337608 14523985
41588 14523985 13712755 9486750 8266495 10392939 10607926 6934181 3932623 5222239
41580 5222239 7305559 4581417 -2461229 -8396604 -10525353 -10881080 -11206385 -10496371 -8142668
41571 -8142668 -5582382 -3746156 -2315026 -2423173 -6010252 -10715139 -9950639 -1613296
41563 -1613296 6940740 7344986 1263374 -2361071 136232 3493359 3110089 1892020
41555 1892020 4138358 7476737 6174791 240960 -4267863 -3981024 -2396886 -3735992
41547 -3735992 -6538224 -6451329 -3086417 -401289 -972168 -3671415 -7703877 -14983731 -25591590
41538 -25591590 -33539743 -31734405 -21328567 -12154943 -12202026 -19563556 -26738002 -29874786
41530 -29874786 -30490258 -30326093 -29272965 -28240757 -29428779 -32035157 -31169347 -23602306
41522 -23602306 -12578925 -4659181 -3225240 -6919720 -12611092 -17163760 -17497572 -12357921
41514 -12357921 -4498371 1360794 3611275 5161029 9231085 15468705 21075477 24160295
41506 24160295 24551653 22328880 17400769 10745618 4919711 2498313 3907191 6936135
41498 6936135 8614161 7753814 5579277 3853144 2914832 1991954 845027 135625 309387
41489 309387 1091507 2178478 3420534 3951328 2193299 -2260077 -7203200 -9518465 -8829738
41480 -8829738 -8604572 -12275592 -18105118 -19591761 -12654961 -1512891 5192567 4444917
41472 4444917 2169856 5003935 11554402 14888146 12067950 7526207 7162368 12254651
41464 12254651 19469150 24019704 22389310 14776983 5654848 -437178 -3855130 -7824087
41456 -7824087 -11778985 -11305579 -5868018 -1425399 -2381198 -5483733 -5606093 -3207468 -831765
41447 -831765 3883347 14366764 25864650 28029394 18223100 5939872 1349208 4047744
41439 4047744 5741653 259479 -11601359 -23822972 -29204339 -24587435 -14706541 -8650030
41431 -8650030 -10381825 -14789557 -14679746 -9172712 -3391857 -2407673 -7451722 -15672948
41423 -15672948 -21631938 -21244648 -15815213 -9772917 -3785164 5533702 17343679 23752488
41415 23752488 19619961 10465113 5020457 3684013 816599 -4507373 -7853097 -8387035
41407 -8387035 -10355688 -14650707 -16252183 -12459425 -7470580 -5690322 -5658955 -4101820
41399 -4101820 -1787504 -1745019 -4847883 -10193484 -16771879 -21881033 -21229696 -14208681 -6370068
41390 -6370068 -2935186 -2107609 1186424 6795347 9318189 6207231 1461310 141123
41382 141123 2435462 4907050 5517845 5230989 5336291 5437187 5148116 6384239 11322082
41373 11322082 17595614 18658146 11531045 1847566 -2528951 -1199329 61007 -1091362
41365 -1091362 -1574932 -744548 -2749350 -8138967 -10147151 -4403271 3259131 4826241
41357 4826241 1630529 1041025 4659747 7171429 5581452 2496742 307825 -1484036
41349 -1484036 -2604493 -1539763 377541 -82855 -1854549 309934 7883856 15743072
41341 15743072 19244691 19348635 18434272 15819821 10683041 5620009 3800769 5173286
41333 5173286 7983216 11165948 12856488 9919125 2223662 -5273208 -7971208 -6936995
41325 -6936995 -5806536 -4825493 -1641259 3550333 7257849 6521666 1210182 -6244045
41317 -6244045 -11395307 -10292618 -4340052 -497487 -3094350 -7390243 -5568031 2318539
41309 2318539 8638564 9397771 9640343 15605018 25665730 32192878 30230936 21762668
41301 21762668 12700371 7785357 7735425 9633473 9937661 7540218 3658380 -824901
41293 -824901 -6351227 -12654915 -17399300 -18080789 -14613610 -9209423 -4219861 -638528
41285 -638528 1974989 4898567 9155092 14133241 17356263 16580844 12840756 10966588
41277 10966588 15656149 26077801 35212463 36103257 28664411 18952076 12094690 8177480
41269 8177480 5201036 2847364 1431184 -349321 -3909586 -8440752 -12281502 -15022830
41261 -15022830 -15943342 -12674102 -5272399 58872 -3357449 -12935471 -17978251 -12570158
41253 -12570158 -2935505 1049171 -1989599 -5342660 -4403127 -1500437 -805076 -2782429
41245 -2782429 -5094494 -5962538 -4643508 -570822 5498625 10078118 8916745 1155776
41237 1155776 -9127023 -15720080 -14394309 -5257672 7006654 15153548 14365461 7299972
41229 7299972 2416362 4515041 8130973 4011291 -8123648 -17941743 -17126436 -9090011
41221 -9090011 -3024384 -2349670 -3701592 -4413633 -5011893 -5128328 -2798033 1335127 3813607
41212 3813607 3469484 2618988 2248550 390750 -3473270 -7090033 -10201214 -15315631 -20854559
41203 -20854559 -19325870 -7574091 5580845 8672206 2252044 -2662083 -7440 4683904
41195 4683904 4364050 351369 -1696151 -952762 -1430055 -4747820 -7688904 -7373196 -5641418
41186 -5641418 -6708641 -11709663 -16893924 -17176990 -10950300 -1310325 6955646 11048671
41178 11048671 11231631 9561218 8133210 7608569 6729864 4141258 1251302 1785559 7070999
41169 7070999 13076030 14284718 10022047 4905885 3184472 4650242 6400408 6701119
41161 6701119 6242156 6740286 9102014 12504418 15220482 16873696 19392403 24604001
41153 24604001 31088003 34583349 31649778 22508103 11108420 3289885 3339766 9965279
41145 9965279 16043170 14734526 6305701 -2506902 -5616239 -2362951 4123666 10551991
41137 10551991 15041709 17535042 19632251 22516758 24824260 24307399 21357384 18312137
41129 18312137 15271771 9923808 2475827 -2544732 -1196882 5721016 14795417 23154737
41121 23154737 27620280 24456900 13731309 1678582 -5137699 -6752813 -7613368 -9122718
41113 -9122718 -8624502 -5100767 -1114642 1792348 5504127 11278419 16570747 18533375
41105 18533375 18649790 20923899 25881976 28746029 24506347 13998674 3876809 109727
41097 109727 2138481 4644547 4656318 4392199 6148920 7521944 4801561 -779263 -4145702
41088 -4145702 -3292341 -1443652 -2180783 -5931750 -11699611 -18387917 -23199529 -22573815 -16781688
41079 -16781688 -10311880 -5639473 -373777 6412768 9196122 2679758 -8735244 -14172840
41071 -14172840 -8917864 1327163 9222565 13259723 14712594 13047955 8860121 7399864
41063 7399864 13245848 22642390 26522601 21587166 13781112 9469060 7563509 3288770
41055 3288770 -3497191 -7845373 -6511018 -1716925 1903784 1566563 -2433829 -7096485
41047 -7096485 -7849022 -1889233 8360193 16773591 19342431 17068845 13044302 9288770
41039 9288770 7120622 7081182 6290416 -680410 -14608884 -27770647 -31821365 -28149863
41031 -28149863 -25443525 -27546549 -29508506 -26582488 -20756169 -14988349 -6687350 6941181
41023 6941181 19952830 21214853 7793656 -10172584 -19985017 -18594325 -12606870 -9273623
41015 -9273623 -10549092 -14403111 -18103784 -19322829 -16698617 -11580750 -8328681 -10623320
41007 -10623320 -17272516 -23535015 -26983440 -29601369 -32770644 -33271627 -27687751 -18749991
40999 -18749991 -12571828 -10072789 -6398967 250671 4923569 3834783 845006 1608877
40991 1608877 5148882 6467950 4706023 2849257 1129156 -2728285 -6897328 -5767153
40983 -5767153 1590944 9069264 12075396 13195967 15954687 17763920 14272213 7868753
40975 7868753 5842461 10093042 13622548 9278500 -839921 -7386046 -4560668 3292007
40967 3292007 7026526 3640879 -447634 2046950 9832371 14841615 12221035 5094006
40959 5094006 -418030 -1226706 2298252 7956979 11754404 9493829 1145244 -8055278
40951 -8055278 -12773919 -12277952 -8938367 -4825711 -1670351 -1133023 -2094504 -94137 7011316
40942 7011316 14522445 15716492 10255539 4329784 2945857 5387620 8199282 9410855
40934 9410855 9150503 8471204 8368261 8604572 7514631 4139145 -103294 -3135684 -4437708
40925 -4437708 -4152168 -1974509 790985 341453 -5027790 -11159128 -12840999 -11157040
40917 -11157040 -11677376 -16124082 -20752018 -23065552 -25008297 -28306830 -31155434 -31158783 -27921154
40908 -27921154 -21708400 -13466468 -6907150 -5793926 -7795211 -6124856 925849 7722632
40900 7722632 10812061 13777573 18255580 17557817 7043690 -4487342 -3774820 8349204
40892 8349204 17259682 14191344 6388895 4492041 7885056 8357061 3065626 -2923988
40884 -2923988 -4925359 -3403718 -366789 4109608 9728756 13239003 10887072 3417935
40876 3417935 -3438214 -4531422 -346702 4734095 8078618 10118628 10365541 6198480
40868 6198480 -2281868 -9652521 -10953749 -7900402 -5755823 -6093235 -6981325 -8584568
40860 -8584568 -12962720 -18558144 -20651656 -18301454 -15498740 -14087468 -11375679 -7235985
40852 -7235985 -7257620 -14098311 -20806782 -19012975 -10588244 -4536294 -4048023 -3719145 314387
40843 314387 4591673 5038591 3684015 4721860 7616728 8498451 6456404 4344931 3985064
40834 3985064 4137505 3483265 2554009 1698645 -377563 -4363316 -8363774 -10295539 -11344007
40825 -11344007 -14645259 -20522298 -25351930 -25973719 -23298445 -20432767 -19139845 -19722041
40817 -19722041 -22327989 -25777750 -26650979 -22886644 -17504497 -15050953 -14631161 -10919783
40809 -10919783 -2896782 3438830 3668516 1753331 4084831 9982103 13166023 11027271
40801 11027271 7238437 5433799 5172443 5055717 5601951 7142310 7875380 6042096 2147440
40792 2147440 -2313831 -6536568 -9681830 -10361014 -8351916 -5727668 -5308689 -8734659
40784 -8734659 -15844821 -24014096 -28098832 -24011698 -13732486 -4373802 -544239 340454
40776 340454 3416411 9335288 14510601 16820363 17839869 19551701 21390859 21119517
40768 21119517 17225193 10348124 3483095 489349 2919014 8069167 11022000 8792754
40760 8792754 2554894 -3069435 -2645710 5732179 16767995 20741862 13229448 1113149
40752 1113149 -4568518 -1445791 2323857 -673693 -8635619 -15498104 -19896238 -24615820
40744 -24615820 -29410084 -29949690 -24672767 -18411873 -16825333 -19476382 -20789909 -16683264
40736 -16683264 -8043281 1747160 10118560 15432069 16102215 11924554 5715783 1342657
40728 1342657 -348954 -1666501 -3365433 -2472381 2686166 7386096 4767127 -4687380
40720 -4687380 -12163399 -10642175 -2426201 5749953 11430525 16315659 20194208 20574874
40712 20574874 18132071 17403819 20647631 24830463 26389113 25640711 24539438 23171493
40704 23171493 20910090 18376738 15516983 10141591 1681909 -5461271 -6134433 -1113535
40696 -1113535 4096869 6671838 8662480 11367449 11815642 7223308 265011 -2996923
40688 -2996923 276713 6727336 9871344 5415542 -5239335 -15478049 -18163224 -11231680
40680 -11231680 1012834 11966529 17508091 17341264 13509720 8367039 2907187 -3517266
40672 -3517266 -11095080 -17404298 -19027466 -15548297 -10159217 -6014807 -4119696 -5075997
40664 -5075997 -9512725 -14829961 -14647086 -5079486 9617390 20632913 23214659 19513073
40656 19513073 14215422 10572367 10111895 12563518 15296727 15586748 14249054 14714214
40648 14714214 18024057 21486235 23124946 24247382 25574571 23745959 15269316 3027890
40640 3027890 -4657245 -2478792 6119105 12733171 12649688 8663483 6500016 7759807
40632 7759807 8798475 6494753 2936005 2499927 5607234 8266096 7667194 4995834
40624 4995834 1849386 -2507720 -7810555 -9833897 -5098068 2499541 4382132 -2350918
40616 -2350918 -10923363 -13249458 -9392342 -5649554 -5114399 -4446300 -581819 3293122
40608 3293122 1467171 -6269564 -13725661 -15664690 -13212301 -10578936 -8716948 -4861529
40600 -4861529 2397569 10308845 14871672 14882607 12288148 9646022 8003652 6580958
40592 6580958 4049410 587557 -1489732 -231169 2927602 4280149 2388483 -261942
40584 -261942 -873140 489359 2763044 6626045 12499059 17081957 15620072 8232693
40576 8232693 969306 -930559 1316654 2761274 1176435 -1412702 -2248752 -67738
40568 -67738 5608057 13959345 20690156 19596928 9068157 -4465407 -12334439 -12346327
40560 -12346327 -9318557 -7612214 -6635313 -4453637 -2041825 -1204392 -653152 2445313
40552 2445313 7937770 12780492 15448485 17424560 19911922 21473402 19718610 13620504
40544 13620504 3785853 -7662087 -16968830 -20594614 -18291811 -13078356 -7689123 -2659127
40536 -2659127 1752785 4107375 3611698 1664803 108989 -802137 -1542171 -1811623 -1240185
40527 -1240185 -500592 -529212 -1481230 -3133384 -5136215 -6396270 -5895599 -4698602 -5026587
40518 -5026587 -6552196 -6211529 -2915175 598000 2438292 4553488 8057734 9222825
40510 9222825 4815376 -1177087 -1978987 1845518 2885285 -1963091 -6947218 -6212080
40502 -6212080 -1617254 1787891 3686262 6925374 10486966 9518623 2498784 -5831000
40494 -5831000 -9997728 -9459189 -7186217 -4787008 -1490684 2730355 5634598 5252986
40486 5252986 2260715 -1785119 -7308745 -15155121 -22327445 -22758683 -14347343 -2997529
40478 -2997529 2850427 466018 -6342710 -12756770 -16239017 -15575549 -10627132 -3692762
40470 -3692762 1551824 3243985 1926229 -1493785 -5972275 -9004116 -8087402 -3819047
40462 -3819047 900547 4631858 7688313 9056861 6530209 345340 -6448961 -11616134
40454 -11616134 -14695018 -14600135 -10250739 -3704312 1814605 7250010 15679539 24199182
40446 24199182 24625579 15028532 3893155 -1292325 -3001305 -5687058 -5452385 3904619
40438 3904619 18540838 27476603 26517890 21082356 15718130 9233417 1310636 -4064060
40430 -4064060 -4679656 -3400320 -2428093 251309 5417790 8554440 5323569 -2220131
40422 -2220131 -8384135 -10135988 -7784553 -2222367 5082511 11137041 13549303 12888229
40414 12888229 11356226 10297469 9875812 9307056 6725792 1368967 -3463459 -3044597
40406 -3044597 1997396 5527425 4495470 3295441 6502209 11699197 13964688 13712748
40398 13712748 14498068 15659035 13419296 8086814 3814531 1320262 -2708437 -7816214
40390 -7816214 -7861033 46698 9875421 14055876 12793951 11518318 11842279 10591370 7154273
40381 7154273 6205280 10979710 17252471 17113612 7883078 -4654317 -11654528 -8783071
40373 -8783071 850942 9481182 10374421 2918091 -6504395 -9861941 -5334679 819058
40365 819058 1780203 -1489106 -2066459 3244004 9874070 12340152 11160233 9952619 8890471
40356 8890471 5623080 1153428 -351818 2080560 4622737 4610572 3929331 4398620 3745250
40347 3745250 -430132 -5556933 -7260717 -6296221 -7788127 -13163620 -16867793 -13146158
40339 -13146158 -3663197 4066990 4805315 89586 -4901861 -6784001 -5647611 -3148708
40331 -3148708 -799830 197381 -619382 -1799584 -535032 4075048 8841444 9293495 4933603
40322 4933603 337085 461590 5739066 12001197 14129534 9722898 999091 -6164122
40314 -6164122 -7005543 -3101078 -1034844 -4079901 -7302216 -4081439 3927922 7885873
40306 7885873 3409760 -3385044 -4056588 1359950 5569928 4184277 115619 -2344620
40298 -2344620 -3559629 -6405689 -10673476 -12745586 -10470454 -5943485 -2664701 -1397444
40290 -1397444 -266305 1472674 1601344 -2024335 -7828777 -12088833 -13955670 -16022921
40282 -16022921 -18817281 -18258057 -11976814 -5382225 -5822860 -11298397 -11757642 -3913900
40274 -3913900 2000440 -4181338 -17124918 -22039013 -14303849 -4436395 -2365154 -5300389
40266 -5300389 -5533547 -3109325 -3502461 -6688464 -6753969 -1839738 2624923 1955005 -2112820
40257 -2112820 -5645858 -7453483 -7313564 -3933256 1626555 4054200 -345914 -8043770
40249 -8043770 -12413126 -11527393 -7924981 -2934039 3245420 6875192 2735722 -7788864
40241 -7788864 -16443599 -18327972 -17213438 -17597367 -16899002 -10745588 -2002766 2040286
40233 2040286 -157368 -3241006 -3677148 -3848163 -6618706 -10788954 -13400827 -12624570 -7422020
40224 -7422020 1489345 9375602 10875739 7246485 5423201 7822736 8444795 2376853
40216 2376853 -6210401 -10260634 -9374783 -7526095 -5188807 -484945 4447948 5482840
40208 5482840 3607959 2900266 2177533 -3404988 -11716872 -13019797 -3193447 9272757
40200 9272757 13692311 9148567 1933162 -3650733 -6571420 -5253300 1204478 9558989
40192 9558989 15045671 16545167 15624893 12281857 5839988 -1234953 -4885557 -4674114
40184 -4674114 -4144752 -6476844 -12666385 -22688249 -34478599 -42377188 -41002966 -31516798
40176 -31516798 -20942572 -14823265 -13293235 -14156711 -16003592 -17349004 -16163130 -12094003
40168 -12094003 -7158022 -3322174 -1393400 -2493654 -7562098 -14295912 -17616820 -15157301
40160 -15157301 -10189151 -7363691 -7461776 -8063889 -7381189 -5147975 -1283790 3626866 7191331
40151 7191331 7113154 4369525 2474735 3136052 4355625 3704764 2127418 3043968 8124122
40142 8124122 15371582 21591326 25394221 26983410 26349608 23447974 19455459 15595312
40134 15595312 10813467 3335082 -4785233 -7787517 -2958455 5128134 9728166 9484921
40126 9484921 8077726 7976645 8155423 7450035 6575993 6253513 5913092 4704786 1792414
40117 1792414 -4053167 -12570205 -19866508 -21197653 -16549624 -11022542 -9037857 -10214520
40109 -10214520 -11124865 -8804953 -2541478 5067803 8689468 4986263 -2637356 -6931850
40101 -6931850 -4928240 -109555 3682698 6308376 8172188 7654542 4327194 990681
40093 990681 -469647 -2005367 -5089388 -6796514 -4215352 -191582 114747 -2696077
40085 -2696077 -2215585 5422489 16511545 23820599 23524432 17826260 12380356 11134321
40077 11134321 12528719 11362305 5465944 -838807 -1621514 3726782 10613800 15082933
40069 15082933 16863875 17126393 15998994 13072519 8953365 5644372 5429297 8689935
40061 8689935 12760842 14463262 13970660 13796444 13438213 8672133 -1632293 -11471834
40053 -11471834 -14033294 -9724073 -4248048 -617129 2811799 7377748 11217257 11449350
40045 11449350 6943896 -218148 -4333410 77155 10725270 16990598 11703567 805563
40037 805563 -4645628 -3698652 -4931458 -11337882 -14979826 -9312896 1273698 8859905
40029 8859905 12486631 15502597 17201807 13873141 6275604 380626 731720 6414021
40021 6414021 12972717 15663453 11982617 3954431 -2524012 -2668876 3292059 11939637
40013 11939637 20237728 25754704 26079142 21038495 14105573 9201742 7353601 8167467
40005 8167467 12173410 18895683 24633338 25528956 21725527 15713749 8032417 -2109945
39997 -2109945 -12902142 -19977034 -20358910 -14433995 -5181446 2414148 3357430 -2333982
39989 -2333982 -7967482 -7237920 -1654756 3089751 6422946 12696107 21857308 27040608
39981 27040608 23857205 16606878 11679738 8978708 4048374 -4199292 -12194609 -16510159
39973 -16510159 -16271587 -11982653 -5448836 -149889 1681114 2225784 5387471 10822762
39965 10822762 13453526 9513228 786471 -7732292 -12164027 -11131774 -5618351 666718
39957 666718 2859234 -300793 -3898622 -1676799 6241091 12832780 12525020 8015384
39949 8015384 6646942 11256132 17528781 20262989 18762553 14659057 7988732 -1113403
39941 -1113403 -9135493 -12297310 -12365353 -14408459 -18103180 -16881436 -8464836 -784454
39933 -784454 -2190807 -9642345 -13411045 -11462607 -10971507 -14922332 -15981123 -7949543
39925 -7949543 3796227 9922497 10497386 13005237 19342321 23063606 19952022 13787280
39917 13787280 9303823 5770211 1143101 -2413557 -1526479 3208549 8932788 14557016
39909 14557016 19341583 20349130 15931744 9930048 7787007 9536149 10941178 10656338
39901 10656338 11509608 14712478 17419411 17007214 14187377 11041143 9047925 9344930
39893 9344930 11546403 12097110 7644955 598043 -2678232 9675 4507509 7094700
39885 7094700 8608151 10253678 10616409 9576869 10078206 12352171 11298044 4302254
39877 4302254 -2737311 -3023256 776850 219230 -6855205 -14551973 -18336515 -19526642
39869 -19526642 -19962312 -18620473 -15408300 -12927351 -11780738 -8385143 -497783 8283010
39861 8283010 12749098 12810209 13048742 16389105 20422917 20264073 14407673 7451442 5960837
39852 5960837 10808329 15455596 14072530 9390426 8676115 13133354 16450318 14337536
39844 14337536 10107612 8559431 8989670 7722131 4198211 750796 -1419186 -2370481
39836 -2370481 -1135171 2930151 7079184 6839836 1258507 -5550217 -8452330 -5673591
39828 -5673591 604088 6700632 10534343 12982612 15776332 17922283 15887640 8443775
39820 8443775 -416918 -5400727 -5771066 -5236920 -6494486 -8047025 -6847016 -2515724
39812 -2515724 2125709 4403105 4856966 6144327 8661165 8676688 2680349 -7045663 -13797473
39803 -13797473 -13827003 -9904226 -6654172 -4872135 -2041504 3592289 11337938 18966632
39795 18966632 23840551 24623981 22993819 21759178 20337177 15003655 5469938 -2198697
39787 -2198697 -2581805 1767417 3936980 1703854 -1420171 -3035664 -4887840 -8771874
39779 -8771874 -13514489 -16908418 -17523870 -14220275 -7156811 187488 3324206 1894286
39771 1894286 -437005 -1571849 -2979645 -5570864 -7671118 -8482954 -9539424 -10848494
39763 -10848494 -9626270 -5169686 -701182 2753162 9760764 23031795 36318240 40819992
39755 40819992 36546957 30899854 26943488 20168014 7875691 -5018244 -12481024 -14323208
39747 -14323208 -13199863 -9376346 -3044645 1685585 607881 -4262657 -6996346 -5650722
39739 -5650722 -3475497 -2775711 -2607431 -3274755 -7799839 -16086043 -21577098 -17889709 -7208859
39730 -7208859 1375425 1464563 -5110459 -11746379 -13463656 -9657434 -2678059 5090754
39722 5090754 12951998 20598129 25474123 23893425 16754536 11943011 17016278 29541698
39714 29541698 38608773 37218555 29767302 25174637 25917046 27584182 27264361 27281939 29881530
39705 29881530 32593635 31821853 28712301 27905612 30953565 34415760 35439540 36038197
39697 36038197 39238260 43261699 43676096 40866963 40518801 44961667 48680746 46184218
39689 46184218 40659523 39314088 42123434 41821790 35205892 27687621 24570062 24191628
39681 24191628 23368481 23633910 26396656 26549443 18325899 5468999 -1859077 -206758
39673 -206758 3781649 3833142 1276537 -231203 -886558 -1914904 -1505540 1905446 5725726
39664 5725726 6985819 7317437 9704607 12488395 11469192 6612549 1703244 -1920602
39656 -1920602 -5912910 -9020714 -6630756 1441509 7747194 5739359 -1598590 -5728769
39648 -5728769 -3214287 1770318 4698192 6064933 8556830 12106682 13843053 11768401
39640 11768401 7203944 3873105 4587099 8179793 10236705 8030603 3924853 2009401
39632 2009401 2317430 1495837 -1034726 -1897846 -184296 -424153 -5454753 -9925392 -6413450
39623 -6413450 3395859 9505833 6208368 -1361771 -5237623 -4628278 -4635335 -8196937 -13420901
39614 -13420901 -17714876 -21002848 -24570930 -28692863 -31712287 -30875244 -24930787 -16544727
39606 -16544727 -10549318 -8692647 -7922217 -5181659 -1509965 795525 2444022 4963048
39598 4963048 5997927 1367749 -8228943 -16719423 -19804516 -19167915 -18361490 -17893809 -16597104
39589 -16597104 -15287008 -16045093 -18642201 -19948225 -17122268 -10402413 -2614369 3712375
39581 3712375 8554577 13247045 17107984 17031110 12119037 6930934 6841756 10814148 12669914
39572 12669914 9945864 7147336 8342019 10675165 8766679 2772769 -2051320 -2412425
39564 -2412425 403948 4409551 9259898 13847363 14886908 9877653 -31581 -11244997
39556 -11244997 -20451798 -25371891 -24489293 -17803243 -7509484 2963265 10379467 12131737
39548 12131737 6814524 -4035284 -15280303 -21140249 -19697780 -14013456 -8681441 -6108265
39540 -6108265 -6266318 -8404477 -11331265 -12710256 -10292684 -4588566 991594 3503257
39532 3503257 3267617 3051043 5519580 11553964 19181028 23586292 20797632 13180264
39524 13180264 8730758 11871644 16864631 14414545 3963401 -5290166 -6177922 -1513612
39516 -1513612 1928849 3009792 5644701 10970003 14909957 13835629 9083948 4280629
39508 4280629 299058 -4806036 -11179786 -14807081 -11621664 -3320937 3540939 5301853
39500 5301853 5555173 9592045 16837638 22393483 24464075 25392445 25559633 21862632 14026983
39491 14026983 7436588 6628010 9800429 12915827 15523726 18649132 20297423 18163443
39483 18163443 14962965 15839211 20779671 24038395 21609691 15944164 12675479 15115371
39475 15115371 22020685 28534749 29648877 25058568 20184611 20204757 23904433 25829700
39467 25829700 23279716 18114109 12910113 9280779 9431853 14890966 22808879 26974626
39459 26974626 23605496 13997711 2021632 -7797406 -10724815 -5344014 2744903 5461969
39451 5461969 1683438 -2205653 -2045830 -717016 -1297675 -1628021 243653 641673 -3939486
39442 -3939486 -9278417 -7972895 300766 8782353 12677449 12559603 9359253 2236187
39434 2236187 -7162529 -13505491 -13382554 -8824835 -3415224 1986056 7710377 12469185
39426 12469185 14724045 15110568 15313958 15678599 15297569 13012817 7292078 -2549676 -13131366
39417 -13131366 -17584951 -12722020 -4322455 -1596472 -6613169 -12821573 -14421493 -13035936
39409 -13035936 -13042763 -14106682 -12447385 -7700321 -3749107 -2382577 -399070 4896425
39401 4896425 10325035 10021533 2819180 -6016826 -9925197 -6112732 3537170 13924765
39393 13924765 19125562 16234140 8370300 2427818 2400579 5502595 5685875 371536
39385 371536 -7135903 -11534831 -10882002 -7727655 -5365946 -4122515 -2462737 -921538
39377 -921538 -2109843 -5801549 -7162069 -2985858 2383777 1781122 -4555295 -8214977
39369 -8214977 -3248951 6751021 14419624 17423725 17928572 16468982 11568552 4839255
39361 4839255 1613988 4942847 11804276 16963030 18837649 19977854 22793164 26457332
39353 26457332 28116803 26313061 22697016 20391019 21157885 24722996 30352596 37603806
39345 37603806 45223730 51112067 54742639 58451833 64669069 72585141 79396251 84549043
39337 84549043 90589421 99102567 107706340 113076458 116651313 125086492 143112730 166240178
39329 166240178 182756976 184401208 173904267 160424857 148882901 136643135 120290290
39322 120290290 101757762 85851858 74324754 64995032 55455690 45363438 35692979
39315 35692979 27712553 22675625 21214725 22731419 25543712 27315568 25958188 21797499
39307 21797499 18603503 19884430 23666146 23976618 18755271 13049470 12415717 16551257
39299 16551257 22123992 28030923 33482806 34224799 27025331 16951087 13699798 19460830
39291 19460830 25541996 23038575 12862647 3167140 352114 4949106 13354975 20625381
39283 20625381 23122420 20956076 17626766 16560351 18573256 22114972 23990415 20534669
39275 20534669 11384343 2284404 530540 6813989 15182651 21728836 28462776 36721732
39267 36721732 42454290 42341178 39988879 40408182 41671181 38636521 33014538 32132196
39259 32132196 37278133 40724136 37122753 31607318 31871098 36461976 36784887 29191037
39251 29191037 19721917 16345413 20490225 27638515 33264678 36077998 37248974 38847110
39243 38847110 42435956 47194393 49487000 46142168 38594537 32133238 30285651 31567273
39235 31567273 32821073 33568924 34546959 33630987 27343946 16772693 8008944 4888922
39227 4888922 4520420 2449528 -787956 -1868329 -1119642 -1945634 -4404208 -4469972 -976530
39218 -976530 1254812 -1897716 -7228297 -7960274 -2531448 4051165 7194637 7552464 8210328
39209 8210328 10051627 11594112 11500689 9481246 6112929 3546018 4894262 10241237
39201 10241237 14072600 10220214 -31644 -8328687 -9482776 -7745329 -9565218 -13340723
39193 -13340723 -12005722 -4760380 494970 -1723498 -7025035 -8799720 -8363931 -11461018
39185 -11461018 -17505704 -19494834 -14625541 -8398036 -6238491 -6654123 -5861502 -4389375
39177 -4389375 -4462712 -4137077 351982 7549727 11394162 9284415 5185652 3792168 5696743
39168 5696743 9691783 15279782 19999462 18670816 10454802 4061146 9366465 23705385
39160 23705385 32911053 28524240 18628364 17264271 26806355 36255449 35206321 23904761
39152 23904761 9782528 -233619 -2519661 2828743 10937511 14659769 11579389 6905295
39144 6905295 7194788 13245812 21278282 28147739 31844154 29558383 20678980 11158212
39136 11158212 9386332 16213003 23245414 23107208 17941847 15270983 18398234 24151986
39128 24151986 28159588 28686586 25934783 21111647 16866336 15903371 17667245 18014271
39120 18014271 13811249 7111052 3217466 4748558 9170780 12753332 15268375 18817514
39112 18817514 22830676 23433946 18991031 13305179 10477553 8736661 3597421 -3604053
39104 -3604053 -5662864 287208 7306603 7202030 1466462 -1048824 3846409 10757445
39096 10757445 12201926 6910342 -853601 -6843286 -9096725 -6763730 -2435 8734222
39088 8734222 15316855 17043855 15048982 13323981 15081896 19951053 25122916 29329686
39080 29329686 34398805 41704233 48443914 50046662 46245287 42105731 42200299 46199577
39072 46199577 51611774 58444775 68703403 82789115 99231597 117500849 138536937
39065 138536937 162462568 188150359 215718824 247673706 286680017 333026474 383874384
39058 383874384 432699954 468855680 480622125 462147591 418286854 361945725 306282012
39051 306282012 258639128 219859102 187585652 160243264 138509378 122931771 110707664
39044 110707664 96894609 79919481 64008141 54030218 49178065 44390740 37254606
39037 37254606 30008713 24367774 18452263 11232793 6662272 9196161 16449112 20691285
39029 20691285 18160868 13169976 11583365 13637321 15687206 16222882 16343452 15520099
39021 15520099 11181639 3315028 -3758568 -5953554 -3945265 -1667517 -1556553 -2510065
39013 -2510065 -1702353 2373577 7993858 11412769 11473251 12545280 19818417 31121573
39005 31121573 37387978 33432792 24380254 17977897 14507046 9746552 4929900 6101151
38997 6101151 13599005 19738682 19299094 16059650 15687311 17795382 19409857 21511651
38989 21511651 26621106 32948621 36391533 36564573 36215779 36389792 36754548 38946294 44386500
38980 44386500 49878814 50825887 48484099 48570406 52270414 53924019 48795610 38508087
38972 38508087 27619852 19352368 15855914 17671145 20855472 19334730 12710039 7574728
38964 7574728 8596938 12789460 15687608 18342225 23597283 29476031 32012258 32197750
38956 32197750 34204365 37795372 38218117 33857515 28990328 27729272 29097690 29555899
38948 29555899 27368332 22967154 17400327 12021725 8167413 5956268 4501942 3931898
38940 3931898 5931135 11464316 18798610 24546255 26428792 24839888 21962569 19539725
38932 19539725 17746341 16356582 15927447 16386554 15375982 10615800 3839100 -663739
38924 -663739 -1903574 -3107521 -5728151 -6718949 -4133793 -1282404 -1670616 -3267708 -2100663
38915 -2100663 1357054 4173957 6764699 11034295 14376358 11967382 5117114 1300815
38907 1300815 4524311 10592648 13553328 12476735 10017995 8138135 7380719 7317883 5853871
38898 5853871 756188 -6468418 -10495252 -7367699 1752983 12002424 17747474 14934559
38890 14934559 4371931 -7059336 -12202329 -11117733 -9379744 -9406159 -8460471 -5365461
38882 -5365461 -2870568 -1478179 2701809 10483928 15669019 13209813 7005686 4730597
38874 4730597 8156311 13103547 16064876 16254394 13367165 7803524 1801969 -2775699
38866 -2775699 -5868527 -6185082 -605515 9674359 16611425 14338393 7633695 5666208
38858 5666208 9873199 14176849 15064607 14587734 14531811 14708075 16780979 22667491 28530787
38849 28530787 27434730 19493204 12681911 11523748 11746601 9175791 7021687 9295323
38841 9295323 12322161 9030154 -1104717 -11772799 -17893248 -19506410 -18731857 -16947611
38833 -16947611 -14855189 -12467678 -9147890 -5465566 -3968879 -5982608 -8684004 -7688648
38825 -7688648 -2021666 5159661 9895185 9831731 4564303 -4141351 -12873203 -18981351
38817 -18981351 -22109446 -22421985 -18772520 -10585466 -648054 6239142 7629686 5421252
38809 5421252 3621051 4528543 6384638 4797273 -1728502 -7539181 -4305041 8478189
38801 8478189 20629538 22053167 13968554 5707737 2496616 1547673 -341696 -1285495
38793 -1285495 1475107 6154429 8365865 6175546 788506 -5898860 -12026706 -15433882
38785 -15433882 -14984224 -11774896 -7727022 -3897696 -1138254 -496055 -943312 1497054
38777 1497054 9227148 18257408 21141294 15393305 6681869 2800262 6118789 12447984
38769 12447984 15481561 11685960 2680601 -6127428 -10482968 -11294697 -12236830 -13603467
38761 -13603467 -11620952 -4752160 2963030 7158656 8438232 9363840 9464107 7612161
38753 7612161 6614983 9634582 13366369 11224681 3483118 -2275942 -2107374 -437489
38745 -437489 -1346893 -1912055 1456573 6104108 8307076 10455340 16333927 22824990 23712145
38736 23712145 19727119 17496347 19470041 21972143 22700022 22593226 19911665 10734536
38728 10734536 -2346437 -9716194 -6626741 897364 5950781 9849144 15927026 20454849
38720 20454849 17493243 9362345 4413251 5567305 7854385 6878117 3206475 -1996553
38712 -1996553 -9042582 -15421837 -15323409 -7092213 2717251 6415880 3658674 -444100
38704 -444100 -3131770 -5580060 -7932133 -7863595 -5372531 -4833803 -9181745 -14471362 -14225042
38695 -14225042 -8628965 -5178013 -8846283 -15330490 -16896059 -12092420 -5619266 -305819
38687 -305819 5419839 11621773 13841339 9012073 1078136 -2752289 173500 6344324
38679 6344324 10778640 10886141 7017080 1984993 -490166 613760 1540742 -2672250
38671 -2672250 -12081602 -20611487 -21539823 -13902215 -3530205 2200073 1109554 -2508833
38663 -2508833 -4105691 -5095868 -10047882 -18035034 -21231914 -14340884 -1830056 7677914
38655 7677914 11740114 14696804 19255101 22146720 19158547 11352288 4382928 2628968
38647 2628968 5033150 6778397 5038027 2374954 3056446 6650766 8282462 5747832
38639 5747832 2582039 2109100 2301951 -58759 -3282728 -3196932 187727 2630262 1139411
38630 1139411 -4040480 -11392022 -18244054 -20542954 -16886461 -11599869 -9407355 -8433447
38622 -8433447 -3582588 4351786 9040222 7849194 4450409 1871165 -270676 -445685
38614 -445685 5218784 14882122 19657523 15176704 8601798 8471369 12517547 12161444 5514092
38605 5514092 -1292430 -3792139 -3106823 -792424 3291273 7039246 6394999 2060261
38597 2060261 827490 6728646 14400522 15235121 8184645 520278 -1574484 599157
38589 599157 2152786 1674633 1737038 3887160 6603296 8629228 10933133 13276187 11722198
38580 11722198 3407979 -7332019 -11930686 -7474415 -413564 788964 -5684780 -14480668
38572 -14480668 -18736380 -15532864 -8191591 -3766427 -5659084 -8589327 -4440003 6617856
38564 6617856 15591339 16551376 13471217 12290693 12041032 9084216 5494919 6271837 10469336
38555 10469336 11918425 8212602 3046415 -414906 -2867176 -4834832 -4608153 -1970457
38547 -1970457 191354 -39496 -1143469 -1372276 -1458045 -2421063 -3158168 -1999032 964692
38538 964692 4260905 6437991 6616450 5072110 3430353 2961907 3128861 3256730 4299215
38529 4299215 6570420 7385324 4511271 748595 747832 3856535 4964077 2500786 227945
38520 227945 89270 -982913 -4721997 -7296447 -5175000 -1307725 -1388042 -6444948 -12436334
38511 -12436334 -15032790 -12131882 -4168246 5111630 10416179 10230869 8279440 7518236
38503 7518236 5950864 1731755 -863841 4588549 18109065 32665958 41065358 40602918
38495 40602918 33107878 24317697 21247908 25634355 31259282 31990860 30549405 33929161
38487 33929161 41840647 46876888 46518704 47464114 55297208 66091619 72159633 71267733
38479 71267733 65886513 57374072 46013724 34495755 26585514 23203264 22996143 25180545
38471 25180545 28463755 29140168 24787089 18921098 17145385 18603885 16373832 7851210
38463 7851210 -185861 -166568 6317267 11630209 12996920 14735627 19342512 21947554
38455 21947554 16907436 6406818 -2022567 -5252449 -7194784 -11232462 -14345847 -11088563
38447 -11088563 -653260 12562649 23532077 29315785 29032006 24345193 19518563 18311811
38439 18311811 20504279 22689622 21796364 16822056 9037658 2411493 1440912 5624680
38431 5624680 8523506 6081143 3156178 6477562 13529717 15774693 12122572 10497096
38423 10497096 14446975 17257537 13478644 7997209 7521204 10011570 10026290 8937130
38415 8937130 11202678 14284178 11400570 2600476 -5173367 -7991217 -7096556 -2340911
38407 -2340911 7741089 19038280 23813356 21185526 17936224 17452932 16099986 12482863
38399 12482863 11121068 13279912 13292198 9257936 8743626 16987073 27115645 30206454
38391 30206454 28539138 29675914 32672963 30563078 23324731 17788782 16041170 14232230
38383 14232230 12823710 17534087 28024491 35132950 33155996 27284950 24779153 25381780
38375 25381780 25087056 23934262 25060149 29780395 37599274 47617383 56482874 58836708
38367 58836708 54018827 49314049 52258483 61763462 70398178 73401096 71946810 69354736
38359 69354736 67697994 67118748 65632634 60583979 52390207 45134030 41189178 37512783
38351 37512783 30454533 22504883 20446053 27050673 37390256 43443974 40743815 31164524
38343 31164524 20794420 14416469 11173670 6995772 1543705 -522574 3264010 8728068
38335 8728068 11012987 11292855 13023235 14619567 11862403 6099495 3442556 5282190
38327 5282190 5732044 643304 -5887188 -7274352 -3203513 1091315 2493842 3413078
38319 3413078 7655887 15424539 23435960 28855527 31433676 31251138 26315304 15383872
38311 15383872 2832970 -3565007 -1653968 2199351 2184905 944966 3731067 8422931
38303 8422931 8289293 3054797 -391076 1358168 4307185 5397698 7264753 11314424
38295 11314424 13058394 9554154 5886285 7848042 12129795 10879414 3894842 -1012549
38287 -1012549 385540 3664989 3997095 3676650 7903693 16584419 24234469 26675080
38279 26675080 24702764 21361502 18189886 15260502 13536055 15073575 19907844 23739708
38271 23739708 20937804 10932253 388975 -2705219 2868061 10404460 12293733 7380962
38263 7380962 1140988 -639503 2570398 6820185 8859302 9014030 8824891 7797634
38255 7797634 4160937 -2061346 -8521212 -12828144 -14128035 -13054951 -11485839 -11369039
38247 -11369039 -11973324 -9449384 -1674368 7281225 10475421 5565754 -3698901 -12461326
38239 -12461326 -17528728 -16159930 -7626941 2879237 7193451 3654085 -348933 2236748
38231 2236748 9940825 16305114 17418621 12993788 4330953 -4754153 -8783922 -7048699
38223 -7048699 -6108127 -11129645 -17632103 -17243010 -9403475 -1401102 1981569 2714966 3507048
38214 3507048 3393535 718604 -3753406 -8257496 -11887076 -14547556 -17074509 -20492429
38206 -20492429 -22910788 -19501884 -9230806 1053939 4221458 2106655 1297042 2412259
38198 2412259 1609619 1214617 8707513 23563089 34911540 35968394 32022201 29638983
38190 29638983 26964212 21248739 17529202 20601606 24167745 18093644 3449710 -9052116
38182 -9052116 -13863401 -14810035 -15398989 -14461593 -12710625 -14634053 -20307017 -22325124 -15425348
38173 -15425348 -4291692 2593855 3403634 3137088 5537452 8597299 7688219 1283963
38165 1283963 -6298383 -8058173 -1875387 5620660 5660590 -2292815 -10300233 -12193486
38157 -12193486 -9569225 -6529022 -3831650 -1305462 -1260276 -4886282 -8535651 -8471252 -6929570
38148 -6929570 -8328692 -11281284 -10459158 -6140254 -5445841 -12115259 -20486965 -23094359
38140 -23094359 -20210406 -17474770 -16604186 -13673615 -6364785 1872870 6632241 8101565
38132 8101565 9023264 9234782 6058625 33016 -3676900 -1740088 2171274 2056773 -1971015
38123 -1971015 -4173780 -2123625 -68698 -1205026 -1711423 2725209 8255144 7683758
38115 7683758 2523106 2151905 9452532 15350717 12136221 5391764 5738246 13317072
38107 13317072 18790358 17601346 14358850 12768653 10027728 4122199 -773805 -623544
38099 -623544 2566645 5850989 10874977 18366545 21721878 13797327 -1859647 -13858889
38091 -13858889 -16588900 -14470907 -12760936 -11343387 -9374542 -9180046 -11681589 -12887479
38083 -12887479 -9305898 -3631168 -1049862 -2151615 -3094815 -1181834 2896940 7078224
38075 7078224 9289047 7796582 2901790 -2218853 -4466806 -4203301 -4220173 -6205640 -9684245
38066 -9684245 -13429137 -16362476 -17848796 -18135438 -17365285 -13699408 -5001755 6141941
38058 6141941 12268259 9079959 1585494 -1319863 2799538 8317421 9368287 5824333
38050 5824333 1775391 1174730 5004672 10150729 11273601 6216700 -1011294 -5147633
38042 -5147633 -6361472 -8560733 -12164750 -13400355 -11039269 -8707892 -8833689 -8986498
38034 -8986498 -6907651 -5031294 -6250497 -8187440 -6102369 -115877 4678933 5249299
38026 5249299 4227277 5533265 9044044 11549600 11944204 13161393 17784532 22848179
38018 22848179 21772447 12821287 3193767 1538933 7661859 13625469 14649238 13861611
38010 13861611 15037264 16302408 14784576 12872291 14242192 16357675 13424518 6359872
38002 6359872 3285380 8094089 13777941 10881865 -500548 -11284031 -14594557 -12362959
37994 -12362959 -10341403 -10164514 -8949118 -5249353 -1917802 -1771072 -2665320 384975
37986 384975 8647812 17957238 23991832 26418841 26412788 23165315 16064605 8468045 5106325
37977 5106325 5681832 4782852 -655409 -6841854 -7934079 -3072286 3664434 8756603
37969 8756603 11961824 13997777 14269455 11887342 7349859 1975326 -3492154 -8532315
37961 -8532315 -11787404 -12167478 -11261703 -12552260 -16615393 -18726015 -14139697 -5357157
37953 -5357157 -437574 -2718281 -5834465 -2171419 6343686 10478894 5813963 -2467258
37945 -2467258 -7713178 -9550188 -10627743 -10070177 -5361039 1035024 2549682 -2964128
37937 -2964128 -9539388 -9952173 -3979484 1966659 1964709 -3920295 -9876914 -9158486 -442427
37928 -442427 9492688 11643604 5061360 -1225128 779350 7774839 10279154 6136443
37920 6136443 2692324 5012108 8731879 7881185 3950675 1897253 1401500 -1363201
37912 -1363201 -5744320 -7555957 -7237392 -9614024 -14441323 -14537855 -6536135 2642947 4460732
37903 4460732 -824312 -7130616 -11752038 -15776487 -18210902 -16427429 -11922362 -9643484
37895 -9643484 -10641036 -10046736 -3733782 6631293 16353416 22255727 23372407 20424296
37887 20424296 16240517 13879748 12519988 7731310 -2079964 -11738752 -14535716 -10189075
37879 -10189075 -4814039 -3130459 -3243239 -216751 6855144 13504283 15683977 14684248
37871 14684248 14375368 15037367 13477652 9517504 7990840 11761340 16521522 16726925
37863 16726925 14115265 15075182 20594280 24441876 22028405 16223736 12859138 14278761
37855 14278761 18607612 21661142 18461008 7232393 -6042002 -11167733 -4667815 5952120
37847 5952120 11123744 8873010 3104608 -3389529 -9805884 -14194373 -14476246 -11601905
37839 -11601905 -8109802 -4633881 -871212 1614253 1056705 -1297393 -2995833 -4194440
37831 -4194440 -6353283 -8488181 -8487898 -7208953 -7344204 -8639861 -7900559 -3616206 2576704
37822 2576704 8532844 12465197 12075027 6779824 477110 -1903627 -619492 -114816
37814 -114816 -1996730 -3264281 -1846476 386173 878246 -1252354 -6483213 -14092511
37806 -14092511 -19560012 -17929809 -11351144 -8250292 -12690958 -19161956 -20470290 -16190071
37798 -16190071 -10265247 -4988560 -1509101 -2245338 -7624447 -12725206 -11777325 -4768916
37790 -4768916 3673483 10205238 14446511 16728279 17371649 16631151 13185808 5564488
37782 5564488 -2515408 -2727668 7386150 18617537 20829023 16346248 15577298 21423943
37774 21423943 26271787 24265897 18139195 12113249 6014482 80829 -1161922 4928446
37766 4928446 13367778 16836039 13899227 8173306 2262639 -3205887 -6674203 -6354272
37758 -6354272 -3298749 -455481 1070250 2382283 4035827 5331310 6052405 6763828
37750 6763828 7312295 6622972 4254859 1291906 -523169 -527953 -303744 -2367381 -6421896
37741 -6421896 -7993085 -3525857 3590705 5793121 894200 -5001812 -5798206 -2697213
37733 -2697213 -508116 -361729 -81298 632690 -269720 -3565411 -8186800 -13209818 -16994089
37724 -16994089 -15527741 -5857398 8746631 20690167 25698085 25663509 23688251 19803031
37716 19803031 13028173 4992040 -648663 -1518487 1682209 6013547 8639348 8937020
37708 8937020 8061539 6124557 1400962 -6223485 -12904342 -14625328 -12237458 -9940100
37700 -9940100 -9725330 -10436055 -11303802 -12362699 -11593041 -6251714 1979592 7471142 7978431
37691 7978431 7606642 10278340 13991795 14680635 12847545 12626914 15747475 19643472 20923067
37682 20923067 18465107 13673754 9162067 6255445 2969487 -3593133 -11951674 -16569839
37674 -16569839 -15542018 -14161873 -16939882 -19397307 -13635678 -749103 8685745 7377398
37666 7377398 -898726 -8120719 -11513067 -12876318 -12372103 -7842735 626453 9090170
37658 9090170 13156235 11490158 6278504 1445437 -275222 242491 -357384 -3456447
37650 -3456447 -6331452 -5897400 -3346840 -2896264 -6295942 -10646488 -11924128 -9099131
37642 -9099131 -4322234 -316736 1622994 1599162 -165510 -3965583 -9248210 -12964746
37634 -12964746 -11425690 -5115295 333340 533860 -1540545 790028 8497079 15169730
37626 15169730 15870068 13437449 13020871 13727211 10300794 1756352 -6434976 -9248341
37618 -9248341 -7411338 -4840822 -4129998 -5902025 -9245470 -10538742 -4897510 7781307
37610 7781307 19979103 23400981 17999450 10809155 6166813 1269380 -7182321 -15875966
37602 -15875966 -18067904 -12367121 -4569568 -268747 1256736 3870562 7448788 7361392
37594 7361392 1172157 -7630473 -14660557 -20560754 -28085267 -34799158 -34177441 -25192422
37586 -25192422 -15549997 -12005680 -11640979 -7506055 217484 4935606 4389058 3949692
37578 3949692 7975846 13745600 16641167 16650349 16262978 15434894 12475322 7751844 3098746
37569 3098746 -1127647 -5859951 -11455777 -17756262 -24026101 -27257421 -23652893 -14494789
37561 -14494789 -7285100 -7289425 -10822757 -11319023 -9107879 -9205161 -11346146 -9666257 -2724024
37552 -2724024 3386132 4129781 2352445 1805293 854165 -2541116 -4326648 974999 11465426
37543 11465426 19520209 21243844 19157765 15951408 11051823 4642752 358514 1121265
37535 1121265 4845615 6790654 4871363 1056907 -1173074 712015 6994395 14848942
37527 14848942 19327619 17174909 10136354 3538580 1333674 3160759 6129250 8209751
37519 8209751 9146255 9015824 7466996 4679314 1989261 779262 1238031 2869904 5703033
37510 5703033 9974811 14707888 17651118 17106425 13359180 8044552 2513067 -2803835
37502 -2803835 -7510652 -10204356 -9192390 -4993472 -1323684 -1589577 -4154956 -3551298
37494 -3551298 2362168 9131821 11952445 12446982 15275716 19914830 21239556 18171722
37486 18171722 15862463 17450342 19009034 15925441 9881746 5441335 3214893 1057726
37478 1057726 -510349 902752 4721889 7882046 9166009 8927388 5834554 -1156047
37470 -1156047 -8358087 -10437435 -8160082 -7490192 -10107751 -10863261 -6850304 -2980614
37462 -2980614 -4578574 -9235020 -10857150 -8356632 -5245523 -3032669 -278507 3012432
37454 3012432 4951203 5327042 5397552 4383792 379748 -4948115 -6524777 -1654632 7343881
37445 7343881 16525643 22954207 23880213 17886233 8562751 2932117 3496133 4970336
37437 4970336 1640802 -5110882 -10061516 -12221511 -15062194 -19820928 -23400917 -23591792
37429 -23591792 -22456151 -22770188 -23624548 -21497862 -14507684 -4434675 4684029 9553128
37421 9553128 10204857 9699546 10159496 9695774 5457640 -687563 -3053597 167700 3720217
37412 3720217 2279917 -2557198 -5961082 -7936444 -12384777 -18790136 -20930823 -15996790
37404 -15996790 -10111844 -10913996 -17491132 -21814369 -18818323 -11253092 -5017073 -3222859
37396 -3222859 -5075566 -7294935 -5816096 833944 8356954 9599757 2875267 -4659053
37388 -4659053 -4714731 2095562 6885392 3131129 -6083660 -12478921 -12086249 -8429272 -7174558
37379 -7174558 -9875895 -13626924 -15345013 -14709353 -13039932 -11086335 -9104242 -8018179
37371 -8018179 -8547812 -9235540 -7438747 -3189413 -255607 -1705004 -5704686 -7992893
37363 -7992893 -8010190 -9857936 -16305242 -23989584 -26418402 -20935640 -11160866 -2808804
37355 -2808804 1497877 3156283 4860257 8090739 12708440 17493407 20406045 19238716
37347 19238716 13337781 4692195 -3723842 -10688943 -16430178 -19534689 -16853450 -8487985
37339 -8487985 -603787 460277 -3692540 -5347524 -1225086 3218991 2165148 -2336950
37331 -2336950 -4665524 -4738604 -6832179 -10624821 -10376553 -4441067 853159 395717 -1868927
37322 -1868927 621098 6654410 9741722 8993790 10115061 15039026 17903702 14405321
37314 14405321 8925351 7250579 6716622 323419 -11199724 -18496177 -15707632 -7852915
37306 -7852915 -3761800 -5897798 -10156661 -12518528 -12261639 -10327163 -7903196 -6015977
37298 -6015977 -4099245 214630 7477291 13539504 13334648 7497187 2364916 2912477
37290 2912477 8152990 14034325 18038059 19495260 17799320 12627873 4995225 -3383109
37282 -3383109 -11007775 -16144350 -17004310 -13665305 -8466893 -3266101 2082106 7068725
37274 7068725 8604389 4580444 -2028516 -5981765 -6315445 -6856334 -10062375 -13612725
37266 -13612725 -14047228 -10986159 -6499788 -2695196 -1088400 -1867143 -2507554 -39323
37258 -39323 3478448 1209835 -9289536 -20001523 -20515641 -11086636 -2260668 -921010
37250 -921010 -2178894 2218857 11988547 19334412 19445011 14907683 9989861 5449424
37242 5449424 913032 -1324994 1320915 6528556 7808593 1761308 -7148892 -10807383
37234 -10807383 -6058251 2227423 6791556 5388726 1742037 201509 1304283 2835394
37226 2835394 3307107 2664231 475045 -4020642 -9240052 -10709167 -5468451 3302620
37218 3302620 8147452 4674028 -3969988 -10630377 -11381403 -8678385 -8145046 -13003426
37210 -13003426 -21060482 -26492505 -25217281 -19095371 -13956383 -12902097 -13168671 -11045754
37202 -11045754 -7961985 -8617838 -13776968 -18583089 -18910902 -16242348 -14437642 -14055572
37194 -14055572 -12351429 -7903970 -3247795 -2896243 -9090906 -18604565 -23901421 -19673529
37186 -19673529 -8942244 -431231 880043 -2264348 -5816248 -10451007 -17834827 -24600919
37178 -24600919 -25322804 -20017181 -13825048 -9953900 -7648570 -6717128 -8681935 -12563531
37170 -12563531 -14605701 -13936506 -13816047 -14921429 -12177651 -2316408 8737072 10973833
37162 10973833 1901283 -10618386 -16909858 -14182970 -6996406 -1820791 -1951009 -6167757
37154 -6167757 -11069542 -14353243 -15766439 -15763267 -14812688 -13902927 -13831486 -13676463 -11825205
37145 -11825205 -8757176 -6583851 -5525782 -3656800 -891836 93708 -1509549 -2537490
37137 -2537490 -854460 737280 -950520 -3456100 -1356887 6063200 13718863 17081778
37129 17081778 16183284 12924353 7708293 505066 -6405092 -8871625 -4749127 2932567
37121 2932567 7791927 6307263 1502584 -1312706 -1467361 -2601112 -6230634 -10132687
37113 -10132687 -13356091 -17242110 -19856672 -15955097 -6299470 -643577 -5534027 -14368175
37105 -14368175 -16714304 -13184503 -12483013 -16635472 -19254268 -18157124 -19315263 -25516085
37097 -25516085 -29943263 -25739318 -15601920 -7021648 -2655907 -16498 2711539 4803190
37089 4803190 5078016 3258786 791273 910389 4804533 7486986 2188511 -10002880
37081 -10002880 -20209965 -23378386 -23878021 -26327586 -27173159 -21017987 -10802876 -5089030
37073 -5089030 -7225293 -12587446 -15289710 -13186235 -7452858 -1379385 1253595 30080
37065 30080 -918288 1443922 4011417 1768133 -4468126 -8662085 -7398158 -3529608 -2065989
37056 -2065989 -5204302 -11330683 -16738434 -18496659 -16930663 -14436702 -11391546 -5817202
37048 -5817202 1854284 7523941 9313163 10628869 13984764 16121466 14023720 11640877
37040 11640877 14224306 18906349 18301757 12213166 8199571 10245582 14069334 15197607
37032 15197607 15028480 16015739 16258285 12614328 5712449 -1340815 -6869446 -10772018
37024 -10772018 -12511987 -10938200 -5492816 2570127 9304396 10004312 4674549 -17382
37016 -17382 1987511 8206063 11412303 10034374 8778198 9155826 6708999 -196743 -5709405
37007 -5709405 -4714493 -398085 1155544 -235067 -747569 -370204 -2903983 -8684392 -12241942
36998 -12241942 -8689759 -93519 5845618 3101508 -6642642 -15389600 -17012246 -13333513
36990 -13333513 -10337814 -9612579 -7207408 -869100 6088186 9544451 9147233 6107308
36982 6107308 272162 -7798312 -14875933 -18065937 -17460950 -13740602 -6290142 3388612
36974 3388612 9468406 7096481 -1404403 -8812882 -10609366 -8063801 -5147754 -4801733
36966 -4801733 -7247613 -10053805 -10737097 -10114686 -10940849 -12382817 -9544194 -1052170 6408759
36957 6408759 5227684 -3423740 -10943652 -11320175 -6373678 -1604089 5713 -384803
36949 -384803 -377060 -375244 -4052045 -12847713 -20979668 -20575484 -12547219 -6529410 -7417346
36940 -7417346 -8581200 -3489506 2416330 -474490 -10439973 -16147054 -12413609 -5019290
36932 -5019290 497933 5535942 11291303 13271181 7972904 -405395 -4998041 -4657737
36924 -4657737 -3238478 -3123972 -3241071 -2048740 303315 2099442 1232700 -2408570 -5659072
36915 -5659072 -5808243 -5513093 -9754418 -16899282 -18090646 -8762237 3823426 9293505
36907 9293505 7243012 6058117 10336527 15590924 16034783 12127692 7885164 4708951
36899 4708951 1618205 -469861 1071279 5825411 9039282 6877847 1409656 -1398632
36891 -1398632 2130147 10584107 19710610 25232962 24179768 16727888 7633975 3108433
36883 3108433 4759736 8585384 10733160 11269218 10827859 7483459 405850 -6249395
36875 -6249395 -7270355 -2591305 3928668 9825918 13971203 13478764 6555049 -2072784
36867 -2072784 -4562579 90590 4428227 2266860 -4416480 -10047274 -12639934 -13902761
36859 -13902761 -15257607 -16272464 -15448963 -11598923 -6045148 -2886275 -4214662 -6255374
36851 -6255374 -4725252 -2915630 -7881821 -18106637 -22828794 -16779474 -8174273 -6941480
36843 -6941480 -11365819 -13019598 -9945712 -7075251 -6547166 -5932572 -5293176 -8143082 -14181954
36834 -14181954 -17587162 -14963453 -10219287 -8920251 -11270727 -13174813 -11772660 -7749992
36826 -7749992 -3840031 -2698762 -5045100 -8646993 -9875582 -6862144 -668959 6147168
36818 6147168 10776011 10563562 4591397 -4328312 -10784751 -11170972 -6892512 -3132381
36810 -3132381 -4413567 -10388029 -15202512 -12175243 -714487 11904592 17173338 13496274
36802 13496274 6386199 1055496 -2980865 -9078759 -16932102 -21143233 -17133257 -7291345
36794 -7291345 833572 2890042 2048015 3452436 6928166 8573504 7730184 7304121 7314067
36785 7314067 3931473 -3152573 -7837531 -5638104 -302130 1886374 974407 1393620
36777 1393620 3297765 1580257 -6235777 -15495017 -19255324 -15452497 -8216678 -2840473
36769 -2840473 226252 5619410 15814595 25120910 25263213 16910041 9673562 8838290
36761 8838290 8976247 4579340 -515410 -1125061 -1586142 -9221478 -20955507 -26645690
36753 -26645690 -23946335 -19769588 -17480846 -13074291 -5352829 210268 688085 -229140
36745 -229140 -716931 -4501089 -11786940 -15262806 -10951899 -5241063 -4375426 -4179664 1516677
36736 1516677 8193287 6491960 -2064306 -5237883 3505469 16326568 20459492 11269862
36728 11269862 -5211217 -18787014 -23267273 -20895383 -18631130 -18619994 -15229165 -4742988
36720 -4742988 6142733 7871274 1635822 -2294103 548525 3908352 2550045 521555
36712 521555 2774180 5045525 -568230 -12746412 -20750929 -17264731 -6144378 3751793
36704 3751793 7984176 7534068 4223914 -517573 -3461105 -793912 6794011 13181627
36696 13181627 13451172 9597251 6872453 6071384 3452516 -1983778 -5903913 -5081116
36688 -5081116 -2464956 -2862350 -6330753 -9172648 -9572670 -8677784 -7028297 -3465211 2066782
36679 2066782 7085546 8760694 6602909 2986710 1315386 2630187 3699336 373616
36671 373616 -6516279 -11393855 -11491097 -10704237 -13047506 -15561707 -12103436 -2184735 8640640
36662 8640640 16159248 20654625 23155253 23302588 21589191 19671906 17449740 13149177
36654 13149177 7141801 2647519 1975520 4773882 9907845 15599564 17891440 13723014
36646 13723014 6724674 5155776 11543669 18311995 16886415 8183537 734408 513213
36638 513213 5854097 11103202 12367569 10131321 8150066 9509875 13093102 15065465
36630 15065465 13974765 11832087 9443539 4367879 -4028465 -10825016 -10796853 -5660439
36622 -5660439 -2089454 -3088595 -4926375 -2883891 2964407 8698399 11429293 12205726
36614 12205726 14578671 20286974 26313955 27472361 22461853 15472273 10697090 7808709
36606 7808709 4997742 3625650 5944438 9790156 10161185 6117901 2050297 1276066
36598 1276066 1863218 64808 -4857978 -10289995 -12251783 -7292833 4178802 15308286
36590 15308286 17413060 9660405 939246 -754942 2398084 3120302 226418 -1146609
36582 -1146609 550622 32349 -5991752 -12416798 -12682793 -8883980 -9592230 -18166706 -27959365
36573 -27959365 -30427912 -24483692 -15503455 -7635893 -666444 5982427 9934529 8644736
36565 8644736 3669817 -595865 -2316409 -3823679 -6921029 -9030275 -6526680 -676754
36557 -676754 3118841 2471139 1202547 3589467 7966643 9043724 5250988 289822
36549 289822 -2638853 -4672933 -7890510 -10706975 -9271264 -2695028 5217130 9864369
36541 9864369 10614138 11233234 15482313 22281162 26011667 22518304 14028790 6525832
36533 6525832 2961252 1613974 942416 2282877 5997753 8255106 4896674 -3055496
36525 -3055496 -10589900 -14325678 -14423199 -12078552 -8210323 -4303737 -1747318 -168198
36517 -168198 1447515 2279770 752552 -2097980 -3128627 -1565733 -691628 -4027707 -10991422
36508 -10991422 -16681223 -15509836 -6421151 4002295 5802540 -3788700 -15567208 -17979010
36500 -17979010 -10300742 -1677233 1741081 2251637 2723178 884795 -4785028 -9392770
36492 -9392770 -7024187 1729588 11743326 19281065 21884449 16601355 4231681 -7402856
36484 -7402856 -10779058 -8107643 -7888361 -13005606 -17964884 -17547907 -12194304 -4173348
36476 -4173348 5652979 15290424 20688145 19919740 15067202 8452677 379702 -8116147
36468 -8116147 -14036169 -15743705 -14335976 -10455328 -3596713 3696648 5349125 -1285214
36460 -1285214 -10973502 -16087687 -14174650 -7995247 -1386872 1996775 -755414 -8442918
36452 -8442918 -15112423 -16475806 -15164033 -16420399 -20998010 -26017195 -30025092 -32244071
36444 -32244071 -29228353 -18726645 -6207639 -871223 -4099482 -7657858 -4942137 1539359
36436 1539359 5962017 6653664 4346675 -1718434 -10916314 -17978240 -17857168 -11990942
36428 -11990942 -5587552 -821797 2868336 4012985 388603 -5687955 -9006782 -8680815
36420 -8680815 -8419279 -9002783 -6386047 695128 7053304 8631985 8879059 12740648 17987514
36411 17987514 18281974 12870567 7301280 5037864 4094911 2708392 2762680 5127171 5990220
36402 5990220 1587899 -5668060 -9256848 -6097701 229779 3595498 1359176 -3338049
36394 -3338049 -4594914 369465 8191206 13355002 14972018 17176151 22256060 26626207
36386 26626207 25774841 20557424 15427642 12037145 8052166 1712832 -5753686 -12506752
36378 -12506752 -18148473 -22787723 -26049021 -27381234 -25655088 -18729292 -5962290 8534092
36370 8534092 17981391 19566802 16872316 14440258 12218589 7495275 583178 -4377567
36362 -4377567 -4100791 707227 7308223 13965405 19769106 22975122 21959279 18128451
36354 18128451 15730488 17155429 19780202 19707494 17604587 17398175 19211329 18363616 13637409
36345 13637409 11636349 17949637 27329697 29444203 23421984 19280017 23465045 30174493
36337 30174493 30844424 26155519 22708450 21751594 18335256 10584533 3133130 -13326
36329 -13326 -1034362 -4201083 -9309969 -11893780 -8697924 -1181887 5878192 8433397
36321 8433397 6326105 2786708 406821 -1849055 -6332561 -11832245 -13251082 -7284939
36313 -7284939 2905267 10350757 11585316 10150945 12036339 18124225 22819991 21188563
36305 21188563 15764040 13366504 15482382 15844022 9484580 519032 -2952936 487985
36297 487985 4778154 5710928 6021539 9680166 15363557 18638666 18139058 16227519 14511128
36288 14511128 11770643 6740562 951188 -2190457 -546705 4827111 10436626 12868907
36280 12868907 10939270 5666228 -1494778 -9633533 -17156577 -20468242 -15932913 -4655287
36272 -4655287 5560183 5837831 -4489087 -15816211 -17948849 -11140542 -4621832 -4383143
36264 -4383143 -6407337 -3599966 4465280 12155081 15675221 16300832 16589271 17044295 16779431
36255 16779431 14946933 11303457 7031089 4333148 3484798 1758355 -2260210 -5127577
36247 -5127577 -2878295 2469995 4881827 1892426 -4054918 -10662816 -16548743 -17558795
36239 -17558795 -9680530 2516417 7589600 1274515 -7160687 -7174609 38342 6470454
36231 6470454 9999994 14367633 19438434 20228306 15768803 11354090 9936488 7166028
36223 7166028 -2019855 -15739141 -26737345 -29072961 -21756086 -8735181 2626045 5466157
36215 5466157 -1304737 -11818212 -18335843 -17479453 -11912852 -7117066 -6323682 -7467096
36207 -7467096 -5571681 859671 7188523 8146032 4378705 803804 -227125 -755637
36199 -755637 -2949914 -6529271 -10129502 -11820413 -8668603 314373 10730868 16257161
36191 16257161 15920098 14264284 14511816 16122077 18885707 23312925 25797760 20146906
36183 20146906 6846103 -5384960 -10872199 -13494828 -17348704 -17857068 -9475537 3148590
36175 3148590 10606693 11940658 13024041 13823486 8062286 -3642048 -11120526 -8957624
36167 -8957624 -4301294 -4911143 -7237779 -3642343 4418760 9074148 8724487 9185662 12656162
36158 12656162 13811719 9048997 3259907 3699545 10916403 19293959 24280716 25807730
36150 25807730 25563503 23740457 19041395 10899524 1213084 -6601497 -11038134 -14300025
36142 -14300025 -18864169 -22574847 -19986077 -9566769 3181765 11753769 15478395 17729860
36134 17729860 19300162 17395855 10928931 3252909 -1129381 -32591 6456100 16202414
36126 16202414 24238361 25344643 19659964 12952611 9066436 5193526 -2264492 -10555166
36118 -10555166 -14334581 -14443218 -16647741 -21806794 -23978818 -20290488 -16455831 -18501049
36110 -18501049 -23905537 -26288823 -25583128 -27101408 -31337949 -31092173 -20786211 -4584087
36102 -4584087 7530908 9838995 5019850 -488495 -3099973 -3906593 -5294166 -7260940
36094 -7260940 -7958890 -7087535 -6648216 -7694406 -8248832 -5727274 32759 7183850 13365436
36085 13365436 15586441 11435232 2906133 -3654270 -4929792 -5644868 -11666829 -19894587
36077 -19894587 -21177767 -13661039 -6783782 -9135350 -17344310 -21241252 -16826741 -9467412
36069 -9467412 -5767232 -6853027 -9912991 -12543530 -13718091 -12486308 -8242180 -2593824
36061 -2593824 608381 -1097917 -4927117 -4456568 3422003 14353082 21081309 21035296
36053 21035296 17144631 12379802 6997481 1219088 -2922566 -3556641 -415249 5983122
36045 5983122 13655002 17598872 13252797 3140123 -4052175 -3697313 -968821 -3066382
36037 -3066382 -8892802 -10952810 -5914035 1345070 4335836 2052521 -1473679 -2410399
36029 -2410399 -659720 984376 382349 -1663967 -2988511 -2916765 -1925999 431212 4233348
36020 4233348 6487643 4116237 122606 1526410 9131879 14691486 11541535 2917786
36012 2917786 -4494406 -9840137 -14926475 -16674131 -10988225 -1801394 2187113 -647724
36004 -647724 -3976041 -4524109 -5765666 -8978722 -8781665 -1532893 8109233 13689166 15471443
35995 15471443 17965080 22409739 26130880 27095947 25300459 21104328 15252094 9640869
35987 9640869 6098371 5289634 7449857 11867367 14679888 10380157 -2142160 -17096689
35979 -17096689 -27181923 -29746563 -26621789 -20745542 -15030813 -12159339 -12769579 -14562664
35971 -14562664 -14266240 -9604580 133132 12700185 22105822 22869918 16002898 7724941
35963 7724941 2194166 -539758 48281 5143021 11017532 10777927 5147061 4263995 13478461
35954 13478461 23989951 24566692 17099823 12195614 13161805 13695771 9978129 5909900
35946 5909900 5546140 7882537 10697446 13244620 13425157 7983615 -2193501 -11283084
35938 -11283084 -14769337 -12926584 -7367630 1596842 12753454 22740398 28461457 28506091
35930 28506091 22696529 13607508 7475254 8719311 13623773 14272674 8720344 2095938
35922 2095938 -2179866 -5825104 -9463814 -10033826 -7038221 -4982340 -6071165 -6258222
35914 -6258222 -2723120 18613 -3377195 -10470178 -14335753 -12880624 -9915041 -8550325
35906 -8550325 -7880052 -5666821 -1463059 2489778 2458829 -2610344 -7443460 -4772265 4936213
35897 4936213 12549320 11970394 8264176 10109215 18246157 26372996 30301592 30755537
35889 30755537 29122102 25797249 21980812 19017259 16698455 15077425 15868183 18773148
35881 18773148 19176713 13625274 5125503 -1100007 -4114504 -4981354 -1979043 5338552
35873 5338552 10604540 7316170 -605367 -3493409 -624347 -1037779 -8713714 -16589700
35865 -16589700 -18531716 -18083323 -19917107 -20398461 -13993321 -3829182 1998407 2080057
35857 2080057 2677740 8011081 15504703 20942220 23439670 23965147 22361501 17979997
35849 17979997 12096248 8112385 8549918 11557262 11697570 6151103 -837413 -2766927
35841 -2766927 411443 2645352 1276599 878474 5158615 10044954 9222899 3263053
35833 3263053 -1641148 -2368510 -1816340 -3594100 -7365090 -9971217 -9319334 -7000211 -7362507
35824 -7362507 -12430396 -17527876 -15175077 -4679281 5905557 9563971 7826595 5354804
35816 5354804 1977477 -4435529 -11050276 -13025820 -11495775 -11594811 -13359031 -11887281
35808 -11887281 -7027224 -5470031 -10907206 -18431887 -21822902 -21037009 -19156931 -17032139
35800 -17032139 -15152604 -16452556 -22191941 -28039297 -29147417 -26754811 -24741620 -21732178
35792 -21732178 -12874648 629394 9956479 8729853 250571 -7817752 -12328010 -15008726
35784 -15008726 -16746275 -15860606 -11668259 -6392335 -2932582 -2819736 -6342258 -11981789
35776 -11981789 -15151827 -10831584 179978 9939997 11431771 6792108 4264682 7631793
35768 7631793 12450185 13022042 8896317 2835951 -3662414 -9765288 -13163914 -12331970
35760 -12331970 -9451805 -7721896 -6613311 -2765525 5050210 14488862 22328971 25970065
35752 25970065 23364638 14895458 5035538 -1047252 -2594932 -2388901 -1545118 1273075
35744 1273075 5744304 9105072 10168084 10368543 9819884 6175645 -775801 -6683540
35736 -6683540 -7242718 -3304570 302088 -355837 -5202590 -10011625 -9288698 -1824032 6676586
35727 6676586 9471590 6842763 4278788 3158950 -868138 -9110835 -15966715 -16833774
35719 -16833774 -14020822 -10931157 -6043270 2305005 10134594 12701083 11240826 9140143
35711 9140143 5427961 -1327187 -6452312 -4510421 1195017 2860576 542855 1318613
35703 1318613 6229353 7750990 2504421 -2526811 -658615 4958450 7442087 5977657
35695 5977657 4304976 4063436 4904423 7580345 11599994 12320868 5499119 -6332427
35687 -6332427 -15817079 -18361496 -15295638 -10955426 -9118483 -10961376 -14360527 -16290259
35679 -16290259 -16872931 -18812334 -21996509 -22219549 -17132051 -9834696 -4216330 -443947
35671 -443947 2269551 2566070 95366 -2217552 -2914083 -4826239 -8721204 -8930167 -1609307
35662 -1609307 6757512 7044145 1186701 -521851 4825340 8723733 4485561 -3689738
35654 -3689738 -8012624 -6770220 -2883834 1752237 6193225 8506993 7732634 5318823
35646 5318823 2434340 -1215357 -4467789 -4684410 -2584114 -2507139 -5191082 -5132515 1145601
35637 1145601 8790004 11194267 8768636 5646247 1228947 -7856211 -18739295 -22666884
35629 -22666884 -15882072 -4958764 735795 -1596036 -7718109 -11975160 -11664811 -8243003
35621 -8243003 -5861909 -7348629 -10902160 -12035347 -8732997 -2892086 3078821 8525452
35613 8525452 13033972 15291201 14699545 12428100 9879054 7413040 5076726 3108906
35605 3108906 1395816 120704 1114092 6125627 12885916 15611598 11560395 5245449
35597 5245449 3578645 7856595 13270409 15899164 16798474 17936796 17256819 11306618
35589 11306618 1929241 -3779152 -1954336 2510368 2037144 -3691303 -7895726 -6581168
35581 -6581168 -3475995 -3119430 -3331773 1235007 10231030 16893688 15958885 8770723 553732
35572 553732 -3975377 -2127776 5418698 12886898 12392455 1934129 -11013715 -16756892
35564 -16756892 -13756060 -9231582 -9345478 -11732071 -9833232 -2752000 3136192 3235769
35556 3235769 1329740 3441736 7921186 7842295 3053763 2155682 9037830 14615952 8712995
35547 8712995 -4845328 -13476690 -13221656 -11132714 -11089905 -8422192 -1594437 1531962
35539 1531962 -4160385 -10699265 -7240375 4567234 13982150 16466417 16693323 17918346
35531 17918346 17546820 14341022 12176195 13848522 16928567 18649243 20197150 23062880
35523 23062880 24902833 22424913 16132215 9596114 5557232 4397057 4902365 5327716
35515 5327716 5139873 6115824 9635672 12795450 10462109 2434141 -4485582 -3642607 4110596
35506 4110596 11635456 12394482 5378180 -4492047 -9866237 -7291475 -1129162 1200370
35498 1200370 -1500995 -2927064 1688748 9139469 12885646 10432292 3671659 -4290829
35490 -4290829 -9674092 -9383418 -5669944 -5665163 -11855135 -16934446 -13786658 -6909896 -6448087
35481 -6448087 -13013815 -17113434 -13748089 -8723903 -7999294 -8847552 -6248027 -2015279
35473 -2015279 -2013075 -7856322 -15905656 -21774263 -22316643 -16273041 -6733734 -132730 942158
35464 942158 1086456 4449795 7234060 3135565 -6171826 -12248150 -10997818 -6936947
35456 -6936947 -6081848 -9648732 -15597203 -21569804 -24600841 -21897928 -14160767 -5644361
35448 -5644361 390285 4158620 7065550 9896919 13488937 17563398 18390915 12007385
35440 12007385 1234496 -5131462 -2815479 2403142 3055648 25180 -310748 3938669
35432 3938669 8622429 10914692 12747677 16127692 19403443 20017591 18164920 15875848
35424 15875848 14018004 11474664 6580039 -758524 -7488707 -8810877 -3295428 3761256
35416 3761256 4978460 -290249 -4409336 -552499 8473327 13067849 8205139 -451763
35408 -451763 -3075974 3017917 10970823 13656253 12442385 13707228 18326071 19789817
35400 19789817 14032116 5993252 2665503 3489053 2868514 -268065 -1818479 -868431
35392 -868431 -1987697 -7478524 -13051833 -14118765 -11740564 -8937792 -5245502 690391
35384 690391 6131483 6809220 2988790 -1477822 -5266957 -10212240 -15702741 -16939326
35376 -16939326 -10735440 -495172 6665954 6974685 3306801 1728329 4525496 6512888
35368 6512888 -26749 -15270498 -28727853 -29157741 -16673490 -1886734 6176873 7335599
35360 7335599 5528896 2081522 -3504859 -9522519 -12766428 -12295049 -9816443 -6803633
35352 -6803633 -3173278 1491884 6850459 11692633 14270404 13793924 12382305 13792287
35344 13792287 18615642 22416999 20861564 15253553 10175431 6795446 2380175 -3464589
35336 -3464589 -6465243 -3696204 1380273 3031746 483495 -2281976 -2887164 -3059945
35328 -3059945 -4585236 -6289081 -6647535 -6869064 -9111813 -12940086 -15610695 -15173530 -11562142
35319 -11562142 -5370848 2211095 8234960 9018052 3508288 -5187367 -12113610 -13850753
35311 -13850753 -10259294 -4603434 -1869291 -4736663 -10452969 -13610156 -12719336 -11473246
35303 -11473246 -12011545 -10102264 -556446 14328208 26030239 29369449 26902788 23322889
35295 23322889 19779268 15718964 12468312 11377290 10559674 7253607 2541455 306281
35287 306281 1753445 4261255 5973874 8130252 11509259 13628980 11987703 8310743
35279 8310743 6894060 9429526 13707867 17029391 18600870 18442830 16233109 12275859
35271 12275859 8278225 6299318 7687372 12921162 20604837 26179166 24276963 14458500
35263 14458500 3079827 -2754292 -2172412 267423 724029 -1369955 -5463356 -10464064
35255 -10464064 -13080504 -9858935 -2367983 3140935 3107793 574066 -188712 619681 1000559
35246 1000559 2228724 6966395 14114985 19611409 21231147 19097151 13092388 4174934
35238 4174934 -2994291 -3998044 -1141457 -845488 -4195418 -5609462 -2192411 1413089
35230 1413089 275944 -3795288 -6018782 -5234639 -2997329 91731 3013305 2728452
35222 2728452 -1508860 -5210519 -4845970 -4176602 -8833095 -16821879 -20939974 -19563833
35214 -19563833 -17924331 -18219600 -15940336 -8804662 -2961590 -5593512 -15174604 -23608039
35206 -23608039 -25751897 -22836902 -17895797 -11842814 -4546277 2498004 5753426 2303840
35198 2303840 -6265566 -13391292 -13380356 -7868957 -3579523 -3186050 -2208242 3272396 9766533
35189 9766533 10636568 4640219 -3235612 -7670815 -6608651 -901078 5889828 8625958
35181 8625958 5463660 1029836 1134352 4875611 6022780 2212481 -1694847 -616347
35173 -616347 4380058 8726178 10216890 9774544 8589213 6992818 5014319 2426641
35165 2426641 -653560 -2296737 173211 6113993 10346755 7920677 -960291 -11883337
35157 -11883337 -20353937 -23768018 -21916126 -18076797 -17397876 -20885653 -22650026 -16976102
35149 -16976102 -7033973 -1952305 -5147333 -10298762 -10127803 -4659659 1258773 4208476
35141 4208476 2924366 -2924739 -10176479 -11794911 -4856202 2885156 767821 -10629598
35133 -10629598 -19462942 -17748752 -9939225 -3894376 -250333 3957295 6734255 4013475
35125 4013475 -1278434 -1039998 6613061 14257305 15022180 10201266 5197431 2875071
35117 2875071 3314952 5515659 6422564 2574500 -4061201 -6406461 -2546825 -969088
35109 -969088 -9475112 -22517116 -27384459 -21483709 -14853359 -14641650 -15982068 -12221446
35101 -12221446 -6512945 -6375209 -11242339 -13103851 -8171119 -1094452 3034713 5097203
35093 5097203 8131186 11325934 11189893 6835315 1303584 -1767097 -877972 3565470
35085 3565470 10274085 17175921 21717813 22509937 20794854 19209247 18447455 16098788
35077 16098788 9927335 1401688 -5929527 -11070520 -15948642 -20852123 -22684433 -19488141
35069 -19488141 -14031027 -10393852 -9042646 -8121746 -7819729 -9763393 -12878315 -13809343
35061 -13809343 -11898847 -10448160 -12173849 -16221327 -20614561 -24893535 -28907058 -31293018
35053 -31293018 -30775612 -27377523 -21412904 -13345909 -5733961 -2765423 -5739879 -10690048
35045 -10690048 -12521632 -10227901 -6351760 -2993589 -642945 346410 -206946 -1293760
35037 -1293760 -1923665 -2885777 -5160320 -7072089 -5671546 -1287629 1774686 323889
35029 323889 -3486362 -4537007 -880217 3720885 3894945 -978549 -5452991 -4007571
35021 -4007571 2199256 6361239 3969836 -2453250 -7351623 -8232135 -5897430 -1176749
35013 -1176749 5217185 10688702 12072451 9216773 5085563 2339757 1532764 1972598
35005 1972598 2235708 588794 -2800971 -5021411 -4287089 -3193012 -4656633 -6180081
34997 -6180081 -3133624 2723844 3967001 -1920400 -8401750 -8980563 -5392250 -3225775
34989 -3225775 -3811996 -4770689 -5119864 -5165462 -3903767 -1134272 9427 -2575196 -4709427
34980 -4709427 -111652 10771589 20509654 22829955 17161840 6250722 -5838665 -13901335
34972 -13901335 -15315691 -14246787 -17123824 -23251308 -25504602 -21752265 -19072347 -22911345
34964 -22911345 -27753034 -24371091 -13076648 -3571184 -2590332 -6969472 -9342524 -6437831
34956 -6437831 -380297 5153213 7971199 7734416 4898606 -141966 -6454189 -11431998
34948 -11431998 -12045126 -8282608 -3912274 -2378135 -3050989 -2846259 -222653 3958846
34940 3958846 8049713 10096760 8175298 2857962 -1550556 -1111761 2659228 4495700
34932 4495700 2177931 -1164933 -1989930 -561326 1207772 3493314 7441670 11335926
34924 11335926 10734584 3441860 -6837191 -13114257 -11639823 -5280648 -95254 581046
34916 581046 -2549052 -8356824 -17052497 -27032608 -32920661 -30153365 -20779385 -11910262
34908 -11910262 -8660961 -11000428 -16860939 -24655012 -31851609 -34588052 -31240605 -24852879
34900 -24852879 -20145886 -19018929 -20023173 -20774502 -19352773 -14579441 -6985518 584992
34892 584992 4640370 3680549 -833493 -5580958 -7535187 -6251896 -4341874 -4471430 -5779373
34883 -5779373 -5027319 -1607626 1046580 178622 -2730004 -5032692 -7046810 -10116441
34875 -10116441 -12265271 -9542320 -1560881 7366639 13005467 14782693 14539108 14290932
34867 14290932 15672497 18929023 21249031 18209967 8674557 -2565956 -8270893 -5058706
34859 -5058706 3345675 8738936 5625104 -2710454 -6716009 -1395402 7054450 8809399
34851 8809399 2966652 -2579055 -3183303 -2628721 -4606079 -6254784 -4533085 -2776375
34843 -2776375 -4757328 -7165729 -5427377 -3269765 -7635551 -15951874 -18377075 -13314281
34835 -13314281 -10576855 -15923380 -21893400 -19608044 -11705481 -6251919 -4103501 -999231
34827 -999231 2106915 564864 -3795976 -3621959 2132595 5921184 3252255 -1229593
34819 -1229593 -2686899 -3827988 -8520080 -13571390 -13728071 -11313588 -13341218 -19856285
34811 -19856285 -22247446 -14899942 -3196224 3156213 1322151 -3629443 -6856734 -8785471
34803 -8785471 -11788817 -15345740 -16817322 -15565999 -13717731 -12976563 -13137443 -14331621
34795 -14331621 -17883061 -22861152 -24278927 -18435087 -9178470 -4760355 -7829271 -12239078
34787 -12239078 -11238021 -5404863 -141399 1782282 1998039 2801369 5108777 9172782
34779 9172782 13905517 15624457 10770093 874418 -7373928 -8180546 -1661941 7314828
34771 7314828 13616215 14830655 11852125 7831112 5462206 4289541 1612958 -3193214
34763 -3193214 -6793202 -6127073 -3610435 -5418046 -13934760 -24227440 -29689095 -29369989
34755 -29369989 -27119286 -24793372 -20522289 -14334096 -10599503 -11433650 -11332646 -3762434
34747 -3762434 8426245 15147499 12124823 6033362 4662957 7481711 9663504 10761455
34739 10761455 13798712 18199938 19571173 16386442 12154327 10130158 9598826 8657849
34731 8657849 7683036 8094953 9265968 8544045 4500521 -371718 -1201536 3529818 8292037
34722 8292037 5677943 -3715397 -10327761 -7115529 1705596 7245389 7758452 8406811
34714 8406811 11598371 14149741 13515855 10554670 5890886 -286447 -4288721 -1552863
34706 -1552863 5395371 8715735 7282686 9054698 17271251 22475985 15462161 1785085
34698 1785085 -5636480 -4463389 -3767453 -8509011 -13207642 -12536203 -9501234 -9347019 -11518672
34689 -11518672 -11860070 -8665299 -3064833 3261495 7645836 6628332 -219545 -8529032
34681 -8529032 -13389704 -13453364 -9392932 -1498546 8488866 15999643 17699769 15331020
34673 15331020 12442061 9094909 3469120 -2782498 -5568852 -4967175 -6221496 -12367275
34665 -12367275 -19366886 -21158371 -17153314 -11817951 -8268476 -5546564 -2128887 893908
34657 893908 1394655 -886379 -4546482 -8475081 -11765084 -12136189 -6895010 3103385 11755949
34648 11755949 12405008 4978921 -3119802 -4833008 -1421404 -500608 -5855261 -11862668
$$ [...]
##END NTUPLES=NMR SPECTRUM
##END=
