##TITLE=31Pdec_DE-60K_D2O_2
 D2O, 64 sc
 4.7.2024
##JCAMPDX= 6.0         $$ Bruker NMR JCAMP-DX V2.0
##DATA TYPE= NMR SPECTRUM
##DATA CLASS= NTUPLES
##ORIGIN= UXNMR, Bruker Analytische Messtechnik GmbH
##OWNER= root
$$ XWIN-NMR		Version 3.5
$$ Thu Jul  4 15:34:41 2024 Russian Standard Time (UT+4h)  she@DPX200
##.OBSERVE FREQUENCY= 81.013821
##.OBSERVE NUCLEUS= ^31P
##.ACQUISITION MODE= SIMULTANEOUS
##.ACQUISITION SCHEME= undefined
##.AVERAGES= 64
##.DIGITISER RES= 17
##SPECTROMETER/DATA SYSTEM= spect
##.PULSE SEQUENCE= zgpg30
##.SOLVENT NAME= DMSO
##.SHIFT REFERENCE= (INTERNAL, DMSO, 0, 198.062)
##AUDIT TRAIL= $$ (NUMBER, WHEN, WHO, WHERE, WHAT)
$$ ##TITLE= Audit trail, XWIN-NMR		Version 3.5
$$ ##JCAMPDX= 5.01
$$ ##ORIGIN= Bruker BioSpin GmbH
$$ ##OWNER= she
$$ F:/spectra/data/she/nmr/P31/2/pdata/1/auditp.txt
$$ ##AUDIT TRAIL=  $$ (NUMBER, WHEN, WHO, WHERE, WHAT)
(   1,<2024-07-04 15:33:42.92 +0400>,<she>,<DPX200>,
      <created by zg, POWCHK disabled, PULCHK disabled
       configuration hash MD5:
       00 E9 B6 7A A2 85 ED C7 34 08 36 98 17 FE 4E 26
       data hash MD5: 32K
       2C 39 C7 4E 61 17 CD C0 3C 77 5A 80 76 7A CA C0>)
(   2,<2024-07-04 15:33:46.25 +0400>,<she>,<DPX200>,
      <Start of raw data processing
       efp BC_mod = 2 LB = 1.5 FT_mod = 6 PKNL = 1 PHC0 = 3280.447 PHC1 = -778.9137 SI = 64K 
       data hash MD5: 64K
       DB DA C2 1C B4 A3 58 A6 80 5A 53 2B 67 4F 1A C3>)
(   3,<2024-07-04 15:34:05.04 +0400>,<she>,<DPX200>,
      <pk PHC0 = -317.9986 PHC1 = 445.1997 
       data hash MD5: 64K
       CD 08 85 C3 C3 8F 83 98 CB FB 06 60 9A D5 33 8C>)
(   4,<2024-07-04 15:34:08.53 +0400>,<she>,<DPX200>,
      <abs ABSG = 5 
       data hash MD5: 64K
       93 56 88 00 B3 6B 5C C4 1C 48 15 D7 ED 6C 79 76>)
$$ ##END=
$$ 
$$ hash MD5
$$ 68 54 81 5F C7 F1 48 CC 06 17 C9 31 70 BD E2 0A
##$RELAX= 
##$RELAX= 
##$RELAX= 
##$RELAX= 
##$RELAX= 
##$RELAX= 
##$RELAX= 
##$RELAX= 
$$ Bruker specific parameters
$$ --------------------------
##$DU= <F:/spectra>
##$EXPNO= 2
##$NAME= <P31>
##$PROCNO= 1
##$TYPE= <nmr>
##$USER= <she>
##$AMP= (0..31)
100 100 100 100 100 100 100 100 100 100 100 100 100 100 100 100 100 100 
100 100 100 100 100 100 100 100 100 100 100 100 100 100 
##$AQSEQ= 0
##$AQ_mod= 1
##$AUNM= <au_zg>
##$AUTOPOS= <>
##$BF1= 81.014009
##$BF2= 200.13
##$BF3= 200.13
##$BF4= 200.13
##$BF5= 200.13
##$BF6= 200.13
##$BF7= 200.13
##$BF8= 200.13
##$BYTORDA= 1
##$CFDGTYP= 0
##$CFRGTYP= 5
##$CHEMSTR= <none>
##$CNST= (0..31)
1 1 145 1 1 1 1 1 1 1 1 1 1 1 1 1 1 1 1 1 1 1 1 1 1 1 1 1 1 1 1 1 
##$CPDPRG= <waltz16>
##$CPDPRG1= <>
##$CPDPRG2= <waltz16>
##$CPDPRG3= <>
##$CPDPRG4= <mlev>
##$CPDPRG5= <mlev>
##$CPDPRG6= <mlev>
##$CPDPRG7= <mlev>
##$CPDPRG8= <mlev>
##$CPDPRGB= <>
##$CPDPRGT= <>
##$D= (0..31)
0 1 0 0 0 0 0 0 0 0.06 0 0.03 2e-05 3e-06 0 0 0.0002 0 0 0 0 0 0 0 0 0 
0 0 0 0 0 0 
##$DATE= 1720092822
##$DBL= (0..7)
120 120 120 11 120 120 24 19 
##$DBP= (0..7)
150 150 150 150 150 150 150 150 
##$DBP07= 0
##$DBPNAM0= <>
##$DBPNAM1= <>
$$ [...]
##$SUBNAM3= <"">
##$SUBNAM4= <"">
##$SUBNAM5= <"">
##$SUBNAM6= <"">
##$SUBNAM7= <"">
##$SUBNAM8= <"">
##$SUBNAM9= <"">
##$SW= 400.765351723535
##$SWIBOX= (0..15)
0 1 3 0 0 0 0 0 0 0 0 0 0 0 0 0 
##$SW_h= 32467.5324675325
##$TD= 32768
##$TD0= 1
##$TE= 0
##$TE2= 300
##$TE3= 300
##$TEG= 300
##$TL= (0..7)
0 120 53 12 22 120 120 120 
##$TP= (0..7)
150 150 150 150 150 150 150 150 
##$TP07= 0
##$TPNAME0= <>
##$TPNAME1= <>
##$TPNAME2= <>
##$TPNAME3= <>
##$TPNAME4= <>
##$TPNAME5= <>
##$TPNAME6= <>
##$TPNAME7= <>
##$TPOAL= (0..7)
0.5 0.5 0.5 0.5 0.5 0.5 0.5 0.5 
##$TPOFFS= (0..7)
0 0 0 0 0 0 0 0 
##$TUNHIN= 0
##$TUNHOUT= 0
##$TUNXOUT= 0
##$USERA1= <user>
##$USERA2= <user>
##$USERA3= <user>
##$USERA4= <user>
##$USERA5= <user>
##$V9= 5
##$VALIST= <valist>
##$VCLIST= <CCCCCCCCCCCCCCC>
##$VD= 0
##$VDLIST= <DDDDDDDDDDDDDDD>
##$VPLIST= <PPPPPPPPPPPPPPP>
##$VTLIST= <TTTTTTTTTTTTTTT>
##$WBST= 1024
##$WBSW= 4
##$XGAIN= (0..3)
0 0 0 0 
##$XL= 0
##$YL= 0
##$YMAX_a= 5137
##$YMIN_a= -5367
##$ZGOPTNS= <>
##$ZL1= 120
##$ZL2= 120
##$ZL3= 120
##$ZL4= 120
##$ABSF1= 198.0616
##$ABSF2= -202.7028
##$ABSG= 5
##$ABSL= 3
##$ALPHA= 0
##$AQORDER= 0
##$ASSFAC= 0
##$ASSFACI= 0
##$ASSFACX= 0
##$ASSWID= 0
##$AUNMP= <proc_1d>
##$AZFE= 0.1
##$AZFW= 0.5
##$BCFW= 0
##$BC_mod= 2
##$BYTORDP= 0
##$COROFFS= 0
##$CY= -3
##$DATMOD= 1
##$DC= 0
##$DFILT= <>
##$DTYPP= 0
##$F1P= 0
##$F2P= 0
##$FCOR= 1
##$FTSIZE= 65536
##$FT_mod= 6
##$GAMMA= 0
##$GB= 0
##$INTBC= 1
##$INTSCL= 9.790993e-09
##$ISEN= 30
##$LB= 1.5
##$LEV0= 0
##$LPBIN= 0
##$MAXI= 10000
##$MC2= 0
##$MEAN= 0
##$ME_mod= 0
##$MI= 50
##$NCOEF= 0
##$NC_proc= -10
##$NLEV= 6
##$NOISF1= 182.463
##$NOISF2= 159.3651
##$NSP= 0
##$NTH_PI= 0
##$NZP= 0
##$OFFSET= 198.0616
##$PC= 4
##$PHC0= 2962.448
##$PHC1= -333.714
##$PH_mod= 1
##$PKNL= yes
##$PPARMOD= 0
##$PSCAL= 0
##$PSIGN= 0
##$REVERSE= no
##$SF= 81.0140089999434
##$SI= 65536
##$SIGF1= 159.3651
##$SIGF2= -187.1042
##$SINO= 113.3802
##$SIOLD= 16384
##$SREGLST= <1H.CDCl3>
##$SSB= 0
##$STSI= 65536
##$STSR= 0
##$SW_p= 32467.5324675325
##$SYMM= 0
##$S_DEV= 0
##$TDeff= 32768
##$TDoff= 0
##$TI= <>
##$TILT= no
##$TM1= 0
##$TM2= 0
##$TOPLEV= 0
##$USERP1= <user>
##$USERP2= <user>
##$USERP3= <user>
##$USERP4= <user>
##$USERP5= <user>
##$WDW= 1
##$XDIM= 65536
##$YMAX_p= 297065147
##$YMIN_p= -192794456
$$ End of Bruker specific parameters
$$ ---------------------------------
##NTUPLES= NMR SPECTRUM
##VAR_NAME=  FREQUENCY,     SPECTRUM/REAL,   SPECTRUM/IMAG
##SYMBOL=    X,             R,               I
##VAR_TYPE=  INDEPENDENT,   DEPENDENT,       DEPENDENT
##VAR_FORM=  AFFN,          ASDF,            ASDF
##VAR_DIM=   65536,         65536,           65536
##UNITS=     HZ,            ARBITRARY UNITS, ARBITRARY UNITS
##FACTOR=    0.49542278885378, 1,            1
##FIRST=     16045.7642231865, 0,            0
##LAST=      -16421.768244346, 0,            0
##MIN=       -16421.768244346, -192794456,   0
##MAX=       16045.7642231865, 297065147,    0
$$ Real data points
##PAGE= N=1
##DATA TABLE= (X++(R..R)), XYDATA
$$ [...]
39790A997023J0157748J0291711N52027j5955683k2328241j1774463L403806J0654903
$$ 1997023 12154771 22446482 22998509 7042826 -15285415 -27059878 -23656072 -13001169
39782a3001169J1201849J0120010O037234j594050o746137p099535r614497j6517246
$$ -13001169 -1799320 8320690 14357924 12763874 6017737 -1081798 -10696295 -27213541
39774b7213541j6154090L27670K1443361K7784733J6766235K553701m496512n689859
$$ -27213541 -43367631 -43039961 -21596600 6188133 22954368 25508069 21011557 15321698
39766A5321698m258446p81451K369975L288438O300736J4548774J8762225O794683
$$ 15321698 11063252 10281801 12651776 15940214 22240950 36789724 55551949 62346632
39758F2346632j5534475k7427980j9852087n938232l39534j380628m97530K454251
$$ 62346632 46812157 19384177 -467910 -6406142 -6745676 -8126304 -8623834 -6169583
39750f169583K590213K79703j000147j457842k564954k864289j733142j752570
$$ -6169583 -3579370 -3299667 -4299814 -5757656 -8322610 -11186899 -12920041 -14672611
39742a4672611k380496K059893J2211149J8166344J1144363m364752j6240963
$$ -14672611 -17053107 -14993214 -2782065 15384279 26528642 22163890 5922927
39735E922927j7851711j0814206p56724M689938P65973n983253k277871J2407126
$$ 5922927 -11928784 -22742990 -23499714 -18809776 -18043803 -24027056 -26304927 -13897801
39727a3897801K0618149J0303555o486561j0528716k536411J484826m069128r794316
$$ -13897801 6720348 17023903 10537342 8626 -2527785 -1042959 -5112087 -14906403
39719a4906403r444431o292218j940987N372309J0580957N714067m063735m546877
$$ -14906403 -24350834 -30643052 -32584039 -27211730 -16630773 -10916706 -14980441 -19527318
39711a9527318M147815N778133m577436j0004179M94700J1295432L519330j3957477
$$ -19527318 -15379503 -9601370 -14178806 -24182985 -23688285 -12392853 -8873523 -22831000
39703b2831000j6425139P64219J7810766J9735224J1626301L174463m937313j3719206
$$ -22831000 -39256139 -38491920 -20681154 -945930 10680371 13854834 8917521 -4801685
39695d801685j8802045j8169111j6601195j5341793p111249J0040511K2870682
$$ -4801685 -23603730 -41772841 -58374036 -73715829 -80827078 -70786567 -47915885
39688d7915885J8460223M085576j095122P735304J5949527J1979684K367856j102732
$$ -47915885 -29455662 -25370086 -26465208 -18729904 -2780377 9199307 11567163 10464431
39680A0464431J227830J175902k686049n041732n062908p274475j1492035j1375523
$$ 10464431 11692261 12868163 10182114 5140382 77474 -7197001 -18689036 -30064559
39672c0064559n218545l85186l256631j0333473j3089379p643075L230663J3747542
$$ -30064559 -35283104 -35668290 -38924921 -49258394 -62347773 -69990848 -66760185 -53012643
39664e3012643J8050707J3473119M016060k390545k315076N17829K136312L352106
$$ -53012643 -34961936 -21488817 -17472757 -19863302 -22178378 -21660549 -19524237 -16172131
39656a6172131O021846R201080J1423817J2022171Q393658j681962j2394141j2470960
$$ -16172131 -10150285 -949205 10474612 22496783 30890441 29208479 16814338 4343378
39648D343378m50816J0001277O638851n859450j4007216j3001203p917453k809007
$$ 4343378 3892562 13893839 20532690 14673240 666024 -12335179 -20252632 -23061639
39640b3061639K003344N061177M797049L206233J974064j038898m912745j730377
$$ -23061639 -21058295 -15997118 -11200069 -7993836 -6019772 -7058670 -11971415 -13701792
39632a3701792J1072746K0771129J3902810l598333j3829494j1459294p009913
$$ -13701792 -2629046 18142083 32044893 28446560 14617066 3157772 -3852141
39625c852141p235336p181157l092860P40332J292509J308713J646378m24557
$$ -3852141 -11087477 -18268634 -21361494 -20621162 -19328653 -18019940 -16373562 -16798119
39617a6798119l525272l285085j814727m528358p550039j945234Q826253J1332038
$$ -16798119 -20323391 -23608476 -25423203 -29951561 -37501600 -39446834 -30620581 -19288543
39609a9288543M426157K131753R635879J4014900O192655n078324j0431021j4168115
$$ -19288543 -14862386 -12730633 -3094754 10920146 17112801 12034477 1603456 -12564659
39601a2564659j9971190j8784426n270841P868143P885274K390043N417710J3600446
$$ -12564659 -32535849 -51320275 -56591116 -48722973 -40837699 -38447656 -33029946 -19429500
39593a9429500J3756107O030058J484966K306863J764765o3539K752207P644749
$$ -19429500 -5673393 356665 1841631 4148494 5913259 5849720 8601927 16246676
39585A6246676N753676k497265p768234o755849m259580j979688K250451N641317
$$ 16246676 22000352 19503087 11734853 4979004 719424 -1260264 990187 6631504
39577F631504L241651j596589j055497M315190P262918N625032J846583m774501
$$ 6631504 9873155 8276566 7221069 11536259 18799177 24424209 26270792 21496291
39569B1496291j3276227j4200581k350470Q908533L286668j2414326j6980142
$$ 21496291 8220064 -5980517 -8330987 577546 3864214 -8550112 -25530254
39562b5530254p179107l27805l890269n137443L705395J1368898P535689p73689
$$ -25530254 -32709361 -33037166 -36927435 -42064878 -38359483 -26990585 -19454896 -20228585
39554b0228585k534082J990070P456721J1685910J1498013M289345j700720M626719
$$ -20228585 -22762667 -20772597 -13315876 -1629966 9868047 14157392 12456672 17083391
39546A7083391J4613545O366832j8286386k8012359p624509J5084106R814699
$$ 17083391 31696936 38063768 19777382 -8234977 -15859486 -775380 9039319
39539I039319j0340678j1651466O666425J4221540j017544j7170705j5114469
$$ 9039319 -1301359 -12952825 -6286400 7935140 6917596 -10253109 -25367578
39532b5367578k793272N012180Q257995J1845345J1905354M665757k609149j042698
$$ -25367578 -28160850 -23148670 -14890675 -3045330 8860024 13525781 10916632 9873934
39524I873934O647326J0853075P856195K072866l24005L179488Q179787N075600
$$ 9873934 16521260 27374335 35230530 37303396 36979391 40158879 48338666 53414266
39516E3414266r548457k3735087k1636793n216771O332356K131326o774488n447120
$$ 53414266 43865809 20130722 -1506071 -6722842 -390486 1740840 -5033648 -10480768
39508a0480768L947764Q553222M619228q2426J2208K468318M318256O654284R809667
$$ -10480768 -6533004 2020218 6639446 6557020 6569228 9037546 13355802 20010086 29819753
39499B9819753J0074482M620187l117322o027701j301070N488953N709099k379465
$$ 29819753 39894235 44514422 41397100 35369399 34068329 39557282 45266381 42886916
39491D2886916j1068678j2893039j0258583j0379570j2271243o923790P319331
$$ 42886916 31818238 18925199 8666616 -1712954 -13984197 -20907987 -13588656
39484a3588656J7973117J3461189o64627q826342n923196j449302k750302l959517
$$ -13588656 4384461 17845650 17181023 8354681 2431485 982183 -1768119 -5727636
39476e727636L037774J3462001J4250244K407898r638460r869270j524453L471930
$$ -5727636 -2689862 10772139 25022383 27430281 17791821 7922551 6398098 9870028
39468I870028J971436K208685Q668544J3298643P354181m107200q068689j650995
$$ 9870028 11841464 14050149 22718693 36017336 43371517 39264317 31195628 29544633
39460B9544633M950216M870307M524136J1744321K1333491K1351855J0738538
$$ 29544633 34494849 39365156 43889292 55633613 76967104 98318959 109057497
39453A09057497J224150J303792P091352J1726828J5018605J7848426J4965688
$$ 109057497 110281647 111585439 118676791 130403619 145422224 163270650 178236338
39446A78236338L340481o874101k246596J3106083J9566571Q847339m026123l636646
$$ 178236338 181576819 174702718 172456122 185562205 205128776 213976115 209949992 206313346
39438B06313346K951140n41235j2286454j5955576q445570m503720j0805992j4659262
$$ 206313346 209264486 208723251 196436797 180481221 172035651 167531931 156725939 142066677
39430A42066677p148186k43244p067513j8752992j8479452r370437q345345j6493426
$$ 142066677 134918491 134675247 127607734 108854742 90375290 81004853 72659508 56166082
39422E6166082j7262645n576886K899305j258026n075970L298711J2062645M860021
$$ 56166082 38903437 33326551 36225856 34967830 29891860 33190571 45253216 50113237
39414E0113237r584647r116415N682359J0870761k823914j4550677o151101R055200
$$ 50113237 40528590 31412175 37094534 47965295 45141381 30590704 24439603 33494803
39406C3494803P064380j0162605j8882231q675664O652068J3227538J3301857
$$ 33494803 40559183 30396578 11514347 2838683 9490751 22718289 36020146
39399C6020146J2494856P555021l949632j4113713j5390021j1965806j0693130
$$ 36020146 48515002 56070023 52120391 38006678 22616657 10650851 -42279
39392d2279q636572j98665J0023818J2786732P717061Q05619o274836j2884479
$$ -42279 -8678851 -8877516 1146302 13933034 21650095 22455714 16180878 3296399
39384C296399j1393145K831610J7150367J4253606j421001p441177L900258J4508991
$$ 3296399 -8096746 -5265136 11885231 26138837 24717836 17276659 21176917 35685908
39376C5685908Q197383p554233j6827265j7024181j3574984o024855O150285J3304321
$$ 35685908 43883291 36329058 19501793 2477612 -11097372 -17122227 -10971942 2332379
39368B332379O596094o094631r017471j15086Q429255Q808231N075965K815297
$$ 2332379 8928473 2833842 -6183629 -6298715 2130540 10938771 16014736 18830033
39360A8830033J863539M01564j442192l185212m419454m484500m772399p530591
$$ 18830033 20693572 21095136 19652944 16467732 12048278 7563778 2791379 -4739212
39352d739212r360394l137080Q497439J1360717M72905p706036K530717J9823757
$$ -4739212 -14099606 -17236686 -8739247 2621470 3094375 -4611661 -2080944 17742813
39344A7742813J9199901j543407j7512066j0583376Q928225J9505109J3803878
$$ 17742813 36942714 35399307 17887241 7303865 16232090 35737199 49541077
39337D9541077J65521j0849804j4100936j0462575n375321l420034k862651N53045
$$ 49541077 49706598 38856794 24755858 14293283 8917962 5497928 2635277 3188322
39329C188322N774637Q233256P196725M395139j239909q892560j0580896j950343
$$ 3188322 8962959 17196215 24392940 28788079 27548170 18655610 8074714 6124371
39321F124371O211701J483009q912629p663349L706677O274052l919835q143511
$$ 6124371 12336072 13819081 4906452 -2756897 949780 7223832 3303997 -4839514
39313d839514K579060J0383769J06722j3864710r383270Q892195J7784339J0393260
$$ -4839514 -2260454 8123315 8230037 -5634673 -15017943 -6125748 11658591 22051851
39305B2051851K118569M567845J1231997J0622924O73958j2272910k0036067j7283103
$$ 22051851 24170420 28738265 39970262 50593186 51267144 38994234 18958167 1675064
39297A675064o384697K775082K884326k918803p116749p204042m438110Q54820
$$ 1675064 -4709633 -1934551 949775 -1969028 -9085777 -16289819 -20727929 -19873109
39289a9873109P017094J0020505R908068J1169788J2220763N284566o387902n186620
$$ -19873109 -12856015 -2835510 7072558 18242346 30463109 35747675 29359773 24173153
39281B4173153J4469364K9766175J7435210j1376883k4714250j3025811K832358
$$ 24173153 38642517 68408692 85843902 74467019 49752769 36726958 39559316
39274C9559316N559319J270786J358156M202699L495440P46640R98075N324910
$$ 39559316 45118635 46389421 47747577 51950276 55445716 56192356 57190431 62515341
39266F2515341J2507592J9665376J9474147P325059p543044j0471914k635953
$$ 62515341 75022933 94688309 114162456 121487515 113944471 103472557 100836604
39259A00836604N7699q074780j4531279j0780331n630695p883256j1377371q534212
$$ 100836604 100894303 92819523 78288244 67507913 61877218 53993962 42616591 34082379
39251C4082379m769550o538265p555141j279777M033792j175458q702014m915457
$$ 34082379 29312829 22774564 15219423 13939646 17973438 16797980 8095966 3180509
39243C180509M924535M485853n366104p517662J454260M153227q160551j8543147
$$ 3180509 8105044 12590897 7224793 -292869 1161391 5314618 -2845933 -21389080
39235b1389080r054970J1789122K1185288J3256129K990844K299302O211197M637971
$$ -21389080 -30444050 -18654928 2530360 15786489 18777333 21076635 27287832 31925803
39227C1925803k937897r319803r673182m612665L340037J1453309J5799797J2707958
$$ 31925803 28987906 19668103 9994921 5382256 8722293 20175602 35975399 48683357
39219D8683357K798718q136007j4009724j3877004j1468798r898325q712849o434508
$$ 48683357 51482075 43346068 29336344 15459340 3990542 -5907783 -14620632 -21055140
39211b1055140l673413k053076j537920q04496O31403K567947N614757J0329062
$$ -21055140 -24728553 -26781629 -28319549 -29124045 -28492642 -25924695 -20309938 -9980876
39203i980876J5111634J7061438J5029181J0141928L658526l334892q176496p909002
$$ -9980876 5130758 22192196 37221377 47363305 51021831 47686939 39510443 31601441
39195C1601441l862858k077218o300729j2346736j2935571p453292k635829k528073
$$ 31601441 27738583 25661365 19360636 7013900 -5921671 -13374963 -16010792 -18538865
39187a8538865k307938M253809J4125253J7068498Q169085o190838j5699428j5584671
$$ -18538865 -20846803 -16592994 -2467741 14600757 22769842 16579004 879576 -14705095
39179a4705095q095884M84672K406279o094593j7477803j6286824L265356K6171920
$$ -14705095 -22800979 -22316307 -19910028 -26004621 -43482424 -59769248 -56503892 -30331972
39171c0331972L1013639J4738034m588291j0268479m057050J871093K046562R14920
$$ -30331972 681667 15419701 10831410 562931 -3494119 -1623026 423536 1338456
39163A338456L600329R667652J4655287J4149581P663360M03238j492747Q31796
$$ 1338456 4938785 14606437 29261724 43411305 51074665 51477903 49985156 50816952
39155E0816952l47791p833151j4031909j1684781m874379k418037m199048k834564
$$ 50816952 50469161 42636010 28604101 16919320 12044941 9626904 5427856 2593292
39147B593292K758314N287503J711588j616437j56166J067568k951269o830392
$$ 2593292 5351606 10639109 12350697 10734260 10578094 11645662 8694393 1864001
39139A864001k553186O210582P094526l453136j3790788j1227112K784077J5176223
$$ 1864001 -689185 5521397 12615923 9162787 -4628001 -15855113 -13071036 2105187
39131B105187J5803380O269602l744475o119227j061574L998903K646680l194766
$$ 2105187 17908567 24178169 20433694 14314467 13252893 17251796 19898476 16703710
39123A6703710n835735j768141M117260N630033K991470L30283j658736n909316
$$ 16703710 10867975 9099834 13217094 18847127 21838597 22168880 20510144 14600828
39115A4600828j2552483j6616347j3281546l208508P859880J3348630J0289285
$$ 14600828 2048345 -14568002 -27849548 -31058056 -23198176 -9849546 439739
39108D39739J614973o056694q145165m943693J224030Q140065J1562279O670605
$$ 439739 2054712 -4001982 -12147147 -17090840 -15866810 -7726745 3835534 10506139
39100A0506139l603897p296399J917329J3238167J1877523O72489l831845L439311
$$ 10506139 6902242 -394157 1523172 14761339 26638862 27311351 23479506 26918817
39092B6918817R076383K975484o881129q614644l258940J531679L918952M254185
$$ 26918817 35995200 38970684 32089555 23474911 20215971 21747650 25666602 29920787
39084B9920787q00764r402176r665936L116256J3424714N299534j2012660j5895847
$$ 29920787 29120023 19717847 10051911 13168167 26592881 31892415 19879755 3983908
39076C983908l171933Q025462P177950J921455j530143p472913j4710109j1308763
$$ 3983908 811975 8837437 16015387 17936842 16406699 8933786 -5776323 -17085086
39068a7085086N082310J8035016J4327546J768162n127421m411130r97830N391064
$$ -17085086 -12002776 6032240 20359786 22127948 17000527 12589397 11591567 16982631
39060A6982631J3687057J3903597K96190j6161774k1670159j8216176j5271972
$$ 16982631 30669688 44573285 44869475 28707701 7037542 -11178634 -26450606
39053b6450606j1458874l25837J2043837J2999434M319326K65045M787160O686643
$$ -26450606 -37909480 -38235317 -26191480 -13192046 -8872720 -8607675 -3820515 2866128
39045B866128m82579q402046p906656p50652O817944J1897027J2484412O649209
$$ 2866128 2383549 -6018497 -13925153 -14675805 -7857861 4039166 16523578 23172787
39037B3172787k055318o617608o800695r168362j4958927j7122903j1840776l398331
$$ 23172787 21117469 14499861 7699166 -1469196 -16428123 -33551026 -45391802 -48790133
39029d8790133N077846J5166259K3683873K1330998P351532m930209n422873j100273
$$ -48790133 -43712287 -28546028 -4862155 16468843 23820375 18890166 13467293 12367020
39021A2367020l428281j0109332j0328095k473921N127268Q301986J0642613J3599137
$$ 12367020 8938739 -1170593 -11498688 -13972609 -8845341 -543355 10099258 23698395
39013B3698395J3004902O886723j190394q258243j4608679j8530811j5099599
$$ 23698395 36703297 43590020 42399626 34141383 19532704 1001893 -14097706
39006a4097706l795467P269885Q778341m4620j1198634j5637410r884007K797258
$$ -14097706 -17893173 -10623288 -1844947 -1889567 -13088201 -28725611 -38609618 -35812360
38998c5812360J5327230K1184972J7619098O430645o599811j3472137q910336
$$ -35812360 -20485130 699842 18318940 24749585 18149774 4677637 -4232699
38991d232699L708198J3631380J3210932N664291n13838k425009l361717m629950
$$ -4232699 -524501 13106879 26317811 31982102 31468264 29043255 25681538 21051588
38983B1051588l904321k291509n178580j2439792j4864461o510908M712839O665702
$$ 21051588 17147267 14855758 9677178 -2762614 -17627075 -24137983 -19425144 -12759442
38975a2759442k67441n090199l183542p35756j226779M95248N685889N241396
$$ -12759442 -13026883 -18117082 -21300624 -22036380 -23263159 -22767911 -17082022 -11840626
38967a1840626m719628j0809246M43526J9399405K3254674P721960p524289p396230
$$ -11840626 -16560254 -27369500 -26925974 -7526569 15728105 23450065 15925776 8529546
38959H529546P88430M164374L579385N396218O290771l31328j0508248j5444039
$$ 8529546 9317976 13482350 17061735 22457953 28748724 28417396 17909148 2465109
38951B465109j5776439j7609935j8444336j0259522N106183J6243868J7939389
$$ 2465109 -13311330 -30921265 -49365601 -59625123 -54518940 -38275072 -20335683
38944b0335683J5461930J2559926O249768m270361j3206996j5807454j3271666
$$ -20335683 -4873753 7686173 13935941 9665580 -3541416 -19348870 -32620536
38937c2620536q451892l125576N03437K514207P923660J8276752K3399061J3086449
$$ -32620536 -41072428 -44198004 -43694567 -41180360 -33256700 -14979948 8419113 21505562
38929B1505562m678137j1230289l519617K573542j771640n957771o93695N401831
$$ 21505562 16827425 5597136 2077519 4651061 2879421 -3078350 -3772045 1629786
38921A629786J507178o209697m902005M391925R818242O236600j989503j0467194
$$ 1629786 3136964 -3072733 -7974738 -3582813 6235429 12472029 10482526 15332
38913A5332j6105078j3589448j267937J2454661J7368960J3011975N397309k017834
$$ 15332 -16089746 -29679194 -30947131 -18492470 -1123510 11888465 17285774 15267940
38905A5267940o705486l933492N020847Q607757j07479j0781732r447220J845634
$$ 15267940 8562454 4628962 9649809 18257566 18150087 7368355 -2078865 -233231
38897b33231J1332548J5922834J8446013J3952158k509590j8717646j6528097
$$ -233231 11099317 27022151 45468164 59420322 56910732 38193086 21664989
38890B1664989J38406Q832187J694107n735710k844827O64429l847582p416945
$$ 21664989 21803395 30635582 32329689 26593979 23749152 24413581 20565999 13149054
38882A3149054n71766R575869J2452478J0115061P258489r65231j6089194k3585355
$$ 13149054 12577288 22153157 34605635 44720696 51979185 51013954 34924760 11339405
38874A1339405j0530719J2175514K2240845J4992530M248139r59614m298253r157005
$$ 11339405 808686 12984200 35225045 50217575 54465714 53506100 49207847 40050842
38866D0050842j2905961j3926025j2412817n855824N023368R737704R75029r830494
$$ 40050842 27144881 13218856 806039 -5049785 -26417 9711287 10686316 855822
38858H55822n921843Q198288J1859662N8655r731400o423090n17482k302817m415800
$$ 855822 -5066021 3132267 14991929 15050584 5319184 -1103906 -1621388 -3924205 -8340005
38849h340005J226827N927704l00694q669437n005227N549523N882720n615005
$$ -8340005 -7113178 -1185474 -1486168 -10155605 -15160832 -9611309 -3728589 -9343594
38841i343594j2929921o858180M560295J1266085J2369304R392941J614346p232302
$$ -9343594 -22273515 -29131695 -24571400 -13305315 -936011 8456930 10071276 2838974
38833B838974q772067j998620L478027J197379l265539k135021L511459P892469
$$ 2838974 -5933093 -7931713 -4453686 -3256307 -6521846 -8656867 -5145408 2747061
38825B747061Q878050O852403J702757l638348l138925K921932N053624k086619
$$ 2747061 11625111 18477514 20180271 16541923 13402998 16324930 21378554 19291935
38817A9291935j0015072q571398j795070j069088o359159o479291K638547J1955394
$$ 19291935 9276863 705465 -1089605 -2158693 -8517852 -14997143 -12358596 -403202
38809d03202J3695536J0839029Q015858K468017r078912k0698074k1795861r390578
$$ -403202 13292334 24131363 32147221 34615238 25536326 4838252 -16957609 -26348187
38801b6348187Q226635J8644644J4951670J804429o969332j498546J2154780J8721884
$$ -26348187 -18121552 523092 15474762 17279191 10309859 8811313 20966093 39687977
38793C9687977J3321278O137113M848069L131547n928804j4982279j2721537k591346
$$ 39687977 53009255 59146368 63994437 67125984 61197180 46214901 33493364 30902018
38785C0902018K227383o18832q27629O478292J4583757J8561769K1116857K1783350
$$ 30902018 33129401 32510569 31682940 38161232 52744989 71306758 92423615 114206965
38777A14206965J4614768K826767J410890J5177230K6726518J9144590M22608
$$ 114206965 128821733 131648500 133059390 148236620 174963138 194107728 194530336
38770A94530336r730655q994194j0157697j4703484j0123508M651714J2113154
$$ 194530336 184799681 175805487 165647790 150944306 140820798 145472512 157585666
38763A57585666K358322j0937000j1660797m056214j452411m277029m737543m509587
$$ 157585666 159943988 149006988 137346191 133289977 131837566 127560537 122822994 118313407
38755A18313407j0327532j6886628j2196775J185227P866789M043378K477017
$$ 118313407 107985875 91099247 78902472 80087699 87954488 91997866 94474883
38748I4474883Q403944Q581177n754333k0667118j8489422m000987M232994J802922
$$ 94474883 102878827 111460004 105705671 85038553 66549131 62548144 66781138 68584060
38740F8584060J033323Q198984J4410772J1131739J494585p409741j2550789j1540007
$$ 68584060 69617383 77816367 92227139 103358878 104853463 97443722 84892933 73352926
38732G3352926j847435J1147351J4758571M750961o779105o841689J020172L276846
$$ 73352926 71505491 82652842 97411413 102162374 95383269 88541580 89561752 92838598
38724I2838598l625897r645109p141265j412084j633435p137017q567996j474883
$$ 92838598 89212701 79567592 72426327 71014243 69380808 62243791 53675795 52200912
38716E2200912O667917N878483k729662p984146l632062L807517N456155K035387
$$ 52200912 58868829 64747312 62017650 54033504 50401442 54208959 59665114 61700501
38708F1700501j007396m641432j2597157j9808259j6747580n486858J185205p95681
$$ 61700501 60693105 56051673 43454516 23646257 6898677 1411819 2597024 1801343
38700A801343j310500M995465P992200r25850j3128186j5363362q489898j615589
$$ 1801343 490843 5486308 13478508 12552658 -575528 -15938890 -24428788 -26044377
38692b6044377L736759J0136259J2690490O570209M62410N679365J5495935J3475505
$$ -26044377 -22307618 -12171359 519131 7089340 7551750 13231115 28727050 42202555
38684D2202555Q69533m136776L614283P830375j411648j1270720p930993K570667
$$ 42202555 43072088 38935312 42549595 50379970 48968322 37697602 29766609 32337276
38676C2337276Q130892R938775J2959900J0355763m323770j8622137j4718007
$$ 32337276 40468168 50406943 63366843 73722606 69398836 50776699 36058692
38669C6058692K910942J2398439N808629k852434k564097n8291l710982q483128
$$ 36058692 38969634 51368073 57176702 54324268 51760171 51701880 47990898 39507770
38661C9507770o739053k787029n371775j2224390j2658761l002896Q616792J2397838
$$ 39507770 32768717 29981688 24609913 12385523 -273238 -3276134 5340658 17738496
38653A7738496O656177k088815n617266j432467M482761M060539k763797p760869
$$ 17738496 24394673 22305858 16688592 15256125 19738886 23799425 21035628 13274759
38645A3274759n707403j234708r23526l107939j239438N054349Q789200N805543
$$ 13274759 7567356 6332648 5409122 2301183 1061745 6116094 14905294 20710837
38637B0710837O52743Q419L741180N750834K422381k981548n405832n371964q135361
$$ 20710837 21363580 21371999 25113179 30864013 33286394 30304846 24899014 19527050 11391689
38628A1391689j4859908j8089694r803617P185141K0405832K1109517J2550812
$$ 11391689 -3468219 -21557913 -31361530 -24176389 -3770557 17338960 29889772
38621B9889772L652058j082784k537580k347609k209780n054826j1153646j4115744
$$ 29889772 33541830 32459046 29921466 27573857 25364077 20309251 9155605 -4960139
38613d960139o818569P834734J7494730J4033019K742606m478663j919586O126916
$$ -4960139 -11778708 -3943974 13550756 27583775 30326381 25847718 23928132 30055048
38605C0055048J0986305O448320o602523j8961560j9525788p199703N818977P215382
$$ 30055048 41041353 47489673 40887150 21925590 2399802 -4799901 1019076 8234458
38597H234458p00945m540107K838894J4167782J7378244Q485524n831283j4228755
$$ 8234458 7533513 2993406 5832300 20000082 37378326 45863850 40032567 25803812
38589B5803812r364985M312953J1752314K815670j3108310j6102964r22436J6236034
$$ 25803812 16438827 20751780 32504094 35319764 22211454 6108490 5186054 21422088
38581B1422088J9551155J1366131J997357o351721j4710193j6736063p867566
$$ 21422088 40973243 52339374 54336731 47985010 33274817 16538754 8671188
38574H671188J525232j491234j0634226q474262N082147J1748500M676333j276069
$$ 8671188 10196420 8705186 -1929040 -10403302 -5321155 6427345 11103678 9827609
38566I827609L510863O320031n040930j9219853j8351387o073324R4870l565778
$$ 9827609 13338472 19658503 14617573 -4602280 -22953667 -29026991 -28932121 -32497899
38558c2497899n929718l025283j692277k330689K912664J2249535J2654378K049941
$$ -32497899 -38427617 -41452900 -43145177 -45475866 -42563202 -30313667 -17659289 -15609348
38550a5609348l379119O606422J8476580J3706404l986042j3923498o571738O581659
$$ -15609348 -18988467 -12382045 6094535 19800939 15814897 1891399 -4680339 1901320
38542A901320J0929544N512973j196675m282564n530859p086308p597695n354181
$$ 1901320 12830864 18343837 17147162 12864598 7333739 247431 -7350264 -12704445
38534a2704445j904646O070R03029L613706P318788O551245j138724r758361j1078515
$$ -12704445 -14609091 -14603021 -13699992 -10086286 -2767498 3783747 2645023 -7113338 -18191853
38525a8191853m206027M788408J0394473J0404371M065527o130016j2431722q727634
$$ -18191853 -22397880 -17609472 -7214999 3189372 7254899 1124883 -11306839 -20034473
38517b0034473Q10822O749893P503677R227584J2417864R218784j975858r553861
$$ -20034473 -19223651 -12473758 -4970081 4257503 16675367 25894151 23918293 14364432
38509A4364432m058440O865064Q274748j572034j0156179q707297k187119P0944
$$ 14364432 10305992 17171056 25445804 23873770 13717591 5010294 2823175 2894119
38501B894119l711720q537379j0307597q367594k842974N889990J4442624J6493681
$$ 2894119 -817601 -9354980 -19662577 -28030171 -30873145 -24983155 -10540531 5953150
38493E953150Q738717l728844j1177682r588220m353916j806765r90179J983746
$$ 5953150 14691867 10963023 -214659 -9802879 -14156795 -15963560 -16953739 -14969993
38485a4969993N213753L697109q01925p99752M923946Q246837L384461n412032
$$ -14969993 -9756240 -6059131 -6861056 -7660808 -2736862 5509975 8894436 3482404
38477C482404j1477871j4268561j5438612j2684466m080706N637583R818537Q630798
$$ 3482404 -7995467 -22264028 -37702640 -50387106 -54467812 -48830229 -39011692 -30380894
38469c0380894P709306J0108201J4077889J6323790J3125119J630489j4326127
$$ -30380894 -22671588 -12563387 1514502 17838292 30963411 32593900 18267773
38462A8267773k2837992j5552163M43762R321703N266475j998288j647315M730625
$$ 18267773 -4570219 -20122382 -19678620 -10356917 -5090442 -7088730 -8736045 -4005420
38454d005420P629173L351711j807541o99487N059501P144167J607164n616302
$$ -4005420 3623753 6975464 5167923 4468436 9527937 16672104 18279268 12662966
38446A2662966o929420l619758k473622l532962J83956R190261J3535958P556024
$$ 12662966 5733546 2113788 -359834 -3892796 -3708840 5481421 19017379 26573403
38438B6573403m52463j244476P58778l545684j0748416r960839j785513K293500
$$ 26573403 26120940 24876464 25635242 22089558 11341142 1380303 -405210 1888290
38430A888290k62148J390045J2000442J9834606J3457394j213603r592246p243481
$$ 1888290 1626142 3016187 15016629 34851235 48308629 47095026 37502780 30259299
38422C0259299j481318Q36538r70381m450061n616836k38781R924116J4737965
$$ 30259299 28777981 29614519 28644138 24194077 18577241 18338460 28262576 43000541
38414D3000541O419613q879405j6805649j1483900m47767O693891Q052636O792757
$$ 43000541 49420154 40540749 23735100 12251200 11803433 18497324 26549960 33342717
38406C3342717M637077J270201k885383n982480n846755j535497M407401N897021
$$ 33342717 37979794 39249995 36364612 30382132 24535377 22999880 27407281 33304302
38398C3304302j226661j3207170k0798445j8462220q725455K536626J1266789
$$ 33304302 32077641 18870471 -1927974 -20390194 -29115649 -26579023 -15312234
38391a5312234J4729093J0869195K148829l073657J685047J2165462J6658778
$$ -15312234 -583141 10286054 12434883 9361226 11046273 23211735 39870513
38384C9870513R156159m179536j2910936j3175103q363591k595571J857725K330043
$$ 39870513 49026672 44847136 31936200 18761097 10397506 7801935 9659660 11989703
38376A1989703l037053j0313806j1000466j888957R212326J1669113M432568l638708
$$ 11989703 8952650 -1361156 -12361622 -14250579 -5038253 6630860 11063428 7424720
38368G424720m989678o48841L768846M726583J791353l911532r229388r751331
$$ 7424720 2435042 1786201 5555047 10281630 12072983 8161451 -1067937 -10819268
38360a0819268m607743J023555J634439j312514j421331L523443Q504615Q410453
$$ -10819268 -15427011 -14403456 -12769017 -14081531 -15502862 -11979419 -3474804 4935649
38352D935649M416233R10094q23403k581420n083216p410944q914432p909743
$$ 4935649 9351882 10261976 9438573 6857153 1773937 -5637007 -14551439 -22461182
38344b2461182q12995J1567350J8637568R943793p876332j4450293j920669J1985889
$$ -22461182 -23274177 -11706827 6930741 16874534 8998202 -5452091 -7372760 4613129
38336D613129P200425j0338913j7668393p869014K895565K493237r20016L016410
$$ 4613129 11813554 1474641 -16193752 -24062766 -21167201 -18673964 -19593980 -16577570
38328a6577570Q205638L745436o475296r484763k407062O184500R665118P247437
$$ -16577570 -8371932 -4626496 -11101792 -20586555 -22993617 -16809117 -7143999 103438
38320A03438j059761j2090504j6043969p188736N183438Q464721N616155Q464588
$$ 103438 -956323 -13046827 -29090796 -36279532 -31096094 -22631373 -17015218 -8550630
38312h550630J5738940J5199322O857572M106208Q448898M590555j0915646j7805573
$$ -8550630 7188310 22387632 29245204 33351412 41800310 46390865 35475219 17669646
38304A7669646l559805J2175287M742783j7738833k6924524j6075679m348516
$$ 17669646 14109841 26285128 31027911 13289078 -13635446 -29711125 -34059641
38297c4059641k358573J47608Q278005R074998l815672j3183023k751616J5389922
$$ -34059641 -36418214 -36270606 -27992601 -18917603 -22733275 -35916298 -38667914 -23277992
38289b3277992J6728574r1815j2660240p604358L922753O647867J776152l37784
$$ -23277992 -6549418 -6641233 -19301473 -26905831 -22983078 -16335211 -14559059 -14896843
38281a4896843K825821O217679Q391787J2248988J6415429J4704901N583343m133071
$$ -14896843 -12071022 -5853343 2538444 14787432 31202861 45907762 51491105 47358034
38273D7358034p675998o227721n609085q107123j0938214j1366347r999003q599013
$$ 47358034 39682036 33454315 27845230 19738107 8799893 -2566454 -12565457 -21164470
38265b1164470o732251k185068N103655J0599442Q837579N56958o281140n328443
$$ -21164470 -27896721 -30081789 -24978134 -14378692 -5541113 -4984155 -11265295 -16593738
38257a6593738M80399M084964M780811P149783J0746037R759228M487324L086903
$$ -16593738 -16113339 -12028375 -7247564 -97781 10648256 20407484 24894808 27981711
38249B7981711P485145Q083438r2756o634862k219888L856636k256454j4424178
$$ 27981711 35466856 43550294 43457538 36822676 34602788 38459424 36202970 21778792
38241B1778792j4658323k851718K429417n075899r098117P82505J0801608O117175
$$ 21778792 7120469 4268751 6698168 1622269 -7475848 -6693343 4108265 10225440
38233A0225440m339721k919625Q225718J1571190J028239j1753254j4885755p049032
$$ 10225440 5885719 2966094 11191812 22763002 23791241 12037987 -2847768 -9896800
38225i896800O167927J5083083R122777j0314655k3864288j4352655R707340K4173250
$$ -9896800 -3728873 11354210 20476987 10162332 -13701956 -28054611 -18347271 5825979
38217E825979K0196538J0160535M389475m13252o871800q587108l217656J51592
$$ 5825979 26022517 36183052 40572527 40159275 33287475 24700367 21482711 21634303
38209B1634303m571796r565807n297235M785302R714593M684471o697850j7368787
$$ 21634303 17062507 7496700 2199465 6984767 16699360 21383831 14685981 -2682806
38201b682806j9445805r555569L872041P080697m97755l998917M835494J4875280
$$ -2682806 -22128611 -31684180 -27812139 -20731442 -21229197 -25228114 -20392620 -5517340
38193e517340J3561322N966502L626177M385457j096498r550551r220467r66158
$$ -5517340 8043982 14010484 17636661 22022118 20925620 11375069 2154602 1188444
38185A188444K294028k210723k712575N373790R861196J768626r091394r142970
$$ 1188444 3482472 1271749 -1440826 3932964 13794160 15562786 6471392 -2671578
38177b671578r03514M382476O095445J2274994K1755610K2128541P151472j3808354
$$ -2671578 -3575092 807384 6902829 19177823 40933433 63061974 70213446 56405092
38169E6405092k6419538k4651033j2433011P76282N133955j202398p382494j605564
$$ 56405092 29985554 5334521 -7098490 -6322208 -1188253 -2390651 -9773145 -11378709
38161a1378709J1176141J3783526K241483o574034p13615P465517K121634p623769
$$ -11378709 -202568 13580958 15822441 9248407 8534792 16000309 18121943 10498174
38153A0498174j099573J7536168K1185869J085584j7962997j3768778K667252
$$ 10498174 9398601 26934769 48120638 49206222 31243225 17474447 20141699
38146B0141699P586784j536448j0563136j4173113j6250515j3419327L1113J4506289
$$ 20141699 27728483 26192035 15628899 1455786 -14794729 -28214056 -28182943 -13676654
38138a3676654J3403441p53589p312312L102888J6972016J8810258Q405962o201687
$$ -13676654 -273213 -1026802 -8339114 -5236226 11735790 30546048 38952010 32750323
38130C2750323j8332764k1581388j3020455j019413L065028K059403O536924J1886565
$$ 32750323 14417559 -7163829 -20184284 -21203697 -18138669 -16079266 -9542342 2344223
38122B344223L325798j3181385j1350889J3484566K9497955J3494515j2906488
$$ 2344223 5670021 -7511364 -18862253 -5377687 24120268 37614783 24708295
38115B4708295j6241745o98732M687658n122853q293439K781627J0593818O152895
$$ 24708295 8466550 7767818 12455476 7332623 -960816 1820811 12414629 18567524
38107A8567524L775265J2718249J8782838P778754j1482858k2371079k4415682
$$ 18567524 22342789 35061038 53843876 61622630 50139772 27768693 3353011
38100C353011k6835189k8045084j7780999L658328K1289195K2033383Q457262
$$ 3353011 -23482178 -51527262 -69308261 -65649933 -44360738 -22327355 -13870093
38093a3870093n582259r507023m887836m99819k03275L95830M162871O220290
$$ -13870093 -19452352 -28959375 -33847211 -34347030 -34550305 -34154475 -29991604 -23771314
38085b3771314K922334o7075K553398M441001k431399j1947427j2172306n642240
$$ -23771314 -20848980 -20916055 -18362657 -13921656 -16353055 -28300482 -40472788 -46115028
38077d6115028m491878o878877J827132K1129745K9466441J5100342n217419j0679757
$$ -46115028 -50606906 -57485783 -55658651 -34528906 -5062465 10037877 4820458 -5859299
38069e859299m177130j231689l934841k937647K565148L976798p85193m601811
$$ -5859299 -10036429 -11268118 -15202959 -18140606 -15575458 -11598660 -12383853 -16985664
38061a6985664k933174K777815J1184622K0042758K1927459J2129717j023684
$$ -16985664 -19918838 -17141023 -5956401 14086357 36013816 48143533 47119849
38054D7119849m923480n21080K25029n502295o765213K439616J1923043R484378
$$ 47119849 42196369 41675289 41900318 36398023 29632810 32072426 43995469 53479847
38046E3479847k074379r987535q727480m582449m742844q317583r755502p565350
$$ 53479847 51405468 41417933 32690453 28108004 23365160 15047577 5292075 -2273275
38038b273275o262921r348252j3163508j1224008l910699J388588J479085K617979
$$ -2273275 -8536196 -17884448 -31047956 -42271964 -46182663 -44794075 -43314990 -40697011
38030d0697011R892416J6721649J2667475o56753r838955o432062L544032Q754391
$$ -40697011 -30804595 -14082946 -1415471 -2072224 -11911179 -18343241 -14799209 -6044818
38022f044818N318521k242077p758731p374845m00643R230144J3757412P946520
$$ -6044818 -726297 -2968374 -10727105 -18101950 -18502593 -9272449 4484963 12431483
38014A2431483m660819j3986582j2841180l384616N847689Q200696L805785k141790
$$ 12431483 7770664 -6215918 -19057098 -22441714 -16594025 -8393329 -4587544 -6729334
38006f729334m192232n14364N398007O680587j05121q994467r125635K351587
$$ -6729334 -10921566 -11435930 -6037923 642664 537543 -8456924 -17582559 -15230972
37998a5230972J5597167J9629819J4431129P029166N45183n463608p868646l365128
$$ -15230972 366195 19996014 34427143 41456309 42001492 36537884 28669238 25304110
37990B5304110K325486m28070r749758j2650590l585534P789227J1501012R667147
$$ 25304110 27629596 27201526 17451768 4801178 1215644 9004871 20505883 30173030
37982C0173030Q396222P092623L381342N31293J508534J887575l093670r408253
$$ 30173030 38569252 45661875 49043217 49574510 51083044 52970619 49876949 40468696
37974D0468696r783751m293534J073349K484877k90659n627797q610632m030018
$$ 40468696 30684945 26391411 27464760 29949637 29658978 24031181 15420549 11390531
37966A1390531M656064P195429K390368J860511J0613236J5626211N165308j1140252
$$ 11390531 16046595 23242024 25632392 27492903 38106139 53732350 58897658 47757406
37958D7757406j5684395p874485l97518K374255N337651P299251L024606j827586
$$ 47757406 32073011 24198526 23801008 26175263 31512914 38812165 41836771 40009185
37950D0009185L682574J5219859J6106816K802597r263859q492939k83869N894347
$$ 40009185 43691759 58911618 75018434 77821031 68557172 60064233 59780364 65674711
37942F5674711P398684K710574r714697k2026400k1230586q283632J305422R34858
$$ 65674711 73073395 75783969 66069272 44042872 22812286 14528654 15834076 16768934
37934A6768934J394898R579333J5427710R702139l08111m041511l373453l548603
$$ 16768934 18163832 27743165 43170875 52873014 52564903 48523392 45149939 41601336
37926D1601336r50242P298011J2430283O204583m728250r046010p154711n488034
$$ 41601336 40651094 47949105 60379388 66583971 61855721 52809711 45655000 40166966
37918D0166966l067497L125787O922451J075727q750162j0988134m884544J008949
$$ 40166966 37099469 40225256 47147707 48223434 39473272 28485138 23600594 24609543
37910B4609543K248332r4756n734029j2377600j3096534o931215m023439q782364
$$ 24609543 26857875 26763119 21029090 8651490 -4445044 -11376259 -15399698 -24182062
37902b4182062q545518N890149J9758069J4566044j58445L7252J4228318J6327080
$$ -24182062 -32727580 -26837431 -7079362 7486682 7328237 7365489 21593807 37920887
37894C7920887k833903k1176855k0631103j1228850p772873n061922O841372K0133423
$$ 37920887 35086984 13910129 -6720974 -17949824 -25722697 -30784619 -23943247 -3809824
37886c809824K0946829J1810829M895445J601462m287075r799879o378571K825643
$$ -3809824 17137005 28947834 33843279 35444741 31157666 21357787 14979216 17804859
37878A7804859N092338k625662r928129r361975m890306k048745m8917K911203
$$ 17804859 22897197 20271535 10343406 981431 -3908875 -5957620 -6006537 -3095334
37870c095334M624661K982893p15943n248815j0758655j3904952p525658R829389
$$ -3095334 1529327 4512220 3796277 -1452538 -12211193 -26116145 -33641803 -23812414
37862b3812414K7042426K8850092J2332467p944133j4098820m218921N606154
$$ -23812414 3230012 32080104 44412571 36468438 22369618 18150697 23756851
37855B3756851Q89165j2881491j7430913o079014Q047161J1378208P771231Q412219
$$ 23756851 24646016 11764525 -5666388 -11745402 -3698241 7679967 15451198 23863417
37847B3863417J1257432M280365j1881444j9533437q301599P827095Q509084n124167
$$ 23863417 35120849 39401214 27519770 7986333 -315266 7511829 16020913 10896746
37839A0896746j3857230r129251l326131p437276j2701354n411863R341023J3405970
$$ 10896746 -2960484 -12089735 -15415866 -22853142 -35554496 -40966359 -31625336 -18219366
37831a8219366J956201j0458656j1458231m842333R05110M958053P908746N088968
$$ -18219366 -16263165 -26721821 -38180052 -43022385 -42117275 -37159222 -29250476 -24161508
37823b4161508m097735r961352o469519k354386n977629q457261J741632J4687777
$$ -24161508 -28259243 -38220595 -44690114 -47044500 -53022129 -61479390 -59737758 -45049981
37815d5049981J0265930q434266j5561183l65347J6963726J6302173M928982O20539
$$ -45049981 -34784051 -43218317 -58779500 -59144847 -42181121 -25878948 -20949966 -20329427
37807b0329427L880510M134356J927898N763936J2795781J1254780R63309m652940
$$ -20329427 -16448917 -12314561 -10386663 -4622727 8173054 19427834 20391143 15738203
37799A5738203J197389R533688R764034K407373n787392j0720821j1324766q109960
$$ 15738203 16935592 26469280 36233314 38640687 32853295 22132474 10807708 2697748
37791B697748m691318n087930p008588l418165O552371J3657617R229641l794878
$$ 2697748 -1993570 -7081500 -14090088 -17508253 -10955882 2701735 11931376 8136498
37783H136498j4061471j3966888o034909J652391M198996L595398M167322O077100
$$ 8136498 -5924973 -19891861 -25926770 -24274379 -20075383 -16479985 -12312663 -6235563
37775f235563O083202M051448L642103N148865L885481p45056j470991N311059
$$ -6235563 -152361 3899087 7541190 12690055 16575536 15830480 14359489 19670548
37767A9670548J0680375M814616p354369j2848793r903138p925473q927942l736300
$$ 19670548 30350923 35165539 27811170 14962377 5059239 -2866234 -11794176 -15530476
37759a5530476R180553J5569626N677534p950105n730767J1295565K2246649J4090540
$$ -15530476 -6349923 9219703 14897237 6947132 1216365 12511930 34758579 48849119
37751D8849119l426444j3554819j3029712r858130p378345r82821R360978J3239679
$$ 48849119 45422675 31867856 18838144 8980014 1601669 618848 9979826 23219505
37743B3219505K828198j3192470j7418535n240904R562851J3129094P141638R09565
$$ 23219505 26047703 12855233 -4563302 -9804206 -241355 12887739 20029377 20938942
37735B0938942l917246j1022883j7085426j4170933l707625L841254M893351O635688
$$ 20938942 17021696 5998813 -11086613 -25257546 -28965171 -25123917 -20230566 -13594878
37727a3594878J1569851J0783995j4945r229639n273369M578002M520729n377140
$$ -13594878 -2025027 8758968 8744023 -485616 -5758985 -1180983 3339746 -2037394
37719b037394r458238k30698J2152226J6587601J4404977J1015342N679897k519854
$$ -2037394 -11495632 -11726330 425896 17013497 31418474 42433816 48113713 45593859
37711D5593859p506331m684859o13733m225161j2319088j4098613p938587k606014
$$ 45593859 38087528 33402669 32788936 28563775 16244687 2146074 -5792513 -8398527
37703h398527j763581J029676Q621071J2790483P219257j015034j848364K322021
$$ -8398527 -10162108 -9132432 -511361 12279122 19498379 18483345 16634981 18957002
37695A8957002K013164k493327j614778O435879J0909221M634604m944923p093332
$$ 18957002 20970166 18476839 16862061 23297940 34207161 38841765 33896842 26803510
37687B6803510k758452l64292j390923O25340P561526J1832927P115360j678135
$$ 26803510 24045058 23680766 22289843 22915183 30476709 42309636 49424996 47746861
37679D7746861m136076J858483P067571L067639o185757r280673k909478L514543
$$ 47746861 43610785 45469268 52536839 55604478 49418721 40138048 37228570 40743113
37671D0743113J630735l387130r85886P501724R298954r80074j1832054q943855
$$ 40743113 42373848 38986718 38000832 45502556 54801510 53821436 41989382 33045527
37663C3045527O773784K0183206J8091360J653744j4558824j4955984J132932
$$ 33045527 39819311 60002517 78093877 79747621 65188797 50232813 51365745
37656E1365745J5519049R833945j0731508k1318245q392296J3304937K0996678
$$ 51365745 66884794 76718739 65987231 44668986 36276690 49581627 70578305
37649G0578305J0798119m641206j5640235k0031679j5395145j764005J0771756
$$ 70578305 81376424 76735218 61094983 41063304 25668159 23904154 34675910
37642C4675910J1133956L028558q37244J242260p4030n475405l702005Q105824
$$ 34675910 45809866 48838424 48001180 49243440 49169410 43694005 39992000 48097824
37634D8097824J6516830J1927472L455019M260099J2592931J7954489J7827181
$$ 48097824 64614654 76542126 79997145 84257244 96850175 114804664 132631845
37627A32631845J6864063J4875020P314575l845480r314916l748634P691103J4777342
$$ 132631845 149495908 164370928 171685503 167840023 158525107 154776473 162467576 177244918
37619A77244918J1315690m01152j1919273j6253774j4005410j0699821r750106
$$ 177244918 188560608 188159456 176240183 159986409 145980999 135281178 125531072
37612A25531072j1493063j6036797k0573963j7281186l541913Q459948N028965
$$ 125531072 114038009 98001212 77427249 60146063 56604150 65064098 70093063
37605G0093063p582479j0779853l051956j792224j1119973j1762985M683157J5583624
$$ 70093063 62510584 51730731 48678775 46886551 35766578 24003593 28686750 44270374
37597D4270374J893779j7743717j4689929L139631M528361j3432659k1940711
$$ 44270374 46164153 28420436 13730507 16870138 21398499 7965840 -13974871
37590a3974871q582071O050091P057269P287001J6564804J8937496J460907j8040006
$$ -13974871 -22556942 -16506851 -9449582 -2162581 14402223 33339719 34800626 16760620
37582A6760620j6067147J010838J0575786R002464Q092245P055562m164848j8517560
$$ 16760620 693473 1704311 12280097 21282561 29374806 36430368 32265520 13747960
37574A3747960j6702427O87595J1453300O385314J088827N554199O183918p805931
$$ 13747960 -2954467 -2266872 9186428 15571742 16660569 22214768 28398686 20592755
37566B0592755k0598142j1960887J0131434K0011738J0591729q56002j095819
$$ 20592755 -5387 -11966274 -1834840 18176898 28768627 27912625 26816806
37559B6816806L641216L303268q80720l317246m237064n303164l439488L048062
$$ 26816806 30458022 33761290 32880570 29563324 25326260 20023096 16583608 19631670
37551A9631670P871003L905740o290089j3301831j1860380m085250N311730J1506155
$$ 19631670 27502673 31408413 25118324 11816493 -43887 -4129137 1182593 12688748
37543A2688748R987176J189638o618954n801362j83254m71373q763517j5542520
$$ 12688748 22675924 23865562 17246608 11445246 11261992 10790619 2027102 -13515418
37535a3515418j3746017p349121k351046K088849P491841R202362M440584R00388
$$ -13515418 -27261435 -34610556 -36961602 -34872753 -27380912 -18178550 -13737966 -12837578
37527a2837578O622436J5310016J3713685K070285n650400k938419J127476r96258
$$ -12837578 -6215142 9094874 22808559 24878844 19228444 16290025 17417501 16421243
37519A6421243l230111J406196P421093O824767L796647P063070J3460917J2353984
$$ 16421243 13191132 14597328 22018421 28843188 32639835 39702905 53163822 65517806
37511F5517806L426989l305154m406598o216625r667797o352378M829314J0429127
$$ 65517806 68944795 65639641 61233043 55016418 45348621 38996243 43825557 54254684
37503E4254684J175232j2340743j4229260o331160l287187q046347p241720O409027
$$ 54254684 55429916 43089173 28859913 22528753 19241566 11195219 3953499 10362526
37495A0362526K0086995J7192251K16953j1949302p237665O942525J4892158R983752
$$ 10362526 30449521 47641772 47858725 35909423 28671758 35614283 50506441 60490193
37487F0490193k241116j3266242j7794024j2698395J736529J6139158J5453572
$$ 60490193 58249077 44982835 27188811 14490416 16226945 32366103 47819675
37480D7819675l282767k0703679j4341335J1474947K7602032J6682010n070777
$$ 47819675 44536908 23833229 9491894 20966841 48568873 65250883 60180106
37473F0180106j2103699l620069J764192k416173m000483L514172J0377112R918919
$$ 60180106 48076407 44456338 46220530 43804357 39803874 43318046 53695158 63614077
37465F3614077J0676605J9139400K5140168J7859516N558711M239640J3564513
$$ 63614077 74290682 93430082 118570250 136429766 141988477 146228117 159792630
37458A59792630J9587682J7837554J7972584K5020547K9899042K2473837M481271
$$ 159792630 179380312 197217866 215190450 240210997 270110039 292583876 297065147
37451B97065147j3910745k3478159k0710098j0397952m129929r207162j9283976
$$ 297065147 283154402 259676243 238966145 228568193 224438264 215231102 195947126
37444A95947126k3230117k1203051k1875397k5358102k2094345j0225256k18046
$$ 195947126 172717009 151513958 129638561 104280459 82186114 71960858 71742812
37437G1742812J961632K761340O094397M181992p510763j8260195j6466720o707816
$$ 71742812 73704444 76465784 82560181 86742173 79231410 60971215 44504495 37796679
37429C7796679o79689P90087L968826P062779K886452o796123j2717674j2105243
$$ 37796679 37116990 37907077 41875903 48938682 51825134 45029011 32311337 20206094
37421B0206094r381407m641387N827144J7277100J7495599L491386j2479699j7330295
$$ 20206094 10824687 6183300 12010444 29287544 46783143 50274529 37794830 20464535
37413B0464535j0400189Q0709O846541P407976L916067J601956L348737N625419
$$ 20464535 10064346 10145055 16991596 24399572 28315639 29917595 33266332 38891751
37405C8891751L802547n05664k953202m141020o041940m086750O528048J8002610
$$ 38891751 42694298 42188634 39235432 35094412 29052472 24965722 31493770 49496380
37397D9496380J5828528n45863j4617049j4291323n904794j697609l046566l181836
$$ 49496380 65324908 64779045 50161996 35870673 29965879 28268270 25221704 22039868
37389B2039868O80528N267019O856731L670691l490775r415941p842437K22111
$$ 22039868 22720396 27987415 34844146 38514837 35024062 25608121 17765684 17987795
37381A7987795O449722O104543L246905K197419N89602m565561r873222j0104536
$$ 17987795 24437517 30542060 33788965 35986384 36575986 32010425 22137203 12032667
37373A2032667n751450j592509q49923l616221p491699p845837j823699O301304
$$ 12032667 6281217 4688708 3838785 222564 -7269135 -15114972 -16938671 -10637367
37365a0637367Q614486L486548l298506p229329p686485k348601J0843229K4349805
$$ -10637367 -2022881 1463667 -1834839 -9064168 -16750653 -19099254 -8256025 16093780
37357A6093780K4795936J0274100o046325j3477946j4169268j1968887m440830
$$ 16093780 40889716 51163816 45117491 31639545 17470277 5501390 1060560
37350A060560O686854J0641724L681579j626033M996137J4003625J0016702n320447
$$ 1060560 7747414 18389138 22070717 20444684 25440821 39444446 49461148 44140701
37342D4140701j7445360j8235818r051370O865858K1419479K0246009M41133j8023140
$$ 44140701 26695341 8459523 -591847 6274011 27693490 47939499 48380632 30357492
37334C0357492j5874340k144458J257235m540109N78259J7908225K3586846N953400
$$ 30357492 14483152 12338694 13595929 9055820 9634079 27542304 51129150 57082550
37326E7082550j5254106j8129434p324213m78348j585266k172899J783895P103506
$$ 57082550 41828444 23699010 16374797 15896449 14311183 12138284 13922179 21025685
37318B1025685J0383581Q408149j347735j3401790j5793464o025017L395421K504961
$$ 21025685 31409266 39817415 38469680 25067890 9274426 3249409 6644830 9149791
37310I149791k716248k640090N97492M56277k05105M884252J1527121R548663
$$ 9149791 6433543 3793453 4390945 4847222 4642117 9526369 21053490 30602153
37302C0602153j549540j1471693j2181025m856108L684970N530339l425044j6943221
$$ 30602153 29052613 17580920 5399895 543787 4228757 9759096 6334052 -10609169
37294a0609169k1175343j0158772N953798J3796318J2019715P433934L287860
$$ -10609169 -31784512 -41943284 -35989486 -22193168 -10173453 -2739519 548341
37287E48341j99957m35918K727912K687020l465787o490401J497075J1240849
$$ 548341 348384 -87534 2640378 5327398 1861611 -4628790 -3131715 8109134
37279H109134Q224727l752739o934702L262165J2004846Q761848J627167J481588
$$ 8109134 16333861 12581122 5646420 8908585 20913431 29675279 31302446 32784034
37271C2784034M855290J789938p782988j4677760j2912300m980950K168439K282205
$$ 32784034 37639324 39429262 31646274 16968514 4056214 -924736 1243703 3525908
37263C525908n605280j4608390j5620551p709144J083767M550678M565438M950188
$$ 3525908 -2079372 -16687762 -32308313 -40017457 -38933690 -34383012 -29817574 -24867386
37255b4867386N521826N222630N197647N325067L293180L28067J444608O103032
$$ -24867386 -19345560 -14122930 -8925283 -3600216 -307036 21031 1465639 7568671
37247G568671O050701j547910o403281M13969J0080456O169268j0474765j9941521
$$ 7568671 13619372 12071462 5668181 6082150 16162606 22331874 11857109 -8084412
37239h084412r616976Q775559J5441444P557974j571930l515633k765404l436569
$$ -8084412 -17701388 -8925829 6515615 14073589 12501659 8986026 6220622 2784053
37231B784053m66348R091732J5210983O567687j0694003j7976607q512647M980768
$$ 2784053 2317705 11409437 26620420 33188107 22494104 4517497 -3995150 985618
37223I85618J0098733R976491J1492307J0097687p18412j2542297j0737208K141105
$$ 985618 11084351 21060842 32553149 42650836 41932424 29390127 18652919 20794024
37215B0794024P980121M34551n186463L826247J7158335J6383530J142238j2127849
$$ 20794024 28774145 29208696 24022233 27848480 45006815 61390345 62532583 50404734
37207E0404734j2956155o418032j466723o23416k857668q008805j4548709j8058971
$$ 50404734 37448579 31030547 29563824 28940408 26082740 18073935 3525226 -14533745
37199a4533745j5362731p750136J230653Q867039J3615484J4772873J2479845
$$ -14533745 -29896476 -37646612 -36415959 -27548920 -13933436 839437 13319282
37192A3319282O739616k601245j2868123j7512308j2111711r89553O251339N428377
$$ 13319282 20058898 17457653 4589530 -12922778 -25034489 -26024042 -19772703 -14344326
37184a4344326J549273R77171L226689K735020k878998q446765n807492O615489
$$ -14344326 -12795053 -11817882 -8591193 -5856173 -8735171 -17181936 -22989428 -16373939
37176a6373939J9165290J9045527N119766q919375j0257275k456094J109190l124979
$$ -16373939 2791351 21836878 26956644 18037269 7779994 5323900 6433090 3308111
37168C308111n192082J311769Q563766O641697j530428n574774l188564j220624
$$ 3308111 -1883971 -572202 7991564 14633261 13102833 7528059 4339495 3118871
37160C118871l215983m819726k286646J967513M497807N662818O653177O040401
$$ 3118871 -97112 -4916838 -7203484 -5235971 -738164 4924654 11577831 17618232
37152A7618232J897207n287161j2656254j5379799q583541N628624J4407867N968374
$$ 17618232 19515439 14228278 1572024 -13807775 -22391316 -16762692 -2354825 3613549
37144C613549j3308340k2852037j2990336L192809R064273N726696M579451P208438
$$ 3613549 -9694791 -32546828 -45537164 -42344355 -33280082 -27553386 -22973935 -15765497
37136a5765497O117008Q21768j528864o17686l503179r127727o938059M238080
$$ -15765497 -9648489 -8826721 -10355585 -10973271 -14476450 -23604177 -30542236 -26304156
37128b6304156R870521O20016j1802399j0235437M471462J6557813J6561114Q808042
$$ -26304156 -16433635 -15813619 -27616018 -37851455 -33379993 -16822180 -261066 8546976
37120H546976J125345k653637j217210M140621P796302N170416j59177n99572
$$ 8546976 9672321 7018684 5801474 9942095 17738397 22908813 22749636 22150064
37112B2150064M787549R485565Q769716M197209p52519m452742o677798q146238
$$ 22150064 26937613 36423178 45192894 49390103 48637584 44184842 37507044 29360806
37104B9360806r508391q356218j061037Q997238J1365554K909517m960540k773629
$$ 29360806 19852415 11496197 10435160 19432398 30797952 33707469 28746929 25973300
37096B5973300P50535p590979k1260664k1214951o084993M608016J061726l187408
$$ 25973300 26723835 19132856 -2127808 -23342759 -29427752 -24819736 -23758010 -26945418
37088b6945418K994073Q582447J304311p712113k96363J7202109K0583790L613388
$$ -26945418 -23951345 -15368898 -14064587 -21776700 -22073063 -4870954 15712836 19326224
37080A9326224j2965624j0908678L823668J4201732J3189915M712534n293193
$$ 19326224 6360600 -4548078 -724410 13477322 26667237 31379771 26086578
37073B6086578j0707305o552759L217251N609925n488750j8138090j5787218Q49514
$$ 26086578 15379273 8826514 12043765 17653690 12164940 -5973150 -21760368 -20910854
37065b0910854J4034464J0798262l098635j2346903q890137L056256J3614928
$$ -20910854 -6876390 3921872 823237 -11523666 -20413803 -17357547 -3742619
37058c742619J4782872M439645j2252075k5280946k6611453j6006544L4416J4157022
$$ -3742619 11040253 15479898 3227823 -22053123 -48664576 -64671120 -64636704 -50479682
37050e0479682K1912134K1437832J3017013K50218j0383891j3386453q261668
$$ -50479682 -28567548 -7129716 5887297 6137515 -4246376 -17632829 -25894497
37043b5894497J3596M381935J288581n013282n268936M159682J4817991J5750577
$$ -25894497 -25880901 -21498966 -20210385 -25223667 -30492603 -26332921 -11514930 4235647
37035D235647R032650P409466J3994206J4861064q2955j8136799j8969730l866534
$$ 4235647 13268297 20677763 34671969 49533033 49450078 31313279 12343549 8477015
37027H477015N827465o69419j0733400j0380081l424602K03512J776502O795214
$$ 8477015 14304480 13635061 2901661 -7478420 -10903022 -10699510 -8923008 -2127794
37019b127794J0380584M160876p479417j1923924o573516P9293L882502Q297780
$$ -2127794 8252790 12413666 4934249 -6989675 -13563191 -13483898 -9601396 -1303616
37011a303616J2171561Q208120k861542r104032m042382M085504O225547N676079
$$ -1303616 10867945 19076065 16214523 7110491 3068109 7153613 13379160 19055239
37003A9055239Q780961J1089889M325747p504183j1145410k787308O869251Q314501
$$ 19055239 27836200 38926089 43251836 35747653 24602243 21814935 28684186 36998687
36995C6998687M984901N069366Q747553J0063644P392025M577974K362058m172777
$$ 36998687 41983588 47052954 55800507 65864151 73256176 77834150 80196208 76023431
36987G6023431j6902505k8558786l0058625k1515649j1178616m651385m53191
$$ 76023431 59120926 30562140 503515 -21012134 -32190750 -36842135 -37295326
36980c7295326L910804P785229J0966463J4889858J6832791J0011617m538509
$$ -37295326 -33384522 -25599293 -14632830 257028 17089819 27101436 22562927
36973B2562927j2975496m918865R712397J1565497k031473j4392109j4017119
$$ 22562927 9587431 4668566 14380963 25946460 23914987 9522878 -4494241
36966d494241p866388m873843n26216J0897225J9680084J2072557o385118j5343610
$$ -4494241 -12360629 -17234472 -17760688 -6863463 12816621 24889178 18504060 3160450
36958C160450p991533M08007k948843r369375l995559R743387J4468038M310928
$$ 3160450 -4831083 -4423076 -7371919 -16741294 -20736853 -10993466 3474572 7785500
36950G785500o985214n612098M757320J0403535O017404j285105l699162j714947
$$ 7785500 800286 -4811812 -54492 10349043 16366447 15081342 11382180 9667233
36942I667233q06889l972767r512160j3300483j1310083k014587J1353597K1791515
$$ 9667233 8860344 4887577 -4624583 -17925066 -29235149 -31249736 -19896139 1895376
36934A895376K3528189J5969664K636123j1797939k2279453k4046602j6056527
$$ 1895376 25423565 41393229 44029352 32231413 9951960 -14094642 -30151169
36927c0151169l135766P968745J4166148J5516052J1309467J499547q566106j1187497
$$ -30151169 -33286935 -25318190 -11152042 4364010 15673477 17173024 8606918 -2580579
36919b580579o261968k532943n267046q090137k775875P216687J0869355N382755
$$ -2580579 -8842547 -11375490 -16642536 -24732673 -27508548 -20291861 -9422506 -4039751
36911d039751q73596j727010m38886l23699K914049J2525082K0855364J7297094
$$ -4039751 -4913347 -6640357 -7079243 -7402942 -4488893 8036189 28891553 46188647
36903D6188647L243075r661588j4953376j6020303j5258016r007915K872861J1743500
$$ 46188647 49431722 39770134 24816758 8796455 -6461561 -15469476 -12596615 -853115
36895h53115J1151380O155243M274596L265191k662592q967970n218013O947236
$$ -853115 10298265 16453508 20728104 23993295 21330703 12362733 7144720 14091956
36887A4091956J2491987L410961r682167j2585247o093388j408773k296068j528580
$$ 14091956 26583943 29994904 20312737 7727490 1634102 225329 -2070739 -3599319
36879c599319N791741J3861032J3852388N248223l853257o392246m183363n183294
$$ -3599319 2192422 16053454 29905842 35154065 31300808 24908562 20725199 15541905
36871A5541905j2717966j9348232j4959241o88397J0367041Q576938r12230n944955
$$ 15541905 2823939 -16524293 -31483534 -32171931 -21804890 -13227952 -14140182 -20085137
36863b0085137k016934N769425J1516549J2636984P356890l993466j4378691j3752649
$$ -20085137 -22102071 -16332646 -4816097 7820887 15177777 11184311 -3194380 -16947029
36855a6947029o69727J4024710J8344972J1382985J824644l257543m404638m956356
$$ -16947029 -17616756 -3592046 14752926 26135911 27960555 24703012 20298374 15342018
36847A5342018m254102R27246Q837612J1420932M162560n865550p995206k944388
$$ 15342018 11087916 12015162 20852774 32273706 36436266 30570716 22575510 19631122
36839A9631122j714137p936082j1045586l022867O952671M780597o984342j1918020
$$ 19631122 17916985 9980903 -1064683 -4087550 2865121 7645718 661376 -11256644
36831a1256644l005265Q313466Q611551j247098j0202378j0757695m619358J215166
$$ -11256644 -14261909 -5948443 2663108 1416010 -8786368 -19544063 -24163421 -22948255
36823b2948255J335469k271650j100880R365941K1214533K2071401J0983400o51801
$$ -22948255 -21612786 -23884436 -24985316 -15619375 5595158 27666559 38649959 37998158
36815C7998158m433700l700473n354254j0395148j5342524j6873625j2811735
$$ 37998158 33564458 29863985 24509731 14114583 -1227941 -18101566 -30913301
36808c0913301m367602J603206j87000l306347L760977J8530726K3403700R295648
$$ -30913301 -35280903 -33677697 -33864697 -37171044 -33410067 -14879341 8524359 17820007
36800A7820007j0198314j6323621q000922J909460N401582L979375M17405l171019
$$ 17820007 7621693 -8701928 -16702850 -14793390 -9391808 -5412433 -4995028 -8166047
36792h166047k750152K155056L622897m265905j3501540j1505800k29155O105886
$$ -8166047 -10916199 -8761143 -5138246 -9404151 -22905691 -34411491 -34640646 -28534760
36784b8534760K342541r60920M635599J2163247J0170450m99975q065335m736955
$$ -28534760 -26192219 -27153139 -22517540 -10354293 -183843 -683818 -8749153 -13486108
36776a3486108M922827R842857M433527n068708p025770J408612R373830N639130
$$ -13486108 -8563281 1279576 5713103 644395 -6381375 -4972763 4401067 10040197
36768A0040197n998339j1099109l240847R030494J4764468J2925891R105220N599429
$$ 10040197 4041858 -7057251 -10298098 -1267604 13496864 26422755 35527975 41127404
36760D1127404j79090r043995j5523473j2022909J286194J2184559P420150j0007172
$$ 41127404 40948314 31904319 16380846 4357937 5644131 17828690 25248840 15241668
36752A5241668k1223942j4022026K063829J0688051J0829398J1985913J3561777
$$ 15241668 -5982274 -20004300 -17940471 -7252420 3576978 15562891 29124668
36745B9124668O117736p646821j1829061k357248L992815n017106j7357220j5263705
$$ 29124668 35242404 27595583 15766522 13409274 17402089 12384983 -4972237 -20235942
36737b0235942k318804L437015k872800p987087j770727R962552J5616653J1113364
$$ -20235942 -22554746 -19117731 -21990531 -29977618 -31748345 -21785793 -6169140 4944224
36729D944224J121521n964852l783894M951924Q189634j517407j4609483j5426238
$$ 4944224 6065745 100893 -3683001 1268923 9458557 7941150 -6668333 -22094571
36721b2094571m615831J265400n107907j0299889j262074J3273893J4823766K199723
$$ -22094571 -26710402 -25445002 -30552909 -40852798 -42114872 -28840979 -14017213 -11817490
36713a1817490p697211n202752P6591k906107q575372m063511R911334J8840221
$$ -11817490 -19514701 -24717453 -24640862 -27546969 -36122341 -40185852 -30274518 -11434297
36705a1434297J4205700L486148k323480l133973o193390j3223295j8081662j5869672
$$ -11434297 2771403 6257551 3934071 800098 -5393292 -18616587 -36698249 -52567921
36697e2567921q562814r71758M718633Q924055J1698680J1418567O229875k585210
$$ -52567921 -61130735 -62102493 -57383860 -48459805 -36761125 -25342558 -19112683 -21697893
36689b1697893q756855n784818M277451J0571825O296088j481810j058542P149503
$$ -21697893 -30454748 -36239566 -31962115 -21390290 -15094202 -16576012 -17634554 -10485051
36681a0485051J1358715O160823K33593K427811Q176872O847750j992999p701526
$$ -10485051 873664 7034487 7268080 9695891 17872763 24720513 22727514 15025988
36673A5025988l212523N915564R039128L478253k653208l53218Q937068J3826497
$$ 15025988 11813465 17729029 26768157 30246410 27593202 27239984 36177052 50003549
36665E0003549O110523q545267j6519109j2039836k671928J348855j653380n970008
$$ 50003549 56114072 47568805 31049696 19009860 16337932 17686787 16033407 10063399
36657A0063399o404309k321652K774985L482954k382117r225423q460447n1264
$$ 10063399 3659090 1337438 4112423 7595377 5213260 -4012163 -12472610 -12523874
36649a2523874N738552J718538n989528o249177K138920R771600R287003L155699
$$ -12523874 -6785322 -5066784 -11056312 -17305489 -15166569 -5394969 3892034 7047733
36641G047733j134592L97683N260446P973764O244859L749871M975621P799260
$$ 7047733 5913141 6310824 11571270 19545034 25789893 29539764 34515385 42314645
36633D2314645N735111j311704m462445K254967J2474991J4863971O253680p121865
$$ 42314645 48049756 46738052 42275607 44530574 57005565 71869536 78123216 71001351
36625G1001351j7714069k1017972j5671987n235465K540958L427494J266193M83099
$$ 71001351 53287282 32269310 16597323 11361858 13902816 17330310 18596503 19079602
36617A9079602j593289q597268j5521340j3721724l653816N387142P292185L683808
$$ 19079602 17486313 8889045 -6632295 -20354019 -24007835 -18620693 -11328508 -7644700
36609g644700k067003p218095o900183K044675J3633657J7344674J1398538L717725
$$ -7644700 -9711703 -16929798 -23829981 -21785306 -8151649 9193025 20591563 24309288
36601B4309288j228604p454589j6738864k2081974j7121346n506505M289858Q677061
$$ 24309288 23080684 15626095 -1112769 -23194743 -40316089 -45822594 -41532736 -32855675
36593c2855675R357636Q513796P359336N921394J920263o140543j3570118j2804340
$$ -32855675 -23498039 -14984243 -7624907 -1703513 216750 -5923793 -19493911 -32298251
36585c2298251l893095M586283P247690P519770Q831951Q317220L877931l38193
$$ -32298251 -36191346 -31605063 -24357373 -16837603 -8005652 311568 4189499 3851306
36577C851306j257155k113100l892747J83802J2541715K0931287J2213500p533575
$$ 3851306 2594151 481051 -3411696 -3227894 9313821 30245108 42458608 34925033
36569C4925033j9170500j5443994p448671n261300m834462Q10989P750085O743031
$$ 34925033 15754533 310539 -7138132 -12399432 -17233894 -16422905 -8672820 -1929789
36561a929789k943867j2943166j6331384j2558146l550090Q479895J8315847J8643808
$$ -1929789 -4873656 -17816822 -34148206 -46706352 -50256442 -41776547 -23460700 -4816892
36553d816892Q093979l911500n727913K035769N718239l687398j6356967j4829125
$$ -4816892 3277087 -634413 -6362326 -4326557 1391682 -2295716 -18652683 -33481808
36545c3481808J836644J4888462J0145108l858499r082262k134735M774077L409222
$$ -33481808 -31645164 -16756702 -6611594 -10470093 -19552355 -21687090 -16913013 -13503791
36537a3503791j014072o66372L747375O066102L163561k788306p146863o313085
$$ -13503791 -14517863 -15184235 -11436860 -5370758 -2207197 -4995503 -12142366 -18455451
36529a8455451j055991L665770M904888N991540J0398484J3969282J0003911O51350
$$ -18455451 -19511442 -15845672 -10940784 -4949244 5449240 19418522 29422433 30073783
36521C0073783m972521m275931l991081p696130r843083o213339j585300j226774
$$ 30073783 25101262 20825331 16834250 9138120 -704963 -6918302 -8503602 -9730376
36513i730376k370588q95335N37143q68177M57615J0028128K0303096J7649041
$$ -9730376 -12100964 -12996299 -12459156 -13327333 -12869718 -2841590 17461506 35110547
36505C5110547J848686j1968023j2708219n418970r54927j893959l632333l240944
$$ 35110547 36959233 24991210 12282991 6864021 5909094 4015135 382802 -2858142
36497b858142j532703J09489N98779n61660j251255J352689M511139Q80606j0175531
$$ -2858142 -4390845 -4281356 -3682577 -4244237 -5495492 -4142803 368336 1248942 -8926589
36488h926589j7787651j2431025O33353Q239244O564194K819915J422099j075465
$$ -8926589 -26714240 -39145265 -38511912 -30272668 -23708474 -20888559 -19466460 -20541925
36480b0541925n847870p238725k969351L37058j475490j270540P908365J8773454
$$ -20541925 -26389795 -33628520 -36597871 -36260813 -37736303 -39006843 -31098478 -12325024
36472a2325024J8330155P369094m92934P86200K225535l962984j1579954j0262029
$$ -12325024 6005131 13374225 12881291 13667491 15893026 11930042 350088 -9911941
36464i911941k35952R913971J4633558J3678256P742751p31215n682346l909553
$$ -9911941 -10147893 -233922 14399636 28077892 35820643 35089428 29407082 25497529
36456B5497529j456523o330374j6025967j9524633j1776106L11357O955295M865709
$$ 25497529 24041006 17710632 1684665 -17839968 -29616074 -29304717 -22349422 -17483713
36448a7483713k813164r984179j0304896k483245N872916N644725j148910k585330
$$ -17483713 -20296877 -30281056 -40585952 -43069197 -37196281 -31551556 -32700466 -35285796
36440c5285796O946623J8472487K0065692J0777082j229041q630623q141407K93643
$$ -35285796 -28339173 -9866686 10199006 20976088 19747047 11116424 2975017 3268660
36432C268660J0839289J2991283K985033r358648j2775573j0136843j2335771
$$ 3268660 14107949 27099232 30084265 20725617 7950044 -2186799 -14522570
36425a4522570j8704455j6115291n00959J3101465J0313608j472201l278708P930287
$$ -14522570 -33227025 -49342316 -49843275 -36741810 -26428202 -27900403 -31179111 -23248824
36417b3248824J4834229N104558j0291258j2068919R47066J1495167Q922025K657185
$$ -23248824 -8414595 -3310037 -13601295 -25670214 -24723148 -13227981 -4305956 -1648771
36409a648771N281151J1890056P767244p223043j5809480p922986M284899M179207
$$ -1648771 3632380 15522436 23289680 16066637 257157 -7665829 -3380930 798277
36401G98277n906611j0546869n148022k34722k394822m821382j039348L811941
$$ 798277 -5108334 -15655203 -20803225 -21037947 -23432769 -28254151 -29293499 -25481558
36393b5481558K800551p75145k13903K444902J469143L79081Q111232K2667772
$$ -25481558 -22681007 -23456152 -23670055 -21225153 -19756010 -19376929 -11265697 11402075
36385A1402075K9772557K0971549M416323o777645r877635j0696673j1855578
$$ 11402075 41174632 62146181 66562504 59784859 49907224 39210551 27354973
36378B7354973j0078357l487136M318158Q224738O795122L281292K698802O731234
$$ 27354973 17276616 13789480 18107638 26332376 33127498 36408790 39107592 45838826
36370D5838826J0581779P304557l190207j2655595j4482077j1445168r762019
$$ 45838826 56420605 63725162 60534955 47879360 33397283 21952115 12190096
36363A2190096r411729o263633j065818J098735l99449j055341N6051j319147
$$ 12190096 2778367 -3485266 -4551084 -3452349 -3851798 -4907139 -4851088 -6170235
36355f170235n550637o585582k212850J103205q19636j792151M057881J0221195
$$ -6170235 -11720872 -18306454 -20519304 -19416099 -20235735 -22027886 -17970005 -7748810
36347g748810O879708k234358m248225K716089O762605J955369j868919M595769
$$ -7748810 -869102 -3103460 -7351685 -4635596 2127009 4082378 2213459 6809228
36339F809228J4423529J4320609L373675q013692j3837623j6737088j7641742
$$ 6809228 21232757 35553366 38927041 30913349 17075726 338638 -17303104
36332a7303104j1603641K804630J7034912K0699797J3516355N270746M103476
$$ -17303104 -28906745 -26102115 -9067203 11632594 25148949 30419695 34523171
36325C4523171P123350M530961o581456j5762630j1406402J782750N896940o268370
$$ 34523171 41646521 46177482 39596026 23833396 12426994 14209744 20106684 13838314
36317A3838314j9290410j5067932K220317J2519531P776696N5017Q49583N523840
$$ 13838314 -5452096 -20520028 -18299711 -5780180 1996516 2051533 2901116 8424956
36309H424956L888569l984420j0222838j0742204p054542j040949N650331J0111844
$$ 8424956 12313525 8329105 -1893733 -12635937 -19690479 -20731428 -15081097 -4969253
36301d969253J0953857R672437O383313n90548p494227n051981P871259J7549287
$$ -4969253 5984604 15657041 22040354 21449806 13955579 8903598 16774857 34324144
36293C4324144J1287829n117409j5445675j4195254q672545l243728N115531J5022089
$$ 34324144 45611973 40494564 25048889 10853635 2181090 -1062638 4052893 19074982
36285A9074982J7508648Q808656l422990j0499275j0788988m913377O705562J7059024
$$ 19074982 36583630 45392286 41969296 31470021 20681033 15767656 22473218 39532242
36277C9532242J4122233l545824k1292175k5525115j8304764q247003K687096
$$ 39532242 53654475 50108651 28816476 3291361 -15013403 -23260406 -20573310
36270b0573310J3254442J4194849K75409j5243807j4416131j25055Q279470L855721
$$ -20573310 -7318868 6875981 7151390 -8092417 -22508548 -22633603 -14354133 -10498412
36262a0498412r19861J869733L414186k800122p455740k850241Q75955p472048
$$ -10498412 -11418273 -9548540 -6134354 -8934476 -16390216 -19240457 -18364502 -25836550
36254b5836550j8163218j3690399K519985J0354757M487912J428325J1215007
$$ -25836550 -43999768 -57690167 -55170182 -44815425 -40327513 -38899188 -27684181
36247b7684181K1105617J6954186N267732M79206J320943m021598j4862570j6938414
$$ -27684181 -6578564 10375622 15643354 16122560 17443503 13421905 -1440665 -18379079
36239a8379079m711705R465704J2428757N727612q14388k434932o51174K211905
$$ -18379079 -23090784 -13625080 -1196323 4531289 3716901 1281969 630795 2842700
36231B842700L994136L141617K526656P157206J3801356J0663100n362435j9144374
$$ 2842700 6836836 9978453 12505109 19662315 33463671 44126771 38764336 19619962
36223A9619962j6272509n510607p136795k0661832k2388755o82925K3411949K3403736
$$ 19619962 3347453 -2163154 -9299949 -29961781 -52350536 -53033461 -29621512 -6217776
36215f217776L394545r404120k533141Q957082Q519879M75064j153665N181224
$$ -6217776 -2823231 -12227351 -14760492 -5803410 2716469 3191533 2037868 7219092
36207G219092Q446271K297756p594743j3077568j2485714q031468l96858R276899
$$ 7219092 15665363 17963119 10368376 -2709192 -15194906 -23226374 -23623232 -14346333
36199a4346333J5150072J1110166Q14362k698529P213179J8999927J5079407m242156
$$ -14346333 803739 11913905 12728267 10029738 17242917 36242844 51322251 47080095
36191D7080095j8498179j2835427K881699Q533239J23661r166120r931744n434866
$$ 47080095 28581916 15746489 18628188 27161427 27285088 18118968 8187224 2752358
36183B752358r0533O942184J2825310Q758587n384851j4269173n515303J1297355
$$ 2752358 2661825 9604009 22429319 31187906 25803055 11533882 6018579 17315934
36175A7315934J5097534M0994j8328326k3120713j3313659K54380Q116599Q123704
$$ 17315934 32413468 32454462 14126136 -8994577 -22308236 -22053856 -13937257 -5813553
36167e813553L729684N12636K026756O516858Q820388O248154J135185k442091
$$ -5813553 -2083869 -1571233 455523 6972381 15792769 22040923 23176108 20734017
36159B0734017k532498M2263K660646K163906k901115j0459807j6014605j5659661
$$ 20734017 18201519 18243782 20904428 23068334 20167219 9707412 -6307193 -21966854
36151b1966854q337286K840627J0760911R007971p53162q424539o133057K173126
$$ -21966854 -30304140 -27463513 -16702602 -7694631 -8447793 -16872332 -23005389 -20832263
36143b0832263N566593k48852q270899r479767l164067L487343M043567l61512
$$ -20832263 -15265670 -15514522 -23785421 -33265188 -36429255 -32941912 -28898345 -29259857
36135b9259857k547756K411280J0843431J4447366J0760224N892225M912889M081179
$$ -29259857 -31807613 -29396333 -18552902 -4105536 6654688 12546913 17459802 21540981
36127B1540981k878708j4065175k0627540j7207728o103793P531155J9003769
$$ 21540981 18662273 4597098 -16030442 -33238170 -39341963 -31810808 -12807039
36120a2807039K3409565J8110670P265373q99905k887602k566470m512263q329424
$$ -12807039 10602526 28713196 35978569 35078664 32191062 29624592 25112329 16782905
36112A6782905j0198313p154281N0876O043327M733763k752558p531989m964645
$$ 16782905 6584592 -569689 -518813 5524514 10258277 7505719 -26270 -4990915
36104d990915k143540n784533q334490J427303J6885624J8595138K863825j0859341
$$ -4990915 -7134455 -12918988 -21253478 -19826175 -2940551 15654587 18518412 7659071
36096G659071p511511L679434O305092K44329m422850n755557p612983p383356
$$ 7659071 147560 3826994 10132086 10376415 5953565 198008 -7414975 -14798331
36088a4798331j685593J714239n862710j5762035j1487437M673319J2663092M690147
$$ -14798331 -16483924 -14769685 -20632395 -36394430 -47881867 -43208548 -30545456 -25855309
36080b5855309l419069K998744J6819587K1990397J4688271K452209p637976j0882815
$$ -25855309 -29274378 -26275634 -9456047 12534350 27222621 29674830 22036854 11154039
36072A1154039m258644O758971Q716972k862123j4359862j1778769m81677L983628
$$ 11154039 6895395 13654366 22371338 19509215 5149353 -6629416 -7111093 -3127465
36064c127465j255659n450163k436013L248638P121995R397719Q682349K318828
$$ -3127465 -4383124 -9833287 -12269300 -9020662 -1898667 7499052 16181401 18500229
36056A8500229n702507p163913j360820M435670O446489O763194M950428q14815
$$ 18500229 12797722 5633809 4272989 8708659 15155148 21918342 26868770 26053955
36048B6053955l854424N539451K1574717K4870458Q988053r500921j5352016j3777496
$$ 26053955 22199531 27738982 49313699 74184157 83172210 73671289 58319273 44541777
36040D4541777j4352876j1858931K51795J0486762M464540q719241q006994N482905
$$ 44541777 30188901 18329970 18581765 29068527 33533067 24813826 16806832 22289737
36032B2289737R578436k916276j3488275r198630j713790m056257q535250l120253
$$ 22289737 31868173 28951897 15463622 6264992 4551202 494945 -8040305 -11160558
36024a1160558O067821O234460N85401J383711P723934Q124212J361376k223596
$$ -11160558 -5092737 1141723 1727124 3110835 10834769 18958981 20320357 18096761
36016A8096761Q37054K766611l84822k936941j425888n73376l861216p679650
$$ 18096761 18933815 21700426 21315604 18378663 16952775 16379399 12518183 4838533
36008D838533q523323q180043q339840o490790m87786P010953J0374412N141256
$$ 4838533 -3684790 -11864833 -20204673 -26695463 -27183249 -20172296 -9797884 -4656628
36000d656628p253802j5738656o915689J6441765L1248682K0189603l655001j3050601
$$ -4656628 -11910430 -27649086 -34564775 -18123010 13125672 33315275 29660274 16609673
35992A6609673l609766L760754k754290j0032717m622900O457245J0429288Q194444
$$ 16609673 12999907 16760661 14006371 3973654 -649246 5807999 16237287 24431731
35984B4431731O290176K724904n290422j0324788n647657J739884K689566J741197
$$ 24431731 30721907 33446811 28156389 17831601 12183944 13923828 16613394 18354591
35976A8354591O654285J0817677L822173o608809l306923J1760023J8061330P811628
$$ 18354591 25008876 35826553 39648726 33039917 29732994 41493017 59554347 67365975
35968F7365975k981638r68413M989282J073489q999890j2159081p524216n704836
$$ 67365975 64384337 63415924 68405206 69478695 60478805 48319724 40795508 35090672
35960C5090672j0539547j4276780j1209977o007590n249384p398533o029023M3847
$$ 35090672 24551125 10274345 -935632 -6943222 -12192606 -19591139 -25620162 -25576315
35952b5576315M893201L985925N46857P52109N016438Q147671P134368L935384
$$ -25576315 -20683114 -16697189 -16150332 -15398223 -10381785 -2234114 4900254 8835638
35944H835638P46893j752583j167838M196017Q266415J936321j1301669j5093964
$$ 8835638 9582531 7829948 6662110 10858127 19124542 21060863 9759194 -5334770
35936e334770k644874J1256787J0764226J469782j100690K982056J204031p236637
$$ -5334770 -7979644 3277143 14041369 15511151 14410461 17392517 18596548 11359911
35928A1359911r428325j451642M662078P43475n946228o558315l163769j365369
$$ 11359911 1931586 479944 5142022 5885497 -60731 -6619046 -9782815 -11148184
35920a1148184j353030j875179l366620k775753M632083J4462833J5128845M754182
$$ -11148184 -12501214 -14376393 -17743013 -20518766 -15886683 -1423850 13704995 18459177
35912A8459177n283191p844126q136747r195970m166877Q397787J5958744J0010766
$$ 18459177 13175986 5331860 -2804887 -12000857 -16167734 -7769947 8188797 18199563
35904A8199563J92086j769099l20476m595730r880774o768169Q2113L0892l125043
$$ 18199563 18391649 16622550 16302074 11706344 1825570 -4942599 -4860486 -4829594 -7954637
35895g954637K284592J2184134R364912r093588k4669015k2007124o556220P098930
$$ -7954637 -5670045 6514089 15879001 6785413 -17883602 -39890726 -46446946 -39348016
35887c9348016J2247096J0241434M467702J52955K036969P051893N950702l826415
$$ -39348016 -27100920 -16859486 -12391784 -12238829 -10201860 -3149967 2800735 -1025680
35879a025680j3213132j2998877m592033L772953O559413M253910J679954M375036
$$ -1025680 -14238812 -27237689 -31829722 -28056769 -21497356 -17243446 -15563492 -11188456
35871a1188456J2233249J6753791J0197947k857313r977838p045407k156907k164618
$$ -11188456 1044793 17798584 27996531 25139218 15161380 8115973 5959066 3794448
35863C794448l833170j617458L445387P343558R744031J1955186J2094655O905100
$$ 3794448 -38722 -1656180 1789207 9132765 18876796 30831982 42926637 49831737
35855D9831737l180911j3050196j6126906r504795J323973N044636k988456j2585863
$$ 49831737 46650826 33600630 17473724 7968929 9292902 14337538 11349082 -1236781
35847a236781r732228N151261J7519124J7145310P921002j521081p592211r393840
$$ -1236781 -10969009 -5817748 11701376 28846686 36767688 35246607 27654396 18260556
35839A8260556n720235P67528L555560J170674k62341K506927L742560j728750
$$ 18260556 12540321 13307849 16863409 18034083 17771742 20278669 24021229 22292479
35831B2292479r320110j1272146p341669k697447N38327L243810M149771J329108
$$ 22292479 12972369 1700223 -5641446 -8338893 -7800566 -4556756 -406985 922123
35823I22123k841521l840201j542170l37950k796800o206811n932999j269504
$$ 922123 -1919398 -5759599 -7301769 -7639719 -10436519 -16643330 -22576329 -23845833
35815b3845833K445983n20554o902382m994371R525645K2454861J6078159n669844
$$ -23845833 -21399850 -21920404 -28822786 -33817157 -24291512 -1836651 14241508 8571664
35807H571664j9619777j3515546l10285L790001J597350L922188P892120K595615
$$ 8571664 -11048113 -24563659 -24873944 -21083943 -19486593 -15564405 -7672285 -5076670
35799e076670q950452j0563285L293723J8200748J8558600N880678o660056j0891128
$$ -5076670 -14027122 -24590407 -21296684 -3095936 15462664 21343342 14683286 3792158
35791C792158r312189q046216r129448r321290m503009N163839J4783183J9138742
$$ 3792158 -5520031 -13566247 -22695695 -32016985 -36519994 -31356155 -16572972 2565770
35783B565770J5860226N115656r204134j7566060j1179558N831582J7116792J2458725
$$ 2565770 18425996 23541652 14337518 -3228542 -14408100 -8576518 8540274 20998999
35775B0998999k70359p515187p865481q899715j1737634j0017625k405909M563374
$$ 20998999 20728640 13213453 5347972 -3551743 -15289377 -25307002 -27712911 -23149537
35767b3149537O603557N960472N155177M295775M651961P035464O906296l64642
$$ -23149537 -16545980 -10585508 -5430331 -1134556 3517405 10552869 17459165 17094523
35759A7094523r443115r630597j82370Q770627J1478451J1333992Q280467m451549
$$ 17094523 7651408 -1979189 -2161559 6609068 18087519 29421511 37701978 33250429
35751C3250429k4128090l2525888j8168094M667000J2943464N377377J236769
$$ 33250429 9122339 -23403549 -41571643 -36904643 -23961179 -18583802 -17347033
35744a7347033J0395932K0137463J5860374J941009o677097n633448l514382o106453
$$ -17347033 -6951101 13186362 29046736 30987745 24310648 18677200 15162818 9056365
35736I056365q575417n461051p37639k122337q691852j0768657k874099Q346718
$$ 9056365 480948 -4980103 -5717742 -7840079 -16531931 -27300588 -30174687 -21827969
35728b1827969J2107003O200306j973696n272480l395757J36968L161250N078091
$$ -21827969 -9720966 -3520660 -5494356 -10766836 -14162593 -14025625 -10864375 -5786284
35720e786284M636579N15577n801220r396848n975709K505352P912452M877729
$$ -5786284 -1149705 -634128 -6435348 -15832196 -21807905 -19302553 -11390101 -6512372
35712f512372p42314K604912J6289656K6809716K1518774M296065j0605394j6308726
$$ -6512372 -7254686 -4649774 11639882 38449598 59968372 64264437 53659043 37350317
35704C7350317j6853659j5515032r851255j13403O235746K946864o981924j4755437
$$ 37350317 20496658 4981626 -4869629 -4983032 1252714 4199578 -2782346 -17537783
35696a7537783j3730843l231537J0545996J6918559J0227179j910104o432817
$$ -17537783 -31268626 -34500163 -23954167 -7035608 3191571 1281467 -5151350
35689e151350j746953J527975j772268m027236j57102J747363n089899j1099471
$$ -5151350 -6898303 -5370328 -7142596 -11169832 -11326934 -9579571 -14669470 -25768941
35681b5768941l667529J0436987J1886897k482362j3149906m619624J3606355
$$ -25768941 -29436470 -18999483 -7112586 -9594948 -22744854 -27364478 -13758123
35674a3758123K0405463R410217o404049j2453932p170225N33687K930492O42507
$$ -13758123 6647340 16057557 9653508 -2800424 -9970649 -9436962 -6506470 -5863963
35666e863963m10474K475660N579035N297766M371755O799486R011816L574192
$$ -5863963 -6274437 -3798777 1780258 7078024 11449779 18249265 27261081 30835273
35658C0835273q056262j4709673j0381468k302966N15802m31996J006871L928696
$$ 30835273 22779011 8069338 -2312130 -4615096 -4099294 -4531290 -3524419 404277
35650D04277L584493K101115N407147J0999983R987514K324217j564342J793785
$$ 404277 3988770 6089885 11497032 22497015 32484529 34808746 33244404 35038189
35642C5038189J439890j0531424k3942138k3871423j2251313l459649k086663
$$ 35038189 36478079 25946655 2004517 -21866906 -34118219 -37577868 -39664531
35635c9664531P44572Q861287J3509365Q670495Q25883l649362q846678j6954384
$$ -39664531 -38919959 -30058672 -16549307 -7878812 -7052929 -10702291 -19548969 -36503353
35627c6503353j6336651K893601K6878002K8936665M220479k1075036k0854551
$$ -36503353 -52840004 -49946403 -23068401 5868264 10088743 -10986293 -31840844
35620c1840844J345593K1125740K3081445J2778632L508299P66149N76605k600213
$$ -31840844 -30495251 -9369511 13711934 26490566 29998865 30765014 31341619 28741406
35612B8741406q687121j1591261o415914K750198N513602k174237j1508449j0922434
$$ 28741406 20054285 8463024 2047110 4797308 10310910 8136673 -3371776 -14294210
35604a4294210m90578Q338030O580422l334819j2862219j6782872j4767144p248689
$$ -14294210 -14784788 -6446758 133664 -3201155 -16063374 -32846246 -47613390 -54862079
35596e4862079N030857J7258313K1161441J2907596j352748j1225383j2585395
$$ -54862079 -49831222 -32572909 -11411468 1496128 143380 -11082003 -23667398
35589b3667398r052090m275726J499350O460998N946138M4396l680979n73577
$$ -23667398 -32719488 -36995214 -35495864 -29034866 -23088728 -23044332 -26725311 -27298888
35581b7298888L563317K094254q05136K555881Q675304P267427j034850m444116
$$ -27298888 -23735571 -21641317 -22446453 -19890572 -11215268 -3947841 -4982691 -9426807
35573i426807P18207L786625j958804p029715n91617J1591274J4800027N776339
$$ -9426807 -8708600 -4921975 -6880779 -13910494 -14502111 -2910837 11889190 17665529
35565A7665529m707173p476597m416785k335230l892381o049202m412250J480128
$$ 17665529 12958356 5481759 1064974 -1270256 -5162637 -11211839 -15624089 -14143961
35557a4143961O809695P199582M933262M748738M207735l646858j6386820k0776498
$$ -14143961 -7334266 -134684 4798578 9547316 13755051 10108193 -6278627 -27055125
35549b7055125j0294964M840454J1670717J0086058O930387L332175k070006m593958
$$ -27055125 -37350089 -32509635 -20838918 -10752860 -3822473 -490298 -2560304 -7154262
35541g154262J93125O623605O414708J567470j078455l030537r131131j3791630
$$ -7154262 -6961137 -337532 6077176 7644646 6566191 3535654 -5595477 -19387107
35533a9387107p248548O197787J1578931N245097j489375j848453q86535m65083
$$ -19387107 -26635655 -20437868 -8858937 -3613840 -5103215 -6951668 -7838203 -8303286
35525h303286N752609J5829409J5219086l49337j2479255m774309J1326179J1872575
$$ -8303286 -2550677 13278732 28497818 28148481 15669226 10894917 22221096 34093671
35517C4093671n115567j7979654j2968223j128335M83760q042559j3017291p148285
$$ 34093671 28978104 10998450 -1969773 -3098108 -2614348 -10656907 -23674198 -30822483
35509c0822483K507704N576735J149824l186789k355135P11706J489098J135254
$$ -30822483 -28314779 -22738044 -21588220 -24775009 -27130144 -26418438 -24929340 -23794086
35501b3794086L177298O182278N807389K692484J660096L426945M114592L285278
$$ -23794086 -20616788 -14434510 -8627121 -5934637 -4274541 -847596 3266996 6552274
35493F552274M753963Q062230P253748Q26816m724832m546356j459127N92223
$$ 6552274 11306237 19368467 26622215 27449031 22724199 18177843 16718716 17310939
35485A7310939J518871N58287m499691r802581p027134K259199M644539n130927
$$ 17310939 18829810 19388097 14888406 5085825 -1941309 317890 4962429 -168498
35477a68498j3272020o581292O965567J0627838L988377n068J866479M19079o164516
$$ -168498 -13440518 -20021810 -13056243 -2428405 1559972 1554904 3421383 3840462 -2324054
35468b324054p414139N37123O430612J625135n781842l972836M316167P317972
$$ -2324054 -9738193 -9201070 -2770458 -1145323 -6927165 -10900001 -6583834 734138
35460G34138K913035M14803M309909O647718j18981r726148r149069K887099J2897948
$$ 734138 3647173 4061976 8371885 15019603 14900622 5174474 -3974595 -1087496 11810452
35451A1810452J0958712M158238M424004R055404N447084o622949j2211131m437763
$$ 11810452 22769164 26927402 31351406 40406810 45853894 39230945 27019814 22582051
35443B2582051M018046R21102o836601o118906J389026M720912K094565j110676
$$ 22582051 26600097 27521199 20684598 14565692 15954718 20675630 22770195 21659519
35435B1659519o324380j7050902k4457769j6045913K206469J0783945N304794
$$ 21659519 15335139 -1715763 -26173532 -42219445 -40012976 -29229031 -23924237
35428b3924237J683095Q420748J2813657L568368r672415j1720743m091485J242477
$$ -23924237 -22241142 -13820394 -1006737 2561631 -7110784 -18831527 -22923012 -21680535
35420b1680535J034715O95191J438213j65785l223494l170059M84468M090828
$$ -21680535 -20645820 -19950629 -18512416 -18678201 -21901695 -25071754 -24587286 -20496458
35412b0496458N053666K131859n001066j1617619r180271L533920J6427266K0672450
$$ -20496458 -15442792 -13310933 -18311999 -29929618 -39109889 -35575969 -19148703 1523747
35404A523747J8345130J3903072N536563o317856j1611027l997972O148892N648288
$$ 1523747 19868877 33771949 39308512 32990656 21379629 17381657 23530549 29178837
35396B9178837r41096j52058N817162J861997j3062901k1117583j2788086j634552
$$ 29178837 28237741 28085683 33902845 35764842 22701941 1584358 -11203728 -12838280
35388a2838280k711626j0182720q478731L641955J3191750J2436427O463335K313066
$$ -12838280 -15549906 -25732626 -34211357 -30569402 -17377652 -4941225 1522110 3835176
35380C835176K71390k213299m587882m457939j851387M04099J84046j215307q29026
$$ 3835176 4106566 1893267 -2694615 -7152554 -9003941 -8599842 -8415796 -9631103 -10460129
35371a0460129J399822J849265j214037l759499j297128L724672M560639m37183
$$ -10460129 -9060307 -7211042 -8425079 -12184578 -13481706 -9757034 -5196395 -5633578
35363e633578n837898o352032j356848P298759J6331645J9637061J2277306k133586
$$ -5633578 -11471476 -17823508 -19180356 -11881597 4450048 24087109 36364415 34230829
35355C4230829j3105228j4277437q725048k861743j78981j253902l782730k148249
$$ 34230829 21125601 6848164 -1876884 -4738627 -4917608 -6171510 -9954240 -12102489
35347a2102489N972342J2177486N594374r654662j6052889o244485O253638P176016
$$ -12102489 -6130147 6047339 11641713 1987051 -14065838 -20310323 -14056685 -6880669
35339f880669J297523J410279O830891O938165R03175j112615M387374Q737953
$$ -6880669 -5583146 -4172867 2658024 9596189 10499364 9386749 13774123 22512076
35331B2512076N182374k157350n945942m022653J520630O375805M829747l858543
$$ 22512076 27694450 25537100 19591158 15568505 17089135 23464940 28294687 24436144
35323B4436144j0642129p095931P90536N51942n853274l838851Q546308J3944187
$$ 24436144 13794015 6698084 7488620 8040562 2187288 -1651563 6894745 20838932
35315B0838932K253056j1677990r442642M063817J0222662M300502l191322p464574
$$ 20838932 23091988 11413998 1971356 6035173 16257835 20558337 17367015 9902441
35307I902441j3810585k1330303j9310383m476322J0928600J4490489Q264582
$$ 9902441 -3908144 -25238447 -44548830 -49025152 -38096552 -23606063 -15341481
35300a5341481K838459L612853P490471Q078505J154690j0790707j8601621j6079469
$$ -15341481 -12503022 -8890169 -1399698 6678807 7833497 -2957210 -21558831 -37638300
35292c7638300q780665o143057o270668J004859J5229594K2105191J3749561M89611
$$ -37638300 -46418965 -52562022 -58832690 -57827831 -42598237 -20493046 -6743485 -6253874
35284f253874m500553j932475M86695J924256N052271O718382L607137J475352
$$ -6253874 -10754427 -12686902 -12200207 -10275951 -5223680 1494702 5101839 6577191
35276F577191O777312J3238985R253723l569541j1758268r625254n590551p232633
$$ 6577191 13354503 26593488 35847211 32277670 20519402 10894148 5303597 -1929036
35268a929036j0946074r961617m024497K653771O664001O253098K573874Q01684
$$ -1929036 -12875110 -22836727 -26861224 -24207453 -17543452 -11290354 -8716480 -7914796
35260g914796L863602N774130p90671j1262896j3935394q114334m802198o552284
$$ -7914796 -4051194 1722936 932265 -10330631 -24266025 -32380359 -37182557 -43734841
35252d3734841j370924J5709538K8876251K1988646L199964n590513J111294P761455
$$ -43734841 -45105765 -29396227 -519976 21468670 24668634 19078121 20189415 27950870
35244B7950870K630961o750982p249943Q09546N304829r66864j1120128j2611114
$$ 27950870 30581831 23830849 16580906 17390452 22695281 21728417 10608289 -2002825
35236b002825k986034N819474K096030q920967j0578241J660290J2148266O541803
$$ -2002825 -4988859 830615 2926645 -5994322 -16572563 -14912273 -2764007 3777796
35228C777796q082759j4449747q803622n25313O803654J7823704K8964217K6346313
$$ 3777796 -4304963 -18754710 -27558332 -28083645 -21279991 -3456287 25507930 51854243
35220E1854243O173539j5582545k1947906j4017987l668558L707583R477762J1957162
$$ 51854243 58027782 42445237 20497331 6479344 2810786 6518369 15996131 27953293
35212B7953293Q129075K001661K26961L80804n825327j6768255j9056068n726168
$$ 27953293 36082368 38084029 38310990 38691794 32866467 16098212 -2957856 -8684024
35204h684024J2226616J8657828J0509801l208064j5022331k2585939k2009592
$$ -8684024 3542592 22200420 32710221 29502157 14479826 -8106113 -30115705
35197c0115705r455736Q274753J5325938N574754p324818o604415O040894J4749784
$$ -30115705 -39571441 -31296688 -15970750 -10395996 -17720814 -24325229 -18284335 -3534551
35189c534551J2052406O027718M857367N779178L388602p83446l107494m809386
$$ -3534551 8517855 14545573 19402940 25182118 28570720 27787274 24679780 19870394
35181A9870394p456666p588368k719803K568082L601528L568537O507898P137426
$$ 19870394 12413728 4825360 2105557 4673639 8275167 11843704 18351602 25489028
35173B5489028k248942j7000948k2619283j2654274M095341J4932211J4475015
$$ 25489028 23240086 6239138 -16380145 -29034419 -24939078 -10006867 4468148
35166D468148M486061r036363j6693105j1334843L440240J5170169J5142314N602325
$$ 4468148 8954209 -82154 -16775259 -28110102 -24669862 -9499693 5642621 11244946
35158A1244946n414806j1337652r412110j824070M872571O348555N760775P167981
$$ 11244946 5830140 -5507512 -14919622 -16743692 -11871121 -5522566 238209 7406190
35150G406190O573803j967110j3311820j5221981n933907L305640N184313M653179
$$ 7406190 13979993 12012883 -1298937 -16520918 -22454825 -19149185 -13964872 -9311693
35142i311693P334570J1013027J2949740J4440766J3159575K756518j3682375
$$ -9311693 -1977123 9035904 21985644 36426410 49585985 52342503 38660128
35135C8660128k1890305j5797642o520047l392176K71262J0570403J6298497N911450
$$ 38660128 16769823 972181 -5547866 -8940042 -8668780 1901623 18200120 24111570
35127B4111570r525293j0457493N11551L269588o975785j3144121m732567P182095
$$ 24111570 14586277 4128784 4640335 7909923 934138 -12209983 -16942550 -9760455
35119i760455R202160K987740l664193q371817r261525k210022Q510947R576598
$$ -9760455 -558295 2429445 -1234748 -9606565 -18868090 -21078112 -12567165 -2990567
35111b990567j752989r204373j35J4803078J5983913M069899l779215n33656L057193
$$ -2990567 -4743556 -13947929 -13948064 855014 16838927 20908826 17129611 16595955 19653148
35102A9653148j849469r091838q974993k856344L11155l261551q427291q088626
$$ 19653148 17803679 8711841 -263152 -3119496 -2808341 -6069892 -14497183 -22585809
35094b2585809q45468P722502J0833571Q271347O759566J0347120J3217833P107799
$$ -22585809 -23431277 -15708775 -4875204 3396143 10155709 20502829 33720662 40828461
35086D0828461n640082j3298644j0150133l638758k383252l450309J310266R861382
$$ 40828461 35188379 21889735 11739602 8100844 5717592 2267283 3577549 13438931
$$ [...]
##END NTUPLES=NMR SPECTRUM
##END=
