##TITLE=31Pdec_DE-60-EA_d6.T
 DMSO-d6, 64 sc
 3.7.2024
##JCAMPDX= 6.0         $$ Bruker NMR JCAMP-DX V2.0
##DATA TYPE= NMR SPECTRUM
##DATA CLASS= NTUPLES
##ORIGIN= UXNMR, Bruker Analytische Messtechnik GmbH
##OWNER= root
$$ XWIN-NMR		Version 3.5
$$ Wed Jul  3 15:21:04 2024 Russian Standard Time (UT+4h)  she@DPX200
##.OBSERVE FREQUENCY= 81.013821
##.OBSERVE NUCLEUS= ^31P
##.ACQUISITION MODE= SIMULTANEOUS
##.ACQUISITION SCHEME= undefined
##.AVERAGES= 64
##.DIGITISER RES= 17
##SPECTROMETER/DATA SYSTEM= spect
##.PULSE SEQUENCE= zgpg30
##.SOLVENT NAME= DMSO
##.SHIFT REFERENCE= (INTERNAL, DMSO, 0, 198.062)
##AUDIT TRAIL= $$ (NUMBER, WHEN, WHO, WHERE, WHAT)
$$ ##TITLE= Audit trail, XWIN-NMR		Version 3.5
$$ ##JCAMPDX= 5.01
$$ ##ORIGIN= Bruker BioSpin GmbH
$$ ##OWNER= she
$$ F:/spectra/data/she/nmr/P31/2/pdata/1/auditp.txt
$$ ##AUDIT TRAIL=  $$ (NUMBER, WHEN, WHO, WHERE, WHAT)
(   1,<2024-07-03 15:20:08.62 +0400>,<she>,<DPX200>,
      <created by zg, POWCHK disabled, PULCHK disabled
       configuration hash MD5:
       00 E9 B6 7A A2 85 ED C7 34 08 36 98 17 FE 4E 26
       data hash MD5: 32K
       51 97 5D 89 93 47 66 0C F6 D2 35 C8 96 35 0B 43>)
(   2,<2024-07-03 15:20:10.75 +0400>,<she>,<DPX200>,
      <Start of raw data processing
       efp BC_mod = 2 LB = 1.5 FT_mod = 6 PKNL = 1 PHC0 = 3134.66 PHC1 = -778.9137 SI = 64K 
       data hash MD5: 64K
       F2 11 C4 7B 39 F8 85 68 92 57 59 EC 83 14 8B D7>)
(   3,<2024-07-03 15:20:25.84 +0400>,<she>,<DPX200>,
      <pk PHC0 = -10.20705 PHC1 = 0 
       data hash MD5: 64K
       99 0E 8C A9 BE 46 D2 A6 8E 2F 16 89 0B 97 06 52>)
(   4,<2024-07-03 15:20:30.76 +0400>,<she>,<DPX200>,
      <abs ABSG = 5 
       data hash MD5: 64K
       4F D8 D7 F3 2B 47 C0 62 5D 94 A7 F3 47 1A 26 E2>)
$$ ##END=
$$ 
$$ hash MD5
$$ AA C1 7C 73 36 6A 3B 6A DF 05 CF 5B 56 F5 EE 9A
##$RELAX= 
##$RELAX= 
##$RELAX= 
##$RELAX= 
##$RELAX= 
##$RELAX= 
##$RELAX= 
##$RELAX= 
$$ Bruker specific parameters
$$ --------------------------
##$DU= <F:/spectra>
##$EXPNO= 2
##$NAME= <P31>
##$PROCNO= 1
##$TYPE= <nmr>
##$USER= <she>
##$AMP= (0..31)
100 100 100 100 100 100 100 100 100 100 100 100 100 100 100 100 100 100 
100 100 100 100 100 100 100 100 100 100 100 100 100 100 
##$AQSEQ= 0
##$AQ_mod= 1
##$AUNM= <au_zg>
##$AUTOPOS= <>
##$BF1= 81.014009
##$BF2= 200.13
##$BF3= 200.13
##$BF4= 200.13
##$BF5= 200.13
##$BF6= 200.13
##$BF7= 200.13
##$BF8= 200.13
##$BYTORDA= 1
##$CFDGTYP= 0
##$CFRGTYP= 5
##$CHEMSTR= <none>
##$CNST= (0..31)
1 1 145 1 1 1 1 1 1 1 1 1 1 1 1 1 1 1 1 1 1 1 1 1 1 1 1 1 1 1 1 1 
##$CPDPRG= <waltz16>
##$CPDPRG1= <>
##$CPDPRG2= <waltz16>
##$CPDPRG3= <>
##$CPDPRG4= <mlev>
##$CPDPRG5= <mlev>
##$CPDPRG6= <mlev>
##$CPDPRG7= <mlev>
##$CPDPRG8= <mlev>
##$CPDPRGB= <>
##$CPDPRGT= <>
##$D= (0..31)
0 1 0 0 0 0 0 0 0 0.06 0 0.03 2e-05 3e-06 0 0 0.0002 0 0 0 0 0 0 0 0 0 
0 0 0 0 0 0 
##$DATE= 1720005608
##$DBL= (0..7)
120 120 120 11 120 120 24 19 
##$DBP= (0..7)
150 150 150 150 150 150 150 150 
##$DBP07= 0
##$DBPNAM0= <>
##$DBPNAM1= <>
$$ [...]
##$SUBNAM3= <"">
##$SUBNAM4= <"">
##$SUBNAM5= <"">
##$SUBNAM6= <"">
##$SUBNAM7= <"">
##$SUBNAM8= <"">
##$SUBNAM9= <"">
##$SW= 400.765351723535
##$SWIBOX= (0..15)
0 1 3 0 0 0 0 0 0 0 0 0 0 0 0 0 
##$SW_h= 32467.5324675325
##$TD= 32768
##$TD0= 1
##$TE= 0
##$TE2= 300
##$TE3= 300
##$TEG= 300
##$TL= (0..7)
0 120 53 12 22 120 120 120 
##$TP= (0..7)
150 150 150 150 150 150 150 150 
##$TP07= 0
##$TPNAME0= <>
##$TPNAME1= <>
##$TPNAME2= <>
##$TPNAME3= <>
##$TPNAME4= <>
##$TPNAME5= <>
##$TPNAME6= <>
##$TPNAME7= <>
##$TPOAL= (0..7)
0.5 0.5 0.5 0.5 0.5 0.5 0.5 0.5 
##$TPOFFS= (0..7)
0 0 0 0 0 0 0 0 
##$TUNHIN= 0
##$TUNHOUT= 0
##$TUNXOUT= 0
##$USERA1= <user>
##$USERA2= <user>
##$USERA3= <user>
##$USERA4= <user>
##$USERA5= <user>
##$V9= 5
##$VALIST= <valist>
##$VCLIST= <CCCCCCCCCCCCCCC>
##$VD= 0
##$VDLIST= <DDDDDDDDDDDDDDD>
##$VPLIST= <PPPPPPPPPPPPPPP>
##$VTLIST= <TTTTTTTTTTTTTTT>
##$WBST= 1024
##$WBSW= 4
##$XGAIN= (0..3)
0 0 0 0 
##$XL= 0
##$YL= 0
##$YMAX_a= 4453
##$YMIN_a= -3936
##$ZGOPTNS= <>
##$ZL1= 120
##$ZL2= 120
##$ZL3= 120
##$ZL4= 120
##$ABSF1= 198.0616
##$ABSF2= -202.7028
##$ABSG= 5
##$ABSL= 3
##$ALPHA= 0
##$AQORDER= 0
##$ASSFAC= 0
##$ASSFACI= 0
##$ASSFACX= 0
##$ASSWID= 0
##$AUNMP= <proc_1d>
##$AZFE= 0.1
##$AZFW= 0.5
##$BCFW= 0
##$BC_mod= 2
##$BYTORDP= 0
##$COROFFS= 0
##$CY= -3
##$DATMOD= 1
##$DC= 0
##$DFILT= <>
##$DTYPP= 0
##$F1P= 0
##$F2P= 0
##$FCOR= 1
##$FTSIZE= 65536
##$FT_mod= 6
##$GAMMA= 0
##$GB= 0
##$INTBC= 1
##$INTSCL= 9.790993e-09
##$ISEN= 30
##$LB= 1.5
##$LEV0= 0
##$LPBIN= 0
##$MAXI= 10000
##$MC2= 0
##$MEAN= 0
##$ME_mod= 0
##$MI= 50
##$NCOEF= 0
##$NC_proc= -9
##$NLEV= 6
##$NOISF1= 182.463
##$NOISF2= 159.3651
##$NSP= 0
##$NTH_PI= 0
##$NZP= 0
##$OFFSET= 198.0616
##$PC= 4
##$PHC0= 3124.453
##$PHC1= -778.9137
##$PH_mod= 1
##$PKNL= yes
##$PPARMOD= 0
##$PSCAL= 0
##$PSIGN= 0
##$REVERSE= no
##$SF= 81.0140089999434
##$SI= 65536
##$SIGF1= 159.3651
##$SIGF2= -187.1042
##$SINO= 113.3802
##$SIOLD= 16384
##$SREGLST= <1H.CDCl3>
##$SSB= 0
##$STSI= 65536
##$STSR= 0
##$SW_p= 32467.5324675325
##$SYMM= 0
##$S_DEV= 0
##$TDeff= 32768
##$TDoff= 0
##$TI= <>
##$TILT= no
##$TM1= 0
##$TM2= 0
##$TOPLEV= 0
##$USERP1= <user>
##$USERP2= <user>
##$USERP3= <user>
##$USERP4= <user>
##$USERP5= <user>
##$WDW= 1
##$XDIM= 65536
##$YMAX_p= 429131900
##$YMIN_p= -108120064
$$ End of Bruker specific parameters
$$ ---------------------------------
##NTUPLES= NMR SPECTRUM
##VAR_NAME=  FREQUENCY,     SPECTRUM/REAL,   SPECTRUM/IMAG
##SYMBOL=    X,             R,               I
##VAR_TYPE=  INDEPENDENT,   DEPENDENT,       DEPENDENT
##VAR_FORM=  AFFN,          ASDF,            ASDF
##VAR_DIM=   65536,         65536,           65536
##UNITS=     HZ,            ARBITRARY UNITS, ARBITRARY UNITS
##FACTOR=    0.49542278885378, 1,            1
##FIRST=     16045.7642231865, 0,            0
##LAST=      -16421.768244346, 0,            0
##MIN=       -16421.768244346, -108120064,   0
##MAX=       16045.7642231865, 429131900,    0
$$ Real data points
##PAGE= N=1
##DATA TABLE= (X++(R..R)), XYDATA
$$ [...]
6640F667446M968957L312932j017543o432314r902804j0241952p100114m51735
6632b0197127O129886O318759p18623p013968n392184J204030M816152L324464
6624a1528611O04951j037127k063274j245899L190743Q470460R395275N651794
6616A1438312J655601o16614k898469m798222l216133J143196K992896N28100
6608F228667j471563M11199K603649Q58431k490748k643784m06651n51560l694174
6599a156534n250960k613888J127143J811203o89544l488810m424120l068716
6591a7754226K07518L947546N149856J741386l724517n134543J69545O686786
6583h710649O342166j005279o321466k501303O630386J1529768Q481785J896567
$$ plain form
6640 6667446 11636403 14949335 13931792 7499478 -2403326 -12645278 -19745392 -20197127
6632 -20197127 -14067241 -7748482 -8467105 -15481073 -20873257 -19669227 -14853075 -11528611
6624 -11528611 -10923660 -11960787 -14024061 -15269960 -12079217 -3608757 5786518 11438312
6616 11438312 13093913 12477299 9578830 4780608 1564475 2707671 5700567 6228667
6608 6228667 4757104 5168303 7771952 8630383 6139635 3495851 3089200 2537640 -1156534
6599 -1156534 -6407494 -9021382 -7894239 -6083036 -6772580 -10261390 -14685510 -17754226
6591 -17754226 -17546708 -13599162 -8449306 -6707920 -10432437 -15566980 -15397435 -8710649
6583 -8710649 -2368483 -3373762 -9695228 -12196531 -5566145 5963623 14445408 16341975
6575A6341975l035511m964859m168621j096598J630273L29993m464141p307334
6567f734823m680309L49606K612757J520120O78187K424254N137211N457544K053169
6558H817716k278047k456949L130025R052598P980218j40559p360357p265536
6550I479109j893311K381013K329116r80359n157107p560158n828634m80635M420082
6541c290884N381927K874947o15985l451304m319537k094224J588922K819559
6533a106579R32163J13669K772202N268864L845473O68440n99724j217059l757247
6524F920202n769476l721836l58695n83045k120611J137564P334691P760153J049793
6515A1648740l310076P52696O677353N577295j186284n865307n386461k180354
$$ plain form
6575 16341975 13306464 8341605 4172984 3076386 4706659 5036652 572511 -6734823
6567 -6734823 -11415132 -11065526 -8452769 -6932649 -6254462 -3830208 1307003 6764547 8817716
6558 8817716 6539669 4082720 7212745 16265343 24245561 24105002 16744645 9479109
6550 9479109 7585798 9966811 12295927 11315568 6158461 -1401697 -7230331 -7710966 -3290884
6541 -3290884 2091043 4965990 4350005 898701 -3420836 -5515060 -3926138 -1106579
6533 -1106579 -174416 -60747 2711455 7980319 11825792 12494232 11894508 10677449 6920202
6524 6920202 1150726 -2571110 -2929805 -3512850 -5633461 -4495897 2838794 10598947 11648740
6515 11648740 8338664 9091360 15768713 21346008 20159724 14294417 8907956 6727602
6507F727602J834637N424805N117760j119840q582695j0144964n456654q92203
6499g091552o93936k837568l668481k205140O51420L385637L861325J450078o74678
6490g822895R51994M042459K375126n002074j0676535p760643J156024P231952
6482a5504592N872428Q99022j158438J680879N617225N596056O67432m732654
6474a062642n272403p87429L395876L049913J66031n76079J119192J237846j430805
6465a60500k628156O66710M601753L736019k55990p06351L358982M841773o49652
6456A2804588p254183p013505j792658o45604o569445j2397895j0824101l017042
6448c6709845M748876Q412129P415921K735827k773663m720337j473148L327036
$$ plain form
6507 6727602 8562239 13987044 19104804 17984964 9402269 -742695 -6199349 -7091552
6499 -7091552 -7785488 -10623056 -14291537 -16496677 -15845257 -12459620 -8598295 -7148217 -7822895
6490 -7822895 -6870901 -2828442 -453316 -5455390 -16131925 -23892568 -22736544 -15504592
6482 -15504592 -9632164 -8733142 -9891580 -8210701 -2593476 3002580 3670012 -1062642
6474 -1062642 -6335045 -7122474 -3726598 -676685 -510654 -1086733 32459 1270305 -160500
6465 -160500 -2788656 -2121946 2479807 6215826 5959836 5253485 8612467 13454240 12804588
6456 12804588 5550405 -1463100 -3255758 -3901362 -10470807 -22868702 -33692803 -36709845
6448 -36709845 -31960969 -23548840 -16132919 -13397092 -16170755 -20891092 -22364240 -19037204
6440a9037204N232506M374800L825279M411713M404560L208769J971876Q46869
6432I239168j349302m582317p043354p240693m792467L27554O904836J1206026
6424B669451R604212L173751k760761m553633l594594k815473k219622J27725
6416c68944M111754P014661O874772M574365K042910k03802k519150m003583l123764
6407A4399219j109380k380905q943550j5399287j3347791j887247R541718J1303285
6399g823938M414889j726045j117646K968354M079026J124716j253744N99961
6391A265573M626756N690981J985472k645390l357241J9457L611612M808579M110280
6382B0116079J846590l028423r184979j1631629p425651l62228L357041K392099
$$ plain form
6440 -19037204 -13804698 -9429898 -5604619 -1192906 3211654 6420423 8392299 9239168
6432 9239168 7889866 3307549 -3735805 -10976498 -15768965 -15441411 -8536575 2669451
6424 2669451 12273663 15447414 12686653 8133020 4538426 1722953 -496669 -368944
6416 -368944 3742810 10757471 17632243 22206608 24249518 24045716 21526566 17522983 14399219
6407 14399219 13289839 10908934 1965384 -13433903 -26781694 -28668941 -19127223 -7823938
6399 -7823938 -3409049 -5135094 -6252740 -3284386 794640 1919356 665612 1265573
6391 1265573 5892329 11583310 13568782 10923392 7566151 7585608 11197220 16005799 20116079
6382 20116079 21962669 18934246 9749267 -1882362 -9308013 -9670241 -6313200 -3921101
6374c921101q3160k122784m130598n201186l193409R54194L257466K454561K077511
6365i908506M693902P098530M210785l616787r907895q842891j428561N476203
6357a2225220N954583O19392m735870n561425k388677J526539L897864L718718
6349i194096P76002k757751k711791J968531O479811O005360K406715R67934K189482
6340F130197J999449o37565k143135r58062j60301j812142l675439l743892l573394
6331h574284m491900m371881j036128M168846Q582502J1120407J0966215O627809
6323B2991586j257697q822952j2654534j2205199p867938o45243N188201M442614
6315a0831162j291097l508140K050295R034366R460317M142587q16457l123728
$$ plain form
6374 -3921101 -4004261 -6127045 -10257643 -15458829 -18652238 -17698044 -14440578 -11986017 -9908506
6365 -9908506 -5214604 1883926 6094711 2477924 -7429971 -16272862 -17701423 -12225220
6357 -12225220 -6270637 -5651245 -10387115 -15948540 -18337217 -16810678 -12912814 -9194096
6349 -9194096 -8418094 -11175845 -13887636 -11919105 -5439294 566066 2972781 3940715 6130197
6340 6130197 8129646 7492081 5348946 4390884 4230583 2418441 -1256998 -5000890 -8574284
6331 -8574284 -13066184 -17438065 -18474193 -14305347 -5722845 5397562 16363777 22991586
6323 22991586 21733889 12910937 256403 -11948796 -19816734 -20461977 -15273776 -10831162
6315 -10831162 -12122259 -15630399 -13580104 -4545738 4914579 9057166 8240709 5116981
6307E116981l756758j640100L715054P130965L227264m380827o853575k496315
6299F2689J925781K052094M53994n04485k442545n165101m306178J328534N749006
6290h46211L585391k172698m516031j626460K041453K004202j887105o047546
6282i465005o272834j608173L927780N286351K363619o05908j661820l121930
6274a1157920n946990o705575k874553K427706M281314K175833l89732n82503
6266a8772420J816971N319951P499881O458827L078155J57989j397009k848903
6258A313442l468157l59831N329581O546802j016476j1263094j3587513n519868
6250b2025114M555511P329792K152318l869519m384126l98500J672308j424938
$$ plain form
6307 5116981 1360223 -279877 3435177 10566142 13793406 9412579 2559004 62689
6299 62689 1988470 4040564 4494558 3990073 1547528 -3617573 -7923751 -6595217 -846211
6290 -846211 2739180 566482 -3949549 -5576009 -3534556 -1530354 -3417459 -9465005
6282 -9465005 -15737839 -17346012 -13418232 -8131881 -5768262 -6374170 -8035990 -11157920
6274 -11157920 -17104910 -23810485 -26685038 -24257332 -19976018 -17800185 -18189917 -18772420
6266 -18772420 -16955449 -11635498 -4135617 2323210 5401365 5559354 4162345 1313442
6258 1313442 -2154715 -2514546 2815035 9361837 8345361 -2917733 -16505246 -22025114
6250 -22025114 -17469603 -10139811 -7987493 -11857012 -16241138 -16639638 -14967330 -16392268
6242a6392268m864639k024459N609634R599165O092151O92149m18918J251564
6234d55621R14125j475249k348970l61603L311481P468874R638078O030281k458739
6225B0262657q003427n355068p7096o54279n604848o503263j838801J301382n61352
6216g034095k539183q04338J504126J158813N41385K211918L489624J125379k766325
6207c112696l744850j068961K579380M714485L928299J36783l768550l603331
6199c939441N84602L765546K622484m60621k068395k490493l215781l461676k232074
6190a0895849p04130Q0788P93258R34030j743120o395056p981077m180353Q31643
6181b9259866K966291L964866O395118P769152N144560J494110J297612K999591
$$ plain form
6242 -16392268 -21256907 -23281366 -17671732 -8072567 -1980416 -1288267 -1707185 -455621
6234 -455621 458504 -1016745 -3365715 -3727318 -415837 7053037 16691115 22721396 20262657
6225 20262657 12259230 6904162 6827066 6172787 567939 -5935324 -7774125 -6472743 -7034095
6216 -7034095 -9573278 -10377616 -8873490 -7714677 -7173292 -4961374 -1471750 -346371 -3112696
6207 -3112696 -6857546 -7926507 -5347127 -632642 3295657 3432440 -336110 -3939441
6199 -3939441 -3354839 410707 3033191 2572570 504175 -1986318 -5202099 -8663775 -10895849
6190 -10895849 -11599979 -11519191 -10725933 -9791903 -11535023 -17930079 -25911156 -30091509 -29259866
6181 -29259866 -26293575 -22328709 -15933591 -8164439 -3019879 -1525769 -228157 2771434
6173B771434K257269J2913N05073L093347L039165m39936l384243l816073l151800
6164H87149j554935J799394M288722K291379j991687k873123l99573L0700k230020
6155B48006j572553L292851N635644J365003m066709m305455j343941o90760k491596
6146c929510l191184k057353o69211Q26181K194988J225182k005073k697824J536029
6137h767775M833440Q29703o520734p283762K63390P112533O021971J68449k794320
6128f137105m16378L539311M608132J713103k549101m321303k220685J139333
6120d644693K437515J678453J257387K131078L181872L325411J859825j870348
6112I356500o248619o511118r0563Q184156J0744502O882374K979987K779200
$$ plain form
6173 2771434 5028703 5041616 5546689 8640036 11679201 11239265 7855022 4038949 887149
6164 887149 -667786 1131608 5420330 7711709 5720022 2846899 2447326 2478026 248006
6155 248006 -1324547 1968304 7603948 8968951 4902242 596787 -747154 -1437914 -3929510
6146 -3929510 -7120694 -9178047 -9847258 -9021077 -6826089 -5600907 -7605980 -10303804 -8767775
6137 -8767775 -3934335 -3104632 -9625366 -16909128 -16645738 -9533205 -3511234 -3342785 -6137105
6128 -6137105 -6553483 -3014172 1593960 3307063 757962 -3563341 -5784026 -4644693
6120 -4644693 -2207178 -528725 728662 2859740 6041612 9367023 11226848 9356500
6112 9356500 3107881 -3403237 -3493800 4690356 15434858 22317232 25297219 28076419
6104B8076419K636394j610959p685780j0077340p364488l192250j492033l036791
6096c746828n622766o015996k734979J952534L899767J741921j547548k288948
6088a4362843J55726L553107M876511J991960m216760q557354n142782N669682
6080a6032753J5645088J6092226O443961n441063j0737023p039220K69512L247823
6072B448551r91654p495938r139022m540223J384006M000032L276949J695926
6064i361373J174254K677148N597802O586639K470682m287981o734945k108388
6056c986162M153816N713510L165139J140445P11058p53066l822314n757596m783367
6047d218537j946052J344192M478021O191916M984421J754194l62592J13957Q16888
$$ plain form
6104 28076419 30712813 29101854 21416074 11338734 3974246 781996 -710037 -3746828
6096 -3746828 -9369594 -15385590 -18120569 -16168035 -12268268 -10526347 -12073895 -14362843
6088 -14362843 -14207117 -10654010 -5777499 -3785539 -8002299 -16559653 -21702435 -16032753
6080 -16032753 -387665 15704561 22148522 16707459 5970436 -1068784 -799272 2448551
6072 2448551 1456897 -6039041 -15178063 -19718286 -18334280 -14334248 -11057299 -9361373
6064 -9361373 -8187119 -5509971 87831 6674470 9145152 4857171 -1877774 -3986162
6056 -3986162 167654 5881164 9046303 10186748 10897806 10144740 6322426 564830 -4218537
6047 -4218537 -6164589 -4820397 -342376 5849540 10833961 12588155 12225563 12339520 13156408
6038A3156408j637057p143069j1093798q406809O50530R070507R439487K097879
6030F134078n045017n497484o51859L528858L291423r49705o175352p965916l234907
6021a6565881N381643J0569532Q539823L248437k87033k704961o087965p516558
6013e422963l349389K923779M385807R06861j436679l78675N33717q9755O06755
6004a320542K749820K514857k08303q21741P62121j484974p974692r229243j37780
5995a5150477R482031P762407j448154m313906K336486P227520K004753p695567
5987B05093j1856881r015404m764138k417755m40975K991464O942503Q898371
5979i457722P111938K223196k559786l699568m84413M408873P377058O457853
$$ plain form
6038 13156408 11519351 4376282 -6717516 -15124325 -14473795 -5403288 4036199 6134078
6030 6134078 1089061 -4408423 -5060282 -1531424 1759999 810294 -5365058 -13330974 -16565881
6021 -16565881 -11184238 -614706 7925117 11173554 10886521 8181560 2093595 -5422963
6013 -5422963 -8772352 -5848573 -1462766 -555905 -1992584 -2371259 -1837542 -1927297 -1320542
6004 -1320542 1429278 3944135 3735832 2914091 3676212 2191238 -5783454 -15012697 -15150477
5995 -15150477 -5668446 2093961 645807 -3668099 -1331613 5895907 7900660 205093
5987 205093 -11651788 -20667192 -25431330 -27849085 -28290060 -25298596 -18356093 -9457722
5979 -9457722 -2345784 -122588 -2682374 -6381942 -6866355 -2457482 4919576 11377429
5971A1377429K394676j693786k649351o01350J019031j85159k987191n495486
5963A178813p796797r261579o776416M7071M932898K099592m337482m851535J892080
5954b2873355P144800N124514O67855O20419M054826N813417M804959L324775
5946H682210J554711j826299n681645p779383q376325q292068n515926J521911
5938b5712814Q959035J0967719P447649L395117J296908n20776k147563p85694
5930B899581L373427N509087K912146j127279k687721k136410q91488K066490
5922I917833O353113P007639O95278p456670r131005l887409O76541l13757l685198
5913A76365m566535k680683j74303K204650L834087K845947o87030l137931k217954
$$ plain form
5971 11377429 13772105 12078319 9428968 8827618 9846649 9661490 6674299 1178813
5963 1178813 -6617984 -15879563 -22655979 -22608908 -17676010 -15576418 -19913900 -24765435 -22873355
5954 -22873355 -15728555 -10604041 -9936186 -9315767 -5260941 552476 5357435 8682210
5946 8682210 10236921 8410622 2728977 -5050406 -13426731 -21718799 -27234725 -25712814
5938 -25712814 -16753779 -5786060 1661589 5056706 6353614 5832838 3685275 2899581
5930 2899581 6273008 11782095 14694241 13566962 10879241 8742831 7851343 9917833
5922 9917833 16270946 23278585 23973863 16517193 7386188 3498779 4175320 3861563 176365
5913 176365 -4390170 -7070853 -7245156 -5040506 -1206419 1639528 952498 -2185433 -4403387
5904d403387q40261k462455m999735l832457O77627L623089L070917K184541L256564
5895c725557M429970L921774L072439K777942Q87879l483550o270952l328598
5887a718653K786774N199432J393525m223970o562152n185878k556758k2173K526200
5878h363653M751722N699006N142956L866401K476651N50984k590510o162870
5870E370687p642647n414126j560145q9661j618346k009331J908613P260801Q465685
5861D671530M373566j035972m385802n816825o122159m822262k424128j256695
5853a6818747j897429j379059K397393O400125N864587J284176j278474K205872
5845c221556Q033301Q550674J129547q331694j1735676p718014k471496j473849
$$ plain form
5904 -4403387 -5243648 -7706103 -12705838 -16538295 -15860668 -12237579 -9166662 -6982121 -3725557
5895 -3725557 704413 4626187 7698626 10476568 11364447 7880897 1609945 -1718653
5887 -1718653 1068121 6267553 7661078 3437108 -3125044 -8310922 -10867680 -10889853 -8363653
5878 -8363653 -3611931 2087075 7230031 11096432 13573083 14124067 11533557 5370687
5870 5370687 -2271960 -7686086 -9246231 -9335892 -10954238 -12963569 -11054956 -3794155 4671530
5861 4671530 9045096 8009124 3623322 -2193503 -8315662 -13137924 -15562052 -16818747
5853 -16818747 -18716176 -20095235 -17697842 -11297717 -5433130 -4148954 -5427428 -3221556
5845 -3221556 4811745 13362419 14491966 6160272 -5575404 -13293418 -15764914 -17238763
5837a7238763k970215j883739J873409L251130L64570j741950J638031P172056
5829i535471P390615J268627l607680q12120O268770Q550778K884222l862879
5821H544862l654137K254546M920267n56409q660842j0761326n812689l34990
5813a4060718O36467j584612l228810k564980M15865M926805Q255588P027889
5805a76506J804111k263554j512856J980763M235857M483284L798946J749502
5797A4099547j769857l757709j735357J248477J24869m099899m890331J97196
5789e83064N244252L882152j950578m569042l50939O130799P889919L384959k485729
5780A6592729m515147k675628m99189N01515J741689K943201J006190m119881
$$ plain form
5837 -17238763 -20208978 -22092717 -20219308 -16968178 -16603608 -18345558 -16707527 -9535471
5829 -9535471 -2144856 -876229 -4483909 -5296029 972741 9523519 12407741 8544862
5821 8544862 4890725 7145271 12065538 11509129 2848287 -7913039 -13725728 -14060718
5813 -14060718 -13424251 -15008863 -18237673 -20802653 -20386788 -15459983 -7204395 -176506
5805 -176506 1627605 -635949 -2148805 -168042 4067815 8551099 12350045 14099547
5797 14099547 12329690 8571981 6836624 8085101 8209970 4110071 -780260 -583064
5789 -583064 4661188 8543340 6592762 2023720 1672781 7803580 15693499 19078458 16592729
5780 16592729 12077582 9401954 8902765 9404280 11145969 14089170 15095360 10975479
5772A0975479o700388k889817K072056N47235n209122m958839M340399J2803221
5764A0980224J0777754J738337l414904j091501K133685J5185n714619r040261
5756F383900p123069k342084J205650J738393O58159j0791k45964j053370j712787
5747b501963n64029J413293J166617j229775j669377J614440M620067L697150
5739F546423J352267J471884J953875j880660q084536r024351k183950N852755
5731c996293Q049235M697207L98007k238026k976190j812862O6114j69904l184839
5722a167551n281752l157206R87532K411515M90142j189606o89593L2456r10684
5713h474747k334293k169867m84708J084725J678275J807009K111474K262197
$$ plain form
5772 10975479 4275091 1385274 3457330 4004565 -1204557 -6163396 -1822997 10980224
5764 10980224 21757978 23496315 20081411 18989910 21123595 21138780 15424161 6383900
5756 6383900 -739169 -3081253 -1875603 -137210 520949 510158 264194 -789176 -2501963
5747 -2501963 -3065992 -1652699 -486082 -1715857 -3385234 -1770794 2849273 6546423
5739 6546423 7898690 9370574 11324449 9443789 1359253 -7665098 -9849048 -3996293
5731 -3996293 4052942 8750149 9148156 6910130 3933940 2121078 2187192 2017288 -1167551
5722 -1167551 -6449303 -9606509 -8618977 -6207462 -5717320 -6906926 -7596519 -7564063 -8474747
5713 -8474747 -10809040 -12978907 -13463615 -12378890 -10700615 -8893606 -6782132 -4519935
5705d519935J223383j184239l077614j981495J853545M930269M594354K412286
5697D250554J644598K363988J567762k011272n670095o004728k806203R11696
5689e753700J767044j041856m523415m286872J15536L215857j15556o871672q268705
5680b5763339r48981Q027953R763915L991599k174123l710016k115813j167696
5672a4096501j828005k133530j54328L720036O776552O429421L021786p09986
5664A025445l088909m541027m917290k907679N00019J670273k8766j20810L751355
5655h657389O604876L470122j680858j442077K980792L600526j189837m432830
5647g46675k773189j391550l548987m288248J62012M608595L111973j432146k898002
$$ plain form
5705 -4519935 -3296552 -4480791 -7558405 -9539900 -7686355 -2756086 1838268 4250554
5697 4250554 5895152 8259140 9826902 7815630 2145535 -3859193 -6665396 -5753700
5689 -5753700 -3986656 -5028512 -9551927 -13838799 -13723263 -10507406 -10622962 -17494634 -25763339
5680 -25763339 -26712320 -18684367 -8920452 -4928853 -7102976 -10812992 -12928805 -14096501
5672 -14096501 -15924506 -18058036 -18212364 -14492328 -7715776 -1286355 1735431 1025445
5664 1025445 -2063464 -6604491 -11521781 -14429460 -13929441 -12259168 -12287934 -12408744 -8657389
5655 -8657389 -2052513 1417609 -263249 -1705326 1275466 4875992 3686155 -746675
5647 -746675 -3519864 -4911414 -8460401 -12748649 -12586637 -7978042 -4866069 -6298215 -9196217
5638i196217j593223j065614l36203K683327M354446N88984m353708l340758J864458
5629a0394508L532333P31075n98681Q81832Q59466k73939K845089Q876528R047231
5620A5506426J443085m530535k544576J626316R03075k520208l709005l585225
5612B589353m055092k393274K139288L544417j131155m540436l40095N280752
5604A093758L455742k293722k452862J829738J260493m943389p728934l079673
5596a2858849L635387Q445610J2240877J2506690L936388r540894j4825191o659151
5588c119133M926842Q958736O294350L001022Q9954l420508m818054k517183q89278
5579H506748l542470o652983n104297n91087K229068K941220K894400N24690m322969
$$ plain form
5638 -9196217 -10789440 -11855054 -12191257 -9507930 -5153484 -4564500 -8918208 -12258966 -10394508
5629 -10394508 -6862175 -6131100 -6729781 -5847949 -4988483 -5262422 -2417333 6459195 15506426
5620 15506426 16949511 12418976 9874400 11500716 12403791 9883583 6174578 2589353
5612 2589353 -1465739 -3859013 -1719725 1824692 693537 -3846899 -4186994 1093758
5604 1093758 4549500 2255778 -197084 1632654 2893147 -2050242 -9779176 -12858849
5596 -12858849 -9223462 -777852 11463025 23969715 27906103 18365209 3540018 -3119133
5588 -3119133 1807709 10766445 17060795 20061817 20151771 16731263 11913209 9396026 8506748
5579 8506748 4964278 -1688705 -6793002 -7384089 -5155021 -2213801 680599 1205289 -3117680
5570c117680o191779j479865L989349K773514k212733k191395L247983N790652
5562F08046K065524j421518R73642N817434O394643J581370m149454o310868m083378
5553A475441q21038j364290o354205r902197o303274J970918P315958P112252
5545f870435N437416M805921K507308k992882p674029p333696l531137r39002
5537a6590536j318834k669693k399329M66535M462889O113323L421392n49190
5529i063443o84930K824714M077152J55027l991956k612741K375230M398764J723012
5520g99171r29284p9577J632792q4140m729402p487985n149387N00924N218984
5511a1906246O522196M538321K16069m969102p731535m468477M074549J1523079
$$ plain form
5570 -3117680 -9309459 -10789324 -6799975 -4026461 -6239194 -8430589 -5182606 608046
5562 608046 2673570 1252052 2225694 8043128 14437771 16019141 11869687 5558819 1475441
5553 1475441 654403 -709887 -7064092 -16966289 -23269563 -21298645 -13982687 -6870435
5545 -6870435 -1433019 3372902 5880210 2887328 -4786701 -12120397 -15651534 -16590536
5537 -16590536 -17909370 -20579063 -22978392 -22511857 -18048968 -11935645 -8514253 -9063443
5529 -9063443 -9748373 -6923659 -2846507 -2691480 -6683436 -9296177 -6920947 -2522183 -799171
5520 -799171 -1728455 -1808032 -175240 -259380 -4988782 -12476767 -17626154 -17125230 -11906246
5511 -11906246 -5384050 -845729 -629660 -5598762 -13330297 -17798774 -13724225 -2201146
5503b201146J1705580N024382k731256o764058o375230l094339J097557L809984
5495D71474L378133O87624j672762k039670k76139L071075O227062O296224K772095
5486A8915116l19276Q40201M028480L790786o70080m852760n898586n158690l478568
5477G196623L73813M839408M805900r92674o378086n410049j12877L374867L164555
5468A0861480J657014k82068l865875p740300p731204k489446L687523N258560
5460f44316J228632m325870o561420m020895R77371N115420O441652M404923k78974
5451B336523m571474m360947M96251M353926K517025k075728l405365j643530
5443f353319j541804k625911O65461P706162R575493K314384n932914o864242
$$ plain form
5503 -2201146 9504434 14528816 11797560 5033502 -1341728 -4436067 -3338510 471474
5495 471474 3849607 4537231 2864469 824799 548660 3619735 9846797 16143021 18915116
5486 18915116 18595840 19436041 23464521 27255307 26585227 21732467 15833881 10675191 7196623
5477 7196623 7570436 12409844 17215744 16223070 9844984 4434935 4322058 7696925 10861480
5468 10861480 12518494 12236426 8370551 630251 -7100953 -9590399 -5902876 -644316
5460 -644316 584316 -3741554 -10302974 -14323869 -13346498 -8231078 -1789426 2615497 2336523
5451 2336523 -2234951 -6595898 -6099647 -1745721 771304 -1304424 -4709789 -6353319
5443 -6353319 -7895123 -10521034 -9855573 -2149411 7426082 9740466 3807552 -3056690
5435c056690l675530l361332m020246M86617P544531Q320947J993279k782713
5427A448863j282524J724755J754366J235879K868008L843193J438876j415949
5419A1615467j275590m32954k667411n882414m684661R32909M603444J731395
5411C940185n002731r332179q147599l305172J584141M403836N110934M871713
5403e876872N204201O658080P413301M724588o41684l515736j022291J969220
5395A4912807o54236n643293m018376L712778N526267m178057j3962922j0977441
5387a5282473M44455O556696M905255M272624O778990M758845l102035o677280
5379B655077m85439O984284O756592K232402P85512J003773k447763p355060p176176
$$ plain form
5435 -3056690 -6732220 -10093552 -14113798 -13627181 -6082650 2238297 4231576 1448863
5427 1448863 166339 1891094 3645460 4881339 7749347 11592540 13031416 11615467
5419 11615467 10339877 9906923 7239512 1357098 -3327563 -2394654 2208790 3940185
5411 3940185 -1062546 -10394725 -18542324 -21847496 -20263355 -15859519 -10748585 -5876872
5403 -5876872 -672671 5985409 13398710 18123298 17481614 13965878 12943587 14912807
5395 14912807 14258571 8615278 4596902 8309680 13835947 9657890 -4305032 -15282473
5387 -15282473 -14838018 -8281322 -3376067 896557 7675547 12434392 9332357 2655077
5379 2655077 2169638 9153922 15910514 18142916 18928428 19932201 17484438 10129378 2953202
5370B953202k427850N8572k045045l843426j078509M919300J0119028J1508098
5362B0163370Q368969K914219j367480l899857o911225r427576o318030K865752
5354F388142R465217O164316k242018n458090k081431J96610k777740o610447
5346C044559o375149k985918r9649M17321j360715m073260n163610l090203Q32924
5337a8853700M845874Q818074J1295717Q407063K78615n722620m395598j153033
5329C520392l216316o507749j824884Q239973J0980586K814464n734205p162510
5321A109751o469862q243289o727695K565256J1564622J0692996M002758K165276
5313A0659813N392546M803703j808113o718296m713639N28357L564804L204832
$$ plain form
5370 2953202 525352 583924 -1461121 -5304547 -6383056 -1463756 8655272 20163370
5362 20163370 28532339 31446558 30079078 26179221 19267996 9840420 3522390 6388142
5354 6388142 15853359 22017675 19775657 14317567 12236136 12432746 9655006 3044559
5346 3044559 -3330590 -6316508 -6416157 -5998836 -7359551 -11432811 -16596421 -19686624 -18853700
5337 -18853700 -14007826 -5189752 6105965 14513028 14791643 9069023 4673425 3520392
5329 3520392 304076 -6203673 -8028557 211416 11192002 14006466 8272261 1109751
5321 1109751 -5360111 -13603400 -20331095 -17765839 -6201217 4491779 8494537 10659813
5313 10659813 16052359 20856062 19047949 12329653 7616014 8144371 11709175 14914007
5305A4914007L72697l557568n358826k560589K022576L505202K127996J436674
5297A2902169M97865m359026j0191967r026000r91919L261674k257815r479997
5289a9645016q203696n77909L998220L386899L243680N470658N201294l4222n512199
5280a2672291o046634k363915J758900M815243P271614Q586484P385433L742291
5272A2477125l64524k674169k411887r53466m08844p88258M03532M243144P334530
5263A6857183N277047j289335o849554p294301l512126J318902N079080O708664
5255A6295560N743805L139087N15168k075096n329573p456258n338962k32333
5247E261398J642003l086434r632173j0732279n144490K682989Q826243J1843879
$$ plain form
5305 14914007 15286704 11729136 6370310 3809721 5832297 9337499 11465495 12902169
5297 12902169 13400034 9041008 -1150959 -10176959 -11168878 -7907204 -10165019 -19645016
5289 -19645016 -27848712 -28426621 -24428401 -21041502 -17797822 -12327164 -7125870 -7160092 -12672291
5280 -12672291 -18718925 -21082840 -19323940 -14508697 -7237083 1349401 8734834 12477125
5272 12477125 12112601 9438432 7026545 6073079 5664235 4875977 5279509 9522653 16857183
5263 16857183 22134230 20844895 13995341 6701040 3188914 4507816 9586896 16295560
5255 16295560 22039365 25178452 25693620 23618524 18288951 10832693 5493731 5261398
5247 5261398 6903401 3816967 -5815206 -16547485 -21691975 -19008986 -10182743 1661136
5239A661136J0732077N779367O28898j018024m89925j876020n161323o206868
5231D049318l533523k13005J501598K323694J925667j335286m891759k720479
5223b893775M807916Q281069J987170o236605n279217K997681O671492J576984
5215A1912715l319551l08493N777352N524453j550838p520013p346116l878840
5207g09331j700689n50794K985982Q987329J1971899O714163m003104j0093117
5199A3602338n105263N066831Q293043J065618p134185o161827K097882P001782
5191A8726219K773771n510795r339268o399657j418869L49912j620398l967500
5183f406585l941285k096299o38345k22375M64671K239063L980567M141947K691720
$$ plain form
5239 1661136 12393213 18172580 18801478 17783454 17293529 15417509 10256186 4049318
5231 4049318 515795 302790 1804388 4128082 6053749 4718463 -173296 -2893775
5223 -2893775 1914141 10195210 12182380 5945775 666558 3664239 10335731 11912715
5215 11912715 8593164 8284671 14062023 19586476 18035638 10515625 3169509 -709331
5207 -709331 -2410020 -2960814 25168 9012497 20984396 27698559 23695455 13602338
5199 13602338 8497075 13563906 21856949 22922567 15788382 9626555 11724437 18726219
5191 18726219 21499990 15989195 6649927 250270 -1168599 -818687 -2439085 -6406585
5183 -6406585 -10347870 -12444169 -13082514 -13304889 -12840218 -10601155 -6620588 -2478641 213079
5174B13079R11664j19324l41096l92734p04557p68428K28867J603635J099752
5165A730858k052304n074659m744193j790709M96495J545991L702965O665744
5157D80188O189157P46798m482520m284539j324493k308153p267227q384235r97428
5148b1632452Q929681J1712035N723156j473143k894136N75742L361502K616647
5140F919032K00288j275957j506832j317260p81650J45039O32867K59148K34074
5131C508749J463665K194515L0931l803980m926812j331350L889873O611207O272669
5122A3909467M710538K551339m94080k971059k608119r2260R19431j374712m261304
5113A0289241m191290j399287J243864K865186N151732Q031092Q029637L219366
$$ plain form
5174 213079 1124743 1005419 664323 271589 -432968 -1201396 -972529 631106 1730858
5165 1730858 -321446 -5396105 -10140298 -11931007 -11434512 -9888521 -6185556 480188
5157 480188 6669345 7416143 2933623 -1350916 -2675409 -4983562 -12250789 -20635024 -21632452
5148 -21632452 -12702771 -990736 4732420 3259277 365141 940883 4302385 6919032
5140 6919032 7119320 5843363 4336531 3019271 2237621 2382660 3015527 3274675 3508749
5131 3508749 4972414 7166929 7197860 3393880 -1532932 -2864282 1025591 7636798 13909467
5122 13909467 18620005 21171344 20677264 17706205 15098086 15005826 15925257 14550545 10289241
5113 10289241 6097951 4698664 5942528 8807714 13959446 21990538 30020175 33239541
5105C3239541k368034k895324J162396L064134q67982n932158n965438k366232
5097A7070903j678797n668822r042562p602431l826728k117121k242532q09226
5089a5917316K873868N800013N493986K669476k55563j422973l18558K033084
5081I56017L301222J635688j954368l799445j420397K672760K547704m132816
5073a93635j1467242j0643863p36316R012759R948285M031004m50930n08233l55991
5064a364162k612404l926038j128742L278074M641404J863355k657137n869837
5056g775487n130898K08732O179200O610289P67501m599222l599730J538217M669024
5047a132374M097894K874900L011152L493231K851866M04077l931274q289856
$$ plain form
5105 33239541 30871507 27976183 29138579 32202713 31334731 25402573 19437135 17070903
5097 17070903 15392106 9723284 680722 -6921709 -10748437 -12865558 -15108090 -15917316
5089 -15917316 -13043448 -7243435 -1749449 920027 664464 -758509 -1077067 956017
5081 956017 4257239 5892927 3938559 139114 -1281283 1391477 3939181 -193635
5073 -193635 -11660877 -22304740 -23041056 -14028297 -4080012 -49008 -499938 -1008171 -1364162
5064 -1364162 -3976566 -7902604 -9031346 -5753272 -1111868 751487 -1905650 -7775487
5056 -7775487 -12906385 -12697653 -6518453 91836 859337 -3739885 -7339615 -5801398 -1132374
5047 -1132374 2965520 5840420 8851572 12344803 15196669 15600746 11669472 3379616
5039C379616q914683m572952N03604J146116k365892n048242l182548K577412
5031a6477569Q432810R917390N512194l60679j253724K283771K363252m070859
5023F346586q700952l747780M971450N754371j586870o290549l573561j40953
5015f968258j265615k958428j109044Q22032p86818j922184K427673Q864387R845504
5006F949249M338459j948813m981257n511767m917095k860648P71071M750597
4998c410204P354201O910610L090098r84999p49043L475886N401870J097561m896551
4989A7289429n737356j592083K005533K697397K517082J865482j423860o476305
4981A1145319q551280n618481j207163J285767K847289M766808M351979j055881
$$ plain form
5039 3379616 -5535067 -10108019 -9604415 -8458299 -10824191 -15872433 -19054981 -16477569
5031 -16477569 -8044759 1872631 7384825 7024146 5770422 8054193 10417445 6346586
5023 6346586 -2354366 -6102146 -1130696 4623675 3036805 -3253744 -6827305 -6968258
5015 -6968258 -8233873 -11192301 -12301345 -11479313 -12266131 -14188315 -11760642 -2896255 6949249
5006 6949249 11287708 9338895 4357638 -1154129 -6071224 -8931872 -8160801 -3410204
4998 -3410204 3943997 10854607 13944705 12959706 12210663 15686549 21088419 22185980 17289429
4989 17289429 11552073 9959990 11965523 14662920 17180002 19045484 17621624 11145319
4981 11145319 2594039 -3024442 -4231605 -2945838 -98549 4668259 9020238 7964357
4973G964357p943496r064928k145572O953768J0565240O828633L42013l351582
4965A0148433l025781k016158l571814o126917m460607L195012J0653597R505284
4957A4301049l50939r303537r017960j864809L577679L721050J979134R81225
4949D022892r76266m259065m564992P46884O846158O764830O95283m417429l823335
4940A034960K79283K832893J588148j706319l581899k091075R44193J658408o98249
4931B60343k140608M66117M306676M155760n37171n474502p349354o447778m136122
4922a6896639j186312J447806K847343L054839K181026j23392k656868k556397
4914a3888594M09631K425449J543861J355796M588979P060154L793509k143010
$$ plain form
4973 7964357 20861 -9044067 -11189639 -4235871 6329369 13158002 13500015 10148433
4965 10148433 7122652 5106494 1534680 -4592237 -9052844 -5857832 4795765 14301049
4957 14301049 13950110 4646573 -4371387 -6236196 -2658517 1062533 3041667 4022892
4949 4022892 3046626 -1212439 -5777431 -5030547 1815611 8580441 9275724 4858295 1034960
4940 1034960 1314243 4147136 5735284 4028965 447066 -1644009 -699816 958592 260343
4931 260343 -1880265 -1414148 2892528 7048288 6511117 1036615 -6312739 -12760517 -16896639
4922 -16896639 -18082951 -16635145 -13787802 -10732963 -8551937 -8675329 -11332197 -13888594
4914 -13888594 -13478963 -11053514 -9509653 -8153857 -3564878 3495276 7288785 5145775
4906E145775l664970k53707K349207J320347j078601k802890k773575J486675
4898b71739R540950J3756611P764948k882584p464186n174172l471140l939120
4890G859568j785728K082179J731958j326583P8660M706018N236280M121829R820136
4881C2524317J7072746J1648339k870093o786824K235493M942644j451733N616229
4873F2931118K6626916K0315733l4892781q9587045p9114761j4399244L1733052
4866g6387012K3767490r78959j656766J1468522J1816529L964872N935003J2428909
4858i641412P303994m990792q428961l577461k236469l676027R12639P732867
4850a6601622N916400j393083j755214M293086M907883j180712l126256J711779
$$ plain form
4906 5145775 1480805 1227098 3576305 4896652 3818051 1015161 -1758414 -271739
4898 -271739 9269211 23025822 30790770 27908186 20444000 15269828 11798688 7859568
4890 7859568 6073840 8156019 9887977 8561394 8640054 13346072 18582352 22704181 32524317
4881 32524317 49597063 61245402 58375309 51588485 53823978 58766622 57314889 62931118
4873 62931118 89558034 109873767 74980986 -14606059 -93720820 -108120064 -76387012
4866 -76387012 -52619522 -53598481 -55255247 -43786725 -31970196 -28005324 -22070321 -9641412
4858 -9641412 -2337418 -7328210 -15757171 -19334632 -21571101 -25247128 -24334489 -16601622
4850 -16601622 -10685222 -12078305 -13833519 -9540433 -4632550 -5813262 -8939518 -7227739
4842g227739L532358j705767n725176l252469J4617n25918m15999M082435Q052283
4833c171375N837276l61031n036042o814452o951892n175114j191266K831188
4825b0032708M457114L831158K889210L225362M789661N223309J767743m246729
4817A904120p152367l913222J416414L434143K346420J362815Q89884J70555J073836
4808A532598M616622O913564M493097N97775J07707J427398O1683l045551m158262
4799A2546631m575633p543233j0032285o746790n09622J047224j769983j420522
4791a9004213L346193N247211J386994j812025L57680M129718N177033M903195
4783C731786M853374K611074k310183n312927l810484j517592k003226l826512
$$ plain form
4842 -7227739 -3695381 -5401148 -11126324 -14378793 -14364176 -14890094 -15306093 -11223658 -3171375
4833 -3171375 2665901 2304870 -2731172 -9545624 -16497516 -21672630 -22863896 -20032708
4825 -20032708 -15575594 -11744436 -8855226 -5629864 -840203 4383106 6150849 1904120
4817 1904120 -5248247 -9161469 -7745055 -4310912 -1964492 -601677 288207 458762 1532598
4808 1532598 6149220 13062784 17555881 18153656 18261363 19688761 19750444 16704893 12546631
4799 12546631 7970998 427765 -9604520 -16351310 -16860932 -15813708 -17583691 -19004213
4791 -19004213 -15658020 -10410809 -9023815 -10835840 -10478160 -6348442 -1171409 3731786
4783 3731786 8585160 11196234 8886051 3573124 -237360 -1754952 -3758178 -7584690
4775g584690n143789o746406p521487m004072K128070L847894K58089J0879P701900
4766a7053612J5047045J2740940L801509k901851n794425q270285q965901m611259
4758a6007839J176600K198859M08852K448475P143916O780720N79141l466857
4750A261867j594473O15522j189181l414389k287606m74994j078124j556664J045252
4741h672790M147139M353286L621288M967128N708342J401964n672339q490301
4733A363717n256038j545046j759630l561967k720983M91547K542548J899599
4725h546253K21476p33413r94279j063098l88092J790294M355997M245784k27699
4716a339283n948862o793456m62307P705578J0128628N694732K27570j852576
$$ plain form
4775 -7584690 -12728479 -19474885 -26996372 -31000444 -28872374 -25024480 -24766391 -24755512 -17053612
4766 -17053612 -2006567 10734373 14535882 11634031 5839606 -2430679 -11396580 -16007839
4758 -16007839 -14831239 -12632380 -12223528 -9775053 -2631137 4149583 4728724 1261867
4750 1261867 -332606 282916 -906265 -4320654 -6608260 -7083254 -8161378 -9718042 -8672790
4741 -8672790 -4525651 -172365 3448923 8416051 14124393 15526357 9854018 1363717
4733 1363717 -3892321 -5437367 -7196997 -10758964 -13479947 -12988400 -10445852 -8546253
4725 -8546253 -8324777 -9058190 -10052469 -11115567 -11503659 -9713365 -5357368 -1111584 -1339283
4716 -1339283 -7288145 -14081601 -14543908 -6838330 3290298 8985030 9212600 7360024
4708G360024k483808m660415o063871k404950M681806Q314101N420497O12831
4700A0776215o68406R26542J152475j326232m067175m835759l680744j971104
4692c694188j354402k560072l693662j549800L492689O209005K858768l372998
4684c664660o412666m707102j041734K754825O217322P032584L026972l075761
4676A29780o294544o561922p399818p535374j383288J0018263J6315199J0752477
4668H040773k53735n949287m776699k971872l552490l872698k371511q80071j35573
4659a6723163J511003M207199N609625M327298J098700l173051p154826p625988
4651a7923203k506758M785186Q206887O550614M005971L162608K117187n57964
$$ plain form
4708 7360024 4876216 215801 -5848070 -8253020 -3571214 4742887 10163384 10776215
4700 10776215 10107809 11034351 12186826 10860594 6793419 1957660 -1723084 -3694188
4692 -3694188 -5048590 -7608662 -11302324 -12852124 -9359435 -3150430 -291662 -3664660
4684 -3664660 -10077326 -14784428 -15826162 -13071337 -6854015 178569 3205541 129780
4676 129780 -6164764 -12726686 -20126504 -27661878 -29045166 -19026903 -2711704 8040773
4668 8040773 7787038 1837751 -2938948 -5910820 -9463310 -13336008 -15707519 -16587590 -16723163
4659 -16723163 -15212160 -11004961 -5395336 -1068038 30662 -3142389 -10297215 -17923203
4651 -17923203 -20429961 -15644775 -7437888 -887274 3118697 6281305 8398492 7840528
4643G840528k805257l013964k791616l438101l310744j281012N26155K91609k27517
4634h209919Q85835J742957l08519l709380m458776j525739K851040O898480R694908
4625C860887R042718L487900l438634n465417j477722K453523J008322l303674
4617F167903l784218J369122O646580N962784k49044n732087n586646j588694
4609C205700M50375j983073n322284m976074p38577M573536R227284J2062958
4601A6499845J0186355K232320o669266q827967l982570r6672k286458o249706
4593H05881n610831o16326M393319P289501P216612K188374o349698j0763711
4585a446879o184118J109932K132475r49946J086426Q283901J0704577M914527
$$ plain form
4643 7840528 5035271 2021307 -770309 -4208410 -7519154 -8800166 -8274011 -7982402 -8209919
4634 -8209919 -7324084 -5581127 -5889646 -9599026 -14057802 -15583541 -12732501 -5834021 3860887
4625 3860887 12903605 16391505 12952871 7487454 6009732 8463255 9471577 6167903
4617 6167903 2383685 3752807 10399387 16362171 16113127 10381040 4794394 3205700
4609 3205700 3656075 1673002 -3649282 -8625356 -9363933 -4790397 4436887 16499845
4601 16499845 26686200 28918520 22249254 13421287 9438717 9342045 7055587 805881
4593 805881 -4804950 -5421276 -1027957 6261544 13478156 15666530 9316832 -1446879
4585 -1446879 -7630997 -6521065 -4388590 -5338536 -4252110 4031791 14736368 19650895
4577A9650895m51900O08396K318231j287007n722772n070142k996403n095132
4569A954166p122101j949067O412131P599271J548097j510858K062549L858093
4561A2852281k224025r859771r587339j536870O181478P504304K864080l128709
4553C065429n293602j616161M401467P038907M930930K014879J691069L113627
4545A9346545L637498J701574l039422r022059j1895021q027176L42010O633851
4537c22200P082245L502594p18262l871068n440700n995745p218994q748028o487741
4528b8217899J576774R760734J0499539M382844j685063m614960o062582m901736
4520a9262349J742063R738060J0445609L976002m1033K272787L682149o4260k267120
$$ plain form
4577 19650895 19198995 19807391 22125622 20838615 15115843 10045701 7049298 1954166
4569 1954166 -5167935 -7117002 -704871 6894400 8442497 6931639 8994188 12852281
4561 12852281 10628256 768485 -8818854 -10355724 -4174246 3330058 6194138 3065429
4553 3065429 -2228173 -3844334 557133 7596040 12526970 14541849 16232918 19346545
4545 19346545 22984043 24685617 21646195 12624136 729115 -7298061 -6956051 -322200
4537 -322200 6760045 10262639 9544377 5673309 232609 -5763136 -12982130 -21730158 -28217899
4528 -28217899 -26641125 -16880391 -6380852 -1998008 -3683071 -8298031 -14360613 -19262349
4520 -19262349 -17520286 -7782226 2663383 6639385 6598352 8871139 12553288 12489028 10221908
4511A0221908J704991M329750j540062q957424o997677J684242N240879Q16307
4503F502914l133667j163882K869509L942903J740721k175763o088988o770487
4495d276740k508085K705425L534307R84207K33961K241484L540890L006421K418929
4486A1880799J458378j270299l205493p09993L652239L766719l90230k934192
4478A2247928j829528q09061j026108Q85836M464323L449765m040808j0441392
4470B900955q726301k101407J348100l60304k605584k010954J36657J431645J522169
4461h465024J342109J175141K72681j673989k868982o17849M594530P939894N444038
4452G142549r80034o095926p366891n747898k613442M14267N75195k504605l787983
$$ plain form
4511 10221908 11926899 16256649 14716587 5759163 -1238514 445728 5686607 6502914
4503 6502914 3369247 2205365 5074874 9017777 10758498 8582735 2493747 -4276740
4495 -4276740 -6784825 -4079400 -545093 439114 673075 2914559 6455449 9461870 11880799
4486 11880799 13339177 12068878 8863385 8153392 11805631 15572350 15182120 12247928
4478 12247928 10418400 9609339 8583231 9469067 13933390 17383155 13342347 2900955
4470 2900955 -5825346 -7926753 -6578653 -6938957 -9544541 -11555495 -11418838 -9987193 -8465024
4461 -8465024 -7122915 -5947774 -5675093 -7349082 -10218064 -10835913 -6241383 1698511 7142549
4452 7142549 6162515 66589 -7300302 -13048200 -15661642 -15247375 -14672180 -17176785 -20964768
4443b0964768J601194J0365514J3680545Q008041j281921p240469p765317m356910
4435g954091Q62077N431758P113311N500804J775609k140070k827634K665644
4427A0427408J0572027J0575139j508314j4761188j4963280l487571M503704N82301
4419A940226p486543q722597k823232K824749L720996J486648J45380J932987
4411f981386M752947L873433j242460m271105p85260L987789L203628K42188K655776
4402E435550P341839M413780m769611p697672j073026L560495n83127m880445
4394A747783j768526K110160m15390k681589L504689J1015535P593503l542912
4386A7563253q359713l992433j479478o748966j2047968q987643L4812P142787
$$ plain form
4443 -20964768 -19363574 -8998060 4682485 12690526 11408605 4168136 -3597181 -7954091
4435 -7954091 -7092014 -1660256 5453055 10953859 12729468 10589398 7761764 10427408
4427 10427408 20999435 31574574 30066260 15305072 341792 -3145779 1357925 1940226
4419 1940226 -5546317 -14268914 -17092146 -14267397 -10546401 -9059753 -8914373 -6981386
4411 -6981386 -2228439 1644994 402534 -3868571 -4653831 -666042 2537586 2779774 5435550
4402 5435550 12777389 17191169 12421558 4723886 3650860 7211355 6628228 1747783
4394 1747783 -20743 2089417 1674027 -1007562 2497127 13512662 21106165 17563253
4386 17563253 9203540 5211107 3731629 -3017337 -15065305 -24052948 -24018136 -16875349
4378a6875349Q549923N506043O42279l901668p237189r330114q747697l326737
4370c4720509M607798P947352M006113k62248K275333Q337986R559322M802606
4362F553753j29150k269785l197395k854861L35443L821638K753752k452398o583550
4353d022553p187816n618496j634191N944861J3333439J3709603O205368k705453
4345A8024762p401326p468853m188630J116478M798382L145820j856807m283668
4337A886158k592838j043909k162872l219420j478747J775922L703265K560949
4329e71492k185699q268916r788951l112114O712175J0776288P314896K446384
4321C322571O62178J103598K924573O605208Q905746M534057m678433r706699
$$ plain form
4378 -16875349 -8325426 -2819383 -2177104 -6078772 -13315961 -22646075 -31393772 -34720509
4370 -34720509 -30112711 -22165359 -18159246 -18421494 -16146161 -7808175 1751147 6553753
4362 6553753 6424603 4154818 957423 -1897438 -1561995 2259643 5013395 2560997 -4022553
4353 -4022553 -11210369 -16828865 -18463056 -12518195 815244 14524847 20730215 18024762
4345 18024762 10623436 3154583 -1034047 82431 4880813 8026633 6169826 1886158
4337 1886158 -706680 -1750589 -3913461 -7132881 -8611628 -6835706 -3132441 -571492
4329 -571492 -2757191 -11026107 -20815058 -23927172 -17214997 -6438709 876187 3322571
4321 3322571 3984749 5088347 8012920 14618128 23523874 28057931 23379498 13672799
4313A3672799o636388k007206k086374l844928j801465K322422L260112J120639
4305C999611q0577n9369j838019m797486m216832J461029P197425O879992K75693
4296H821467o609029p558727k561112J915451J86533n443274p217206k044060
4288b0509957M300931M979191R43199j380263O01813K924374J927060j29062J042302
4279e300412M346216L925875k018052o953503m052153L805783P073392K217037
4271C044183m192798n314829k161465R78942L530818O336178P047610L716280
4263A2984919j38909p120K250510J295434l107810o188981n732467l895756k095967
4254d636147M94119L391264M522664L706838K694952K185242J929959K293190
$$ plain form
4313 13672799 7036411 5029205 2942831 -902097 -2703562 -381140 2878972 3999611
4305 3999611 3919034 3859665 2021646 -2775840 -6992672 -5531643 1665782 8545774 8821467
4296 8821467 2212438 -5346289 -7907401 -5991950 -5805417 -11248691 -18465897 -20509957
4288 -20509957 -16209026 -11229835 -10286636 -11666899 -11065086 -8140712 -6213652 -6342714 -5300412
4279 -5300412 -954196 2971679 953627 -5999876 -10052029 -6246246 827146 3044183
4271 3044183 -1148615 -6463444 -8624909 -7645967 -4115149 2221029 9268639 12984919
4263 12984919 12846010 12838890 15089400 16384834 13277024 7088043 1355576 -2540180 -4636147
4254 -4636147 -4142028 -750764 3771900 7478738 10173690 12358932 14288891 16582081
4246A6582081K524094J40016m176545m735700J059191O746394N201306r23286
4238B2417551m424508n186535p667171j0036701o363123J689202N942709M440146
4230H11570K978997L697924K563442r24039k293425j915479n157288j0425353
4222a0663651q739324J012676Q092242O297537K830227M267613N104250p74920
4214G426650p094188m649520L217738N956471K227047K8894K547280M193070J219388
4205A5072830k280335j521334J651008K053169j105331l228331j083367K009581
4197A1567890M38572m942459o926773k461489K608077L102099K300938L841853
4189I528708K756429n839070j4813027j3558701m567995J074111J510372L554851
$$ plain form
4246 16582081 19106175 19246191 15069646 10333946 11393137 18139531 23340837 22417551
4238 22417551 17993043 12806508 5139337 -4897364 -11260487 -9571285 -3628576 811570
4230 811570 3790567 7488491 10051933 9127894 6834469 4918990 -238298 -10663651
4222 -10663651 -19402975 -18390299 -10298057 -4000520 -1170293 3097320 8201570 7426650
4214 7426650 332462 -4317058 -1099320 4857151 7084198 7113092 9660372 13853442 15072830
4205 15072830 12792495 11271161 12922169 14975338 13870007 10641676 9558309 11567890
4197 11567890 12006462 7064003 137230 -2324259 283818 3385917 5686855 9528708
4189 9528708 12285137 6446067 -8366960 -21925661 -26493656 -25419545 -23909173 -20354322
4181b0354322O876357M538220j301339q60529N053109N151773j966693m908708
4173g772132P056L073671j24137k417480j491185l634145p015247j977501P617313
4164a3733787O630541k696981j094126J1843872J3075753k068223q335584L906807
4156G528272J0141922l01825r49680J7876048K1024386j500057J0749437R4665273
4148A59233776J65241523J04656601o0977359j71413665j35816493l6773821M690644
4141B8841206j5864624k5642225k969156J2422978M147493j703018N814973O552965
4133A1600592o187253j2482849l449240N409175M810080M262762Q189140O957577
4125A9109984k148719q506896p833298p622025r432316n616904L075675N753096
$$ plain form
4181 -20354322 -13477965 -8939745 -10241084 -11101613 -6048504 -896731 -2863424 -7772132
4173 -7772132 -7765076 -4691405 -4815542 -7233022 -8724207 -12358352 -19373599 -21351100 -13733787
4164 -13733787 -7103246 -9800227 -10894353 949519 14025272 11957049 3621465 7528272
4156 7528272 17670194 17368369 16418689 34294737 55319123 53819066 64568503 159233776
4148 159233776 324475299 429131900 368154541 196740876 60924383 24150562 28841206
4141 28841206 12976582 -12665643 -15634799 -3211821 935672 -767346 5047627 11600592
4133 11600592 5413339 -7069510 -10518750 -5109575 -299495 3963267 12152407 19109984
4125 19109984 16961265 8454369 621071 -7000954 -16433270 -22050174 -18974499 -13221403
4117a3221403O45707j743699K199759M166788R50009m92570J863314J514804j878111
4108e995402o93982M450488L617424l331403m111030L862617O592979l050062
4100A341629j1843913o938184M336865P562685K514859j228980j001511j063632
4092f320182k246449k424762k568992l377777p44956P024960J2427250P966011
4084I735103j792089n965186k222839K204479K224222k03554j863942k147855
4076c1661j180567O34448J411284K14276m02616J733061L750648J597973k941073
4067D785773m311931j578636O23405k27806j209291K77716K246225K265886J928493
4058D799834L426867M357089P86036n180219o240859j48904N597758L379303l613981
$$ plain form
4117 -13221403 -12575696 -14319395 -12119636 -7952848 -7002839 -7495409 -5632095 -4117291 -5995402
4108 -5995402 -6689384 -2238896 1378528 -1952875 -6063905 -2201288 4391691 1341629
4100 1341629 -10502284 -17440468 -13103603 -5540918 -3026059 -4255039 -5256550 -6320182
4092 -6320182 -8566631 -10991393 -13560385 -16938162 -17683118 -10658158 1769092 9735103
4084 9735103 7943014 1977828 -245011 1959468 4183690 3980136 2116194 -31661
4076 -31661 -1212228 -577780 833504 1047780 645164 2378225 6128873 7726846 4785773
4067 4785773 473842 -1104794 -481389 -709195 -1918486 -1640770 605455 2871341 4799834
4058 4799834 8226701 12583790 13369826 8189607 1948748 1799844 7397602 10776905 7162924
4049G162924n955210j897889P62870k146903m365879j21018N285185L392399l414424
4040a297945m826765J883092Q028614O165676r65631o467841p847207o318716
4032a1646723k827707J165877K505134m4288l003987k104793K344783O209018
4024g402686O333982K826893k081546n541244n326637j404950L624605O370841
4016b600742N181984J289780k048702k111353P69571L649414M249402K699566
4008A1078920j40748l791898o613418o091773k711361n96048j479422j015503
4000a1361251N023372J3235513J5852452J0263684J073992o352766j0241884j1076213
3992F416899j0170142r472886r384453p268303j270018N500342Q018224N311517
$$ plain form
4049 7162924 1207714 -690175 72695 -2074208 -6440087 -6561105 -1275920 2116479 -1297945
4040 -1297945 -6124710 -4241618 3786996 9952672 8987041 2519200 -5328007 -11646723
4032 -11646723 -14474430 -13308553 -10803419 -10847707 -13851694 -15956487 -13611704 -7402686
4024 -7402686 -1068704 1758189 -323357 -5864601 -11191238 -12596188 -8971583 -2600742
4016 -2600742 2581242 3871022 1822320 -289033 480538 4129952 8379354 11078920
4008 11078920 10938172 7146274 532856 -5558917 -8270278 -8866326 -10345748 -11361251
4000 -11361251 -6337879 6897634 22750086 33013770 34087762 27734996 17493112 6416899
3992 6416899 -3753243 -13226129 -22610582 -29878885 -31148903 -25648561 -17630337 -12318820
3984a2318820J82804m723161o629742j785505Q879445J5723822R784161m264520
3976D848484j2110201p392437J953119O084083M378923J490795p54137l128959
3968d630330n185883n572179l710397M07760N386418P492046M644657P99706J190616
3959H22414M098694L914839J404782K281878N469941L332532m165188p136080
3951A0023812k414624n24789q068039j4442731p564347N889178R613653J743263
3943e744624m560901k388275J439067J202642J116532N019602Q188255N529256
3935I801554N3664k758563k869716k376499J94978N973782J0123034O899107j456859
3926B3584482o755665n278618j286023j4741j631700l309029l649537k884332
$$ plain form
3984 -12318820 -12136016 -16859177 -23488919 -25274424 -16394979 -671157 9113004 4848484
3976 4848484 -7261717 -14654154 -12701035 -6616952 -2238029 -747234 -1501371 -4630330
3968 -4630330 -9816213 -15388392 -19098789 -18691029 -13304611 -5812565 -1167908 -368202 822414
3959 822414 4921108 8835947 10240729 12522607 17992548 21325080 17159892 10023812
3951 10023812 7609188 7084399 -983640 -15426371 -22990718 -17101540 -7487887 -5744624
3943 -5744624 -10305525 -12693800 -11254733 -10052091 -8935559 -3915957 4272298 9801554
3935 9801554 9855218 7096655 4226939 1850440 2045418 8019200 18142234 25041341 23584482
3926 23584482 16828817 11550199 10264176 10249435 8617735 5308706 1659169 -1225163
3918a225163r92356J821333L748138K893325K33336j026536J57616Q21675j772326
3909D659042n553525o004627k580645N43608P88443O80867L012375N677957M772254
3900E995749Q51877j866390j780470j392674k380485l068936j939428k27032P34933
3891e072856J735527K961912J855555k997166p725510p005086j582071K062064
3883a5767631K66336l290247l170618J084570O077465R279707R451037N107674
3875I038293k893009q644747o214068K247192P788868N060643k291294p429162
3867c337284p511624l908529N26279K527142N57801k385541j904356Q14688L09466
3858a4311958l449554l623943J979329N852156K919541j18366M135049J0103458
$$ plain form
3918 -1225163 -2217519 -396186 3351952 6245277 6478613 5452077 5609693 6431368 4659042
3909 4659042 -894483 -6899110 -9479755 -8936147 -8147704 -7466837 -4454462 1223495 5995749
3900 5995749 6847626 4981236 3200766 1808092 -572393 -3641329 -5580757 -5807789 -5072856
3891 -5072856 -3337329 -375417 1480138 -1517028 -9242538 -16247624 -17829695 -15767631
3883 -15767631 -15501295 -18791542 -21962160 -20877590 -14800125 -5520418 3930619 9038293
3875 9038293 6145284 -2499463 -8713531 -6466339 1322529 6383172 4091878 -3337284
3867 -3337284 -10848908 -14757437 -14231158 -11704016 -11146215 -13531756 -15436112 -14621424 -14311958
3858 -14311958 -17761512 -21385455 -19406126 -13553970 -10634429 -10752795 -6617746 3485712
3850C485712P305611k344654p019716k686683L265962N393829N409660L499274
3842A6308995l263434j1277803j1179526k556316L175459j63876m422422j661408
3834a5040331K893284J332398k649307p21943N321023P043228L610239J684674
3826C473265L063527K551489j917662n740392n376742k797509p82434R14853L323306
3817c288299N941932P397568O067535J060012n045541o811125k582083K184461
3809D924460K038932j095696k199385j345542j654695j834291J971018P779207
3801H584008Q448385J744547o025615p986074l926105J643463M879871M764701
3793A2127181K680810Q64030j18558j690378l764644l399340L11965K915018L00506
$$ plain form
3850 3485712 10791323 8446669 1426953 -1259730 2006232 7400061 12809721 16308995
3842 16308995 13045561 1767758 -9411768 -11968084 -8792625 -8956501 -13378923 -15040331
3834 -15040331 -12147047 -10814649 -13463956 -14185899 -8864876 -1821648 1788591 3473265
3826 3473265 6536792 9088281 7170619 1430227 -3946515 -6744024 -7526458 -6611605 -3288299
3817 -3288299 2653633 10051201 16118736 17178748 12133207 5322082 2739999 4924460
3809 4924460 6963392 5867696 3668311 2322769 668074 -1166217 804801 8584008
3801 8584008 17032393 18776940 12751325 4765251 839146 2482609 7362480 12127181
3793 12127181 14807991 15672021 15553463 13863085 10098441 6699101 7011066 9926084 10226590
3784A0226590m638895n863932k907503n80322j193718k432538k409306j608289
3776a1407913N9479L066601M997660K514022k757559n052055k268360J329508
3768i518617J518846o58706j715648m97122J746912L732391M785575M396197K447753
3759F237581k16321j580507N35090N552475Q571504M908217l256576q655980q369895
3750C725588o600720o415686n085895j052719J427349j9268k16069M712424R203471
3741c21525P242844L475662N249661Q548061L801494p169589j2757792r292025
3733a223209m438788k255313J981819R098909J0976692L723316m716555o429320
3725F717551m024860k880618j312705L896469Q755762P005344j84547o180850
$$ plain form
3784 10226590 5587695 -276237 -3183740 -3764062 -4957780 -7390318 -9799624 -11407913
3776 -11407913 -11348434 -8281833 -3284173 -770151 -3527710 -8579765 -10848125 -9518617
3768 -9518617 -7999771 -8658477 -10374125 -10871247 -9124335 -5391944 -606369 3789828 6237581
3759 6237581 6021260 4440753 4975843 10528318 19099822 24008039 20751463 12095483 3725588
3750 3725588 -2875132 -9290818 -14376713 -15429432 -14002083 -14021351 -14237420 -9524996 -321525
3741 -321525 6921319 10396981 15646642 24194703 27996197 20826608 8068816 -1223209
3733 -1223209 -5661997 -7917310 -5935491 3163418 14140110 17863426 13146871 6717551
3725 6717551 2692691 -187927 -1500632 2395837 11151599 18156943 17972396 11791546
3717A1791546p661543o107564l299236j51409J942837K249926J555682J5710l133648
3708b797699o381651o163201j881198K933582N524474N965156M127737p4605l125536
3699a872941r97653L453611L355859r05265j636550L006913N283273R40075l629043
3690F998279k625987j9687q95132k340717p99267n86837n964562j1210105q441783
3681b5885798o49111K710431j87263k773936j021686K892191N888378O076181
3673a2950613K028753l655425l540941M898318J2531353R458440q80955o986352
3665I02578n381388k025373l16145J835149M015063K986987P04086K516269O328193
3656A1565419L876790m839114q867361k494539N310970M089054k974828n008782
$$ plain form
3717 11791546 4130003 -1977561 -5276797 -5428206 -3485369 -1235443 320239 335949 -2797699
3708 -2797699 -9179350 -15342551 -17223749 -14290167 -8765693 -2800537 1327200 1252595 -1872941
3699 -1872941 -2870594 583017 3938876 3033611 1397061 4403974 9687247 10627322 6998279
3690 6998279 4372292 4352605 3457473 1116756 317489 -269348 -6233910 -17444015 -25885798
3681 -25885798 -26534909 -23824478 -24011741 -26785677 -27807363 -24915172 -19026794 -12950613
3673 -12950613 -10921860 -14577285 -18118226 -13219908 -688555 8769885 7888930 902578
3665 902578 -4478810 -6504183 -6820328 -4985179 -970116 2016871 2720957 5237226 11565419
3656 11565419 15442209 10603095 1735734 -758805 4552165 8641219 5666391 657609
3648F57609K20017M465742K141289k275632j830272K878530M937555P28027n450638
3639F472227p365140m460715o52320K148509M516143M732872K29550n330398m092542
3630c801814L769655P748289J937382n510321m805424R54558K607045n0731p11932
3621B136707P00401m11782j935135K266573R221703Q971595O49020n657618n113376
3612A0828088m294687p789667j0271262p058457k163195L35664L673719J0244193
3604f495604J4164710R749228J253194l184326k401678m70033J144541K869353
3596A6629385K363207k514395q397128r841878o414914k007488Q38274K030925
3588g314012J596306j44625j949968l609938n902693p087043l778788K571660
$$ plain form
3648 657609 877626 5343368 7484657 5209025 3378753 6257283 11194838 11922865 6472227
3639 6472227 -892913 -5353628 -6005948 -3857439 658704 5391576 5621126 290728 -3801814
3630 -3801814 -32159 7716130 9653512 4143191 -662233 292325 2899370 2848639 2136707
3621 2136707 2837108 2425326 490191 2756764 11978467 20950062 21599082 15941464 10828088
3612 10828088 6533401 -1256266 -11527528 -18585985 -20749180 -20413516 -16739797 -6495604
3604 -6495604 7669106 17418334 18671528 15487202 13085524 12615491 13760032 16629385
3596 16629385 18992592 16478197 8081069 -1760809 -8175723 -10183211 -9344937 -7314012
3588 -7314012 -5717706 -5862331 -7812299 -11422237 -17324930 -24411973 -28190761 -25619101
3580b5619101N518224L111090J557271M951737P610213L016494m780824o416785
3572a1051681o26102N143996N686128K677845n16990k284820j388228K315750
3564d4102N883678O362651M946212M027474K278557k076824n337201k480640L632684
3555A7192489M505412j840603p821085p199796k693604R8837N48788O72979m71057
3546B992360m726962r388956r067066l139904K562760K974881K24675N54585N745237
3537a1268390J0514160R522998M275000O7070k030454n293887r552092r377637
3529a3143232k780174L831485M167155J276091K126076N851033M929338k255738
3521D002034p649395m801380K015654M125918K89042k526291P91841O710550P661407
$$ plain form
3580 -25619101 -20100877 -16989787 -15432516 -10480779 -2870566 145928 -4634896 -11051681
3572 -11051681 -11677783 -6533787 -847659 1830186 1313196 -971624 -2359852 -44102
3564 -44102 5839576 12202227 17148439 21175913 23454470 21377646 16040445 13559805 17192489
3555 17192489 21697901 19857298 12036213 4836417 2142813 2241650 2790438 3463417 2992360
3546 2992360 -1734602 -11123558 -20190624 -23330528 -20767768 -17792887 -17568212 -17013627 -11268390
3537 -11268390 -754230 8768768 13043768 13110838 11080384 5786497 -3765595 -13143232
3529 -13143232 -15923406 -12091921 -7924766 -6648675 -4522599 1328434 6257772 4002034
3521 4002034 -3647361 -8448741 -6433087 -2307169 -2018127 -4544418 -3752577 2957973 10619380
3512A0619380J497749n849523p458609l287971R39860J503996j8167j231402k356192
3503e640879l392565k143233J724162M293601K892305N59077P02609R88095j795633
3494a812461m284317j442202L365087K175215m009635n266839J607590P408894
3486b258668N011248K50926J183395M203127N05222q322034j1755296o002667
3478a7184747J577762M452418M351833M266521K224575l126544o732771k992887
3470a3163840N584853J0744609Q135593Q68679n322750p146387m916398j625107
3462f840748l64893p98311M20824L948128N228364R98928m401683m138682J322631
3453d625442N195769M575664L320776L922367L199786j154065n612063o265896
$$ plain form
3512 10619380 12117129 6267606 -1191003 -4478974 -3539114 -2035118 -2053285 -3284687 -5640879
3503 -5640879 -9033444 -11176677 -9452515 -5158914 -2266609 -1707532 -1004923 -16828 -1812461
3494 -1812461 -6096778 -7538980 -4173893 -1998678 -6008313 -11275152 -9667562 -2258668
3486 -2258668 2752580 3003506 4186901 8390028 8895250 573216 -11182080 -17184747
3478 -17184747 -15606985 -11154567 -6802734 -2536213 -311638 -3438182 -10170953 -13163840
3470 -13163840 -7578987 3165622 11301215 12169894 6847144 -299243 -5215641 -6840748
3462 -6840748 -7205641 -8003952 -7583128 -3635000 1593364 2592292 -1809391 -5948073 -4625442
3453 -4625442 570327 5145991 8466767 12389134 15588920 14434855 8822792 2556896
3445B556896m519790l330145k084704M46703K154850J367703P84376K577778L464534
3436C418201M01641k836672j725058J89269k909572p342112m252558N023270Q859665
3427a173926K381566n675066o507074k260459Q34905J667148J412991o49802l028620
3418a2998337j112587M123607M373145k744483p181815j421856O376646M720969
3410e864711k766368l870432K072520M634540R36904p36782K883306M236697o47739
3401H77935m220333j17935O108624O153786J285179j577607k54170K732893N580575
3392A6568947O498267K275508o152515j0883162o433158J430695L029265j830460
3384D503387n027657k843304L58887J061999J511193L885621O009595N736487
$$ plain form
3445 2556896 -1962894 -5293039 -7377743 -6931040 -4776190 -3408487 -2624111 -46333 3418201
3436 3418201 3819842 983170 -741888 -552619 -3462191 -10804303 -15056861 -10033591 -1173926
3427 -1173926 1207640 -4467426 -10974500 -13234959 -12400054 -10732906 -9319915 -9969717 -12998337
3418 -12998337 -14110924 -9987317 -5614172 -8358655 -15540470 -16962326 -10585680 -5864711
3410 -5864711 -8631079 -12501511 -10428991 -5794451 -4857547 -5594329 -2711023 1525674 877935
3401 877935 -3342398 -3460333 2648291 8802077 10087256 8509649 8255479 10988372 16568947
3392 16568947 23067214 25342722 19190207 8307045 1873887 3304582 6333847 4503387
3384 4503387 -524270 -3367574 -3008687 -1946688 -435495 3450126 9459721 15196208
3376A5196208M519916L535537P26727m600213q021840n387401M43797K943059
3368I355790O66108k011937k345177k263169l129592k607048O65467L504166K954458
3359D789066J452976K967855O301428O949225M089005O93805k210787n620972
3351A9411601p299757l351589L608917M990878j900315q976358q497937k968671
3343d983231J209859L788387P301145Q714847L323364n551310r537358p096172
3335b830469m456490m937221n239593k859302N80282M414126R514539J2318436
3327F504308O865945m093916q520344n69466J0549658J2928055O731691R1683
3319C0487614l877142p659795j0755706r606145n218242l027002m574233n725504
$$ plain form
3376 15196208 19716124 23251661 23978388 19378175 11356335 5968934 6412731 9355790
3368 9355790 10021898 8009961 5664784 3401615 272023 -2335025 -1669558 1834608 4789066
3359 4789066 6242042 9209897 15511325 22460550 26549555 27243360 25032573 19411601
3351 19411601 12111844 8760255 12369172 17360050 15459735 6483377 -2014560 -4983231
3343 -4983231 -3773372 15015 7316160 16031007 19354371 13803061 4265703 -2830469
3335 -2830469 -7286959 -12224180 -17463773 -20323075 -19742793 -15328667 -5814128 6504308
3327 6504308 13370253 9276337 755993 186527 10736185 23664240 30395931 30487614
3319 30487614 26610472 18950677 8194971 -1411174 -6629416 -9656418 -14230651 -19956155
3311a9956155m034399j900357q63843J522006O274305R070754N775482p07234
3303d819441l097000J373263P590346Q416245K344196n167254p383745l068774
3295c812164K425150L018625j487831n569937m669924k17835K966143K962675
3287d385098K393578L900110O329499O733186M477890J329519j529594m061836
3279A5187254n389235m182924j416592J69492J16333O99394K322722K158192o84317
3270H980319k565426q81664J519050J238072l1706N35268Q01598k447889o162788
3261I84834m631985Q31293L201836O57669j298557L89893J968409N26815j061557
3252A568650j80280Q31482l7424l4752L099209O213507N764661L726418L660505
$$ plain form
3311 -19956155 -23990554 -25890911 -26754754 -25232748 -18958443 -9887689 -4112207 -4819441
3303 -4819441 -7916441 -6543178 1047168 9463413 11807609 6640355 -743390 -3812164
3295 -3812164 -1387014 1631611 143780 -5426157 -10096081 -10313916 -7347773 -4385098
3287 -4385098 -1991520 1908590 8238089 14971275 19449165 20778684 19249090 15187254
3279 15187254 9798019 5615095 4198503 4367995 4484328 5183722 7506444 9664636 8980319
3270 8980319 6414893 5533229 7052279 8290351 8258645 8793913 9595511 7147622 984834
3261 984834 -3647151 -2815858 385978 1043647 -254910 134983 2103392 2630207 1568650
3252 1568650 1388370 2219852 2182428 2147676 5246885 11460392 17225053 20951471 24611976
3243B4611976M206147J520659l997174q053588q288681o133279l782616k055014
3235a971570m84749J969903N013090N548767J137131m758871n487988m26692L743205
3226D282226L009093J220739J932863J626770l389016q890526q521912l848849
3218a2578612j532820l047282m077567k392086L25296L356081P280958R978276
3210b687756Q224746L186750q99106l055560n269920o555733l485574K901158
3202g640995O744522N364888K372469J022295n41850m678430q839396q301259
3194a4497756k504523L958782O187737L641441K35301l9296K358158L290538M68995
3185C099377l709102n626820m339726r64942K766076M025104Q80693l297376k199749
$$ plain form
3243 24611976 28818123 30338782 26341608 18288020 9999339 3866060 83444 -1971570
3235 -1971570 -2456319 -486416 4526674 10075441 11212572 6453701 965713 539021 4282226
3226 4282226 7291319 8512058 10444921 12071691 8682675 -207851 -8729763 -12578612
3218 -12578612 -14111432 -17158714 -21236281 -23628367 -23303071 -19946990 -12666032 -2687756
3210 -2687756 5536990 8723740 7824634 4769074 -500846 -7056579 -10542153 -7640995
3202 -7640995 -896473 4468415 6840884 7863179 7321329 2642899 -6196497 -14497756
3194 -14497756 -17002279 -13043497 -6855760 -3214319 -2979018 -3018314 -660156 2630382 3099377
3185 3099377 -609725 -6236545 -10576271 -11541213 -8775137 -4750033 -3869340 -7166716 -9366465
3176i366465L852596O369539R59730n097762l733958J516658K243897p82810l46900
3167d385475L613480M075453m79097m213593m823359n868221p328740m465571
3159b3875123J842130M208446J296885P52281N448158P548506K231914k974931
3151c521734n45095M304058K724532k950088m023942k50759J053417j703712k424802
3142g338125J496741N104153M347298J292338r76192k498649l294937j443185
3134c310558K708182M460365N09252n431004o307765p72108M327110K161530m722542
3125f377538o588381O51967Q453628N896045n193142j1795468o779371K472847
3117a9259413N258084J038993k911242k404782Q54693M190542N890493L958709
$$ plain form
3176 -9366465 -5513869 855670 1815400 -3282362 -7016320 -5499662 -3255765 -4038575 -4385475
3167 -4385475 -771995 3303458 2824361 -1389232 -6212591 -12080812 -19409552 -23875123
3159 -23875123 -22032993 -17824547 -16527662 -15775381 -10327223 -2778717 -546803 -3521734
3151 -3521734 -4066829 237229 2961761 11673 -4012269 -4263028 -3209611 -4913323 -7338125
3142 -7338125 -5841384 -737231 3610067 4902405 3926213 1427564 -1867373 -3310558
3134 -3310558 -602376 3857989 4367241 -1063763 -7371528 -8143636 -3816526 -1654996 -6377538
3125 -6377538 -12965919 -12313952 -3860324 2035721 -3157421 -14952889 -21732260 -19259413
3117 -19259413 -14001329 -12962336 -15873578 -18278360 -17423667 -13233125 -7342632 -3383923
3109c383923j771332o966711o677945j671034K696237L567262L102748L823301
3101g281397M576876K317181l427793q771772q753909l273296J489633L03713
3093b2820764l552454k489793L869822P582551M445833L17285J578701N676926
3085e391893O646453M718752L855571L680419Q77684l845799o643089o564173
3077b666075n112083k029325K645346M770795R46922m679437n227912j277971
3069a2629740O81642j137361k094498M42673M198017P377185R624837P806780
3061A4269535q11432j0391047j0556029j043702O352703L988657j998047l035916
3053c225278p89686j604311m896949n266291k074995Q95067K771573N305936O940436
$$ plain form
3109 -3383923 -5155255 -12121966 -18799911 -20470945 -17774708 -14207446 -11104698 -7281397
3101 -7281397 -2704521 -387340 -3815133 -12586905 -21340814 -24614110 -23124477 -22820764
3093 -22820764 -26373218 -28863011 -24993189 -17410638 -12964805 -12647520 -11068819 -5391893
3085 -5391893 1254560 5973312 9828883 13509302 14386986 10541187 3898098 -2666075
3077 -2666075 -7778158 -9807483 -7162137 -2391342 -1444420 -6123857 -11351769 -12629740
3069 -12629740 -11948098 -13085459 -15179957 -14737284 -10539267 -3162082 6462755 14269535
3061 14269535 13458103 3067056 -7488973 -8532675 -2179972 1808685 -189362 -3225278
3053 -3225278 -4014964 -5619275 -10516224 -15782515 -17857510 -16962443 -14190870 -8884934 -1944498
3044a944498M303332q01527k556193M0322J486642j395609m202468j475421N140962
3035a404458Q777831N727487q94919n328116m883829j350310J823198K883383
3027E350267K618855K489109K443610J045735k099779m682881l748915Q7465K152229
3018E655695n40994m206460k384495M760121R536112O892966J036862j444332
3010A9305475p64146j187288k597035j506299J251045J101099k116442l697013
3002I789396k628389l320044o736825p189804j763732L562640K247798l471145
2994i510105o899059o324290m452020j743215L409592R399587J1845890R099023
2986D825403L641296j177351k910505m78540L690059M114123j279118p239484
$$ plain form
3044 -1944498 2358834 1557307 -998886 -958564 528078 -867531 -5069999 -6545420 -1404458
3035 -1404458 7373373 13100860 12205941 6877825 1993996 643686 2466884 5350267
3027 5350267 7969122 10458231 12901841 13947576 11847797 7164916 3416001 3503466 5655695
3018 5655695 5114701 908241 -1476254 3283867 12819979 19712945 20749807 19305475
3010 19305475 18541329 17354041 14757006 13250707 14501752 15602851 13486409 9789396
3002 9789396 7161007 3840963 -2895862 -10085666 -11849398 -8286758 -6038960 -9510105
2994 -9510105 -16409164 -22733454 -27185474 -28928689 -25519097 -16119510 -4273620 4825403
2986 4825403 8466699 7289348 4378843 3900303 7590362 11704485 10425367 3185883
2978C185883p798408m369776k401367k381394m15102L568521N224412L704769
2970a682462L291478N487704N821839J312272m251227n790472l292023N04482
2962A401591M466175P454283O475910J084650l531082k897177l27761k191277
2954A1935312p646387r294566m186517J977899L391223J328908k57100j427771
2946d178999l851750n116700j340393N605633R137905O752493K727126O77996
2938A0413311j438206n925768r520448p662166j848815K291909K769544K124860
2930h795779J569476j29258j677947Q30581P019579J0422826O605444r62587o135862
2921H746473p278689n878335k079807L666398P429803N495269k57417n012014
$$ plain form
2978 3185883 -4612525 -8982301 -11383668 -13765062 -14180164 -10611643 -5387231 -1682462
2970 -1682462 1609016 7096720 12918559 14230831 9979604 4189132 897109 1401591
2962 1401591 5867766 13322049 19797959 20882609 17351527 14454350 14126589 11935312
2954 11935312 4288925 -5005641 -9192158 -7214259 -3823036 -2494128 -2751228 -4178999
2946 -4178999 -8030749 -13147449 -14487842 -8882209 255696 7008189 9735315 10413311
2938 10413311 8975105 3049337 -6471111 -14133277 -15982092 -13690183 -10920639 -8795779
2930 -8795779 -7226303 -7355561 -9033508 -8202927 -1183348 9239478 15844922 14882335 8746473
2921 8746473 1467784 -4410551 -6490358 -2823960 4605843 10101112 9843695 4831681
2913D831681p367940q600033p665618k748397L143720M371540Q75628j591285
2905a4750704l16384J177442L49426j09751J853419L245383J567210L544K233310
2896d747105N672497N013202M0565m780515o416074m545565P70742P408903R308225
2887G724875K753198o244950p692687j236797L038264o55480n592851l204897
2879a1111325M349284Q354632N975689J676672j350951m065247o452337o269988
2871h893571l866341k460291k188017M54188N127262N701067l30684o008400m134533
2862a6599320J833768L078493r37168k231735K466277O731009N319511K465138
2854B125973M173081P779361N882600k060277q617518q252976k884388K641291
$$ plain form
2913 4831681 -2536259 -11136292 -18801910 -21550307 -18406587 -14035047 -13159419 -14750704
2905 -14750704 -15067088 -13889646 -13540220 -13649971 -11796552 -8551169 -6983959 -6980415 -4747105
2896 -4747105 925392 5938594 5979159 1198644 -5217430 -9762995 -8992253 -1583350 7724875
2887 7724875 10478073 4233123 -3459564 -4696361 -1658097 -2313577 -7906428 -11111325
2879 -11111325 -6762041 1592591 7568280 9244952 7894001 3828754 -2623583 -8893571
2871 -8893571 -12759912 -15220203 -17408220 -16954032 -11826770 -6125703 -6456387 -12464787 -16599320
2862 -16599320 -14765552 -11687059 -12624227 -14855962 -12389685 -5658676 -339165 2125973
2854 2125973 6299054 14078415 19961015 17900738 9283220 1030244 -1854144 787147
2846G87147N728307N598007K015354l300384o689477o031994k749163N42997K610076
2837a489130L238064K441478R78818r5590r48300k169307k470058q0480L141875
2828B547370K790109j327183l492490o6919M368368K984218l614636q402499p445141
2819a1658803l619042q90075N65380K397618M784187O591460O470251L144436
2811G785412k814086p154191n223665J793317P084142O142641J504673j954074
2803G164169k927780k479668n41384K577134L766684P21226l360799l230571O12299
2794B301310K111133j621728n951240m978444R87734O586957P943256N644680
2786A3023658K464824M87481K44337R25186J016013m60092k942550m709193m360765
$$ plain form
2846 787147 6515454 12113461 14128815 10828431 4138954 -1893040 -4642203 -4099206 -1489130
2837 -1489130 1748934 4190412 5169230 5073640 4125340 1956033 -514025 -594505 2547370
2828 2547370 5337479 4010296 517806 450887 4819255 7803473 4188837 -4213662 -11658803
2819 -11658803 -15277845 -16167920 -15602540 -13204922 -8420735 -1829275 4640976 7785412
2811 7785412 4971326 -2182865 -7406530 -5613213 1470929 7613570 9118243 7164169
2803 7164169 4236389 1756721 1215337 3792471 7559155 8280381 4919582 1689011 2301310
2794 2301310 4412443 2790715 -3160525 -8138969 -7151235 -564278 7378978 13023658
2786 13023658 15488482 15975963 16220300 17145486 18161499 17701407 14758857 10049664 5688899
2777E688899k173105j98071o36032l602756o778812p587428n128850J78788P194357
2768a3043010J3018058J3249583O200987l435803p912254m288803K590669N479981
2760A1859408J828261m593140p738056m761340J434760N144510L943436P19012
2752G836851j259835k753657n343969o480615k523533M357035P670780N251542
2744F754599J332535o36342j745053k828557j867073J075318J818515j391387
2736B512555m125391k482299J006003K462946L108972N490419P295554M779100
2728B0047859o07113m635230o736819q562264q861617n721676j523115L28613
2720a6271362J270515M085225O373759M579066J709179K770015M829293J206598
$$ plain form
2777 5688899 3515794 3317723 2681691 -921065 -7699877 -15287305 -20416155 -20237367 -13043010
2768 -13043010 -24952 13224631 19425618 15989815 8077561 3788758 6379427 11859408
2760 11859408 13687669 9094529 1356473 -3404867 -1970107 3174403 7117839 7836851
2752 7836851 6577016 3823359 -1520610 -8001225 -10524758 -6167723 1503057 6754599
2744 6754599 8087134 7450792 5705739 2877182 1010109 2085427 3903942 2512555
2736 2512555 -1612836 -4095135 -3089132 -626186 2482786 7973205 15268759 20047859
2728 20047859 19440746 14805516 8068697 -493567 -9355184 -15076860 -16599975 -16271362
2720 -16271362 -15000847 -10915622 -4541863 37203 1746382 4516397 9345690 10552288
2712A0552288n796875p152751k209638J15802k850844k943720L208464O300484
2704g76790l66418q277872o064884L351197Q193664M903413j62664k287766k259184
2695c747304j118758N99451K48373l026227m111769J017202O868227N417661p50960
2686A395896j826557L457227N560696p53553q342803q254479j119234N939733
2678c943074Q082434M759194k173635q515065r507307m910372J74694J504219
2670a4528912J1677j289948j264637P3020K756571N381310N445590L053442J581704
2661A219817L008813N085586M536881P21873m741716r271558r618915m272264
2653a3331483L272633O953982N151779J984008N15411j169761m908760p662448
$$ plain form
2712 10552288 4755413 -2397338 -4606976 -4491174 -7342018 -10285738 -7077274 -776790
2704 -776790 -1143208 -9421080 -15485964 -12134767 -3941103 962310 799646 -1488120 -3747304
2695 -3747304 -4866062 -4266611 -4018238 -7044465 -11156234 -10139032 -3270805 2146856 1395896
2686 1395896 -430661 3026566 8587262 7833709 -509094 -8763573 -9882807 -3943074
2678 -3943074 4139360 8898554 6724919 -1790146 -11297453 -16207825 -16033131 -14528912
2670 -14528912 -14517235 -15807183 -17071820 -16998800 -14242229 -8860919 -3415329 -361887 1219817
2661 1219817 4228630 9314216 13851097 14572970 9831254 559696 -9059219 -13331483
2653 -13331483 -10058850 -3104868 2046911 4030919 4546330 3376569 -1532191 -9194639
2645i194639n627779o63528J475241j297390m608727k868990M049010R976303
2637h760499Q685304J245537m331089k281307M169274Q047744P957483P174563
2629B1907010N460358q16069r787610j3189849p549764L10989L027402J974619
2621A337086J987839K606667J001595r07937K72154J871555j329999p299745q187067
2612h647852j947737M524796N443335K980510J582263J122851m06632j587227
2604C064307K98003L819344M400044M98281m322304o013429m597004k992772k370821
2595h216351l84035N075120J1191839J1638853M033356n700767q974532m126859
2587D536624K149034L148893p98352m683086n480022m010707j807917N52790J899642
$$ plain form
2645 -9194639 -14822418 -15485946 -14010705 -15308095 -19916822 -22785812 -18736802 -8760499
2637 -8760499 -75195 1170342 -3160747 -5442054 -1272780 6774964 14732447 21907010
2629 21907010 27367368 26551299 16763689 3573840 -3975924 -3664935 -637533 1337086
2621 1337086 3324925 5931592 6933187 6025250 6297404 8168959 6838960 -460785 -8647852
2612 -8647852 -10595589 -6070793 -627458 2353052 3935315 5058166 4651534 3064307
2604 3064307 3362310 7181654 11581698 12079979 7757675 1744246 -2852758 -5845530 -8216351
2595 -8216351 -8600386 -3525266 7666573 19305426 23338782 17638015 8663483 4536624
2587 4536624 6685658 9834551 9036199 4353113 -1126909 -5137616 -6945533 -6392743 -4493101
2578d493101L55655l575356n830444l001412L188764P849496Q736029P474916
2570A0704547N340091J526795l280529n598323m059612k229871k972951l234344
2562c804197O66679N184347L602637k897045n698861j638403K018718r80589o094445
2553i641159n213652J162416N697134N515444M754099O207958O761563K919933
2545A8163736l447886p390176o673286l461716j338620j763710l018234k352151
2537a1282043O16552L140042K460195j040225m385080m884940k030753K371863
2529a5034389N417238N516000L889029K638598J946705J080179R38086K099050
2521H490496J381199m266214j0159230p011073N586391J5533244J2904697K565539
$$ plain form
2578 -4493101 -4137446 -7712802 -13543246 -16544658 -13355894 -5506398 3229631 10704547
2570 10704547 16044638 17571433 14290904 8692581 4632969 2403098 -569853 -3804197
2562 -3804197 -3137518 2046829 5649466 2752421 -2946440 -4584843 -2566125 -3546714 -9641159
2553 -9641159 -14854811 -13692395 -7995261 -2479817 2274282 8482240 15243803 18163736
2545 18163736 14715850 7325674 652388 -2809328 -4147948 -5911658 -8929892 -11282043
2537 -11282043 -10665491 -7525449 -5065254 -6105479 -10490559 -15375499 -17406252 -15034389
2529 -15034389 -9617151 -4101151 -212122 2426476 4373181 5453360 6391446 8490496
2521 8490496 9871695 5605481 -4553749 -11564822 -5978431 9554813 22459510 25025049
2513B5025049l888415l803447l558664o431043q963542q489146o395658l434490
2505a9939356J403205O387329P555408M910637K616565K099115O67061j944045
2497C755919j993602J141890K460644p22780l793057k061334J367932l6496o476547
2488f357431j1051906q028258J061442R230291J0533342N608028J209109K662983
2480D867600P118444P258755J483337m017331m236849j403684J27650M6769k96651
2471A0948040j897988n004434n458577K46720P914828R148711J965577o466722
2463A1396155q551515m430401j27012K98650j036763O23987N623440P920087K184998
2454A3901626p987884j2843254q397892j288373Q68639l93906J536808P264024
$$ plain form
2513 25025049 21136634 17333187 13774523 7343480 -1620062 -10109208 -16504866 -19939356
2505 -19939356 -18536151 -12148822 -4593414 317223 2933788 5032903 5699964 3755919
2497 3755919 1762317 2904207 5364851 4642071 849014 -1212320 155612 119116 -6357431
2488 -6357431 -17409337 -25437595 -24376153 -15145862 -4612520 995508 2204617 4867600
2480 4867600 11986044 19244799 20728136 16710805 12473956 11070272 11197922 11244691 10948040
2471 10948040 9050052 4045618 -1412959 -1166239 6748589 15897300 17862877 11396155
2463 11396155 2844640 -1585761 -1712773 -1414123 -2450886 -1826899 3796541 11716628 13901626
2454 13901626 5913742 -6929512 -15327404 -16615777 -15747138 -16141044 -14604236 -7340212
2446g340212J0388258O980834N25565l619302m298017l308809j499011J340802
2438h29892M378077N667830L862105o48876n750571q725081q308226n666825k537161
2429a8558620J042703N664878R674071R650279M590256k036325n743609n726665
2421a443032m786668m932332m848239k757144l27035r54630l815752l073868M251019
2412b2687681J2232591J2294253M502188k527988l339740j515921j862887k728881
2404e634066m83757L113061L877257K534889K852453M148251K280027k175232
2396A0512883l462317K19275L272010J229298k469452k311054M73468l3130n146032
2387B284949r152539o719271M68725N797547M879572m62492m688082m198517m10062
$$ plain form
2446 -7340212 3048046 10028880 10554445 6935143 2637126 -671683 -2170694 -829892
2438 -829892 3548185 9216015 13078120 12429244 6678673 -2046408 -10354634 -16021459 -18558620
2429 -18558620 -17515917 -11851039 -2176968 7473311 12063567 10027242 4283633 -1443032
2421 -1443032 -6229700 -11162032 -16010271 -18767415 -19094450 -20049080 -23864832 -26938700 -22687681
2412 -22687681 -10455090 1839163 6341351 3813363 473623 -1042298 -2905185 -5634066
2404 -5634066 -6117823 -3004762 872495 3407384 6259837 10408088 12688115 10512883
2396 10512883 7050566 7269841 10541851 11771149 9301697 6990643 7464111 7430981 2284949
2387 2284949 -6867590 -13586861 -13118136 -7320589 -2441017 -2903509 -7591591 -11790108 -12200170
2378a2200170K532373K419355O48495l30353J44924J071741J579539J692459J829127
2369f12510K328208L289096M303807M358845K586357l69103j979533l2158L989055
2360A7862064N044332K36875o228656p034375j454710K618238j181964q750619
2352A111185j0664963m386210L240133N187565J556899k816120m078595j472597
2344a2322703K944731N242515L008831j027248j528398K239267M955405K617430
2336F129830j975801l482575q20960L046491N521126N487802K415809k041458
2328A4280264l381860Q25621O462816P279518L080054o89884j268274j668962
2320B4919293m328261o325687l849941J523230M312233J755902l307705n653685
$$ plain form
2378 -12200170 -9667797 -7248442 -6599947 -6930300 -6785376 -5713635 -4134096 -2441637 -612510
2369 -612510 1715698 5004794 9308601 13667446 16253803 15884700 13905167 13873009 17862064
2360 17862064 22906396 23143271 16914615 9880240 8425530 11043768 9861804 1111185
2352 1111185 -9553778 -13939988 -10699855 -5512290 -3955391 -6771511 -10850106 -12322703
2344 -12322703 -9377972 -4135457 -1126626 -2153874 -3682272 -1443005 3512400 6129830
2336 6129830 4154029 671454 -149506 2896985 8418111 13905913 16321722 14280264
2328 14280264 10898404 11724025 18186841 25466359 28546413 27856529 26588255 24919293
2320 24919293 20591032 14265345 10415404 11938634 16250867 18006769 14699064 9045379
2312I045379k511255M049854Q683940P535713J936433l540803o344288p259947
2304A1595026o880531m278136k33671J909165Q83052j98330J088699K243971K32458
2295F361703k773989k612160k1441Q87258j12836O26908L419968M084507J380907
2286A1240825j44523K451692N082344K360106m574970r766514r879963o690297
2278i921300l554456k016166j145612J062832M640807O220543L368995k32791
2270a577148J176062N731161M808238l870811j1152729r271715k881197m51630
2262a7489769q81610K115635O661367M848848k902275o572024j331539N662344
2254i889023O294274J739341j766927j363463J409485L340408J494283l142469
$$ plain form
2312 9045379 6534124 10583978 19267918 26803631 28740064 25199261 18854973 11595026
2304 11595026 4714495 436359 202688 2111853 2994905 2796575 3885274 6129245 6361703
2295 6361703 3587714 975554 954113 1841371 1728535 2355443 5775411 9859918 11240825
2286 11240825 11096302 13547994 18630338 20990444 16415474 6648960 -3231003 -9921300
2278 -9921300 -13475756 -15491922 -16637534 -15574702 -10933895 -4713352 -1344357 -1577148
2270 -1577148 -401086 5330075 10138313 6267502 -4885227 -14156942 -17038139 -17489769
2262 -17489769 -18371379 -16255744 -9594377 -4745529 -7647804 -14219828 -15551367 -9889023
2254 -9889023 -3594749 -1855408 -3622335 -4985798 -3576313 -235905 1258378 -1884091
2246a884091m076204K510658Q907727M229219p901951j1351480o44226R878733
2238c31615O933685k901840n198172P34469M566057L019983J780934K241003l78579
2229A0465925n473935n619298P47026N096468J163720o095095q098587l496195
2221a1309971K515741N519865M954393K547804L28961j043521k609209m576537
2213c672474m722751j790773J314068J253696n50234n59176Q17832O33628n68967
2204g845151M64813L612177N308287M190709J993343m73426l365535m907315l553039
2195d575137j584059j216616L74618N423618Q115750K039860o958823o768609
2187e149398J997590N549609j768332q624747m997624K644687L084858k418957
$$ plain form
2246 -1884091 -5960295 -3449637 5458090 9687309 1785358 -9566122 -10210348 -331615
2238 -331615 6602070 3700230 -1497942 -763473 3802584 6822567 8603501 10844504 10465925
2229 10465925 4991990 -627308 119718 5216186 6379906 284811 -7813776 -11309971
2221 -11309971 -8794230 -3274365 1680028 4227832 4556793 3513272 904063 -3672474
2213 -3672474 -8395225 -10185998 -8871930 -7618234 -8168468 -8727644 -7909812 -7276184 -7845151
2204 -7845151 -7380338 -3768161 1540126 5730835 7724178 7250752 3885217 -1022098 -4575137
2195 -4575137 -6159196 -7375812 -7001194 -1577576 6538174 8578034 1619211 -5149398
2187 -5149398 -3151808 2397801 629469 -7995278 -12992902 -10348215 -7263357 -9682314
2179i682314m789095j891512J748042M858324Q776866J0357190N480434k199825
2171A2658110n044060k856772k092739m291850l980776R76576N031020L653276
2163D052785J63429L60563M328917O865255M193650j683330m792964j451730M761072
2154A6797647O159888M88049n701413n969968k834264l063155o731727o958032
2146g812975j67179Q655064J1850294O726116k900023r790280q405457j58581
2138b003021O985011P087834L088101J621218L132391K518024j400018l634264
2130A7395276j542295M59299k127649o529006o380875n52425N448498O380281
2122A2551104K807897q48587k056305k278709l382482m051268j949427J687237
$$ plain form
2179 -9682314 -14471409 -16362921 -14614879 -9756555 -979689 9377501 14857935 12658110
2171 12658110 7614050 4757278 2664539 -1627311 -5608087 -4631511 399509 4052785
2163 4052785 4216214 4576777 8905694 15770949 19964599 18281269 13488305 12036575 16797647
2154 16797647 22957535 23445584 17744171 11774203 8939939 5876784 -854943 -7812975
2146 -7812975 -7980154 674910 12525204 19251320 16351297 6561017 -1844440 -2003021
2138 -2003021 4981990 12069824 15157925 16779143 19911534 22429558 21029540 17395276
2130 17395276 15852981 16312280 14184631 7655625 1274750 722325 6170823 12551104
2122 12551104 15359001 14510414 12454109 10175400 6792918 2741650 792223 2479460
2114B479460L097708J762100J097756K234152J592633k852256p277634p529661
2106e395742n124656l723135l131826j298227R20561J797791K631532M684367
2098h639335N210272J812139k279816k996770k220654l306594l400979J652389
2090a4169348P554292O207607j150998n415164m006120l259768n308077l909792
2082b3457368L105520Q020556N435650R84900J272723L246317J128697k883031
2074c146036l161857p64927n98097k094637r52323K068337J962300j654173l426372
2065a1767785m94294L545719L913265K29161l818928m168964p6585M472987M569328
2056c596096O63120j836053n11304Q89442m44570j539147J08326J108657j209301
$$ plain form
2114 2479460 5577168 7339268 8437024 10671176 12263809 9411553 2133919 -5395742
2106 -5395742 -10520398 -14243533 -17375359 -18673586 -17753025 -15955234 -13323702 -8639335
2098 -8639335 -3429063 -1616924 -3896740 -6893510 -9114164 -12420758 -15821737 -14169348
2090 -14169348 -6615056 -407449 -1558447 -6973611 -10979731 -14239499 -19547576 -23457368
2082 -23457368 -20351848 -12331292 -6895642 -5910742 -4638019 -1391702 -263005 -3146036
2074 -3146036 -6307893 -7072820 -7670917 -9765554 -10717877 -8649540 -6687240 -8341413 -11767785
2065 -11767785 -12262079 -8716360 -4803095 -4573934 -8392862 -12561826 -12638411 -8165424 -3596096
2056 -3596096 -2932976 -4769029 -5280333 -4390891 -4835461 -6374608 -6266282 -5157625 -6366926
2047f366926k174644K493865O665549J314422r751098j2359854j615213J0614342
2039a1179557J1636418L453857k915945k590149K15182J021153K99912K26923
2031A67794J107067K297372L943701O191725P710795O374286J703497l959768
2023B5536469p442718p598341n177526o57180N164448Q435708M361300n623843
2015A6998317j2631553j0142453k248026K223620J158030p79364j536238l854080
2007a0811747p559207p162420n70854N490684L720376l394546o553340j691339
1999b8532393N561347P871598M928262K104270K323121K429693j341580o582938
1991a1238620o716662J4532P120204P648521K671489j273057j287244m81155j765207
$$ plain form
2047 -6366926 -8541570 -6047705 617844 1932266 -7818832 -20178686 -21793899 -11179557
2039 -11179557 456861 3910718 994773 -1595376 -1380194 -359041 -59129 167794
2031 167794 1274861 3572233 7515934 13707659 21418454 27792740 29496237 25536469
2023 25536469 18093751 10495410 5317884 4660704 9825152 18260860 22622160 16998317
2015 16998317 4366764 -5775689 -8023715 -5800095 -4642065 -5421429 -6957667 -10811747
2007 -10811747 -18370954 -25533374 -26104228 -20613544 -16893168 -20287714 -26841054 -28532393
1999 -28532393 -22971046 -15099448 -10171186 -8066916 -5743795 -3314102 -4655682 -11238620
1991 -11238620 -17955282 -17940750 -10820546 -3172025 -500536 -1773593 -3060837 -3541992 -5307199
1982e307199l569492k890328L60361L523409M113628J888860q87858j394952N02274
1973c661297J925419J123966p1124l5311q14664m146318o639500m071423J183573
1964a5206679K935625N90881o88479P71324R72751j365948j765674J815297M927501
1955g013401M709676N004799Q189763Q673583J666161o993966q242670l480905
1947B513040j856960n630251p575218l327348K584919N259814O065491P154777
1939E188264O184038J577499k072531R0889M754237L885770m073510j1436687
1931D097969j0510434k235564N708765P338237L477547n74079j099505P90820
1923F993756J725250Q12491M02903K134150L995245K557191k578897p610273p855677
$$ plain form
1982 -5307199 -8876691 -11767019 -11406658 -7883249 -3769621 -1880761 -2768619 -4163571 -3661297
1973 -3661297 -1735878 -611912 -683036 -718347 -1533011 -5679329 -12318829 -16390252 -15206679
1964 -15206679 -12271054 -11680173 -12368652 -11597328 -10624577 -11990525 -13756199 -11940902 -7013401
1955 -7013401 -2303725 2701074 10890837 19564420 21230581 14236615 5993945 2513040
1947 2513040 656080 -4974171 -12549389 -15876737 -13291818 -8032004 -1966513 5188264
1939 5188264 11372302 12949801 10877270 10968159 15722396 19608166 15534656 4097969
1931 4097969 -6412465 -8648029 -2939264 4398973 7876520 7302441 6202936 6993756
1923 6993756 8719006 9531497 9934400 12068550 16063795 18620986 16042089 8431816 576139
1914E76139k288740M748602O787787J527355o119788q840599m973045J79105J563276
1905f839908K96674O40987L430078N492460M490876J180332k831981o305287o958690
1896g404459k477303N220539R745550P210843J456779j055522o6523p40887m295215
1887G593802n160160k24939M236972N35848q174637j0675766l192323M880043
1879a0181160M170756j558216j618647N466939R750470M484924l931448m637182
1871A946436L124018R310947N992057l568279r901525q386769k918774L14336
1863d087553o7135q37812K61922J797770J859106J384843K137079L042207J726729
1854G217156q18801q63709J927889K793190j412550p022363q460542n961971m157703
$$ plain form
1914 576139 -1712601 3036001 9823788 11351143 5231355 -3609244 -8582289 -8403184 -6839908
1905 -6839908 -6543234 -5902247 -2472169 3020291 7511167 8691499 5859518 -445769 -7404459
1896 -7404459 -9881762 -4661223 5084327 12295170 13751949 12696427 12629904 11889017 7593802
1887 7593802 2433642 2208703 6445675 6981523 -1193114 -11868880 -15061203 -10181160
1879 -10181160 -6010404 -7568620 -9187267 -3720328 6030142 10515066 6583618 1946436
1871 1946436 5070454 14381401 20373458 16805179 6903654 -1483115 -4401889 -4087553
1863 -4087553 -4154688 -4992500 -4730578 -2932808 -1073702 311141 2448220 5490427 7217156
1854 7217156 6398355 5534646 7462535 10255725 8843175 1820812 -6639730 -12601701 -16759404
1845a6759404m263320k684145K175363O597698P088081N248984M119979K779725
1837D302961j314681o199629o291201j44175O193362N707361j347182p818602
1829f911786p829333k756916J532546J954958P67659R97353K009751J557374J96649
1820h481745L07411J502344R96325j114835j297791J248013K456383K19500j156583
1811e320978K322277O852541N679712q98608o394336p665527p248568o611718
1803a9285205l954505K44215K090013P36637n5318R11437J3851l079154k073785
1794b4451814N877834J3041133J1123799L792559J104065M438622N820475J339103
1786B2085776l710681m517354l591177m620180n751329l428205J023966K835972
$$ plain form
1845 -16759404 -21022724 -23706869 -21531506 -14933808 -7845727 -2596743 1523236 4302961
1837 4302961 2988280 -3211349 -9502550 -9646725 -3453363 2253998 906816 -6911786
1829 -6911786 -14741119 -17498035 -15965489 -14010531 -13242872 -12245519 -10235768 -8678394 -8481745
1820 -8481745 -8174334 -6671990 -5675665 -6790500 -8088291 -6840278 -4383895 -4164395 -5320978
1811 -5320978 -2998701 3853840 9533552 8634944 2240608 -5424919 -12673487 -19285205
1803 -19285205 -23239710 -22995495 -20905482 -20168845 -20224163 -19312726 -19298875 -22378029 -24451814
1794 -24451814 -18573980 -5532847 5590952 9383511 10487576 14926198 20746673 22085776
1786 22085776 18375095 13857741 10266564 5646384 -104945 -3533150 -2509184 326788
1778C26788k01767n833957r758512q450281j857836N258275P108241L466982O1633
1769i880434J078785M168083M657892J739987j989122m590099n575481m586139
1761a4976528k062508J55198J235076K807557N627310O624253K575003m229630
1753b244269p408077l736430L498346Q443072P842834K566054l433716n501243
1745B6571k227722K334797K731376r87149l168809o70257K185602j16673n368758
1736e261022n752166J123012Q166732Q055263K646324o32402P87329K752706K112607
1727A3998383Q06387J020305J227461k27744j529530p72037J42699j309993l681524
1718I674407l973846k447596j005388Q68541L744005M105293j178334p362550
$$ plain form
1778 326788 125021 -5708936 -15467448 -23917729 -25775565 -20517290 -13409049 -9942067 -9880434
1769 -9880434 -8801649 -4633566 24326 1764313 -224809 -4814908 -10390389 -14976528
1761 -14976528 -17039036 -16883838 -15648762 -12841205 -7213895 -589642 1985361 -2244269
1753 -2244269 -9652346 -13388776 -9890430 -1447358 6395476 8961530 5527814 26571
1745 26571 -2201151 133646 2865022 1877873 -1290936 -1961193 224409 107736 -5261022
1736 -5261022 -11013188 -9890176 -1723444 6331819 8978143 8345741 9133070 11885776 13998383
1727 13998383 14804770 15825075 17052536 16824792 15295262 14523225 14665924 13355931 9674407
1718 9674407 5700561 3252965 2247577 3116118 6860123 10965416 9787082 2424532
1710B424532o021218K568908Q375243N098480j964429m765240k907759p48676
1702B059841L99520J574941J752573L111q09671J833620M551821K398674k896390
1693A0868040m883357j626588K842798N746257P889516Q339114L623441n254627
1685B7544594j0886212q397281k049922J077760L21516l95333o75063l665917
1677B874142q451510q884055k469680M421680M364489j003776l668468r26121
1669a3743299J418723j092485m237864j838903M205920O649798M037503K491655
1661b108952N636802Q994480P187515J766828j923107k067960n70610J304117
1653A8219113L177285L192996l87498n827087r281216q896201n218635P92040
$$ plain form
1710 2424532 -3596686 -1027778 7347465 12445945 10481516 5716276 2808517 2059841
1702 2059841 2459361 4034302 5786875 5789986 4980315 6813935 11365756 13764430 10868040
1693 10868040 5984683 4358095 7200893 12947150 20836666 29175780 32799221 27544594
1685 27544594 16658382 8261101 6211179 7288939 7610455 7215122 6540059 2874142
1677 2874142 -5577368 -14461423 -16931103 -12509423 -8144934 -9148710 -12817178 -13743299
1669 -13743299 -12324576 -13417061 -17654925 -19493828 -15287908 -8638110 -4600607 -2108952
1661 -2108952 3527850 12522330 19709845 21476673 19553566 17485606 16914996 18219113
1653 18219113 21396398 24589394 24201896 18374809 9093593 197392 -5021243 -4229203
1645d229203P027190R248646N054569j676407m269891j414844J524739k72661
$$ plain form
1645 -4229203 2797987 12046633 17101202 15424795 11154904 9740060 11264799 10992138
$$ [...]
##END NTUPLES=NMR SPECTRUM
##END=
