##TITLE=31Pdec_DE-59rm_1h
 
 64 sc
 4.6.2024
##JCAMPDX= 6.0         $$ Bruker NMR JCAMP-DX V2.0
##DATA TYPE= NMR SPECTRUM
##DATA CLASS= NTUPLES
##ORIGIN= UXNMR, Bruker Analytische Messtechnik GmbH
##OWNER= root
$$ XWIN-NMR		Version 3.5
$$ Tue Jun  4 14:39:50 2024 Russian Standard Time (UT+4h)  she@DPX200
##.OBSERVE FREQUENCY= 81.013821
##.OBSERVE NUCLEUS= ^31P
##.ACQUISITION MODE= SIMULTANEOUS
##.ACQUISITION SCHEME= undefined
##.AVERAGES= 64
##.DIGITISER RES= 16
##SPECTROMETER/DATA SYSTEM= spect
##.PULSE SEQUENCE= zgpg30
##.SOLVENT NAME= CDCl3
##.SHIFT REFERENCE= (INTERNAL, CDCl3, 0, 248.564)
##AUDIT TRAIL= $$ (NUMBER, WHEN, WHO, WHERE, WHAT)
$$ ##TITLE= Audit trail, XWIN-NMR		Version 3.5
$$ ##JCAMPDX= 5.01
$$ ##ORIGIN= Bruker BioSpin GmbH
$$ ##OWNER= she
$$ F:/spectra/data/she/nmr/P31/1/pdata/1/auditp.txt
$$ ##AUDIT TRAIL=  $$ (NUMBER, WHEN, WHO, WHERE, WHAT)
(   1,<2024-06-04 14:39:02.95 +0400>,<she>,<DPX200>,
      <continue with go, POWCHK disabled, PULCHK disabled
       configuration hash MD5:
       00 E9 B6 7A A2 85 ED C7 34 08 36 98 17 FE 4E 26
       data hash MD5: 32K
       D1 4B 40 D0 B4 BF 01 30 56 0C 27 8C 81 16 C1 4A>)
(   2,<2024-06-04 14:39:04.78 +0400>,<she>,<DPX200>,
      <Start of raw data processing
       efp BC_mod = 2 LB = 10 FT_mod = 6 PKNL = 1 PHC0 = -189.017 PHC1 = 0 SI = 64K 
       data hash MD5: 64K
       16 DE 77 47 2C 1B 3A 81 BB 57 57 D2 9A D1 0C 70>)
(   3,<2024-06-04 14:39:20.04 +0400>,<she>,<DPX200>,
      <pk PHC0 = -3.072131 PHC1 = 0 
       data hash MD5: 64K
       AE 06 49 20 AE 70 2D 36 4C B5 85 03 C8 EE E9 23>)
(   4,<2024-06-04 14:39:28.68 +0400>,<she>,<DPX200>,
      <abs ABSG = 5 
       data hash MD5: 64K
       53 DE 3F 4F A4 73 C6 BE 2F C4 78 38 7C 3D E8 40>)
$$ ##END=
$$ 
$$ hash MD5
$$ 39 E7 46 7A E6 BD 74 EE 8F AA C0 A4 FB 2E FC 0A
##$RELAX= 
##$RELAX= 
##$RELAX= 
##$RELAX= 
##$RELAX= 
##$RELAX= 
##$RELAX= 
##$RELAX= 
##$RELAX= 
$$ Bruker specific parameters
$$ --------------------------
##$DU= <F:/spectra>
##$EXPNO= 1
##$NAME= <P31>
##$PROCNO= 1
##$TYPE= <nmr>
##$USER= <she>
##$AMP= (0..31)
100 100 100 100 100 100 100 100 100 100 100 100 100 100 100 100 100 100 
100 100 100 100 100 100 100 100 100 100 100 100 100 100 
##$AQSEQ= 0
##$AQ_mod= 1
##$AUNM= <au_zg>
##$AUTOPOS= <>
##$BF1= 81.014009
##$BF2= 200.13
##$BF3= 200.13
##$BF4= 200.13
##$BF5= 200.13
##$BF6= 200.13
##$BF7= 200.13
##$BF8= 200.13
##$BYTORDA= 1
##$CFDGTYP= 0
##$CFRGTYP= 5
##$CHEMSTR= <none>
##$CNST= (0..31)
1 1 145 1 1 1 1 1 1 1 1 1 1 1 1 1 1 1 1 1 1 1 1 1 1 1 1 1 1 1 1 1 
##$CPDPRG= <waltz16>
##$CPDPRG1= <>
##$CPDPRG2= <waltz16>
##$CPDPRG3= <>
##$CPDPRG4= <mlev>
##$CPDPRG5= <mlev>
##$CPDPRG6= <mlev>
##$CPDPRG7= <mlev>
##$CPDPRG8= <mlev>
##$CPDPRGB= <>
##$CPDPRGT= <>
##$D= (0..31)
0 1 0 0 0 0 0 0 0 0 0 0.03 2e-05 3e-06 0 0 0 0 0 0 0 0 0 0 0 0 0 0 0 0 
0 0 
##$DATE= 1717497425
##$DBL= (0..7)
120 120 120 11 120 120 24 19 
##$DBP= (0..7)
150 150 150 150 150 150 150 150 
##$DBP07= 0
##$DBPNAM0= <>
##$DBPNAM1= <>
##$DBPNAM2= <>
$$ [...]
##$SUBNAM3= <"">
##$SUBNAM4= <"">
##$SUBNAM5= <"">
##$SUBNAM6= <"">
##$SUBNAM7= <"">
##$SUBNAM8= <"">
##$SUBNAM9= <"">
##$SW= 501.771253377433
##$SWIBOX= (0..15)
0 1 3 0 0 0 0 0 0 0 0 0 0 0 0 0 
##$SW_h= 40650.406504065
##$TD= 32768
##$TD0= 1
##$TE= 0
##$TE2= 300
##$TE3= 300
##$TEG= 300
##$TL= (0..7)
0 120 53 12 22 120 120 120 
##$TP= (0..7)
150 150 150 150 150 150 150 150 
##$TP07= 0
##$TPNAME0= <>
##$TPNAME1= <>
##$TPNAME2= <>
##$TPNAME3= <>
##$TPNAME4= <>
##$TPNAME5= <>
##$TPNAME6= <>
##$TPNAME7= <>
##$TPOAL= (0..7)
0.5 0.5 0.5 0.5 0.5 0.5 0.5 0.5 
##$TPOFFS= (0..7)
0 0 0 0 0 0 0 0 
##$TUNHIN= 0
##$TUNHOUT= 0
##$TUNXOUT= 0
##$USERA1= <user>
##$USERA2= <user>
##$USERA3= <user>
##$USERA4= <user>
##$USERA5= <user>
##$V9= 5
##$VALIST= <valist>
##$VCLIST= <CCCCCCCCCCCCCCC>
##$VD= 0
##$VDLIST= <DDDDDDDDDDDDDDD>
##$VPLIST= <PPPPPPPPPPPPPPP>
##$VTLIST= <TTTTTTTTTTTTTTT>
##$WBST= 1024
##$WBSW= 4
##$XGAIN= (0..3)
0 0 0 0 
##$XL= 0
##$YL= 0
##$YMAX_a= 28760
##$YMIN_a= -28854
##$ZGOPTNS= <>
##$ZL1= 120
##$ZL2= 120
##$ZL3= 120
##$ZL4= 120
##$ABSF1= 248.5645
##$ABSF2= -253.2056
##$ABSG= 5
##$ABSL= 3
##$ALPHA= 0
##$AQORDER= 0
##$ASSFAC= 0
##$ASSFACI= 0
##$ASSFACX= 0
##$ASSWID= 0
##$AUNMP= <proc_1d>
##$AZFE= 0.1
##$AZFW= 0.5
##$BCFW= 0
##$BC_mod= 2
##$BYTORDP= 0
##$COROFFS= 0
##$CY= -3
##$DATMOD= 1
##$DC= 0
##$DFILT= <>
##$DTYPP= 0
##$F1P= 0
##$F2P= 0
##$FCOR= 1
##$FTSIZE= 65536
##$FT_mod= 6
##$GAMMA= 0
##$GB= 0
##$INTBC= 1
##$INTSCL= 6.047779e-11
##$ISEN= 30
##$LB= 10
##$LEV0= 0
##$LPBIN= 0
##$MAXI= 10000
##$MC2= 0
##$MEAN= 0
##$ME_mod= 0
##$MI= 50
##$NCOEF= 0
##$NC_proc= -7
##$NLEV= 6
##$NOISF1= 182.463
##$NOISF2= 159.3651
##$NSP= 0
##$NTH_PI= 0
##$NZP= 0
##$OFFSET= 248.5645
##$PC= 4
##$PHC0= -192.0891
##$PHC1= 0
##$PH_mod= 1
##$PKNL= yes
##$PPARMOD= 0
##$PSCAL= 0
##$PSIGN= 0
##$REVERSE= no
##$SF= 81.0140089999694
##$SI= 65536
##$SIGF1= 159.3651
##$SIGF2= -187.1042
##$SINO= 113.3802
##$SIOLD= 16384
##$SREGLST= <1H.CDCl3>
##$SSB= 0
##$STSI= 65536
##$STSR= 0
##$SW_p= 40650.406504065
##$SYMM= 0
##$S_DEV= 0
##$TDeff= 32768
##$TDoff= 0
##$TI= <>
##$TILT= no
##$TM1= 0
##$TM2= 0
##$TOPLEV= 0
##$USERP1= <user>
##$USERP2= <user>
##$USERP3= <user>
##$USERP4= <user>
##$USERP5= <user>
##$WDW= 1
##$XDIM= 65536
##$YMAX_p= 389255694
##$YMIN_p= -34596114
$$ End of Bruker specific parameters
$$ ---------------------------------
##NTUPLES= NMR SPECTRUM
##VAR_NAME=  FREQUENCY,     SPECTRUM/REAL,   SPECTRUM/IMAG
##SYMBOL=    X,             R,               I
##VAR_TYPE=  INDEPENDENT,   DEPENDENT,       DEPENDENT
##VAR_FORM=  AFFN,          ASDF,            ASDF
##VAR_DIM=   65536,         65536,           65536
##UNITS=     HZ,            ARBITRARY UNITS, ARBITRARY UNITS
##FACTOR=    0.620285442955139, 1,           1
##FIRST=     20137.2065510682, 0,            0
##LAST=      -20513.1999529968, 0,           0
##MIN=       -20513.1999529968, -34596114,   0
##MAX=       20137.2065510682, 389255694,    0
$$ Real data points
##PAGE= N=1
##DATA TABLE= (X++(R..R)), XYDATA
$$ [...]
41663 -656436 -457194 -233008 7663 251394 479233 668998 800523 861793 852960 786306
41653 786306 682301 563655 449621 352182 274921 214574 164524 118755 74688 34306 3968
41642 3968 -6615 13634 73925 177923 321464 493023 676636 855621 1015527 1145714
41632 1145714 1239775 1295124 1312074 1292814 1240787 1160761 1059347 945036 826894 711906
41622 711906 602201 493882 378338 245502 87585 -98021 -307308 -529804 -750290 -951750
41612 -951750 -1118799 -1240471 -1311564 -1332395 -1307442 -1243581 -1148527 -1029974 -895665 -753868
41602 -753868 -613223 -481313 -362572 -257119 -161353 -69563 24776 128263 246363 381247
41592 381247 529970 684980 837432 981404 1116566 1248350 1386462 1542768 1728763 1952499
41582 1952499 2215751 2512788 2831586 3156829 3473206 3767858 4031636 4259509 4450419
41573 4450419 4606722 4733114 4835048 4916809 4979818 5021838 5037620 5020893 4966878 4874127 4744763
41562 4744763 4583187 4394151 4181458 3948063 3697479 3435472 3170781 2914243 2676730
41553 2676730 2467025 2290384 2148005 2037204 1952124 1884681 1825276 1763063 1686194 1582876
41543 1582876 1443610 1264222 1048542 809426 567116 344838 162621 31287 -51081 -98403
41533 -98403 -131387 -169926 -226646 -304438 -398044 -497520 -591333 -668329 -719032 -736530 -716782 -658294
41521 -658294 -561487 -428267 -262050 -68378 143993 362136 569219 747010 880302 961401
41511 961401 992130 981960 943304 886814 819237 744252 664664 583903 505857 433459 367174
41500 367174 304476 240757 171211 92574 3753 -94786 -202040 -316780 -436664 -556794 -669118
41489 -669118 -763695 -831545 -867559 -871963 -849834 -809128 -757819 -700743 -637297 -561524 -465430 -344308
41477 -344308 -201244 -48312 96220 213280 288624 316692 301534 254715 191020 123556 60149
41466 60149 2494 -52037 -107487 -167015 -231760 -300298 -368324 -428823 -473201 -493049 -481752 -435317
41454 -435317 -352411 -233884 -82057 100026 309287 542988 798472 1072027 1357411 1644946
41444 1644946 1921808 2173411 2385498 2546725 2651342 2701144 2705858 2681932 2650186 2632758
41434 2632758 2649526 2714396 2832258 2997643 3195973 3407626 3613692 3801030 3964519 4106455
41424 4106455 4234672 4360477 4496200 4652126 4833783 5041074 5269407 5511643 5759689
41415 5759689 6005580 6242366 6464710 6668502 6849001 6998342 7104388 7152694 7131082 7034096
41405 7034096 6864481 6631216 6346128 6021435 5668979 5300249 4926114 4556188 4198757
41396 4198757 3862082 3556465 3295052 3091762 2956801 2892224 2889981 2933081 2998841 3062655
41386 3062655 3101311 3095618 3032396 2905667 2716745 2473013 2185999 1869682 1539564 1212188
41376 1212188 904180 630155 399499 212992 60931 -75663 -220193 -393321 -606237
41367 -606237 -857082 -1131901 -1409349 -1666872 -1885686 -2052978 -2161443 -2207525 -2189682 -2107285
41357 -2107285 -1960189 -1748982 -1475987 -1146434 -768872 -354196 85798 538909 991511
41348 991511 1427426 1828628 2178387 2465574 2688024 2853619 2978767 3084704 3192340 3316929
41338 3316929 3464207 3629529 3800390 3961344 4099285 4207165 4284966 4338096 4374557 4402850
41328 4402850 4431887 4472476 4538492 4646020 4810267 5041766 5343740 5711755 6135297 6600026
41318 6600026 7089389 7585400 8069088 8521238 8923387 9259164 9516273 9688900 9779088 9795505
41308 9795505 9750021 9654493 9519840 9356847 9176521 8988774 8800396 8614015 8428596 8240725
41298 8240725 8045699 7838283 7613491 7367535 7098511 6806355 6492306 6158677 5809428
41289 5809428 5451050 5092629 4744507 4416124 4114187 3841806 3598521 3380881 3183449
41280 3183449 3000257 2826393 2659417 2500458 2354688 2230501 2136657 2077991 2051770 2047062
41270 2047062 2047896 2038639 2008933 1955973 1883536 1798963 1710172 1624208 1547350 1485526 1443937 1425751
41258 1425751 1430575 1453624 1486276 1518215 1540602 1548693 1542190 1522979 1491832 1446633 1383524 1300125
41246 1300125 1198652 1087353 980057 894333 848608 858544 933492 1074282 1273156 1515626
41236 1515626 1783324 2056755 2317419 2549461 2741360 2887583 2989403 3054044 3092465 3117106
41226 3117106 3140564 3174934 3230834 3315634 3431241 3572396 3726469 3875511 4000363 4085621
41216 4085621 4123664 4116125 4072279 4005101 3927027 3847398 3772395 3706464 3653662 3618105 3603759
41205 3603759 3614084 3651521 3716625 3806948 3916161 4033927 4146635 4238890 4295595 4304648 4259867
41194 4259867 4163102 4024039 3857108 3676641 3492705 3309646 3127653 2945913 2765357 2589554
41184 2589554 2423699 2272759 2140001 2026468 1931186 1851641 1784373 1725755 1672918 1624335
41174 1624335 1579673 1538857 1500940 1463501 1422745 1374036 1312708 1235416 1141792 1035266 921775
41163 921775 806834 693314 582058 474885 377233 298002 246706 230089 250338 305454 390990
41152 390990 502077 634901 786985 955930 1137092 1321719 1497331 1650753 1772328 1858870
41142 1858870 1914094 1947062 1970130 1997133 2041558 2114286 2221185 2361302 2526483 2702911
41132 2702911 2874543 3027472 3153410 3250558 3321474 3369240 3394009 3391857 3356828 3285591 3182600
41121 3182600 3062910 2950836 2874815 2860665 2925799 3076018 3305360 3598651 3935686 4295481
41111 4295481 4659224 5011682 5341791 5643080 5913670 6155027 6369503 6557827 6717985
41102 6717985 6845993 6937983 6992540 7012286 7004125 6978233 6946279 6919337 6905665 6908740 6926283
41091 6926283 6950745 6970693 6972327 6941305 6865730 6740033 6567711 6360702 6135372 5907460
41081 5907460 5688859 5487402 5308596 5157174 5037042 4949941 4894189 4864494 4852697 4848922
41071 4848922 4842858 4825151 4788637 4729133 4645706 4540375 4417113 4280349 4133942 3981416
41061 3981416 3827062 3676639 3536990 3415069 3317144 3248062 3210224 3202501 3220265 3257191 3308092
41050 3308092 3371064 3447684 3541539 3656613 3796871 3967236 4175061 4430831 4747362 5137492
41040 5137492 5611007 6171782 6816067 7532549 8304251 9111397 9933340 10747924 11528787
41031 11528787 12243550 12855972 13332257 13648456 13794972 13776282 13606909 13306406 12895836
41022 12895836 12396661 11831329 11224251 10602017 9991913 9418208 8897055 8432751 8018376
41013 8018376 7641293 7290347 6960409 6652040 6367666 6107645 5868992 5647154 5438927
41004 5438927 5244187 5065536 4906871 4772356 4666270 4593047 4556835 4560595 4605210 4688981
40994 4688981 4807568 4954462 5122065 5303344 5493433 5690349 5894257 6105722 6324060
40985 6324060 6546706 6769658 6988450 7199023 7398247 7584135 7755827 7913254 8056345
40976 8056345 8183890 8292819 8378524 8436016 8460797 8448640 8394774 8293670 8140088 7930785
40966 7930785 7665777 7348562 6985656 6586320 6162854 5730986 5309356 4917650 4573930
40957 4573930 4292215 4080969 3942557 3873269 3863716 3899598 3962892 4033405 4090465 4114762 4090673
40946 4090673 4009133 3870119 3683230 3465521 3237074 3015834 2813244 2632118 2467704 2311651
40936 2311651 2156912 2001058 1846772 1700162 1568425 1457980 1373673 1319066 1297308 1311520
40926 1311520 1363885 1453648 1575202 1717502 1865385 2002532 2115274 2195984 2244685 2268039
40916 2268039 2276090 2278330 2280841 2285206 2288722 2285065 2265365 2220212 2142650 2031073 1890262 1729572
40904 1729572 1559134 1386481 1215677 1049057 889721 742750 614683 512210 440935 404326
40894 404326 402774 433147 489346 563556 647254 731393 806334 862754 894035 899224 884465 861367
40882 861367 842554 836580 844834 861745 877579 882013 866895 827566 762908 674589 566207 442950
40870 442950 312014 183196 68725 -18073 -64878 -62426 -6061 103215 258092 444925
40860 444925 644845 836334 998799 1116017 1178338 1183393 1135680 1045093 924339 785622
40850 785622 638036 486865 334783 183729 36252 -104272 -234551 -352809 -459673 -557498
40840 -557498 -648422 -732631 -808010 -871120 -918428 -947037 -954744 -939764 -900420 -835305 -744094 -628468
40828 -628468 -492137 -339535 -174027 2898 190849 389105 595988 809410 1027543 1248485
40818 1248485 1468889 1682558 1880019 2049732 2181067 2268364 2314060 2328671 2327171 2323789 2328068
40807 2328068 2343622 2369205 2401143 2436104 2473327 2515347 2567084 2634060 2720729 2829544 2960922
40796 2960922 3113988 3287531 3480062 3688364 3905056 4116830 4305032 4449020 4531311 4542396
40786 4542396 4483198 4364252 4202343 4016403 3824355 3641618 3480860 3352059 3261855 3212079
40776 3212079 3198320 3209880 3231749 3248017 3245561 3217163 3163544 3093505 3021426 2962372 2926802
40765 2926802 2917528 2930356 2957680 2992535 3030739 3070176 3108361 3140441 3159090 3156020 3123886 3057827
40753 3057827 2956748 2824265 2668575 2500744 2332200 2173024 2031711 1915702 1831701 1785534
40743 1785534 1781935 1824280 1914045 2050145 2228835 2444437 2690307 2959094 3242205 3529422
40733 3529422 3809679 4073055 4312857 4526366 4713696 4875494 5011159 5118769 5196605 5244907
40723 5244907 5266558 5266263 5248782 5217264 5172716 5115096 5045520 4967986 4888969 4814751 4748127 4686707
40711 4686707 4623829 4551217 4461635 4350348 4215391 4057456 3880050 3689759 3495901 3309083
40701 3309083 3139118 2993306 2875856 2788501 2731635 2705196 2708720 2740571 2796779 2870317 2951656
40690 2951656 3030863 3100433 3157225 3202115 3237444 3263996 3279551 3279800 3260594 3219960 3159065 3082400
40678 3082400 2997559 2914350 2842877 2791063 2763037 2759430 2779052 2820233 2880591 2955651 3037894
40667 3037894 3117349 3183648 3228660 3248615 3244904 3223207 3191582 3158805 3133835 3125880 3143593 3192863
40655 3192863 3274323 3382324 3506029 3631799 3745816 3836579 3897089 3926048 3927126 3906334 3868905
40644 3868905 3817478 3752469 3674037 3584171 3487493 3390277 3298435 3215869 3144146 3083473 3034133
40633 3034133 2997474 2976069 2973059 2991019 3030786 3090597 3165768 3249016 3331402 3403611 3457157
40622 3457157 3485380 3484415 3454149 3398437 3323682 3235929 3138176 3029625 2907113 2767399 2609042
40611 2609042 2433640 2246715 2057748 1878328 1718472 1583270 1472596 1384293 1317826 1274697
40601 1274697 1255039 1253826 1260616 1263425 1253555 1227795 1187093 1133562 1068292 991214 902623 805114
40589 805114 704660 610130 531317 476149 448111 444942 459181 480246 497021 500191 484366 450204
40577 450204 405899 366469 349908 371135 436440 541256 672397 813504 950756 1076010
40567 1076010 1186236 1280278 1355256 1404641 1418944 1388541 1307209 1174748 997686 788090
40557 788090 561216 333036 118364 -70093 -222027 -329779 -388773 -397836 -358939 -276367
40547 -276367 -155727 -3058 176019 376956 596172 829955 1073081 1318462 1558432 1786918
40537 1786918 2001022 2201119 2389526 2568463 2738131 2895916 3037607 3160700 3268116
40528 3268116 3369575 3478839 3607784 3760571 3931108 4104794 4263228 4389895 4475111 4518935
40518 4518935 4530825 4525692 4517839 4515813 4520721 4528030 4530648 4521127 4492665 4439858 4359587 4251212
40506 4251212 4115319 3951807 3759229 3536520 3286273 3017458 2745893 2492247 2278291
40497 2278291 2122611 2037011 2024785 2081306 2196246 2356181 2546797 2754769 2969368 3183157
40487 3183157 3391183 3588965 3770587 3927954 4051355 4131097 4159910 4135594 4062647 3951595
40477 3951595 3815853 3667634 3515036 3361589 3207861 3053676 2899579 2747221 2599184
40468 2599184 2458989 2331520 2223541 2143635 2100875 2102121 2149036 2236780 2355686 2494998
40458 2494998 2646155 2803786 2965011 3129047 3298362 3480299 3687062 3932897 4229412
40449 4229412 4581157 4983328 5422037 5876472 6322155 6734862 7094813 7390061 7617527
40440 7617527 7780952 7887003 7942009 7951240 7920501 7857990 7774528 7681908 7590492 7507264 7434564
40429 7434564 7369449 7303999 7227139 7127647 6997044 6831210 6630997 6402638 6158013 5913693
40419 5913693 5688189 5498348 5356766 5271182 5245194 5278744 5367575 5502368 5669074 5851081
40409 5851081 6032015 6197280 6333723 6428820 6471133 6452372 6369869 6228279 6039767 5822295
40399 5822295 5595883 5377991 5180527 5010419 4872902 4774159 4720136 4711747 4740080 4785778
40389 4785778 4823886 4831638 4795119 4712183 4591695 4450548 4309675 4189763 4107499 4073423 4092024
40378 4092024 4163369 4284619 4449947 4649111 4866434 5082117 5276068 5432458 5542712 5605844
40368 5605844 5626819 5614399 5579377 5533064 5485341 5442103 5403058 5361442 5306353 5226808 5115587
40357 5115587 4971506 4799973 4612359 4424161 4251604 4106932 3994015 3906583 3830388 3748587
40347 3748587 3648026 3523841 3380582 3229721 3085101 2958864 2859733 2793493 2763826 2771972
40337 2771972 2815308 2886274 2972870 3060723 3135768 3186396 3204398 3184790 3125201 3025625 2888962
40326 2888962 2721934 2535346 2342662 2156977 1987767 1839159 1710403 1597792 1496875
40317 1496875 1404265 1318765 1241474 1174736 1120597 1079838 1051945 1035484 1028192 1026850 1027595 1026856
40305 1026856 1022431 1013853 1001823 987204 970552 952541 934807 920284 912594 914937 929324 956564
40293 956564 996743 1049742 1115733 1195830 1292747 1410556 1552853 1719789 1905700 2098857
40283 2098857 2283518 2443034 2562865 2632963 2649497 2615762 2541759 2442264 2333711 2231060
40273 2231060 2145694 2084735 2051084 2043442 2056358 2080997 2106938 2124301 2125161 2103993 2057672 1985732
40261 1985732 1890779 1778566 1657330 1536666 1426487 1336251 1274176 1246151 1254474 1296950 1366998
40250 1366998 1455238 1552274 1651401 1749535 1845691 1938308 2023483 2095223 2147117 2174196 2174088 2147123
40238 2147123 2095316 2020747 1924436 1806837 1669851 1519069 1364494 1218833 1093944 997169
40228 997169 929500 886483 861314 848430 845904 855882 883394 934536 1014736 1127197 1271349
40217 1271349 1441624 1627239 1813289 1982848 2119513 2209970 2246102 2225983 2153479 2037054
40207 2037054 1888750 1723849 1560675 1419360 1318903 1273158 1287810 1360251 1482309 1643634
40197 1643634 1833510 2040950 2254530 2462970 2655990 2824729 2961900 3062224 3122997 3144126
40187 3144126 3127440 3075965 2993756 2886080 2759334 2620387 2475589 2329892 2186458 2047114
40177 2047114 1913818 1790527 1684091 1603085 1554912 1543073 1566651 1622548 1709081 1828548
40167 1828548 1986975 2191041 2444292 2745322 3089057 3469715 3882906 4325680 4795504
40158 4795504 5289651 5805303 6339655 6889559 7451187 8020497 8594450 9172067 9754188
40149 9754188 10341566 10932031 11517872 12084331 12609817 13068411 13434831 13690409 13827320
40140 13827320 13849175 13768842 13606096 13386689 13142125 12908679 12725273 12630744 12660864 12845106
40130 12845106 13203583 13745273 14468146 15360658 16403434 17570562 18830797 20149068 21487763
40121 21487763 22806473 24059738 25194658 26151934 26872593 27308694 27432960 27242877 26758472
40112 26758472 26016708 25065912 23961663 22763407 21530680 20318897 19175728 18138915
40104 18138915 17235440 16481435 15882747 15436650 15134760 14966059 14918570 14979313 15133612 15365242
40094 15365242 15657989 15997641 16372544 16771328 17178175 17568352 17907433 18155971 18278077
40085 18278077 18250157 18066204 17738176 17292150 16762256 16184623 15593010 15016672 14479546
40076 14479546 13999221 13584930 13235654 12940537 12682766 12445514 12216830 11991041 11766636
40067 11766636 11542720 11316568 11083685 10840102 10585198 10323017 10060879 9805783 9560429
40058 9560429 9321068 9078445 8821540 8542364 8239662 7920215 7597514 7288300 7007810
40049 7007810 6765237 6561532 6390832 6244309 6113507 5991106 5869966 5742940 5604642
40040 5604642 5453749 5293578 5130130 4968870 4812306 4659619 4508268 4356344 4204187
40031 4204187 4054326 3909951 3773095 3643830 3521106 3404893 3298372 3208782 3146258 3121232
40021 3121232 3141856 3212496 3333233 3499629 3702416 3927657 4158180 4376457 4568057 4724257
40011 4724257 4842743 4926482 4981890 5017500 5043362 5070467 5109510 5169148 5254399 5365638 5498135
40000 5498135 5642102 5783554 5906387 5995643 6041161 6040218 5997858 5924652 5833030 5734029 5635678
39989 5635678 5542805 5457170 5377229 5297694 5209786 5102970 4968332 4802579 4610717 4405664
39979 4405664 4204777 4025154 3879996 3776894 3717376 3696963 3705876 3731175 3760304 3784813 3802416
39968 3802416 3816505 3833770 3861481 3905458 3968716 4050472 4145874 4247130 4345967 4436327 4516222
39957 4516222 4588652 4661773 4748013 4861647 5015211 5216184 5465265 5756519 6078890 6418512
39947 6418512 6761313 7095191 7411067 7702589 7965113 8194857 8388898 8545887 8666669
39938 8666669 8753685 8808882 8831225 8815668 8754783 8642430 8477561 8266297 8021496 7760143
39928 7760143 7499581 7253955 7032152 6837752 6670392 6527626 6406673 6305933 6225847 6168460
39918 6168460 6135651 6127076 6139089 6165011 6196316 6224129 6240702 6240474 6220556 6180974 6124943 6058710
39906 6058710 5990080 5925989 5870927 5827666 5799467 5791325 5808855 5855922 5933403 6040091 6174525
39895 6174525 6335517 6520630 6724103 6936505 7146951 7346590 7531465 7703736 7871329
39886 7871329 8046077 8240418 8463234 8716395 8993545 9281607 9564206 9825600 10053797
39877 10053797 10242224 10390052 10501798 10586659 10657299 10727370 10807603 10901761 11004702 11103984
39867 11103984 11184205 11231569 11236711 11195776 11110825 10990020 10846971 10698628 10562138 10451758
39857 10451758 10376825 10341318 10344926 10384820 10456920 10555937 10674790 10804686 10936541 11063029
39847 11063029 11179927 11286121 11382826 11472868 11560354 11650331 11748037 11857789 11981721 12118687
39837 12118687 12263901 12410104 12550420 12681831 12807471 12936671 13082934 13260704 13481752
39828 13481752 13751861 14068821 14422484 14797037 15174808 15540583 15885116 16206502 16508784
39819 16508784 16798607 17081947 17362477 17641656 17919406 18194746 18466625 18735318 19003821
39810 19003821 19278133 19566108 19875955 20215846 20595082 21025841 21524029 22108333 22797706
39801 22797706 23608420 24552035 25634935 26859058 28222826 29721431 31345904 33080452
39793 33080452 34898392 36758848 38607739 40385211 42037821 43530525 44853468 46021175
39785 46021175 47064979 48021558 48921607 49782378 50605762 51380689 52086817 52697535 53182850
39776 53182850 53513911 53669280 53640514 53434105 53069282 52574335 51984587 51342393 50696640
39767 50696640 50098965 49596287 49222070 48989582 48889519 48892689 48956594 49033213 49074995 49037767
39757 49037767 48881874 48574104 48091438 47424927 46580745 45577059 44438425 43191126 41861835
39748 41861835 40479181 39075368 37685047 36340897 35068115 33881127 32784401 31776501
39740 31776501 30854748 30017959 29266396 28599831 28015378 27506543 27063739 26675436 26328848
39731 26328848 26009918 25703551 25394916 25071499 24724821 24351320 23952987 23537999 23120541
39722 23120541 22718542 22349558 22026659 21756214 21537973 21366572 21233530 21129378 21045557
39713 21045557 20975482 20914379 20858489 20804955 20753213 20707073 20675700 20672494 20712492 20809858 20976214
39702 20976214 21219517 21542999 21944082 22413200 22932522 23475506 24009246 24500737 24925044
39693 24925044 25271182 25542712 25753977 25925330 26079993 26242589 26438037 26689853 27017739
39684 27017739 27434515 27942823 28533029 29184644 29872245 30573683 31275797 31973853 32665091
39675 32665091 33340923 33983450 34569078 35077541 35501191 35849404 36146016 36421596 36704316
39666 36704316 37012531 37350737 37709417 38068565 38403457 38690364 38910355 39050913 39106201
39657 39106201 39076513 38966617 38783094 38532018 38219101 37853033 37450272 37037936 36652490
39648 36652490 36334465 36121359 36040746 36104278 36302488 36600802 36938778 37235711 37404730 37373189
39638 37373189 37101982 36594658 35891882 35054848 34146547 33218594 32306030 31428224 30592933
39629 30592933 29801500 29053712 28351117 27698199 27101800 26569585 26107846 25718936 25399360
39620 25399360 25140161 24930278 24761362 24631478 24545902 24515010 24550526 24661700 24853008 25124359
39610 25124359 25473505 25899244 26404113 26996310 27691021 28510526 29482059 30633409 31988217
39601 31988217 33563334 35368909 37409647 39684936 42186538 44893834 47767379 50742550
39593 50742550 53726194 56598956 59223473 61455657 63156574 64205209 64513307 64040364
39585 64040364 62802979 60873548 58368366 55429666 52206894 48841072 45454508 42146571
39577 42146571 38994055 36053167 33360939 30935874 28778773 26874573 25195581 23706370
39569 23706370 22370052 21154616 20037308 19005590 18054692 17183299 16389517 15668336 15010648
39560 15010648 14403569 13832429 13284506 12752969 12238412 11746726 11284879 10857490 10465609
39551 10465609 10107076 9777229 9469594 9177163 8894789 8622264 8366573 8141712 7965572
39542 7965572 7854950 7820558 7863616 7974997 8137236 8328726 8528473 8719525 8890213 9033730
39532 9033730 9147183 9230997 9288634 9325968 9349699 9365095 9374267 9375793 9365358 9336405 9280641
39521 9280641 9189250 9055515 8878233 8664288 8428795 8192416 7976756 7799766 7673038 7601709
39511 7601709 7586066 7623230 7707958 7832884 7989030 8166890 8357679 8554485 8753496 8955088
39501 8955088 9163661 9385092 9622599 9873576 10129569 10379052 10610774 10815762 10987554
39492 10987554 11121281 11212599 11257521 11253700 11202676 11111711 10994143 10867934 10752517 10664440
39482 10664440 10613067 10598273 10611117 10636688 10657452 10656153 10618346 10534635 10402120 10224525 10010922
39471 10010922 9773431 9524723 9276411 9039073 8823411 8640810 8501891 8413398 8375369 8380507
39461 8380507 8416117 8467292 8519858 8562415 8587703 8593429 8582191 8560386 8536526 8519603 8517666 8536761
39449 8536761 8580756 8652383 8754716 8891568 9066250 9279730 9529581 9809930 10111686 10422733
39439 10422733 10728577 11014060 11265846 11474615 11635860 11748961 11815285 11836661 11815412 11756027
39429 11756027 11667372 11563570 11462005 11378612 11322661 11294069 11284679 11282275 11274745 11252660 11210210
39418 11210210 11145212 11058626 10953475 10833190 10699727 10552371 10388025 10203067 9995966 9769492
39408 9769492 9531834 9296407 9080322 8901652 8776066 8713798 8717563 8781763 8893204 9033460
39398 9033460 9182537 9322807 9442062 9534988 9602806 9651367 9688679 9723006 9762244 9814294 9887772
39387 9887772 9992395 10138446 10334917 10586706 10892215 11242531 11622322 12011603 12387868
39378 12387868 12728646 13014695 13233385 13381281 13464838 13498636 13501490 13491618 13482575 13481359 13489275
39367 13489275 13505047 13528630 13563870 13618942 13704757 13832345 14010174 14242253 14527715 14862165
39357 14862165 15239954 15655861 16105122 16582120 17078903 17584482 18085015 18564591 19006548
39348 19006548 19395435 19719236 19971067 20149996 20261713 20319616 20345169 20365294 20406541 20488946
39338 20488946 20622910 20809409 21041031 21302281 21570422 21818928 22023530 22168496 22250515
39329 22250515 22278841 22271885 22251775 22238930 22248155 22286615 22353350 22440287 22534948 22624453 22699632
39318 22699632 22757700 22802375 22841397 22882691 22931223 22988141 23052031 23120710 23191791 23261387 23321804
39307 23321804 23360073 23359164 23302116 23177142 22980775 22717433 22396364 22028638 21626206 21202807
39297 21202807 20774862 20360646 19977958 19641931 19364179 19152798 19011892 18940360 18931133 18972201
39287 18972201 19049430 19149804 19263453 19383897 19507156 19630947 19754702 19880273 20012743
39278 20012743 20160943 20337561 20558535 20841465 21202865 21654391 22198459 22824399 23507090
39269 23507090 24209929 24891959 25516234 26055417 26492479 26817675 27024988 27110387 27071965 26910659
39259 26910659 26630873 26241302 25756208 25196338 24588714 23965286 23360767 22809265 22339288
39250 22339288 21968244 21699031 21520574 21411596 21345483 21294764 21235133 21149143 21028903 20876702
39240 20876702 20703036 20522619 20349766 20194622 20061161 19947130 19845733 19748729 19650194 19549561
39230 19549561 19452335 19367855 19305102 19268730 19257352 19264747 19282926 19305058 19326736 19345393 19358683
39219 19358683 19362988 19352727 19320723 19259367 19162079 19024507 18845253 18626229 18372774 18093402
39209 18093402 17798850 17500257 17206885 16924300 16653711 16392470 16135035 15873918 15600633
39200 15600633 15306804 14985206 14630387 14238837 13809064 13341847 12840633 12311822 11764608
39191 11764608 11210043 10659383 10122539 9607745 9122811 8676949 8281675 7949756 7692234
39182 7692234 7514387 7412295 7372058 7373011 7394182 7421094 7449517 7484517 7535845 7612439 7718748
39171 7718748 7853997 8013684 8191721 8382191 8580573 8784678 8995157 9215149 9449232
39162 9449232 9702368 9979374 10284500 10620541 10987659 11382846 11800664 12234851 12679782
39153 12679782 13131215 13586653 14046101 14513409 14997283 15510401 16066032 16673457 17334930
39144 17334930 18045888 18797813 19581337 20387540 21206960 22027269 22831352 23597474 24302282
39135 24302282 24925507 25453618 25880024 26202006 26417296 26523770 26523375 26428063 26263470 26067147
39125 26067147 25881323 25743415 25678523 25696543 25793749 25956951 26168191 26408902 26663128 26919606
39115 26919606 27172545 27421309 27669696 27925504 28200457 28509654 28869447 29293627 29789286
39106 29789286 30354462 30978686 31645615 32335717 33027536 33697753 34321634 34875165 35338636
39097 35338636 35700003 35956389 36113521 36184222 36186832 36143364 36076691 36007149 35950304 35917371 35917954
39086 35917954 35963021 36065896 36240747 36499910 36852100 37302667 37855123 38512198 39274974
39077 39274974 40140089 41096144 42120747 43179698 44229357 45222062 46112667 46863431 47445946
39068 47445946 47841122 48039197 48040229 47853793 47497115 46992665 46366950 45650391 44876443 44078621
39058 44078621 43286306 42521352 41796380 41114366 40469070 39846598 39228270 38594024 37925493
39049 37925493 37208614 36436038 35608957 34737425 33838731 32934539 32047925 31200975 30412802
39040 30412802 29697769 29063956 28512319 28037152 27628154 27273795 26964813 26696349 26467750
39031 26467750 26280317 26134301 26026466 25948788 25888044 25826343 25743201 25619646 25443465 25213351
39021 25213351 24939635 24640856 24337600 24046480 23776950 23531932 23310869 23112662 22936772
39012 22936772 22782785 22650121 22538938 22451696 22393748 22372161 22393594 22462961 22583771 22759414
39002 22759414 22993889 23291247 23654396 24084372 24580540 25141193 25763967 26446011 27184258
38993 27184258 27975765 28817582 29705657 30633214 31589676 32560947 33530821 34482681 35400741
38984 35400741 36270860 37081142 37822359 38487755 39071984 39569761 39975496 40284978 40498413
38975 40498413 40622741 40671134 40659475 40601502 40505016 40370493 40191997 39959157 39658936 39276778
38965 39276778 38797596 38207316 37495027 36655161 35688982 34605119 33419163 32152421 30830072
38956 30830072 29479011 28125871 26795484 25509868 24287474 23142400 22083552 21113993
38948 21113993 20230989 19427053 18692021 18015745 17390391 16811327 16276377 15784381 15334374
38939 15334374 14925845 14559329 14236296 13957994 13723755 13529605 13367751 13227090 13094772
38930 13094772 12958820 12811465 12651997 12487349 12329562 12191104 12080288 11998770 11941958 11902078
38920 11902078 11872674 11852381 11846143 11863598 11916002 12013147 12160745 12358365 12598595 12868008
38910 12868008 13149699 13426492 13683943 13912546 14108354 14271665 14404713 14510035 14590604
38901 14590604 14651294 14700120 14747904 14805924 14882525 14980712 15098246 15230098 15371729 15521704
38891 15521704 15683045 15863236 16072761 16322400 16620333 16970374 17372041 17822017 18315840
38882 18315840 18848635 19414551 20005360 20609015 21208743 21783229 22308533 22761937 23126372
38873 23126372 23393161 23561769 23637321 23627646 23540901 23383898 23161224 22875519 22528879 22124639
38863 22124639 21668604 21169304 20637392 20084635 19523138 18965221 18423870 17913263 17448888
38854 17448888 17047149 16724482 16496052 16374086 16366056 16472970 16688204 16997561 17381184 17817157
38844 17817157 18285390 18769936 19258859 19742523 20212024 20658897 21075717 21456497 21796495
38835 21796495 22092085 22341526 22546344 22712140 22848022 22965093 23074971 23188803 23316436
38826 23316436 23465393 23639942 23841002 24067262 24317119 24590379 24888584 25213226 25562047
38817 25562047 25924994 26282279 26606379 26867463 27039469 27103600 27047983 26864842 26547930 26092657
38807 26092657 25499392 24778303 23952383 23055774 22127063 21200459 20299266 19434514 18608396
38798 18608396 17819598 17067517 16353978 15682921 15059338 14488371 13974747 13522181 13132477
38789 13132477 12804528 12533898 12313574 12135747 11993832 11883780 11804367 11756737 11743521 11767561
38779 11767561 11830115 11928770 12055977 12199381 12344457 12478594 12594603 12691660 12773182 12842956
38769 12842956 12901844 12946728 12971955 12972288 12945968 12896802 12834620 12773938 12731200 12721511 12755892 12839575
38757 12839575 12971102 13141785 13335716 13531391 13705691 13839441 13922035 13952541 13936643 13881275
38747 13881275 13789936 13660935 13489165 13270280 13005002 12701210 12372946 12037419 11711981
38738 11711981 11412069 11149815 10932945 10764306 10642608 10564067 10524000 10517643 10540171 10586325
38728 10586325 10650033 10724199 10800643 10870150 10922924 10950027 10945912 10911155 10854080 10790405 10741022
38717 10741022 10728422 10772521 10886847 11076112 11335797 11653644 12012251 12391701 12771391 13131036
38707 13131036 13451737 13717900 13919633 14054143 14125160 14140764 14110962 14046116 13956494 13852329
38697 13852329 13743237 13636032 13531447 13421812 13291917 13123307 12900163 12614327 12268023
38688 12268023 11874030 11453746 11033836 10642374 10305338 10043928 9872846 9799476 9823821 9939007
38678 9939007 10132290 10386588 10682470 11000204 11321530 11631023 11917294 12173926 12399828
38669 12399828 12598824 12778713 12950095 13124928 13314690 13528450 13771460 14044498 14343753
38660 14343753 14661074 14984740 15301022 15596480 15860757 16089554 16286984 16466028 16646112
38651 16646112 16848334 17090170 17381521 17722850 18105299 18512509 18923860 19318650 19680248
38642 19680248 19999220 20274741 20514185 20731537 20945504 21177948 21452565 21793193 22221336
38633 22221336 22753175 23397193 24153689 25016602 25976722 27024664 28152572 29354425 30625252
38624 30625252 31959665 33350343 34787461 36259499 37754706 39261794 40769224 42263581
38616 42263581 43728253 45143415 46487926 47743101 48897142 49948180 50904073 51779125
38608 51779125 52589591 53350290 54073124 54766680 55435808 56080940 56697648 57276769 57804797
38599 57804797 58264430 58635654 58897796 59032397 59026314 58874579 58582500 58166163 57650547 57065702
38589 57065702 56442610 55810264 55194180 54615697 54091474 53633093 53246767 52933157 52687876
38580 52687876 52503325 52371873 52289059 52255123 52274040 52350765 52488362 52686495 52941749 53248896
38570 53248896 53601818 53993580 54416562 54863722 55330711 55817019 56324592 56854314 57402416
38561 57402416 57958696 58506970 59026891 59496095 59892226 60195195 60390128 60470568 60440387 60312916
38551 60312916 60107667 59846630 59551783 59243529 58938830 58648736 58376495 58117472 57861059
38542 57861059 57593842 57302864 56977794 56611225 56197603 55732207 55211366 54633644 54000849
38533 54000849 53318129 52593258 51835599 51055094 50261455 49463604 48669408 47885789 47119322
38524 47119322 46377092 45666940 44996305 44369897 43787498 43243124 42725772 42221300 41715077
38515 41715077 41195163 40655350 40096927 39528299 38962627 38414676 37898292 37425416 37006377
38506 37006377 36650224 36363660 36148349 35997981 35897269 35824330 35756096 35674806 35572864 35454000
38496 35454000 35330404 35217585 35129599 35076456 35063712 35093226 35164226 35274301 35419960 35596400
38486 35596400 35796613 36010858 36227611 36436060 36628906 36803853 36962970 37110523 37250873
38477 37250873 37387756 37525227 37669285 37828875 38015464 38241139 38515736 38843942 39223770
38468 39223770 39647697 40106620 40594918 41113921 41671759 42279824 42948061 43681559 44479640
38459 44479640 45336821 46244542 47193138 48174040 49181854 50215147 51275218 52363685 53480797
38450 53480797 54625598 55797245 56995831 58221942 59475569 60755509 62059829 63387189
38442 63387189 64738508 66118399 67535849 69003682 70536724 72149152 73851939 75651337
38434 75651337 77548632 79540524 81619017 83770396 85973978 88202055 90421568 92596670
38426 92596670 94690866 96668607 98497734 100153636 101623622 102908532 104020280 104977340
38418 104977340 105801257 106515079 107142237 107704656 108220838 108705172 109168316 109617475 110056143
38409 110056143 110484115 110898144 111292367 111657549 111979798 112240728 112420253 112500823 112470425
38400 112470425 112322611 112054357 111663882 111149960 110512836 109756239 108890073 107932924 106913068
38391 106913068 105867063 104836468 103864133 102990938 102252968 101678852 101287421 101085965 101069333
38382 101069333 101220358 101512247 101913110 102391518 102921287 103483934 104068482 104669698 105286594
38373 105286594 105922223 106584264 107284965 108039642 108864399 109774400 110783506 111904967 113152172
38364 113152172 114538378 116074968 117768811 119620221 121622665 123764334 126030667 128406785
38356 128406785 130879382 133437982 136075290 138786276 141566226 144409020 147306983 150252148
38348 150252148 153237049 156253301 159288404 162322718 165328214 168269502 171107267 173803920
38340 173803920 176329811 178666994 180808853 182757434 184522217 186121774 187585608 188951785
38332 188951785 190258712 191534400 192789273 194016876 195201289 196325361 197373986 198331736
38324 198331736 199179303 199894206 200457293 200861863 201120379 201265508 201345917 201419765 201548477
38315 201548477 201791255 202199283 202809150 203636893 204674758 205891913 207238619 208652040
38307 208652040 210061632 211392998 212570977 213524151 214191983 214532986 214530128 214190523 213539928
38298 213539928 212615286 211458543 210112438 208617124 207006926 205308277 203540217 201717207
38290 201717207 199852339 197959467 196054674 194158125 192295907 190499669 188802410 187231440
38282 187231440 185801611 184511497 183342951 182263017 181227333 180184980 179084337 177878268
38274 177878268 176527005 174998743 173269958 171327342 169171211 166818533 164303805 161677625
38266 161677625 159003581 156353785 153802843 151420479 149264293 147374703 145773211 144463270
38258 144463270 143431800 142649643 142070784 141631850 141254255 140850691 140335317 139634434 138693521
38249 138693521 137478712 135974567 134181755 132116227 129807844 127295666 124620337 121817543
38241 121817543 118916134 115940391 112912520 109852240 106773905 103683903 100580509 97456186
38233 97456186 94301161 91107065 87869742 84590413 81274832 77931356 74569981 71204064
38225 71204064 67854214 64551703 61338560 58263534 55375316 52715361 50312271 48179234
38217 48179234 46315194 44709081 43344889 42205075 41271169 40522593 39935772 39485029 39145052
38208 39145052 38893287 38710641 38580356 38486505 38413615 38347656 38277476 38195729 38099130 37988399
38198 37988399 37867865 37744243 37623962 37509544 37396674 37273762 37124242 36930333 36676599
38189 36676599 36352622 35954652 35486171 34957281 34383452 33783924 33179577 32589835 32029358
38180 32029358 31506008 31021024 30570796 30148997 29748283 29361303 28980978 28600192 28211432
38171 28211432 27806988 27379949 26925601 26442554 25932825 25400703 24851064 24288272 23716221
38162 23716221 23139089 22561963 21990969 21433290 20897508 20394249 19936285 19537035 19207143
38153 19207143 18950586 18762736 18631801 18542685 18480702 18433263 18389549 18339620 18274148 18184951
38143 18184951 18065556 17911300 17719296 17488993 17223340 16929338 16616763 16295237 15971391
38134 15971391 15648020 15325906 15007326 14699306 14414706 14170132 13981270 13857757 13800279
38125 13800279 13801040 13846379 13919238 14000453 14070075 14110096 14108041 14059159 13965652 13833723 13670527
38114 13670527 13482800 13277547 13063942 12854810 12666023 12513387 12408244 12353890 12344512 12366930
38104 12366930 12404292 12440054 12460937 12458444 12429470 12376281 12305597 12226597 12148591 12079526 12025805
38093 12025805 11992827 11985219 12006129 12055697 12129820 12220501 12317955 12413132 12499011 12570593 12624777
38082 12624777 12660829 12680675 12687927 12685711 12674657 12652363 12614641 12557666 12479667 12381181 12263809
38071 12263809 12128287 11973008 11793704 11584440 11339436 11054913 10730357 10368967 9977396
38062 9977396 9564800 9141255 8716062 8296911 7890436 7503748 7145745 6827125 6558854
38053 6558854 6349677 6203697 6118987 6087598 6096699 6130210 6170389 6199398 6201339 6164807 6084959
38042 6084959 5963654 5807326 5623748 5419340 5197595 4958349 4698079 4411920 4097299
38033 4097299 3757669 3404253 3054886 2730801 2453086 2240120 2106236 2060884 2107724 2243710
38023 2243710 2458660 2735592 3051885 3381533 3698597 3981107 4213764 4388230 4501627
38014 4501627 4554896 4552224 4501281 4413073 4300483 4175668 4047399 3919712 3792527 3664096
38004 3664096 3534199 3406659 3289703 3193564 3126255 3089818 3079144 3083910 3092367 3095082 3087241
37993 3087241 3069132 3045203 3022255 3007273 3005463 3019255 3048780 3093285 3152266 3225359 3311272
37982 3311272 3406919 3507760 3609238 3708228 3803342 3893881 3978528 4055181 4122107 4179137 4227570
37971 4227570 4268883 4303481 4330714 4350235 4363844 4376553 4396075 4431089 4489712 4579437 4708435
37960 4708435 4886704 5125421 5434103 5816747 6268940 6777573 7323237 7883880 8438059
37951 8438059 8967117 9456809 9898695 10290904 10637628 10947525 11231951 11503818 11776991
37942 11776991 12065598 12382870 12739793 13144201 13600690 14111226 14676082 15294919 15967942
37933 15967942 16697075 17486817 18344136 19276719 20289280 21378411 22527491 23703694 24859324
37924 24859324 25938747 26889769 27675443 28280824 28711504 28985303 29122059 29136392 29035452
37915 29035452 28820759 28491958 28050715 27503934 26866064 26160022 25415977 24667645 23947276
37906 23947276 23281651 22690849 22189551 21788941 21497331 21319154 21253527 21294059 21430541 21651811
37896 21651811 21948595 22315590 22752800 23265856 23864574 24559357 25356435 26253962 27240657
37887 27240657 28297181 29399148 30520120 31633595 32714030 33737779 34684710 35540456
37879 35540456 36298665 36962911 37548241 38082001 38602893 39157379 39794061 40557921 41485996
37870 41485996 42604406 43925515 45444128 47132611 48935497 50765192 52501994 54002587
37862 54002587 55119285 55727230 55751470 55184300 54086519 52572448 50784146 48863172 46927507
37853 46927507 45057929 43294227 41639288 40068575 38542696 37020468 35469311 33870454
37845 33870454 32218575 30517960 28778621 27014900 25246667 23500775 21809879 20207667
37837 20207667 18722498 17372868 16166487 15101826 14169643 13353487 12630624 11975273 11364032
37828 11364032 10781150 10221239 9688770 9195126 8754219 8377499 8069664 7826791 7637685
37819 7637685 7487455 7361166 7246096 7132605 7014355 6888323 6754399 6614491 6471392
37810 6471392 6327838 6185773 6045653 5905861 5762749 5611778 5449388 5274574 5089431
37801 5089431 4898919 4710447 4533382 4378001 4253986 4169263 4129711 4139144 4198618 4305148
37791 4305148 4450961 4624322 4811797 5001040 5182924 5352072 5505589 5641102 5755942
37782 5755942 5848328 5919495 5974780 6022584 6071796 6129153 6197898 6278333 6369828 6472908 6589988
37771 6589988 6724451 6878942 7054071 7248068 7457298 7677183 7903014 8130308 8354886
37762 8354886 8573312 8784186 8990085 9199331 9426710 9692529 10020014 10431796 10946805
37753 10946805 11578581 12334947 13218244 14225815 15351465 16588662 17934823 19394478
37745 19394478 20979248 22704279 24582395 26617514 28798123 31091040 33435741 35740429
37737 35740429 37882406 39716406 41093164 41885739 42015602 41468892 40297328 38604966
37729 38604966 36526571 34204372 31768631 29325568 26953482 24705148 22612877 20693098
37721 20693098 18949113 17372525 15944762 14640097 13430618 12292158 11209285 10177682
37713 10177682 9203264 8298553 7477794 6752651 6129840 5610921 5193349 4871574 4637411
37704 4637411 4479717 4384057 4333216 4308842 4293505 4272171 4232906 4167508 4072578 3950375 3808282
37693 3808282 3656467 3504598 3359050 3221474 3088808 2954265 2808857 2643428 2451286
37684 2451286 2231112 1989063 1738795 1498929 1288851 1124517 1015772 965931 973440 1034518
37674 1034518 1145039 1300348 1493247 1712011 1940426 2160198 2354320 2509621 2617759
37665 2617759 2675037 2681705 2641187 2559465 2444828 2307843 2160863 2016157 1882688 1763044
37655 1763044 1652751 1543158 1426672 1301430 1173013 1052934 955447 894370 880667 920953
37645 920953 1017172 1167591 1368320 1613956 1896556 2203918 2519148 2822735 3096492 3327532
37635 3327532 3510527 3647329 3744089 3807061 3839222 3839535 3805060 3734332 3629997 3499579 3354395
37624 3354395 3207340 3070602 2954413 2867099 2815481 2804215 2833806 2898734 2987629 3086139 3181306
37613 3181306 3265358 3337199 3401325 3465269 3537065 3623509 3729166 3855876 4003122 4169481
37603 4169481 4354415 4558785 4783137 5024822 5276296 5526308 5763574 5980743 6176309
37594 6176309 6353421 6516279 6666077 6798577 6904521 6972599 6993515 6963424 6885560 6769786
37584 6769786 6630654 6484903 6349012 6236935 6158062 6115948 6108494 6129664 6171911 6228270 6293492
37573 6293492 6363982 6436667 6507515 6571105 6622100 6657705 6678923 6689206 6691153 6683450 6659954 6611454
37561 6611454 6529124 6407770 6247326 6052315 5830380 5591112 5345429 5104798 4879720 4677696
37551 4677696 4501433 4348141 4210174 4076804 3936568 3779621 3599684 3395184 3169394
37542 3169394 2929781 2687055 2453920 2242878 2062909 1916375 1798292 1698924 1608190 1519199
37532 1519199 1429190 1338195 1247033 1156196 1066218 979018 899047 833362 790610 779708 808924
37521 808924 885383 1014312 1197537 1431516 1706262 2006542 2315386 2618132 2904481 3167512
37511 3167512 3401116 3598421 3752667 3859610 3919455 3937024 3920230 3877652 3816154 3739540
37501 3739540 3649067 3545527 3431468 3311983 3193956 3084784 2991415 2919481 2872046 2848238
37491 2848238 2842682 2846398 2849095 2842230 2821988 2790997 2757861 2734702 2734013 2766447 2839976 2959798
37479 2959798 3128136 3343527 3599871 3885722 4184637 4477179 4744463 4971793 5150628
37470 5150628 5278027 5354376 5381011 5358825 5288239 5170395 5009176 4813114 4595953 4375191
37460 4375191 4169033 3992870 3856280 3761240 3702307 3669172 3650897 3639763 3632738 3630248 3633613
37449 3633613 3642869 3655810 3668270 3675426 3673792 3663293 3648591 3639023 3647014 3685244 3763571 3886940
37437 3886940 4055119 4263711 4504970 4767697 5037192 5296918 5532319 5735019 5904705
37428 5904705 6047156 6169238 6273826 6357605 6412754 6430963 6407277 6342116 6241372 6115246
37418 6115246 5976520 5838883 5715659 5618820 5557749 5537638 5558199 5613525 5693367 5785268 5876712
37407 5876712 5956452 6014581 6041802 6029221 5969892 5861829 5710469 5528362 5331634 5134913
37397 5134913 4947464 4772298 4608148 4452735 4305571 4169296 4049360 3952365 3883684 3845344
37387 3845344 3835078 3846871 3872488 3903289 3932071 3955085 3974145 3997676 4039219 4113126 4229283
37376 4229283 4389779 4589259 4818222 5066939 5327879 5595755 5865794 6131929 6386602
37367 6386602 6622588 6835392 7024348 7191859 7341839 7478542 7606004 7727611 7845721
37358 7845721 7961714 8076798 8193214 8314891 8446662 8592209 8752086 8923217 9100049
37349 9100049 9276108 9444968 9600842 9739496 9859311 9961519 10049158 10125460 10192790 10252524
37339 10252524 10305583 10353269 10398155 10444570 10497917 10562685 10640176 10727852 10821308 10917848 11019231
37328 11019231 11131906 11265103 11428632 11631933 11884540 12197016 12581284 13049796 13613650
37319 13613650 14280388 15052394 15926452 16894411 17944176 19060138 20222642 21407120 22584402
37310 22584402 23723455 24796480 25784937 26684482 27507345 28281302 29044980 29839957 30700993
37301 30700993 31646839 32674386 33758352 34856705 35919933 36900839 37761903 38478709 39039399
37292 39039399 39441196 39685770 39775893 39715651 39514707 39194405 38791666 38357487 37949881 37624117
37282 37624117 37423985 37376575 37490786 37758381 38156279 38649588 39195745 39750133 40272702
37273 40272702 40733962 41118288 41423216 41655273 41824615 41941408 42015799 42060974 42096645 42150019
37263 42150019 42252904 42436249 42725009 43135926 43678843 44359995 45184877 46158817 47284746
37254 47284746 48559104 49968105 51486881 53082600 54719919 56365320 57987861 59557156
37246 59557156 61041885 62411621 63641952 64719974 65646544 66433430 67096755 67650382 68102643
37237 68102643 68457410 68717986 68891318 68990498 69034387 69044165 69037866 69024888 69002453 68954746 68854195
37226 68854195 68664118 68342780 67849791 67155178 66249229 65148842 63896038 62547522 61158992
37217 61158992 59770812 58400803 57046138 55692076 54322731 52929075 51511421 50076738
37209 50076738 48633520 47187577 45740814 44293047 42845407 41403310 39977435 38582305
37201 38582305 37233361 35944171 34724879 33581888 32518042 31533000 30624029 29787527
37193 29787527 29021042 28325079 27703681 27162789 26706144 26330383 26022347 25760885 25522614
37184 25522614 25288670 25049224 24804039 24559250 24322095 24096359 23880912 23671763 23465708
37175 23465708 23262929 23067199 22884210 22719364 22576055 22454781 22353026 22265794 22186666 22108906
37165 22108906 22026077 21932098 21821469 21690450 21538950 21371789 21198264 21029900 20877046 20745153
37155 20745153 20631915 20526813 20414135 20278666 20111646 19914391 19698379 19482166 19286524
37146 19286524 19129455 19022703 18970878 18973300 19027298 19130795 19282444 19479202 19712905 19968225
37136 19968225 20223520 20454687 20640585 20767873 20833475 20844266 20814752 20763873 20711535 20675128
37126 20675128 20666662 20691488 20749341 20837514 20954769 21104022 21292202 21527244 21813876 22150488
37116 22150488 22528542 22934557 23353457 23771833 24179971 24572486 24948175 25309681 25663037
37107 25663037 26016678 26379986 26761928 27170345 27611830 28091925 28615460 29187049 29811522
37098 29811522 30494212 31241489 32062187 32969752 33983605 35128014 36428241 37905529 39572999
37089 39572999 41433649 43480946 45702052 48082853 50612631 53285799 56099947 59051581
37081 59051581 62131381 65319322 68579307 71854817 75069987 78141007 80998412 83613384
37073 83613384 86015863 88294384 90576853 93001617 95691286 98736926 102192270 106072931
37065 106072931 110356058 114979212 119840624 124803724 129706549 134373275 138624361 142285118
37057 142285118 145196504 147231989 148319505 148461607 147745095 146334696 144451705 142343611
37049 142343611 140252155 138385536 136897716 135875971 135336839 135230024 135449510 135851181
37041 135851181 136275559 136572036 136618953 136334908 135681043 134658014 133301073 131673401 129856426
37032 129856426 127938695 126008192 124151704 122459163 121026532 119952391 119328844 119231253
37024 119231253 119711366 120796219 122493282 124800335 127716350 131248507 135411995 140222581
37016 140222581 145684791 151779751 158455991 165625020 173161783 180909748 188690916 196321457
37008 196321457 203632876 210496927 216850910 222718119 228216620 233550178 238979815 244781403
37000 244781403 251199573 258408542 266487585 275415166 285081560 295314906 305911454 316660588
36992 316660588 327359432 337817035 347850309 357273610 365885701 373462662 379767805
36985 379767805 384583630 387758999 389255694 389178407 387777995 385424601 382553982 379597998
36977 379597998 376915739 374740450 373149996 372060574 371239888 370337235 368930715 366591998
36969 366591998 362962226 357820443 351119101 342971608 333601632 323283844 312303734 300943511
36961 300943511 289480853 278182409 267283085 256954746 247275918 238215456 229639602
36954 229639602 221344832 213109732 204750411 196160179 187320005 178280728 169131940 159975734
36946 159975734 150914032 142045728 133464689 125253770 117476777 110173136 103358178 97028423
36938 97028423 91169005 85759927 80778884 76200313 71992662 68117048 64529491 61186232
36930 61186232 58049530 55091452 52294969 49653093 47166728 44841496 42683852 40697406
36922 40697406 38880373 37224461 35714821 34330704 33047144 31838459 30683381 29569933
36914 29569933 28497252 27473157 26509058 25615399 24799558 24065714 23414830 22843781 22344290
36905 22344290 21903308 21505617 21137544 20789486 20455868 20133349 19819423 19512491 19212369
36896 19212369 18919589 18633116 18347969 18054412 17739363 17389502 16995119 16553586 16071277
36887 16071277 15562807 15047468 14544052 14066449 13621905 13212357 12837350 12496394 12189322
36878 12189322 11914943 11669595 11447345 11242269 11051462 10876530 10722263 10593192 10490339
36869 10490339 10410159 10345902 10289897 10235267 10176643 10110537 10035888 9954550 9870904 9790056 9715103
36858 9715103 9645003 9574503 9496257 9403576 9292217 9160817 9010720 8845499 8669705 8486861
36848 8486861 8297700 8099856 7888919 7659956 7408891 7133828 6836167 6520841 6195226
36839 6195226 5867302 5544192 5231753 4934863 4657507 4402266 4169703 3958612 3767412
36830 3767412 3595715 3444768 3316372 3211304 3128440 3064874 3016310 2977128 2940353 2898440
36820 2898440 2845130 2777414 2696065 2604024 2503724 2395159 2275878 2142627 1993638 1830551
36810 1830551 1659416 1490655 1338208 1217983 1145529 1132852 1185133 1298994 1463581 1664133
36800 1664133 1886098 2117853 2351385 2581909 2807629 3029946 3253274 3483457 3724819
36791 3724819 3976951 4232637 4477855 4694076 4862401 4968346 5005686 4978049 4897791 4782516
36781 4782516 4650419 4516132 4388548 4271071 4163291 4062737 3965880 3868402 3765139 3650334
36771 3650334 3518738 3367425 3197249 3012800 2820869 2628373 2440741 2260917 2088970
36762 2088970 1922515 1758200 1593878 1430460 1272532 1127450 1003504 908179 847127 823729
36752 823729 838906 891413 979250 1101840 1261447 1462533 1709494 2004401 2345687 2727322
36742 2727322 3137886 3560101 3972032 4350342 4674408 4929330 5106765 5203890 5221788 5164294
36732 5164294 5037614 4850434 4614129 4342710 4052108 3758786 3478172 3223572 3005714
36723 3005714 2832447 2708197 2633353 2604331 2614898 2658618 2731167 2830922 2957220 3107515
36713 3107515 3275552 3451600 3624148 3781846 3915105 4017214 4084824 4117569 4117159 4086499
36703 4086499 4029141 3949207 3852107 3745997 3642884 3557768 3505464 3496578 3534802 3616491 3732191
36692 3732191 3869194 4014215 4155495 4283995 4394009 4483665 4555394 4615913 4675448 4746362
36682 4746362 4841650 4973773 5154029 5392361 5697141 6074702 6529054 7062515 7677169 8375805
36672 8375805 9161060 10032820 10985462 12006266 13074734 14161321 15224459 16207332 17038333
36663 17038333 17639228 17941161 17903130 17524773 16847696 15945455 14906997 13819412 12754292
36654 12754292 11759810 10859135 10054402 9334328 8682866 8086179 7535977 7028896 6563648
36645 6563648 6138624 5751397 5399279 5079193 4786390 4513337 4250287 3987673 3719213
36636 3719213 3444239 3168076 2900031 2649794 2424170 2225985 2055304 1911521 1794609
36627 1794609 1705053 1642908 1606647 1592256 1593040 1600599 1606890 1606566 1598581 1586407 1576922 1578385 1597972
36614 1597972 1639344 1700625 1773383 1843197 1892193 1903219 1864420 1772581 1633975 1462793 1278233
36603 1278233 1101405 952342 846870 793677 792886 837159 914794 1012878 1119032 1221832 1311005
36592 1311005 1378174 1418091 1429901 1417818 1390468 1358525 1331341 1314193 1307477 1307717 1309366 1306454
36580 1306454 1293893 1268378 1228716 1175647 1111608 1041024 970913 910803 871073 859805 879683
36569 879683 926839 992486 1066507 1140929 1211610 1277786 1340349 1400061 1456509 1508159 1553562
36558 1553562 1593230 1631090 1674293 1731045 1807541 1905589 2021883 2148667 2275121 2389041
36548 2389041 2478447 2532856 2544167 2507546 2422545 2293791 2130286 1943133 1742670 1536273
36538 1536273 1327522 1116894 903900 690079 481449 288793 125236 2240 -73986 -104077
36528 -104077 -94890 -57576 -5581 46703 84763 95219 68339 1592 -97616 -212469 -321349
36517 -321349 -404667 -450414 -456124 -427441 -374956 -310757 -245376 -185594 -133836 -89382 -50674 -17442
36505 -17442 8509 24075 26559 15317 -7549 -37572 -69113 -96884 -117289 -129192 -133915 -134662
36493 -134662 -135767 -141880 -156828 -181857 -213519 -242269 -253070 -228545 -153853 -21288 167169
36482 167169 399962 658315 919848 1162503 1367916 1523654 1624345 1671821 1674275 1644333
36472 1644333 1596429 1544292 1499153 1468753 1457032 1464385 1488152 1522871 1560314 1590161 1602144
36461 1602144 1589396 1551664 1496809 1439605 1397798 1386592 1413860 1478409 1571966 1683467 1803123
36450 1803123 1924349 2043113 2155438 2254663 2330166 2368554 2356967 2286936 2156989 1973072
36440 1973072 1746987 1493798 1229034 966093 714182 477337 254997 43857 -159881
36431 -159881 -358618 -552101 -737015 -907705 -1057975 -1182950 -1279529 -1344896 -1374191 -1359279
36421 -1359279 -1290135 -1158741 -963720 -713212 -424304 -119365 178711 450227 680448 859893
36411 859893 984154 1053784 1073982 1053606 1003458 934511 856851 779231 708644 649534 603045
36400 603045 566872 535864 503208 462057 407319 336927 252030 156054 53252 -52559 -158676
36389 -158676 -263403 -365467 -463697 -557673 -649119 -743090 -847985 -974187 -1131543 -1325955
36379 -1325955 -1555901 -1810225 -2068562 -2304688 -2491773 -2607917 -2640410 -2587693 -2458786 -2270584
36369 -2270584 -2043722 -1797978 -1548370 -1303240 -1064903 -832298 -604398 -383231 -175528
36360 -175528 7908 155367 258596 315840 331754 314498 271887 208565 125334 20834 -105352
36349 -105352 -249976 -405495 -561694 -708044 -835224 -935574 -1003414 -1035837 -1033468 -1000384
36339 -1000384 -943069 -869166 -786781 -704314 -630068 -571083 -531473 -511188 -506094 -509492 -514081 -513106
36327 -513106 -500002 -467226 -405741 -306212 -161807 28664 258849 515194 779361 1031621
36317 1031621 1254058 1432967 1560521 1635676 1664052 1656708 1627851 1591617 1558285 1531058 1505307
36306 1505307 1471378 1419663 1344957 1247753 1132598 1005542 872439 738331 606930 479468
36296 479468 353467 222858 80390 -78497 -252510 -434018 -611595 -774046 -913764 -1027950
36286 -1027950 -1117670 -1185902 -1235873 -1270295 -1291307 -1300616 -1299481 -1288460 -1267145 -1234310 -1188657 -1129876
36274 -1129876 -1059472 -981119 -900616 -825458 -763751 -722459 -705570 -713133 -741726 -786212 -841940
36263 -841940 -906108 -977373 -1054063 -1132599 -1207545 -1273197 -1325246 -1361445 -1381449 -1386500 -1379313 -1363907
36251 -1363907 -1345067 -1327382 -1313996 -1305504 -1299697 -1292666 -1281007 -1264122 -1245303 -1230883 -1227611 -1239399
36239 -1239399 -1264858 -1296605 -1322198 -1325935 -1290873 -1201145 -1044909 -817658 -524514 -179970 195300
36228 195300 579073 951319 1295655 1598968 1850674 2042731 2170597 2234699 2241814 2205729
36218 2205729 2146219 2085647 2043599 2031556 2050333 2091609 2142481 2190269 2225453 2242356 2238531
36207 2238531 2213882 2169987 2109689 2036717 1954989 1867656 1776299 1680891 1580740 1476220 1370596
36196 1370596 1270990 1187499 1130509 1107600 1121793 1171892 1254351 1365494 1503110 1666737 1856463
36185 1856463 2070937 2305915 2554128 2806292 3052623 3284334 3494619 3678626 3832450
36176 3832450 3952057 4033085 4071308 4062918 4004418 3893011 3728144 3513501 3257894 2974142
36166 2974142 2676424 2377314 2085462 1804436 1533011 1267107 1003215 742023 490303
36157 490303 259722 63105 -89777 -194789 -253888 -274453 -268518 -251701 -240771 -249449 -284014
36146 -284014 -341292 -410513 -478023 -532278 -566992 -581659 -579830 -566126 -543573 -512640 -472313 -422062
36134 -422062 -363424 -300813 -241771 -196447 -175796 -188760 -239692 -327149 -444095 -578773 -716013
36123 -716013 -839341 -934026 -990161 -1004267 -978502 -918083 -828729 -715632 -584209 -441666 -298131
36112 -298131 -166612 -61494 4347 23216 -4464 -69518 -156388 -247717 -329164 -392551 -436386
36101 -436386 -464044 -480910 -491940 -500444 -508028 -515148 -521693 -527374 -531968 -535556 -538927 -544100 -554784
36088 -554784 -576486 -616016 -680120 -773245 -895039 -1038693 -1191221 -1335953 -1456424 -1540277
36078 -1540277 -1581780 -1582211 -1548241 -1489324 -1415383 -1335615 -1258181 -1189810 -1134738 -1093345 -1061716 -1032955
36066 -1032955 -999828 -957330 -904124 -842828 -779830 -725015 -691024 -691607 -738930 -840150 -994135
36055 -994135 -1189786 -1407572 -1624577 -1820969 -1984428 -2110349 -2198713 -2250595 -2266918 -2249702
36045 -2249702 -2204095 -2139109 -2066172 -1996305 -1937793 -1895757 -1873286 -1872323 -1892883 -1931114 -1978385 -2023154
36033 -2023154 -2055148 -2069522 -2068393 -2058819 -2048562 -2042396 -2041000 -2042318 -2043464 -2041628 -2034068 -2018235 -1992262
36020 -1992262 -1955275 -1907160 -1848292 -1779681 -1703022 -1619826 -1529790 -1429770 -1314727 -1180571 -1027196
36009 -1027196 -859802 -687788 -522107 -372498 -245307 -141807 -57107 19608 102878 207068
35999 207068 342165 511056 709433 928153 1156452 1384040 1601313 1798721 1966973 2098714
35989 2098714 2190807 2245816 2271653 2279166 2278299 2274275 2265569 2244688 2201262 2125965 2013560 1864088
35977 1864088 1682119 1474729 1249397 1012924 771953 534499 310825 112148 -52699
35968 -52699 -180521 -274527 -341975 -390264 -423769 -442701 -443883 -422553 -374280 -296530 -189797
35957 -189797 -58292 90269 246133 399840 544081 673994 786131 877374 944963 987698
35947 987698 1007398 1009420 1001604 992158 987865 993729 1013976 1053311 1117320 1211648 1340431 1504774
35935 1504774 1701974 1925749 2167069 2414994 2657387 2881905 3077448 3235670 3351772
35926 3351772 3424414 3455073 3447162 3404948 3332390 3232500 3107586 2959901 2791698 2604609 2399390
35915 2399390 2177039 1940899 1698120 1459374 1237112 1043385 887964 776924 711724 688972
35905 688972 701022 737320 786308 837415 882474 916004 934322 934034 910995 860556 779200 666640
35893 666640 526960 367993 199461 31134 -128041 -270135 -388713 -480102 -544795 -587600
35883 -587600 -615764 -635777 -650626 -658937 -656046 -636063 -593740 -525600 -430292 -308520 -162963
35872 -162963 1727 179175 362168 544230 721325 892969 1062032 1232908 1408524 1587720
35862 1587720 1764814 1931895 2082502 2214191 2328481 2428518 2516142 2589969 2645136 2674511
35852 2674511 2670981 2630279 2553595 2448904 2330042 2213487 2114103 2041600 1998986 1982874 1984688
35841 1984688 1992160 1991263 1968845 1915274 1825790 1699909 1539743 1348735 1131522 894465 645847
35830 645847 395182 151684 -77669 -289691 -485386 -668795 -844533 -1015078 -1178838 -1329713
35820 -1329713 -1458168 -1553460 -1606538 -1612934 -1574649 -1500156 -1402435 -1295801 -1192676 -1101068 -1023243
35809 -1023243 -956068 -893136 -827903 -756368 -678086 -595507 -512459 -432572 -358069 -288988 -223006
35798 -223006 -155945 -82783 1108 98838 211252 336924 473055 616715 765109 914153
35788 914153 1056566 1181980 1280284 1346176 1381369 1392754 1388094 1372356 1346491 1308375 1254750
35777 1254750 1183109 1092900 985835 865493 736800 605906 480503 369994 284551 232538
35767 232538 217194 234687 275351 327838 383663 439405 495675 554245 615592 678359 740678
35756 740678 802048 864068 929050 997151 1064058 1121275 1159161 1170802 1154361 1113102 1054247
35745 1054247 987922 926268 881807 864689 879724 924666 990701 1065037 1134562 1189168 1223460
35734 1223460 1236508 1230422 1209127 1178116 1144810 1118450 1108897 1124693 1171331 1250501 1360430
35723 1360430 1496990 1654922 1828432 2010606 2191865 2358630 2493845 2579921 2603054 2556848
35713 2556848 2443755 2274473 2066315 1841429 1624731 1441029 1311236 1248440 1255218 1323451
35703 1323451 1436977 1576035 1721467 1857143 1970577 2052818 2098699 2107464 2083158 2034088
35693 2034088 1971033 1904412 1841325 1783833 1729484 1673583 1611510 1539666 1455221 1356174 1242696
35682 1242696 1119058 994193 879678 785905 718727 678509 661842 664379 682951 716205 764468
35671 764468 829826 916305 1029041 1171795 1343949 1539205 1747208 1957163 2161202 2355672
35661 2355672 2540320 2716618 2886694 3053296 3219901 3389878 3564560 3741487 3914217
35652 3914217 4073942 4211879 4321007 4396505 4435033 4433448 4387600 4291986 4141004 3931807
35642 3931807 3667519 3358707 3021867 2675793 2338073 2023248 1742407 1503090 1308901
35633 1308901 1159005 1047965 966236 901624 841728 776485 699655 608752 504130 388290
35623 388290 265618 142210 25374 -77258 -159009 -215496 -245416 -250056 -231637 -191462 -129047
35612 -129047 -42685 68699 203062 353135 506032 645537 756508 829598 864215 868778
35602 868778 858491 851403 863931 907162 985220 1095921 1232902 1387911 1552429 1718421 1878355
35591 1878355 2024799 2150064 2246369 2306740 2326397 2304119 2242969 2150011 2034973 1908256
35581 1908256 1778966 1653552 1535301 1424517 1319022 1214818 1107198 992745 871933
35572 871933 751152 642755 562653 526329 544752 621435 751050 919679 1106630 1287897
35562 1287897 1440948 1549693 1607774 1618412 1590771 1534715 1456875 1359804 1243776 1109312
35552 1109312 958705 796229 627563 459021 296822 146546 12925 -100262 -190452 -256616
35542 -256616 -299074 -318520 -314699 -285558 -227401 -136112 -9177 152220 342028 549656 761365
35531 761365 961877 1136035 1271019 1359103 1399618 1398625 1366125 1312382 1245226 1169260 1086777
35520 1086777 999597 911023 826997 755681 705193 680338 679786 695049 711698 712484 681545 608622
35508 608622 492159 340185 168483 -3661 -158849 -286241 -383769 -457191 -516675 -572542
35498 -572542 -631904 -697258 -767218 -838584 -908559 -976143 -1042462 -1110136 -1181734 -1257835 -1335743
35487 -1335743 -1409928 -1473963 -1522250 -1549885 -1550893 -1516885 -1438181 -1307429 -1123469 -892885 -628252
35476 -628252 -344387 -54731 230469 503937 759796 992008 1193932 1359387 1484458 1568953
35466 1568953 1616846 1635725 1635372 1625597 1613783 1603059 1592044 1576444 1551967 1517213 1475166 1432583
35454 1432583 1397768 1377871 1376668 1393418 1423291 1459666 1497731 1537948 1587794 1660905 1773417
35443 1773417 1938325 2159718 2429622 2729034 3032542 3314236 3552733 3734285 3853994
35434 3853994 3915436 3929267 3911059 3878397 3847354 3829286 3829312 3847060 3878802 3919260 3962052 3999099
35422 3999099 4020415 4015508 3976369 3900392 3791183 3656470 3504400 3340413 3166038 2979389
35412 2979389 2776414 2552256 2302706 2025766 1723152 1401258 1071180 747395 445186
35403 445186 177491 -47508 -227264 -364253 -464567 -536106 -586550 -621572 -644107 -654909
35393 -654909 -653748 -640353 -614876 -578025 -530959 -474881 -410700 -339190 -261556 -179740 -96190 -13412
35381 -13412 66090 139611 204186 257035 296241 321419 334040 337288 335068 330211 322446 307564
35369 307564 278697 229422 156942 63654 -43313 -153662 -255459 -336365 -385223 -394494 -362939
35358 -362939 -296630 -206895 -105844 -2276 99705 199310 296872 392569 486481 579366 673399
35347 673399 772038 878773 995420 1121217 1253323 1388029 1521743 1651546 1775584 1893169
35337 1893169 2004181 2107748 2200955 2278549 2334212 2363183 2365093 2345245 2313136 2278592 2247592
35326 2247592 2220139 2191425 2155427 2108685 2051986 1989389 1925996 1866327 1813833 1770642 1736948
35315 1736948 1710592 1687885 1665480 1641966 1617935 1594697 1572781 1551251 1527943 1500067 1464788
35304 1464788 1419697 1363424 1296358 1221219 1142968 1067920 1002408 951646 918968 904975 906193
35293 906193 913748 913382 887713 820457 701261 529422 314936 76169 -165225 -389826 -583907
35282 -583907 -739810 -854277 -926751 -958701 -953747 -917520 -856858 -778668 -689145 -593435 -495304
35271 -495304 -396505 -296340 -192278 -81664 36603 161889 293317 431517 578822 737385
35261 737385 906337 1079677 1246024 1390533 1498749 1561342 1577527 1555121 1507064 1446654
35251 1446654 1384187 1325941 1274593 1229746 1188144 1143770 1088305 1012251 906757 765687 587064
35240 587064 373536 131860 -128300 -396248 -662464 -920349 -1166786 -1401501 -1625941 -1842247
35230 -1842247 -2052360 -2256941 -2454183 -2639108 -2803867 -2938935 -3034287 -3079966 -3066408 -2985488
35220 -2985488 -2832686 -2609504 -2324750 -1993774 -1635797 -1270249 -913285 -575587 -261924
35211 -261924 27697 295743 544444 773553 979480 1155952 1295577 1391472 1438815 1436576
35201 1436576 1389006 1305756 1199809 1083768 966295 850454 734733 616060 493035 367590
35191 367590 244386 128755 24631 -66642 -146530 -218668 -287432 -355893 -424046 -488309 -542780
35180 -542780 -581685 -602038 -605712 -600290 -598216 -613811 -658505 -735954 -839245 -951826 -1051884
35169 -1051884 -1118262 -1135811 -1098811 -1011976 -888857 -747766 -606363 -477048 -365213 -270888
35159 -270888 -192441 -130003 -86740 -67553 -76593 -115548 -183654 -278556 -396496 -531517 -674798
35148 -674798 -815180 -940758 -1040530 -1105308 -1127882 -1103070 -1028483 -906257 -744571 -556980
35138 -556980 -358708 -161624 29005 214202 398022 583501 769717 951058 1118793 1263930
35128 1263930 1379702 1462531 1511589 1527749 1512598 1467568 1393154 1288368 1150676 976697
35118 976697 763954 513439 232088 -66187 -361900 -633554 -861936 -1033285 -1140326 -1181648
35108 -1181648 -1160683 -1084800 -964098 -809587 -631674 -440218 -245921 -61168 101274 231173
35098 231173 323305 377840 398739 391439 361089 311976 248167 174840 99463 31919 -16907 -37849
35086 -37849 -26368 15787 81374 160774 245936 333173 423814 522943 636994 770759 924410
35075 924410 1091726 1260657 1416175 1543967 1633328 1678670 1679941 1642465 1576423 1496087 1418643
35064 1418643 1362039 1341553 1365769 1433622 1534078 1648794 1756638 1838263 1879225 1871134 1811426
35053 1811426 1702692 1551982 1369726 1167956 958184 749944 550775 367411 206876
35044 206876 76246 -18944 -76348 -97130 -85110 -46125 11445 75723 131451 162006 152772
35033 152772 94744 -12691 -160698 -332260 -505782 -659980 -778581 -853418 -885164 -881587
35023 -881587 -854113 -814233 -771154 -731154 -698041 -673782 -658901 -652554 -652395 -654496 -653878 -646198 -630223
35010 -630223 -609808 -594030 -595059 -624452 -689124 -788571 -914747 -1055011 -1196799 -1331419 -1454880
34999 -1454880 -1565730 -1661698 -1737382 -1784387 -1793985 -1761018 -1686874 -1579658 -1451368 -1313869 -1175910
34988 -1175910 -1042096 -913050 -785791 -654377 -511600 -351769 -173143 21583 227045
34979 227045 437887 650824 865388 1083469 1307864 1539994 1777249 2011071 2227071 2407791
34969 2407791 2537461 2606793 2615840 2573917 2497036 2404003 2312242 2234149 2174899 2132374 2099291
34958 2099291 2066533 2026280 1973737 1907193 1827075 1735123 1634349 1529541 1427372 1335407 1260142
34947 1260142 1204970 1169072 1147733 1133688 1118703 1094834 1055554 997180 920423 831264 740513
34936 740513 662073 610318 596922 627613 699737 801834 915900 1021837 1102363 1146390 1149676
34925 1149676 1113160 1040526 936476 806214 655833 493121 328378 174449 44962 -49492
34915 -49492 -105815 -130624 -138260 -145285 -164821 -203942 -264588 -345736 -444505 -555919 -672692 -786046
34903 -786046 -887197 -968774 -1025903 -1057209 -1065644 -1058610 -1046990 -1043166 -1058418 -1100057 -1168918 -1258328
34891 -1258328 -1355684 -1446506 -1519212 -1568317 -1595058 -1606140 -1611650 -1622461 -1647016 -1688137 -1741210
34880 -1741210 -1794708 -1832885 -1839663 -1802577 -1715656 -1580275 -1403707 -1196236 -968323 -729116
34870 -729116 -486630 -249010 -25665 172733 335506 453542 520239 531753 487290 389879
34860 389879 247123 70965 -123900 -322357 -510793 -677849 -814069 -911366 -963371 -967165
34850 -967165 -925827 -850306 -758903 -673447 -613156 -588877 -600612 -639347 -691721 -745040 -790802
34839 -790802 -826276 -854195 -880912 -913630 -957754 -1015141 -1083375 -1155821 -1222449 -1271649 -1292890
34828 -1292890 -1279332 -1229325 -1146270 -1037266 -911452 -778794 -649304 -532163 -434362 -359425
34818 -359425 -307379 -276480 -265645 -275693 -308300 -363511 -437869 -524686 -616347 -707122 -794639
34807 -794639 -879108 -960956 -1038663 -1108481 -1166232 -1209785 -1240412 -1262003 -1278613 -1291790 -1299467 -1297395
34795 -1297395 -1282594 -1256884 -1228462 -1210743 -1219021 -1266175 -1358568 -1493398 -1658593 -1835570 -2003850
34784 -2003850 -2145748 -2249742 -2312014 -2336344 -2332666 -2314521 -2295729 -2286925 -2292975 -2312339 -2338629
34773 -2338629 -2363342 -2378264 -2376739 -2354176 -2308417 -2240016 -2152032 -2049210 -1936980 -1820667 -1704943
34762 -1704943 -1593271 -1487216 -1385925 -1286375 -1184750 -1078428 -967295 -853347 -738929 -625016
34752 -625016 -510523 -392569 -267294 -131215 16883 174349 334453 487836 624574 735722
34742 735722 813814 852583 846463 790701 682837 525321 327440 104489 -126260 -350935
34732 -350935 -562870 -762852 -955841 -1146034 -1333070 -1511443 -1673106 -1811186 -1922198 -2005420
34722 -2005420 -2060128 -2082755 -2066176 -2002136 -1885663 -1718723 -1510733 -1275961 -1030015 -787541
34712 -787541 -561319 -361443 -193974 -59944 43956 122814 180307 216575 228230 210440
34702 210440 159965 77557 -31352 -157596 -289983 -417193 -529735 -621847 -692738 -746722
34692 -746722 -792335 -840756 -903713 -990916 -1107585 -1252838 -1419461 -1595105 -1764806 -1914167
34682 -1914167 -2031793 -2109640 -2141543 -2121951 -2046426 -1913464 -1725853 -1490666 -1218564 -923227
34672 -923227 -620730 -328152 -61271 167844 352222 489744 581445 629347 635004 599574
34662 599574 525283 417288 284599 139185 -6435 -141765 -259692 -356466 -431236 -485972
34652 -485972 -525555 -557056 -587816 -623135 -664999 -712495 -763044 -812989 -857108 -888303 -899031
34641 -899031 -884459 -845509 -789764 -729451 -677269 -641647 -623429 -615673 -606839 -585795 -546069 -487438
34629 -487438 -414646 -334378 -252274 -171422 -92749 -16450 56764 125143 185848 235158 269068
34618 269068 284209 278380 250063 197285 117111 6695 -134400 -301809 -485102 -668371 -832777
34607 -832777 -960679 -1040084 -1067767 -1049726 -998966 -931791 -864199 -809323 -776071 -768402 -784778
34596 -784778 -817864 -855208 -881445 -881502 -843400 -759683 -627603 -448729 -228274 25880 304176
34585 304176 595744 888157 1167356 1418590 1628413 1787058 1890400 1940820 1946602 1919867
34575 1919867 1873639 1818999 1763222 1709384 1657314 1605180 1550825 1492345 1428102 1356576 1276373
34564 1276373 1186464 1086743 978739 865958 753202 644918 543629 449625 362018 280069
34554 280069 203723 133564 71172 20075 -13962 -24460 -6907 39347 111155 202980 308506
34543 308506 422157 540590 663628 793702 933891 1085961 1249721 1423705 1606113 1795018
34533 1795018 1987605 2179198 2363202 2532658 2682790 2812859 2925844 3025907 3114970 3190152
34523 3190152 3243308 3262949 3237682 3159615 3026305 2840905 2611075 2347411 2061681 1765116
34513 1765116 1467190 1175461 896373 636190 401274 197670 30598 -95912 -179725 -222101
34503 -222101 -229253 -212176 -183727 -154188 -128202 -105283 -83413 -63065 -48824 -47866 -66640 -107854
34491 -107854 -169059 -243038 -319636 -388608 -442513 -478286 -496700 -500472 -492557 -475387 -450309 -416504
34479 -416504 -369966 -303838 -210420 -83782 78235 272894 492016 722050 945266 1142247
34469 1142247 1295212 1391106 1423493 1392813 1305357 1171695 1005002 819192 627001 438696
34459 438696 262163 103951 -30115 -135805 -212076 -261692 -289835 -301724 -301144 -290851 -273983
34448 -273983 -254883 -238682 -230372 -234109 -252736 -287118 -335632 -394580 -459549 -526574 -592050 -651754
34436 -651754 -700397 -732579 -744623 -736052 -710098 -673441 -635595 -607844 -601372 -624586 -680555 -765820
34424 -765820 -871509 -986519 -1101466 -1211480 -1316440 -1418754 -1520193 -1619698 -1713109 -1794289
34414 -1794289 -1856455 -1893029 -1898203 -1867809 -1800424 -1697869 -1564290 -1404281 -1221547 -1019148
34404 -1019148 -800722 -571218 -336459 -102263 125910 342596 541697 715978 857032
34395 857032 956216 1006778 1006378 958511 871764 757231 625566 485167 342029 200499 63691
34384 63691 -66900 -191800 -312893 -431584 -546744 -653582 -744048 -808692 -839340 -831406 -784593
34373 -784593 -701832 -587733 -448187 -291495 -129601 22505 149957 242580 298338 323418
34363 323418 328684 324613 317685 309856 300387 288009 271986 252231 229299 204657 180904 161475
34351 161475 149751 147778 155022 167723 179509 183524 175304 155039 128077 103411 90866 98214
34339 98214 129540 185472 264747 365627 485838 620992 762816 898901 1014904 1098669
34329 1098669 1144405 1154808 1139912 1113256 1087326 1070328 1065212 1070655 1083180 1099641 1119277 1144262
34317 1144262 1178095 1222399 1273989 1324030 1359646 1366936 1333895 1252410 1119074 935051 705400
34306 705400 438495 145896 -157415 -453106 -720580 -939499 -1093329 -1172620 -1176633 -1112675
34296 -1112675 -993758 -835838 -655486 -468248 -287645 -124810 11173 112634 173111 188117
34286 188117 156364 80096 -36148 -187370 -368660 -573835 -793589 -1015193 -1224245 -1407362
34276 -1407362 -1554285 -1658550 -1716693 -1726598 -1686422 -1595193 -1454867 -1272194 -1058859 -829721
34266 -829721 -600025 -382569 -185680 -12865 135571 260024 359962 434094 481545 502702
34256 502702 499353 474425 431603 374665 306690 229684 144963 53959 -41228 -137711 -231956 -320045
34244 -320045 -398152 -463298 -514185 -551763 -579255 -601481 -623514 -648953 -678267 -707752 -729575
34233 -729575 -733245 -708440 -648334 -552072 -425232 -278005 -121826 34128 185093 330568
34223 330568 472201 611140 746208 873322 985677 1074404 1129870 1143836 1111848 1034824
34213 1034824 919080 774851 613904 447033 282133 123594 -26438 -165363 -287677
34204 -287677 -384950 -449037 -476931 -474132 -454183 -434301 -429210 -446119 -483225 -532218 -583088 -628095
34192 -628095 -662645 -683211 -684508 -658187 -594077 -483410 -322801 -117508 117192 357304 574095
34181 574095 740067 835192 851394 793669 677693 525019 357608 193344 43715 -85889
34171 -85889 -194040 -280796 -346222 -390125 -412468 -413771 -395124 -357543 -300910 -223417 -122551
34160 -122551 2531 148855 309606 476435 642266 802465 953784 1092574 1214102 1313660
34150 1313660 1388453 1438851 1468398 1482909 1489467 1495780 1509910 1539924 1593095 1674527 1785679
34139 1785679 1923369 2079644 2242648 2398282 2532131 2630961 2683526 2681342 2620059 2501198
34129 2501198 2332912 2128923 1905983 1681078 1469014 1280620 1121834 994038 895366 822049
34119 822049 769120 730738 700562 672143 639031 594907 534535 455668 360799 257187 154566
34108 154566 61703 -16225 -78013 -124609 -156515 -171979 -166866 -135908 -74305 21135 151518
34097 151518 315718 510519 731359 973733 1234501 1512058 1805100 2110915 2424339 2737958
34087 2737958 3043409 3333401 3603862 3855270 4092290 4321746 4549990 4780898 5015087
34078 5015087 5250307 5482767 5709148 5928682 6144291 6361994 6588681 6829233 7084057
34069 7084057 7347296 7605506 7836990 8012861 8100975 8072554 7909514 7609540 7186836 6668454
34059 6668454 6088252 5481212 4879720 4311567 3798404 3353989 2982864 2680560 2435812
34050 2435812 2234124 2061423 1906647 1762865 1627297 1500811 1387072 1291169 1217666 1168536
34040 1168536 1141702 1130849 1126790 1120044 1103659 1074925 1035234 988354 938206 887338 836946 788567
34028 788567 746349 718006 713212 740174 802551 898402 1020992 1160153 1303492 1437719 1550639
34017 1550639 1633433 1682148 1697354 1682176 1640054 1573837 1486797 1384451 1275318 1169366 1074621
34006 1074621 993911 923832 856519 782757 694207 583792 445252 273526 66516 -172803
33996 -172803 -435428 -707233 -971503 -1212012 -1415326 -1571547 -1673784 -1717650 -1701821 -1629450
33986 -1629450 -1509267 -1355341 -1185335 -1017753 -868773 -749183 -661954 -601321 -554263 -504497
33976 -504497 -437834 -346583 -231054 -97719 44816 190155 337056 489830 655963 841934
33966 841934 1049275 1272895 1502520 1726507 1936074 2127744 2302776 2464069 2612573 2745319
33956 2745319 2856020 2937517 2984540 2995425 2972495 2921744 2852659 2777990 2712326 2668871 2655595
33945 2655595 2673236 2716604 2778169 2851381 2931807 3016174 3100811 3180793 3250034 3301835 3329537
33934 3329537 3327382 3291602 3221299 3118554 2987785 2834881 2666513 2489564 2310598 2135515
33924 2135515 1969439 1816672 1680470 1562742 1463843 1382573 1316436 1262404 1218181 1183359
33914 1183359 1159594 1149447 1154412 1172991 1199562 1224455 1235305 1219290 1165660 1068144 926813
33903 926813 748785 546926 336518 131261 -59469 -231014 -381906 -511687 -619054 -700798
33893 -700798 -751785 -766235 -740150 -673776 -572633 -446380 -306470 -164336 -31154 81416
33883 81416 160908 195116 174610 96010 -35368 -205123 -392508 -575333 -734526 -856280
33873 -856280 -931626 -954999 -923369 -836379 -696861 -510900 -287222 -36334 230074 499476
33863 499476 759330 999025 1212517 1400011 1566982 1720382 1863810 1994237 2102002 2173837
33853 2173837 2197297 2164748 2075804 1937814 1764359 1572099 1376917 1190808 1020675 869089
33843 869089 735975 620154 520296 435463 365310 310001 270183 247471 245280 268897 324039
33832 324039 414595 541182 701209 889544 1098687 1318790 1538854 1749384 1944976 2124886
33822 2124886 2291275 2446595 2591948 2726975 2850513 2960871 3055483 3130592 3181872 3206015
33812 3206015 3202309 3173041 3122337 3054125 2970511 2871665 2757434 2629769 2494258 2359547 2234872
33801 2234872 2127111 2038962 1968934 1912840 1866059 1825534 1790735 1763271 1745564 1739317 1744285
33790 1744285 1757602 1774043 1787665 1794553 1795258 1795148 1801948 1821600 1854624 1894856 1931024 1950241
33778 1950241 1941661 1898817 1820314 1709505 1573836 1423813 1271155 1126352 996707 885939
33768 885939 795372 725807 678819 656686 660790 689326 735795 789595 838673 872768 885507 874833
33756 874833 842521 793771 736801 681577 637186 608776 595816 592743 591468 584291 566104 535538
33744 535538 495097 450332 408279 375640 357146 354395 365355 384739 405154 418646 418235 399303
33732 399303 360663 304807 236985 163516 90218 21678 -38486 -86516 -117038 -122254 -92857 -20797
33720 -20797 97442 258917 454550 671318 895209 1113890 1318182 1501775 1659454 1785086
33710 1785086 1870917 1908818 1892688 1820568 1695327 1523833 1315113 1078346 821377 550222
33700 550222 269634 -15525 -298626 -569980 -816663 -1023979 -1178231 -1269615 -1293767 -1251487
33690 -1251487 -1147435 -989166 -787230 -555782 -312393 -76058 136105 311773 444385
33681 444385 532130 576333 580447 549899 492149 416416 332925 251809 182118 131383 105628 108993
33669 108993 142442 202508 281862 372384 468951 571189 681785 802663 931681 1061869
33659 1061869 1183224 1285540 1360566 1402833 1409574 1380607 1318547 1229129 1121042 1004802 890674
33648 890674 786380 695662 618399 552037 493329 439287 386945 332411 270335 194432 98763
33637 98763 -21089 -167144 -338025 -527904 -726391 -920169 -1095531 -1240207 -1344131 -1400453
33627 -1400453 -1407535 -1370517 -1300409 -1210397 -1111414 -1009446 -905690 -799197 -690660 -585494
33617 -585494 -494311 -430221 -404204 -421003 -477690 -565500 -673856 -794338 -922462 -1056639 -1195557
33606 -1195557 -1335856 -1470935 -1590658 -1681699 -1729090 -1719557 -1646043 -1511258 -1328039 -1115666
33596 -1115666 -893560 -675351 -466162 -264034 -63997 137950 342837 548627 750924
33587 750924 943607 1119472 1271167 1392153 1477169 1522013 1523231 1478513 1387939 1255461 1089620
33576 1089620 902859 709641 524209 358910 223330 123821 63119 40248 51312 90963
33566 90963 153519 232899 321727 410978 490939 552929 590529 599800 578965 528215 449845 348561
33554 348561 231986 111206 618 -83846 -128258 -124759 -74330 12996 120430 228316 318367
33543 318367 377091 397733 380538 331695 261440 181668 103271 33545 -25703 -78608 -133858
33532 -133858 -201729 -290458 -403131 -536019 -678812 -816565 -932739 -1012565 -1046009 -1029728
33522 -1029728 -967453 -868634 -745926 -612485 -479871 -356622 -247539 -153908 -74904 -9459
33512 -9459 42587 80762 104919 115675 113743 98923 69911 25534 -33037 -100340 -166176 -217208
33500 -217208 -240218 -225851 -171602 -83004 27511 143845 250633 337421 401329 447481 487273
33489 487273 535193 605198 707568 846901 1021748 1225896 1450690 1687044 1926099 2158422
33479 2158422 2372781 2555573 2691473 2765281 2764668 2683267 2523041 2294791 2016239 1708357
33469 1708357 1391387 1082071 792980 533574 311646 133350 1193 -88540 -146445 -187343
33459 -187343 -225454 -269870 -322083 -375651 -417345 -429540 -393806 -295124 -125587 113381 410631
33448 410631 746645 1096498 1434038 1736471 1988238 2183106 2323895 2419992 2483633 2526418
33438 2526418 2557114 2580957 2599977 2613816 2620923 2619986 2611040 2595553 2575166 2549812 2516504 2469777
33426 2469777 2403717 2314498 2202162 2071085 1929376 1787720 1657913 1551162 1476174 1437344
33416 1437344 1433451 1457291 1496663 1536755 1563262 1565068 1535622 1472992 1379202 1259320 1120306
33405 1120306 969561 813576 657376 505094 361229 231438 121939 37791 -18460 -46472
33395 -46472 -46437 -17822 40066 125914 234021 352952 465705 551576 589671 563390 464316 293931
33383 293931 62571 -213529 -515371 -823037 -1116244 -1374907 -1581046 -1721548 -1790049 -1786768
33373 -1786768 -1717199 -1591220 -1422967 -1230160 -1031815 -844815 -680954 -545841 -440022 -361661
33363 -361661 -309419 -283984 -287657 -322629 -389234 -484832 -603130 -733878 -863456 -976707 -1059303
33352 -1059303 -1099442 -1088516 -1021673 -899118 -727611 -520578 -295931 -72308 134668 314952
33342 314952 465228 588815 694146 791804 890700 994732 1101232 1201766 1284820 1339294
33332 1339294 1357607 1337647 1283375 1204293 1114133 1028974 964944 935794 950832 1013515 1120796
33321 1120796 1263277 1426493 1593506 1748216 1878122 1975650 2038397 2069177 2075768 2069215 2060162
33310 2060162 2054720 2052432 2047434 2031626 1997833 1942035 1864739 1771493 1672049 1577918 1498968 1440185
33298 1440185 1399629 1368266 1331979 1275391 1186345 1059474 897603 710567 512070 316163
33288 316163 135007 -21535 -145412 -230426 -273102 -273365 -234034 -159201 -52607 83062 245854
33277 245854 433742 644005 873114 1117031 1371404 1631373 1891179 2144349 2384821 2608186
33267 2608186 2811634 2992093 3143832 3257614 3322242 3327593 3267568 3141969 2956930 2723670
33257 2723670 2455876 2166899 1868242 1569610 1279485 1005233 752902 527431 333220
33248 333220 174061 51727 -36151 -97296 -143701 -188099 -239333 -298842 -360320 -413025 -447331
33237 -447331 -459679 -454343 -441112 -430336 -428135 -434280 -443461 -448683 -444763 -430463 -408952 -387027 -373385
33224 -373385 -376152 -400192 -445215 -505496 -571185 -630553 -672761 -690977 -685276 -663851 -641185 -633312
33212 -633312 -652128 -701432 -776389 -866225 -958379 -1041975 -1109365 -1155776 -1178055 -1173635 -1140487 -1078110
33200 -1078110 -988741 -877624 -751731 -617631 -480016 -342013 -207010 -80516 29453 113740
33190 113740 164072 174558 142546 69529 -37661 -166477 -300242 -421656 -516886 -578895 -609200
33179 -609200 -617544 -619207 -630592 -664633 -727410 -816501 -921079 -1024038 -1106364 -1152668 -1155468 -1116014
33167 -1116014 -1041436 -940227 -818687 -679617 -522790 -345938 -145779 80439 332471 604386
33157 604386 883232 1150292 1384904 1569769 1695892 1765349 1790784 1791876 1790182 1804251 1846289
33146 1846289 1920737 2024315 2146781 2272099 2380375 2451044 2466948 2417837 2301771 2124162
33136 2124162 1895383 1628177 1335445 1028597 716579 405788 100827 -194266 -474803
33127 -474803 -734724 -966816 -1164020 -1321639 -1439549 -1523323 -1583350 -1631917 -1679328 -1730817
33117 -1730817 -1785735 -1839168 -1884878 -1917855 -1935393 -1936681 -1921842 -1891508 -1847277 -1792420 -1731814
33106 -1731814 -1670644 -1612394 -1557321 -1502308 -1442179 -1371568 -1286224 -1183253 -1060985 -919475 -761754
33095 -761754 -594775 -428753 -274764 -141830 -35099 44057 96686 125045 132587 124808 109442
33084 109442 94799 86578 85134 85284 79309 61670 32453 -2821 -36919 -65356 -88451 -110037
33072 -110037 -134536 -164864 -202167 -246832 -299645 -362176 -436154 -522134 -618218 -719631 -819476
33061 -819476 -910396 -986503 -1044848 -1085596 -1110638 -1121229 -1116197 -1092233 -1046498 -979958 -898984 -813830
33049 -813830 -735040 -670430 -624309 -598208 -591236 -599544 -616386 -634237 -648411 -659594 -673037 -694445
33037 -694445 -725166 -760027 -789549 -805227 -804560 -792702 -780095 -777757 -792902 -826759 -874954 -929620
33025 -929620 -981872 -1023873 -1050355 -1059770 -1054682 -1040742 -1024277 -1009614 -997767 -987103 -975272 -960904
33013 -960904 -944042 -925136 -903465 -876375 -840271 -792885 -735026 -670328 -603269 -537051 -472404
33002 -472404 -407090 -335778 -251001 -145968 -18214 128549 285989 444910 598276 741870
32992 741870 873280 990799 1092823 1177326 1241108 1279261 1285411 1252878 1176301 1053199 885057
32981 885057 677759 441232 188166 -68326 -317647 -554079 -777078 -989155 -1192557 -1386738
32971 -1386738 -1567853 -1730091 -1867897 -1977982 -2060285 -2117454 -2153166 -2170147 -2168757 -2146523 -2098808
32960 -2098808 -2020754 -1910079 -1769599 -1608126 -1439415 -1279691 -1144383 -1044339 -982355 -951798
32950 -951798 -938789 -927342 -904740 -864392 -805449 -730555 -643763 -549684 -453535 -360998 -277130
32939 -277130 -204637 -142719 -87714 -35570 15313 62674 101139 124290 126677 105298 60745 -2235
32927 -2235 -75714 -151606 -225390 -298079 -374950 -461777 -560711 -667791 -773002 -862798 -924202
32916 -924202 -948903 -935731 -890855 -826152 -756570 -697163 -660216 -653002 -676859 -727986 -799711 -885528
32904 -885528 -981767 -1088778 -1210032 -1349511 -1508550 -1683439 -1864485 -2036568 -2180857 -2277355
32894 -2277355 -2307872 -2258930 -2124085 -1905309 -1613274 -1266526 -889572 -509937 -154387 155244
32884 155244 405855 595504 733506 837899 930852 1033290 1160134 1317201 1500340 1696890
32874 1696890 1889071 2058572 2191220 2280350 2327443 2339427 2323806 2284184 2218665 2121815 1988942
32863 1988942 1820366 1623630 1412706 1204734 1016036 859066 740939 663047 621312 607230
32853 607230 609946 618906 626161 627580 622856 614609 607068 604687 610815 626300 648243 669775 681645
32840 681645 675319 646005 594032 524224 444093 361910 285321 220716 173215 146886 144630 167445
32828 167445 213192 275538 344012 405885 449579 468012 459816 427601 374611 302355 210807 100543
32816 100543 -25219 -160033 -295015 -420184 -525992 -605203 -654811 -677018 -678370 -667439 -652286
32805 -652286 -638850 -630467 -628124 -631202 -638667 -650481 -668489 -696035 -736206 -789602 -852911 -919103
32793 -919103 -979170 -1024526 -1049053 -1050016 -1027563 -983030 -916767 -826552 -707527 -553979 -362204
32782 -362204 -133044 127145 407418 694260 973699 1232826 1460638 1648203 1788147 1873752
32772 1873752 1898428 1856436 1744917 1566204 1328912 1047051 737777 419224 109374 -174430
32762 -174430 -416636 -605938 -738174 -817695 -855910 -867426 -865531 -858906 -850507 -838536 -818604
32751 -818604 -786117 -738081 -674120 -596684 -510461 -421068 -333412 -250384 -172356 -97514 -22685
32740 -22685 55696 140715 234286 336770 447115 563664 685287 811903 943473 1077675
32730 1077675 1207834 1323018 1410837 1461485 1470553 1439048 1371217 1272293 1147798 1004210 849549
32719 849549 692976 543776 410397 299570 215323 158279 125794 112684 111536 112355 102707
32708 102707 69652 3265 -100220 -237668 -401197 -581881 -772835 -970101 -1171265 -1373052
32698 -1373052 -1569640 -1752769 -1913477 -2044281 -2140496 -2200282 -2223899 -2212888 -2169365 -2095370
32688 -2095370 -1992387 -1861343 -1703108 -1519309 -1313232 -1090594 -859603 -629772 -409825
32679 -409825 -205947 -21383 142620 285241 404591 497121 558783 588015 588921 572181 552578
32668 552578 544183 555634 587733 634339 686056 734630 775421 806652 826705 832180 818486 782357
32656 782357 724090 647741 559256 463819 363769 257602 140251 4930 -153266 -332999
32646 -332999 -523942 -707768 -862913 -970674 -1019643 -1006895 -936443 -816587 -657828 -472146
32636 -472146 -273278 -76888 100417 243256 339755 382802 370045 303289 187828 31431
32626 31431 -157287 -370703 -603098 -850053 -1106909 -1367566 -1624305 -1868335 -2090311 -2280408
32616 -2280408 -2428353 -2524191 -2560108 -2532471 -2442719 -2296470 -2101849 -1868689 -1609021 -1337601
32606 -1337601 -1070948 -824816 -611508 -438466 -308437 -220668 -172437 -160398 -181175 -230874
32596 -230874 -303897 -392153 -485412 -572755 -644260 -692237 -711812 -700865 -659508 -589509 -494295
32585 -494295 -379841 -255768 -135477 -34535 32330 54509 27944 -43933 -150902 -277953
32575 -277953 -407962 -524329 -613199 -665191 -676625 -649998 -593237 -517353 -432849 -346262 -258797
32564 -258797 -168018 -71497 30234 133408 233129 325746 409408 482557 541855 581621 595670
32553 595670 580617 538437 476655 406205 338320 281740 240920 215418 200423 187992 168466
32542 168466 131977 70596 -18786 -131949 -256965 -376870 -474608 -538435 -565979 -565853 -556352
32531 -556352 -561542 -605506 -706258 -871067 -1094669 -1360978 -1647609 -1931610 -2194227 -2423055
32521 -2423055 -2611239 -2755411 -2854491 -2910033 -2926486 -2909639 -2863905 -2791064 -2692139 -2570906 -2435864
32510 -2435864 -2298957 -2172098 -2064044 -1979297 -1918903 -1881762 -1865164 -1864384 -1872412 -1881108 -1883906 -1878502
32498 -1878502 -1867375 -1855536 -1846955 -1842163 -1838392 -1831648 -1819069 -1800274 -1777429 -1754458 -1735948 -1726019
32486 -1726019 -1727067 -1738193 -1753603 -1762060 -1748382 -1697049 -1596693 -1443733 -1243833 -1010721 -762977
32475 -762977 -520096 -299237 -113228 30337 129201 185783 206014 198102 171510 135747 98550
32464 98550 63866 30768 -5808 -52794 -116292 -199658 -302956 -423579 -557407 -699951 -847284
32453 -847284 -996455 -1145007 -1289574 -1424505 -1542068 -1634963 -1700066 -1740940 -1767091 -1790058
32443 -1790058 -1818558 -1855480 -1897986 -1940005 -1975376 -2000265 -2014043 -2018367 -2014882 -2002834 -1978140 -1934452
32431 -1934452 -1865564 -1768034 -1643036 -1496605 -1337719 -1174777 -1012456 -851050 -688658 -524411
32421 -524411 -360479 -201839 -54385 77244 191018 287351 367726 432986 482505 514622
32411 514622 527783 521354 495722 452088 392722 321766 245782 172954 110681 62675 27332 -1564
32399 -1564 -32367 -72820 -128174 -200186 -286508 -380291 -470580 -544285 -589851 -601524 -582294 -544053
32387 -544053 -505025 -485911 -506188 -581096 -719166 -920488 -1176296 -1470427 -1782336 -2090544
32377 -2090544 -2375261 -2619541 -2809383 -2933738 -2985047 -2960252 -2862029 -2700058 -2491730 -2260950
32367 -2260950 -2033993 -1833266 -1671846 -1551480 -1464587 -1398545 -1339989 -1277733 -1204021 -1114366
32357 -1114366 -1006714 -880846 -738801 -586144 -432859 -292382 -178391 -100711 -62522 -60289
32347 -60289 -86154 -131323 -188834 -254667 -327002 -404309 -483473 -559006 -623646 -670024 -692656 -689338
32335 -689338 -661230 -611692 -544859 -464985 -376490 -283760 -190340 -98397 -9417 74222 148284
32324 148284 207065 244378 253987 229690 166307 62189 -78051 -242930 -416814 -584869 -737204
32313 -737204 -869418 -979155 -1061470 -1107060 -1105253 -1049723 -942626 -794389 -619869 -433889
32303 -433889 -248623 -73379 84194 216843 317323 379098 397534 370741 299660 187697
32293 187697 40346 -135036 -329598 -533842 -739081 -939219 -1132134 -1319826 -1506864 -1697737
32283 -1697737 -1894470 -2095760 -2297775 -2495619 -2684457 -2860003 -3018615 -3156962 -3271007
32274 -3271007 -3354729 -3399785 -3397018 -3339231 -3223618 -3052706 -2834069 -2579699 -2305531 -2030587
32264 -2030587 -1774877 -1555740 -1383622 -1259357 -1174713 -1116294 -1071075 -1031222 -996411 -972971
32254 -972971 -970413 -997200 -1057993 -1153403 -1281218 -1437461 -1616896 -1813991 -2024782 -2248246
32244 -2248246 -2485440 -2736318 -2996307 -3255047 -3498026 -3709905 -3877566 -3991794 -4047803 -4045441
32234 -4045441 -3989335 -3888548 -3755352 -3603396 -3445816 -3293565 -3153934 -3029707 -2919550 -2819624
32224 -2819624 -2725523 -2633596 -2541470 -2448086 -2353275 -2256601 -2155852 -2046291 -1921767 -1777532
32214 -1777532 -1613199 -1433911 -1248964 -1068950 -903218 -758567 -638497 -542097 -463015 -389976
32204 -389976 -309706 -211260 -89721 52014 203521 348762 469204 547702 572188 537924
32194 537924 447444 308372 130387 -77087 -305675 -547666 -795212 -1039612 -1270844 -1477543
32184 -1477543 -1647536 -1768781 -1830564 -1825263 -1750856 -1613344 -1427228 -1212951 -992166 -783274
32174 -783274 -598874 -445097 -321811 -223383 -140554 -63797 12716 88451 156560 206707 229112
32163 229112 217795 171660 93550 -11526 -137650 -278483 -427685 -579931 -732151 -884092
32153 -884092 -1037795 -1196394 -1362961 -1539584 -1726706 -1922740 -2124103 -2325449 -2519916 -2699420
32143 -2699420 -2855528 -2981105 -3072304 -3129796 -3158138 -3163179 -3148651 -3114004 -3055045 -2967319 -2850376
32132 -2850376 -2710435 -2559916 -2414160 -2287314 -2189535 -2126457 -2100266 -2110900 -2156350 -2231899
32122 -2231899 -2328961 -2434450 -2531499 -2601745 -2628567 -2600404 -2513509 -2373494 -2194848 -1997878
32112 -1997878 -1803648 -1628929 -1483242 -1368871 -1283074 -1220881 -1176944 -1145913 -1121830 -1097609
32102 -1097609 -1065277 -1017004 -946839 -852907 -739212 -615561 -494767 -388198 -302239 -237527
32092 -237527 -190743 -157184 -132465 -112857 -94790 -74378 -47441 -10056 40488 104438 178379
32081 178379 254887 323743 374576 399893 397161 369260 323281 268281 213039 164788 129052 109792
32069 109792 108946 125422 154409 187917 216641 232530 230928 211418 177140 133079 84133 33603
32057 33603 -17412 -69385 -122597 -175316 -223338 -261606 -287077 -300816 -307787 -314524 -326652 -348165
32045 -348165 -382588 -434298 -508356 -608896 -737394 -891768 -1066351 -1252431 -1439437 -1616807
32035 -1616807 -1776141 -1913191 -2029278 -2131597 -2231548 -2340739 -2465847 -2604825 -2746610 -2874687
32025 -2874687 -2972784 -3030037 -3043689 -3018879 -2966340 -2899150 -2829423 -2765806 -2712520 -2670095 -2636806
32014 -2636806 -2609441 -2583005 -2550276 -2502342 -2430120 -2325996 -2184985 -2005726 -1791669 -1552051
32004 -1552051 -1301629 -1058617 -841378 -665005 -538825 -465343 -440605 -455383 -496394 -547321
31994 -547321 -590286 -608403 -588943 -525725 -419725 -278091 -112314 63893 236749 394115
31984 394115 526406 626833 691475 719319 712023 673321 608403 523560 425955 323226 222952
31973 222952 132307 58214 7861 -11082 8563 71084 175117 312463 469522 630523 780724
31962 780724 908449 1006128 1070767 1103712 1109444 1093802 1062595 1021202 974888 929139 889382
31951 889382 859949 842763 836709 838408 843993 850619 856751 861495 863843 862220 854138 836012 803530
31938 803530 752748 681403 589870 481542 362659 241472 126876 27136 -50687 -100667 -117959
31927 -117959 -99228 -43536 46606 164325 298120 432850 552228 642314 694801 708739 689967
31916 689967 648713 596766 545409 504046 478673 470006 472291 474077 461128 420434 343859 230330
31904 230330 85947 -77967 -248069 -412120 -560870 -688464 -791941 -870797 -927002 -965093
31894 -965093 -991466 -1012531 -1032390 -1051397 -1066425 -1072428 -1064108 -1036868 -987243 -913492 -816557 -700857
31882 -700857 -574400 -448047 -334280 -245624 -192732 -182063 -213374 -278006 -359488 -437263 -492377
31871 -492377 -512290 -492512 -435132 -345949 -231575 -97047 55309 224795 409218 601901
$$ [...]
##END NTUPLES=NMR SPECTRUM
##END=
