##TITLE=31Pdec_DE-59_rm_10m
 
 24 sc
 4.6.2024
##JCAMPDX= 6.0         $$ Bruker NMR JCAMP-DX V2.0
##DATA TYPE= NMR SPECTRUM
##DATA CLASS= NTUPLES
##ORIGIN= UXNMR, Bruker Analytische Messtechnik GmbH
##OWNER= root
$$ XWIN-NMR		Version 3.5
$$ Tue Jun  4 13:59:57 2024 Russian Standard Time (UT+4h)  she@DPX200
##.OBSERVE FREQUENCY= 81.013821
##.OBSERVE NUCLEUS= ^31P
##.ACQUISITION MODE= SIMULTANEOUS
##.ACQUISITION SCHEME= undefined
##.AVERAGES= 24
##.DIGITISER RES= 16
##SPECTROMETER/DATA SYSTEM= spect
##.PULSE SEQUENCE= zgpg30
##.SOLVENT NAME= CDCl3
##.SHIFT REFERENCE= (INTERNAL, CDCl3, 0, 248.564)
##AUDIT TRAIL= $$ (NUMBER, WHEN, WHO, WHERE, WHAT)
$$ ##TITLE= Audit trail, XWIN-NMR		Version 3.5
$$ ##JCAMPDX= 5.01
$$ ##ORIGIN= Bruker BioSpin GmbH
$$ ##OWNER= she
$$ F:/spectra/data/she/nmr/P31/1/pdata/1/auditp.txt
$$ ##AUDIT TRAIL=  $$ (NUMBER, WHEN, WHO, WHERE, WHAT)
(   1,<2024-06-04 13:58:55.67 +0400>,<she>,<DPX200>,
      <created by zg, POWCHK disabled, PULCHK disabled
       configuration hash MD5:
       00 E9 B6 7A A2 85 ED C7 34 08 36 98 17 FE 4E 26
       data hash MD5: 32K
       61 C6 8D 35 DD 1E B2 14 59 54 C7 7D 1C 18 3F 8C>)
(   2,<2024-06-04 13:58:59.90 +0400>,<she>,<DPX200>,
      <Start of raw data processing
       efp BC_mod = 2 LB = 10 FT_mod = 6 PKNL = 1 PHC0 = -187.3496 PHC1 = 0 SI = 64K 
       data hash MD5: 64K
       11 01 CD 55 91 A0 8E 80 1B 81 C3 E4 3B C7 AE 5B>)
(   3,<2024-06-04 13:59:12.59 +0400>,<she>,<DPX200>,
      <pk PHC0 = -8.23573 PHC1 = 0 
       data hash MD5: 64K
       12 0B 91 F3 07 61 1A B7 42 C2 A7 45 25 31 B6 AC>)
$$ ##END=
$$ 
$$ hash MD5
$$ 2D 8C 42 8B 24 D9 D7 22 5D 8A C2 B3 3A F6 8E 46
##$RELAX= 
##$RELAX= 
##$RELAX= 
##$RELAX= 
##$RELAX= 
##$RELAX= 
##$RELAX= 
##$RELAX= 
##$RELAX= 
$$ Bruker specific parameters
$$ --------------------------
##$DU= <F:/spectra>
##$EXPNO= 1
##$NAME= <P31>
##$PROCNO= 1
##$TYPE= <nmr>
##$USER= <she>
##$AMP= (0..31)
100 100 100 100 100 100 100 100 100 100 100 100 100 100 100 100 100 100 
100 100 100 100 100 100 100 100 100 100 100 100 100 100 
##$AQSEQ= 0
##$AQ_mod= 1
##$AUNM= <au_zg>
##$AUTOPOS= <>
##$BF1= 81.014009
##$BF2= 200.13
##$BF3= 200.13
##$BF4= 200.13
##$BF5= 200.13
##$BF6= 200.13
##$BF7= 200.13
##$BF8= 200.13
##$BYTORDA= 1
##$CFDGTYP= 0
##$CFRGTYP= 5
##$CHEMSTR= <none>
##$CNST= (0..31)
1 1 145 1 1 1 1 1 1 1 1 1 1 1 1 1 1 1 1 1 1 1 1 1 1 1 1 1 1 1 1 1 
##$CPDPRG= <waltz16>
##$CPDPRG1= <>
##$CPDPRG2= <waltz16>
##$CPDPRG3= <>
##$CPDPRG4= <mlev>
##$CPDPRG5= <mlev>
##$CPDPRG6= <mlev>
##$CPDPRG7= <mlev>
##$CPDPRG8= <mlev>
##$CPDPRGB= <>
##$CPDPRGT= <>
##$D= (0..31)
0 1 0 0 0 0 0 0 0 0 0 0.03 2e-05 3e-06 0 0 0 0 0 0 0 0 0 0 0 0 0 0 0 0 
0 0 
##$DATE= 1717495135
##$DBL= (0..7)
120 120 120 11 120 120 24 19 
##$DBP= (0..7)
150 150 150 150 150 150 150 150 
##$DBP07= 0
##$DBPNAM0= <>
##$DBPNAM1= <>
##$DBPNAM2= <>
##$DBPNAM3= <>
##$DBPNAM4= <>
##$DBPNAM5= <>
##$DBPNAM6= <>
##$DBPNAM7= <>
##$DBPOAL= (0..7)
0.5 0.5 0.5 0.5 0.5 0.5 0.5 0.5 
##$DBPOFFS= (0..7)
0 0 0 0 0 0 0 0 
$$ [...]
##$SUBNAM2= <"">
##$SUBNAM3= <"">
##$SUBNAM4= <"">
##$SUBNAM5= <"">
##$SUBNAM6= <"">
##$SUBNAM7= <"">
##$SUBNAM8= <"">
##$SUBNAM9= <"">
##$SW= 501.771253377433
##$SWIBOX= (0..15)
0 1 3 0 0 0 0 0 0 0 0 0 0 0 0 0 
##$SW_h= 40650.406504065
##$TD= 32768
##$TD0= 1
##$TE= 0
##$TE2= 300
##$TE3= 300
##$TEG= 300
##$TL= (0..7)
0 120 53 12 22 120 120 120 
##$TP= (0..7)
150 150 150 150 150 150 150 150 
##$TP07= 0
##$TPNAME0= <>
##$TPNAME1= <>
##$TPNAME2= <>
##$TPNAME3= <>
##$TPNAME4= <>
##$TPNAME5= <>
##$TPNAME6= <>
##$TPNAME7= <>
##$TPOAL= (0..7)
0.5 0.5 0.5 0.5 0.5 0.5 0.5 0.5 
##$TPOFFS= (0..7)
0 0 0 0 0 0 0 0 
##$TUNHIN= 0
##$TUNHOUT= 0
##$TUNXOUT= 0
##$USERA1= <user>
##$USERA2= <user>
##$USERA3= <user>
##$USERA4= <user>
##$USERA5= <user>
##$V9= 5
##$VALIST= <valist>
##$VCLIST= <CCCCCCCCCCCCCCC>
##$VD= 0
##$VDLIST= <DDDDDDDDDDDDDDD>
##$VPLIST= <PPPPPPPPPPPPPPP>
##$VTLIST= <TTTTTTTTTTTTTTT>
##$WBST= 1024
##$WBSW= 4
##$XGAIN= (0..3)
0 0 0 0 
##$XL= 0
##$YL= 0
##$YMAX_a= 11130
##$YMIN_a= -11348
##$ZGOPTNS= <>
##$ZL1= 120
##$ZL2= 120
##$ZL3= 120
##$ZL4= 120
##$ABSF1= 0
##$ABSF2= 0
##$ABSG= 0
##$ABSL= 0
##$ALPHA= 0
##$AQORDER= 0
##$ASSFAC= 0
##$ASSFACI= 0
##$ASSFACX= 0
##$ASSWID= 0
##$AUNMP= <proc_1d>
##$AZFE= 0.1
##$AZFW= 0.5
##$BCFW= 0
##$BC_mod= 2
##$BYTORDP= 0
##$COROFFS= 0
##$CY= -3
##$DATMOD= 1
##$DC= 0
##$DFILT= <>
##$DTYPP= 0
##$F1P= 0
##$F2P= 0
##$FCOR= 1
##$FTSIZE= 65536
##$FT_mod= 6
##$GAMMA= 0
##$GB= 0
##$INTBC= 1
##$INTSCL= 6.047779e-11
##$ISEN= 30
##$LB= 10
##$LEV0= 0
##$LPBIN= 0
##$MAXI= 10000
##$MC2= 0
##$MEAN= 0
##$ME_mod= 0
##$MI= 50
##$NCOEF= 0
##$NC_proc= -9
##$NLEV= 6
##$NOISF1= 182.463
##$NOISF2= 159.3651
##$NSP= 0
##$NTH_PI= 0
##$NZP= 0
##$OFFSET= 248.5645
##$PC= 4
##$PHC0= -195.5853
##$PHC1= 0
##$PH_mod= 1
##$PKNL= yes
##$PPARMOD= 0
##$PSCAL= 0
##$PSIGN= 0
##$REVERSE= no
##$SF= 81.0140089999694
##$SI= 65536
##$SIGF1= 159.3651
##$SIGF2= -187.1042
##$SINO= 113.3802
##$SIOLD= 16384
##$SREGLST= <1H.CDCl3>
##$SSB= 0
##$STSI= 65536
##$STSR= 0
##$SW_p= 40650.406504065
##$SYMM= 0
##$S_DEV= 0
##$TDeff= 32768
##$TDoff= 0
##$TI= <>
##$TILT= no
##$TM1= 0
##$TM2= 0
##$TOPLEV= 0
##$USERP1= <user>
##$USERP2= <user>
##$USERP3= <user>
##$USERP4= <user>
##$USERP5= <user>
##$WDW= 1
##$XDIM= 65536
##$YMAX_p= 436420702
##$YMIN_p= -67486490
$$ End of Bruker specific parameters
$$ ---------------------------------
##NTUPLES= NMR SPECTRUM
##VAR_NAME=  FREQUENCY,     SPECTRUM/REAL,   SPECTRUM/IMAG
##SYMBOL=    X,             R,               I
##VAR_TYPE=  INDEPENDENT,   DEPENDENT,       DEPENDENT
##VAR_FORM=  AFFN,          ASDF,            ASDF
##VAR_DIM=   65536,         65536,           65536
##UNITS=     HZ,            ARBITRARY UNITS, ARBITRARY UNITS
##FACTOR=    0.620285442955139, 1,           1
##FIRST=     20137.2065510682, 0,            0
##LAST=      -20513.1999529968, 0,           0
##MIN=       -20513.1999529968, -67486490,   0
##MAX=       20137.2065510682, 436420702,    0
$$ Real data points
##PAGE= N=1
##DATA TABLE= (X++(R..R)), XYDATA
$$ [...]
40447a476042K45304K92649L54194M41325N61616P10567Q68933J007749J097884
$$ -1476042 -1230738 -938089 -583895 -142570 419046 1129613 1998546 3006295 4104179
40438D104179J118679J061804R30508P37403N03439K57250L2227j39609k35160
$$ 4104179 5222858 6284662 7215170 7952573 8456012 8713262 8745489 8605880 8370720
40429H370720k46539j83963p3289N2303J63179K40985K79810K82728K57454K12864
$$ 8370720 8124181 7940218 7866929 7919232 8082411 8323396 8603206 8885934 9143388 9356252
40419I356252J56117R0680J6035p1015j74059k93855m25047n55398o69432p54236
$$ 9356252 9512369 9603049 9619084 9548069 9374010 9080155 8655108 8099710 7430278 6676042
40409F676042q02704q12409p82915p15031o12170m81661l34536j83961m3350P5025
$$ 6676042 5873338 5060929 4278014 3562983 2950813 2469152 2134616 1950655 1907305 1982330
40399A982330J60656K05394K04898J60471P9658k4957j37498k40036l14243l44772
$$ 1982330 2142986 2348380 2553278 2713749 2793407 2768450 2630952 2390916 2076673 1731901
40389A731901l23632k53163j46198k3792Q8579J66010J89804J52203N8492p4053
$$ 1731901 1408269 1155106 1008908 985116 1073695 1239705 1429509 1581712 1640204 1566151
40379A566151k19712l49239m35635m60226m17474l16320j76502k1162J30760K68831
$$ 1566151 1346439 997200 561565 101339 -316135 -632455 -808957 -830119 -699359 -430528
40369d30528L90751M98099N90505O61553O99353O91800O32857N25489L80287K12542
$$ -430528 -39777 458322 1048827 1710380 2409733 3101533 3734390 4259879 4640166 4852708
40359D852708L9884j20063k53598l55104m28142m81724n23738n55792n72740n67393
$$ 4852708 4892592 4772529 4518931 4163827 3735685 3253961 2730223 2174431 1601691 1034298
40349A034298n37504m90038m39019l98206l74057l63842l58487l46507l17057
$$ 1034298 496794 6756 -432263 -830469 -1204526 -1568368 -1926855 -2273362 -2590419
40340b590419k63207j86014r6544j2494M9907Q3505R2215Q6752P7756P0858O5955
$$ -2590419 -2853626 -3039640 -3136184 -3148678 -3098771 -3015266 -2923051 -2836299 -2758543 -2687685 -2621730
40329b621730N9828M9559L4445J5769m935k7663n4453q8020j29317j75728k20964
$$ -2621730 -2561902 -2512343 -2477898 -2462129 -2467064 -2494727 -2549180 -2637200 -2766517 -2942245 -3163209
40318c163209k56256k72218k61521k22462j61363r0861k3799L3311Q2406J30268
$$ -3163209 -3419465 -3691683 -3953204 -4175666 -4337029 -4427890 -4451689 -4418378 -4335972 -4205704
40308d205704J82270K37860K90307L30361L51259L51721L35206L06660K69821
$$ -4205704 -4023434 -3785574 -3495267 -3164906 -2813647 -2461926 -2126720 -1820060 -1550239
40299a550239K26938J80027J31837Q5860M5917J5784j354l667Q599L2562O2410
$$ -1550239 -1323301 -1143274 -1011437 -925577 -879660 -863876 -865230 -868897 -860298 -827736 -765326
40288g65326R0014J07407J10469J01270Q6779P4719O9705P2019P8690Q5265Q7838
$$ -765326 -675312 -567905 -457436 -356166 -269387 -194668 -124963 -52944 25746 111011 198849
40277A98849Q5382Q1605Q4455J02667J40930J96269K57421L07792L31467L20164
$$ 198849 284231 365836 450291 552958 693888 890157 1147578 1455370 1786837 2107001
40267B107001K77415K17065J56709J10399Q4890Q0500R4448J23769J66104K18236
$$ 2107001 2384416 2601481 2758190 2868589 2953479 3033979 3128427 3252196 3418300 3636536
40257C636536K73871L23280L56459L68193L60777L41464L16506K86508K46350
$$ 3636536 3910407 4233687 4590146 4958339 5319116 5660580 5977086 6263594 6509944
40248F509944J88847J09336Q950j04453k18316l19767l99958m55399m85927m92204
$$ 6509944 6698791 6808127 6817077 6712624 6494308 6174541 5774583 5319184 4833257 4341053
40238D341053m75758m41187l97052l53095l15436k84038k54673k23509j90564
$$ 4341053 3865295 3424108 3027056 2673961 2358525 2074487 1819814 1596305 1405741
40229A405741j59906j37483j28457j35008j54854j80902k02799k10304j97128
$$ 1405741 1245835 1108352 979895 844887 690033 509131 306332 96028 -101100
40220a01100j63564j16756o8596l1760j5082k0121m0955o7799r2190j10183j21523
$$ -101100 -264664 -381420 -450016 -481776 -496858 -516979 -557934 -625733 -717923 -828106 -949629
40209i49629j26668j25001j15763j00069q1698o5896n7002n6027n9384n9835m9678
$$ -949629 -1076297 -1201298 -1317061 -1417130 -1498828 -1564724 -1621726 -1677753 -1737137 -1796972 -1846650
40198a846650k4452J4965O2808J10749J50851J77822J89550J86247J70141J46950
$$ -1846650 -1871102 -1856137 -1793329 -1682580 -1531729 -1353907 -1164357 -978110 -807969 -661019
40188f61019J27111J23188J42876J82317K25594K51952K46291K06391J42840P2644
$$ -661019 -533908 -410720 -267844 -85527 140067 392019 638310 844701 987541 1060185
40178A060185J1077l3429n9624p0876p2661p1305p2949q1381r4929j04650r6378
$$ 1060185 1071262 1037833 978209 907333 834672 763367 690418 609037 514108 409458 313080
40167C13080n6852J9343J26719K51824L79589M98713O03472O92684P67586Q30031
$$ 313080 256228 275571 402290 654114 1033703 1532416 2135888 2828572 3596158 4426189
40157D426189Q81598R23804R59006R90711J022056J052255J072814J066513J011425
$$ 4426189 5307787 6231591 7190597 8181308 9203364 10255619 11328433 12394946 13406371
40148A3406371Q89308O94514M38855J50088j35336l82311n66083o76779p18140
$$ 13406371 14295679 14990193 15429048 15579136 15443800 15061489 14495406 13818627 13100487
40139A3100487p02138o43036n53649m44292l23068j95829o5266O9965K14696L75164
$$ 13100487 12398349 11755313 11201664 10757372 10434304 10238475 10173209 10243174 10457870 10833034
40129A0833034N56535P60413R81589J204446J401918J539549J583043J505772
$$ 10833034 11389569 12149982 13131571 14336017 15737935 17277484 18860527 20366299
40121B0366299J295421R60895N36934P9481l50733p08084r72756j147701j248437
$$ 20366299 21661720 22622615 23159549 23239030 22888297 22180213 21207457 20059756 18811319
40112A8811319j294111j301913j282968j239957j169130j066579r34170p80375
$$ 18811319 17517208 16215295 14932327 13692370 12523240 11456661 10522491 9742116
40104I742116o15787m47510k76939j02181P6973K55007M19755N54793O43658O73923
$$ 9742116 9126329 8678819 8401880 8299699 8376672 8631679 9051434 9606227 10249885 10923808
40094A0923808O39479N40883L85012J85405l7382k57589m49552n94651o86109
$$ 10923808 11563287 12104170 12489182 12674587 12637205 12379616 11930064 11335413 10649304
40085A0649304p28786p34360p14942o78725o29286n67508m94086m11665l26881
$$ 10649304 9920518 9186158 8471216 7792491 7163205 6595697 6101611 5689946 5363065
40076E363065k51483k00332j85484k09435k62425l25693l78083m01800l85523
$$ 5363065 5111582 4911250 4725766 4516331 4253906 3928213 3550130 3148330 2762807
40067B762807l25676k26776j00729L5707J64921K72421L49168L91941M02355L85277
$$ 2762807 2437131 2210355 2109626 2145333 2310254 2582675 2931843 3323784 3726139 4111416
40057D111416L46852K92776K28025J58244R0745L2665j3436n2760r6839j57587
$$ 4111416 4458268 4751044 4979069 5137313 5228058 5260723 5247287 5194527 5097688 4940101
40047D940101k40340l39797m40854n23932n72304n77965n43616m80701m04947
$$ 4940101 4699761 4359964 3919110 3395178 2822874 2244909 1701293 1220592 815645
40038H15645l31396k70457k26358j98135j81664j71247j60611j44256j18792q2873
$$ 815645 484249 213792 -12566 -210701 -392365 -563612 -724223 -868479 -987271 -1070144
40028a070144l5615K4052R5125J70914K37976K79568K81757K38789J55721M8114
$$ -1070144 -1105759 -1081707 -986582 -815668 -577692 -298124 -16367 222422 378143 426257
40018D26257o0986j46417j87051j70288r3715L5001J98384L70372N20827O23592
$$ 426257 365271 218854 31803 -138485 -232200 -197199 1185 371557 892384 1515976
40008A515976O64104O41955N67606M56948L27310J95191P4279k6472j03526j57669
$$ 1515976 2180080 2822035 3389641 3846589 4173899 4369090 4443369 4416897 4313371 4155702
39998D155702j91921k09365k11552j98440j70494j31643q9986n4696l1187j8472
$$ 4155702 3963781 3754416 3542864 3344424 3173930 3042287 2952301 2897605 2866418 2847946
39988B847946j0695j717R954J8791J4281j2991o4808j32921k02390k57745k88078
$$ 2847946 2837251 2835534 2845488 2864279 2878560 2865569 2800761 2667840 2465450 2207705 1919627
39977A919627k89466k65519k26794j88895j69155j82102k34149l19016m17138
$$ 1919627 1630161 1364642 1137848 948953 779798 597696 363547 44531 -372607
39968c72607n01777n49703n49937n05163m26915l29760k27699j31864m8025K4775
$$ -372607 -874384 -1424087 -1974024 -2479187 -2906102 -3235862 -3463561 -3595425 -3643450 -3618675
39958c618675R2242J59978K29179K95837L53461L97038M25808M43516M56392M70154
$$ -3618675 -3526433 -3366455 -3137276 -2841439 -2487978 -2090940 -1665132 -1221616 -765224 -295070
39948b95070M87422N06490N21726N26002N14395M87053M48773M05569L61336L17113
$$ -295070 192352 698842 1220568 1746570 2260965 2748018 3196791 3602360 3963696 4280809
39938D280809K72217K24972J72862J13962M9759j3362o6453j02576j19894j21090
$$ 4280809 4553026 4777998 4950860 5064822 5114581 5101219 5034766 4932190 4812296 4691206
39928D691206j10520r1841o7757m1531j8603o567j3205m3831r9070j73153k52836
$$ 4691206 4580686 4488845 4421088 4379557 4360954 4354387 4341182 4297351 4198281 4025128 3772292
39917C772292l18869l51759l39873k84680j99344j02279j0237O6071J23672J67159
$$ 3772292 3453423 3101664 2761791 2477111 2277767 2175488 2165251 2231322 2354994 2522153
39907B522153K06684K54391L20131M07514N11217O16877P04871P57358P65262
$$ 2522153 2728837 2983228 3303359 3710873 4222090 4838967 5543838 6301196 7066458
39898G066458P31130O66250N84171M94568M00624L00687J93113Q1783k0966r6417
$$ 7066458 7797588 8463838 9048009 9542577 9943201 10243888 10437001 10518784 10497818 10401401
39888A0401401j26351j00857k2560R4424K28842L57604M61248N29102N62151N71135
$$ 10401401 10275050 10174193 10151633 10246057 10474899 10832503 11293751 11822853 12385004 12956139
39878A2956139N70009N68149N65431N52763N17856M53276L61839K55615J49212
$$ 12956139 13526148 14094297 14659728 15212491 15730347 16183623 16545462 16801077 16950289
39869A6950289N2172l4293j14508j91732k62311l14710l34526l12123k47408j48712
$$ 16950289 17002461 16968168 16853660 16661928 16399617 16084907 15750381 15438258 15190850 15042138
39859A5042138k7600J05899K44464L81146N06082O05652O66005O79341O48591
$$ 15042138 15014538 15120437 15364901 15746047 16252129 16857781 17523786 18203127 18851718
39850A8851718N87135N14141M48607M04336L86538L90595M04152M12049M01717
$$ 18851718 19438853 19952994 20401601 20805937 21192475 21583070 21987222 22399271 22800988
39841B2800988L66810L08882K37677J69296J21051J04199J18971J55679K01227
$$ 22800988 23167798 23476680 23714357 23883653 24004704 24108903 24227874 24383553 24584780
39832B4584780K45830K85383L19290L47233L67537L76958L70919L44416K94536
$$ 24584780 24830610 25115993 25435283 25782516 26150053 26527011 26897930 27242346 27536882
39823B7536882K23582J40345N8310p858m5272m4595j392Q2526J98457L31991M66071
$$ 27536882 27760464 27900809 27959119 27951261 27905989 27861394 27860002 27942528 28140985 28472976 28939047
39812B8939047N85133O78953P45091P89378Q24551Q67775R37523J049821J213776
$$ 28939047 29524180 30203133 30948224 31737602 32562153 33429928 34367451 35417272 36631048
39803C6631048J427229J674258J926048K145333K293835K341992K279144K119942
$$ 36631048 38058277 39732535 41658583 43803916 46097751 48439743 50718887 52838829
39795E2838829J902211J675612J486735J368570J337717J396238J533185J724412
$$ 52838829 54741040 56416652 57903387 59271957 60609674 62005912 63539097 65263509
39787F5263509J933387K115473K225114K223476K085024J802782J391052Q82871
$$ 65263509 67196896 69312369 71537483 73760959 75845983 77648765 79039817 79922688
39779G9922688L21477k49811p92670j272133j653929j907590k014853j976448
$$ 79922688 80244165 79994354 79201684 77929551 76275622 74368032 72353179 70376731
39771G0376731j811654j551936j233736q93401n63742k71246l4861J32298K18818
$$ 70376731 68565077 67013141 65779405 64886004 64322262 64051016 64016155 64148453 64367271
39762F4367271K11917R9759j19959m30486p94282j163176j495109j766702j974658
$$ 64367271 64579188 64678947 64558988 64128502 63334220 62171044 60675935 58909233 56934575
39753E6934575k127463k234232k297193k311061k268711k169072k021472j843197
$$ 56934575 54807112 52572880 50275687 47964626 45695915 43526843 41505371 39662174
39745C9662174j652161j460293j271783j086405r04910p32822n79997m55636l61696
$$ 39662174 38010013 36549720 35277937 34191532 33286622 32553800 31973803 31518167 31156471
39736C1156471k89910k25929j58599q7520k2669K3643M5808M7973L9643K8215
$$ 31156471 30866561 30640632 30482033 30394513 30371844 30395487 30441295 30489268 30528911 30557126
39726C0557126J4077r040m9019j08406j79671k46434k90790l01915k79873k32900
$$ 30557126 30571203 30562163 30513144 30404738 30225067 29978633 29687843 29385928 29106055 28873155
39716B8873155j71647j04770l7021L1207J03604J86699K87741M12548N63725P39080
$$ 28873155 28701508 28596738 28559717 28590924 28694528 28881227 29168968 29581516 30145241 30884321
39706C0884321R30182J121482J290935J413514J468492J448815J367515J255786
$$ 30884321 31814503 32935985 34226920 35640434 37108926 38557741 39925256 41181042
39698D1181042J152264J088973J081386J126769J209884J311648J415610J509220
$$ 41181042 42333306 43422279 44503665 45630434 46840318 48151966 49567576 51076796
39690E1076796J580825J616756J602731J529999J401999J235904J056470Q85395
$$ 51076796 52657621 54274377 55877108 57407107 58809106 60045010 61101480 61986875
39682F1986875P33297N99911M81862L81388L09169K79329L00512L68948M67229
$$ 61986875 62720172 63320083 63801945 64183333 64492502 64771831 65072343 65441291 65908520
39673F5908520N68622O44208O70568O37067N51346M39539L38440K81697K86908
$$ 65908520 66477142 67121350 67791918 68428985 68980331 69419870 69758310 70040007 70326915
39664G0326915L49591M44844N34473N77696N43320M18640K10570o0057l64827
$$ 70326915 70676506 71121350 71655823 72233519 72776839 73195479 73406049 73345992 72981165
39655G2981165o70435r39915j137244j235506j223745j108032r07048o46197l53794
$$ 72981165 72310730 71370815 70233571 68998065 67774320 66666288 65759240 65113043 64759249
39646F4759249o0474J99317L86668M62005L95379J79883j60043n72945r96496
$$ 64759249 64698775 64898092 65284760 65746765 66142144 66322027 66161984 65589039 64592543
39637F4592543j375807j673834j871910j966262j965837j891039j769873j630932
$$ 64592543 63216736 61542902 59670992 57704730 55738893 53847854 52077981 50447049
39629E0447049j496365j378251j279027j194434j117079j039176r53883q55531
$$ 50447049 48950684 47572433 46293406 45098972 43981893 42942717 41988834 41133303
39621D1133303p39779o04343m49782k79149r5952R8576L07144N36021P93251J086433
$$ 41133303 40393524 39789181 39339399 39060250 38964298 39062874 39370018 39906039 40699290 41785723
39611D1785723J420253J793458K196262K610691L015715L395663L746858M077520
$$ 41785723 43205976 44999434 47195696 49806387 52822102 56217765 59964623 64042143
39603F4042143M400330M722583N039785N333700N571150N702134N662366N386401
$$ 64042143 68442473 73165056 78204841 83538541 89109691 94811825 100474191 105860592
39595A05860592M829062L983718K887007J609224K37524j140351k446883l617972
$$ 105860592 110689654 114673372 117560379 119169603 119407127 118266776 115819893 112201921
39587A12201921m600054n347413n826275o025299n964474n694202n283778m805390
$$ 112201921 107601867 102254454 96428179 90402880 84438406 78744204 73460426 68655036
39579F8655036m320555l872190l482172l153150k873873k627191k398708k182745
$$ 68655036 64334481 60462291 56980119 53826969 50953096 48325905 45927197 43744452
39571D3744452j983175j809534j671470j574462j517972j495673j497006j509245
$$ 43744452 41761277 39951743 38280273 36705811 35187839 33692166 32195160 30685915
39563C0685915j519483j516293j491330j440948j367521j279964j192310j119266
$$ 30685915 29166432 27650139 26158809 24717861 23350340 22070376 20878066 19758800
39555A9758800j069567j040948j021057r94479r50846q88498q12456p29860o46725
$$ 19758800 18689233 17648285 16627228 15632749 14681903 13793405 12980949 12251089 11604364
39546A1604364n67563m96704m38919l97809l73182l60425l53207l47101l40710
$$ 11604364 11036801 10540097 10101178 9703369 9330187 8969762 8616555 8269454 7928744
39537G928744l33666l24324l09442k85470k49703k00337j36036n6076L8187J41033
$$ 7928744 7595078 7270754 6961312 6675842 6426139 6225802 6089766 6033690 6071877 6212910
39527F212910K41386L25047L79497L97952L79930L29138K51475J54469M7156o0836
$$ 6212910 6454296 6779343 7158840 7556792 7936722 8265860 8517335 8671804 8718960 8658124
39517H658124j60498k44188l05998l42424l53085l40609l09580k65165k12058
$$ 8658124 8497626 8253438 7947440 7605016 7251931 6911322 6601742 6336577 6124519
39508F124519j53962r3974l6303J1629L9047L5311m333p4685j61578k48052l22236
$$ 6124519 5970557 5876583 5840280 5851909 5890956 5926267 5921934 5847249 5685671 5437619 5115383
39497E115383l81822m31833m77181n15904n38894n36417n05916m54784l96611
$$ 5115383 4733561 4301728 3824547 3308643 2769749 2233332 1727416 1272632 876021
39488H76021l44443l05826k81786k69001k62826k59003k53217k39704k11417j63137
$$ 876021 531578 225752 -56034 -325035 -587861 -846864 -1100081 -1339785 -1551202 -1714339
39478a714339r6010j9599N1235J03160J30237J35181J26520J15010J11329J24353
$$ -1714339 -1810349 -1829948 -1778713 -1675553 -1545316 -1410135 -1283615 -1168605 -1057276 -932923
39468i32923J58869K13459K80330L47640M03245M38503M51161M46182M33509M23246
$$ -932923 -774054 -560595 -280265 67375 470620 909123 1360284 1806466 2239975 2663221
39458B663221M20562M23264M23490M12710L87147L49976L08564K68430K28373
$$ 2663221 3083783 3507047 3930537 4343247 4730394 5080370 5388934 5657364 5885737
39449E885737J80386J14449K4998q4755k02792l12178l96714m45881m57548m37999
$$ 5885737 6066123 6180572 6205570 6120815 5918023 5605845 5209131 4763250 4305702 3867703
39439C867703l99290l54574l13164k77753k45304k10673j70922j28654r3269p9002
$$ 3867703 3468413 3113839 2800675 2522922 2277618 2066945 1896023 1767369 1674100 1595098
39429A595098r9271j59340k51732l57837m55041n24817n57268n50737n08632m36192
$$ 1595098 1495827 1336487 1084755 726918 271877 -252940 -810208 -1360945 -1869577 -2305769
39419b305769l38814k21761r0645M7848J85476L12722M19864M98268N41479N46260
$$ -2305769 -2644583 -2866344 -2956989 -2909141 -2723665 -2410943 -1991079 -1492811 -951332 -405072
39409d05072N13864M50793L67610K75455J82084R0186p61r0659j75916k49213
$$ -405072 108792 559585 927195 1202650 1384734 1474920 1474159 1383500 1207584 958371
39399I58371l01334l23568l10076k60243j80225q1767K2106J22196K15409L03289
$$ 958371 657037 333469 23393 -236850 -417075 -498842 -476736 -354540 -139131 164158
39389A64158L88982M75012N61902O46318P19428P68024P79553P48369O78492N80877
$$ 164158 553140 1028152 1590054 2236372 2955800 3723824 4503377 5251746 5930238 6511115
39379F511115M67929L49960K35438J32595M9294q958m0218m5158k5526J5998P4750
$$ 6511115 6979044 7329004 7564442 7697037 7746331 7737373 7697155 7651997 7626471 7642469 7717219
39368G717219J43838K15513K83324L43823L97253M46675M95642N45835N96578
$$ 7717219 7861057 8076570 8359894 8703717 9100970 9547645 10043287 10589122 11185700
39359A1185700O46123O92494P32789P63017P80583P87977P93679Q08463Q39678
$$ 11185700 11831823 12524317 13257106 14020123 14800706 15588683 16382362 17190825 18030503
39350A8030503Q87385R44088R97479J034581J045443J024546R69661Q80217P57455
$$ 18030503 18917888 19861976 20859455 21894036 22939479 23964025 24933686 25813903 26571358
39341B6571358O06346M37359K66403J12780m570p1995q5749n4239L170O0321R0740
$$ 26571358 27177704 27615063 27881466 27994246 27989676 27917681 27831932 27777693 27780863 27841184 27931924
39330B7931924P5793J1995q7069j96871k93109l60934l97548m08767m03331l88456
$$ 27931924 28007717 28019712 27932643 27735772 27442663 27081729 26684181 26275414 25872083 25483627
39320B5483627l68357l46035l26391l17463l27999l63114m21486m95530n73586
$$ 25483627 25115270 24769235 24442844 24125381 23797382 23434268 23012782 22517252 21943666
39311B1943666o42900o92828p17204p14254o84154o27124n44468m41227l26592
$$ 21943666 21300766 20607938 19890734 19176480 18492326 17865202 17320734 16879507 16552915
39302A6552915k10316r7823J1593J21837K34659L45903M45949N23775N71621N87208
$$ 16552915 16342599 16244776 16256369 16378206 16612865 16958768 17404717 17928492 18500113 19087321
39292A9087321N72997N34589M80338M21618L71259L39338L29036L36183L53029
$$ 19087321 19660318 20194907 20675245 21096863 21468122 21807460 22136496 22472679 22825708
39283B2825708L72792L91168M04165M05188L84980L35659K56700J58334N8864
$$ 22825708 23198500 23589668 23993833 24399021 24784001 25119660 25376360 25534694 25593558
39274B5593558k3260p7598j04899j14476j18874j29174j51922j87575k30600k71447
$$ 25593558 25570298 25492700 25387801 25273325 25154451 25025277 24873355 24685780 24455180 24183733
39264B4183733k99494l05585k83465k30295j46615l6404R2287K26641L50236M46965
$$ 24183733 23884239 23578654 23295189 23064894 22918279 22881875 22974162 23200803 23551039 23998004
39254B3998004N06136N25491N10761M72822M24133L75307L32553K97239K67819
$$ 23998004 24504140 25029631 25540392 26013214 26437347 26812654 27145207 27442446 27710265
39245B7710265K42438K20258K01525J87527J80512J82421J92728K08047K25361
$$ 27710265 27952703 28172961 28374486 28562013 28742525 28924946 29117674 29325721 29551082
39236B9551082K46408K78037L26306L88738M51998M97830N12560M92324M40650
$$ 29551082 29797490 30075527 30401833 30790571 31242569 31740399 32252959 32745283 33185933
39227C3185933L62032K58124J29778j7910j73385l22338m54606n68143o66675
$$ 33185933 33547965 33806089 33935867 33917957 33744572 33422234 32967628 32399485 31732810
39218C1732810p53712q28558q87324r26735r46720r49740r38248r12696q71897
$$ 31732810 30979098 30150540 29263216 28336481 27389761 26440021 25501773 24589077 23717180
39209B3717180q15549p47154o74895o09433n59650n28737n12762n02449m87193
$$ 23717180 22901631 22154477 21479582 20870149 20310499 19781762 19269000 18766551 18279358
39200A8279358m58952m14102l53005k78609j94928j05439j1966Q4230J78853K61707
$$ 18279358 17820406 17406304 17053299 16774690 16579762 16474323 16462357 16546587 16725440 16987147
39190A6987147L18623L38334L19305K71048K09001J47100R3001M7845Q813k8570
$$ 16987147 17305770 17644104 17963409 18234457 18443458 18590558 18683559 18731404 18740217 18711647
39180A8711647o9700j20580j86136k66854l55614m37079m91035m98756m49452
$$ 18711647 18641947 18521367 18335231 18068377 17712763 17275684 16784649 16285893 15836441
39171A5836441l43538j91760j2049J73780L43438M78542N69119O15510O26385
$$ 15836441 15492903 15301143 15289094 15462874 15806312 16284854 16853973 17469483 18095868
39162A8095868O14204N90762N64566N40519N21145N07551M99045M93002M87539
$$ 18095868 18710072 19300834 19865400 20405919 20927064 21434615 21933660 22426662 22914201
39153B2914201M86023M98399N36469O06722P07179Q29876R65176J104347J240556
$$ 22914201 23400224 23898623 24435092 25041814 25748993 26578869 27544045 28648392 29888948
39144B9888948J369729J490965J605648J716092J824980J935584K051467K174952
$$ 29888948 31258677 32749642 34355290 36071382 37896362 39831946 41883413 44058365
39136D4058365K304992K435870K558554K665145K753763K829502K899851K968068
$$ 44058365 46363357 48799227 51357781 54022926 56776689 59606191 62506042 65474110
39128F5474110L029766L074656L091614L074530L027143K964512K908740K879557
$$ 65474110 68503876 71578532 74670146 77744676 80771819 83736331 86645071 89524628
39120H9524628K884709K915930K952541K970148K949664K882849K772608K628842
$$ 89524628 92409337 95325267 98277808 101247956 104197620 107080469 109853077 112481919
39112A12481919K462287K279359K080195J860749J618152J356660J090278Q39218
$$ 112481919 114944206 117223565 119303760 121164509 122782661 124139321 125229599 126068817
39104A26068817O21389M44451L04518J92936J05688M7817K9652N8609J33197K43038
$$ 126068817 126690206 127134657 127439175 127632111 127737799 127785616 127815268 127873877 128007074 128250112
39094A28250112L74262N16854O69747Q39915J034986J254017J483466J701735
$$ 128250112 128624374 129141228 129810975 130650890 131685876 132939893 134423359 136125094
39086A36125094J888827K034425K140185K216486K276559K330960K384402K435387
$$ 136125094 138013921 140048346 142188531 144405017 146681576 149012536 151396938 153832325
39078A53832325K477956K504263K507236K482872K431670K358340K269010K166355
$$ 153832325 156310281 158814544 161321780 163804652 166236322 168594662 170863672 173030027
39070A73030027K045770J896800J710540J486763J232493R51774O36952K71770
$$ 173030027 175075797 176972597 178683137 180169900 181402393 182354167 182991119 183262889
39062A83262889j55382o40197j162134j692732k204295k675020l092356l455894
$$ 183262889 183107507 182467310 181305176 179612444 177408149 174733129 171640773 168184879
39054A68184879l776849m070972m347586m602515m820696m986085n090177n132912
$$ 168184879 164408030 160337058 155989472 151386957 146566261 141580176 136489999 131357087
39046A31357087n117747n047229m922296m743209m509894m223088l888080l518757
$$ 131357087 126239340 121192111 116269815 111526606 107016712 102793624 98905544 95386787
39038I5386787l137225k768114k432123k143908j914556j754217j670465j662199
$$ 95386787 92249562 89481448 87049325 84905417 82990861 81236644 79566179 77903980
39030G7903980j713542j793744j865385j896790j871328j788902j660839j502489
$$ 77903980 76190438 74396694 72531309 70634519 68763191 66974289 65313450 63810961
39022F3810961j326720j139453r38079p13671m56398j61336J68412N22531Q87015
$$ 63810961 62484241 61344788 60406709 59693038 59236640 59075304 59243716 59766247 60653262
39013F0653262J248268J596055J924743K233292K524561K803938L077153L347915
$$ 60653262 61901530 63497585 65422328 67655620 70180181 72984119 76061272 79409187
39005G9409187L616612L880590M134936M372400M582354M750027M857083M884019
$$ 79409187 83025799 86906389 91041325 95413725 99996079 104746106 109603189 114487208
38997A14487208M814293M639271M361532L994197L556690L070453K557588K041649
$$ 114487208 119301501 123940772 128302304 132296501 135853191 138923644 141481232 143522881
38989A43522881J547451J098183P11085L93903J43348n4267k20747l82636n66977
$$ 143522881 145070332 146168515 146879600 147273503 147416851 147362584 147141837 146759201 146192224
38980A46192224p95716j079752j416218j792221k192812k606062l020819l421228
$$ 146192224 145396508 144316756 142900538 141108317 138915505 136309443 133288624 129867396
38972A29867396l786124m095893m340966m524559m658001m753067m816380m847900
$$ 129867396 126081272 121985379 117644413 113119854 108461853 103708786 98892406 94044506
38964I4044506m842547m793171m693476m540497m336453m089617l813621l524988
$$ 94044506 89201959 84408788 79715312 75174815 70838362 66748745 62935124 59410136
38956E9410136l239745k970436k724778k506130k314570k146817j994821j845509
$$ 59410136 56170391 53199955 50475177 47969047 45654477 43507660 41512839 39667330
38948C9667330j684434j502489j301084j091625q89811p08903n55842m31314l32615
$$ 39667330 37982896 36480407 35179323 34087698 33197887 32488984 31933142 31501828 31169213
38939C1169213k57066k03446j69924j50039j30894r6564l5447N3427J59398K64761
$$ 31169213 30912147 30708701 30538777 30388738 30257844 30161280 30125833 30179260 30338658 30603419
38929C0603419L51695M07941M29503M20328L89449L46414K96857K40822J75164
$$ 30603419 30955114 31363055 31792558 32212886 32602335 32948749 33245606 33486428 33661592
38920C3661592R8567J5352o5030j32869j84067k22768k58699l01289l55035m19141
$$ 33661592 33760159 33775511 33710481 33577612 33393545 33170777 32912078 32610789 32255754 31836613
38910C1836613m90296n64905o38742p05417p56365p83151p80564p48786o93782
$$ 31836613 31346317 30781412 30142670 29437253 28680888 27897737 27117173 26368387 25674605
38901B5674605o25708n55779m92910m41921m03704l76054l54044l30708k99322
$$ 25674605 25048897 24493118 24000208 23558287 23154583 22778529 22424485 22093777 21794455
38892B1794455k56664k04965j50898j02417o5471m2087l0124k4265j7456k525
$$ 21794455 21537791 21332826 21181928 21079511 21014040 20971953 20941829 20917564 20900108 20897583
38882B0897583K5677O7355J15820J59250J86627J93967J85901J71785J60461J58183
$$ 20897583 20923260 20990615 21106435 21265685 21452312 21646279 21832180 22003965 22164426 22322609
38872B2322609J70047K01885K59915L48280M66562O09206P67414R32418J097854
$$ 22322609 22492656 22694541 22954456 23302736 23769298 24378504 25145918 26078336 27176190
38863B7176190J259674J414294J557690J687258J804874J917582K033928K157702
$$ 27176190 28435864 29850158 31407848 33095106 34899980 36817562 38851490 41009192
38855D1009192K283029K393574K466250K477892K412317K264600K040723J753747
$$ 41009192 43292221 45685795 48152045 50629937 53042254 55306854 57347577 59101324
38847E9101324J419679J054835O73823K87349r8279m77894q42431j177399j467412
$$ 59101324 60521003 61575838 62249661 62537010 62438731 61960837 61118406 59941007 58473595
38838E8473595j702965j883129k012197k094335k131554k126171k084420k017251
$$ 58473595 56770630 54887501 52875304 50780969 48649415 46523244 44438824 42421573
38830D2421573j937430j855300j776104j699862j623104j541533j452933j359059
$$ 42421573 40484143 38628843 36852739 35152877 33529773 31988240 30535307 29176248
38822B9176248j264775j174457j088271j001416r06904p99963o81752n60962m52199
$$ 29176248 27911473 26737016 25648745 24647329 23740425 22940462 22258710 21697748 21245549
38813B1245549l70922l26921l20410l43124l82593m25433m57923m65880m36740
$$ 21245549 20874627 20547706 20227296 19884172 19501579 19076146 18618223 18152343 17715603
38804A7715603l64087k52151j17330J5122J19067J77665J90978J76614J62453
$$ 17715603 17351516 17099365 16982035 16997157 17116224 17293889 17484867 17661481 17823934
38795A7823934J75514K32656L36518M76248O30900P74494Q82654R39645R42379
$$ 17823934 17999448 18232104 18568622 19044870 19675770 20450264 21332918 22272563 23214942
38786B3214942Q98510Q19853P16172N93450M55666L05862J44936k8581k14572
$$ 23214942 24113452 24933305 25649477 26242927 26698593 27004455 27149391 27120810 26906238
38777B6906238m05527n85029p33582q37538q94074r09303q92463q50962p88562
$$ 26906238 26500711 25915682 25182100 24344562 23450488 22541185 21648722 20797760 20009198
38768B0009198p06391o05451m88899l62404k32339j04403J4594J13088J74624
$$ 20009198 19302807 18697356 18208457 17846053 17613714 17509311 17523905 17636993 17811617
38759A7811617J84700J40482N4861m9559j52152k42992l23715m01968m84049n69798
$$ 17811617 17996317 18136799 18191660 18142101 17989949 17746957 17423242 17021274 16537225 15967427
38749A5967427o51968p20102p66288p88778p90982p77175p48678p03496o39434
$$ 15967427 15315459 14595357 13829069 13040291 12249309 11472134 10723456 10019960 9380526
38740I380526n58154m67064l77600l00901k43422k04605j77348j50944j15441
$$ 9380526 8822372 8355308 7977708 7676807 7433385 7228780 7051432 6900488 6785047
38731F785047o5647l003O5399J29701J80631K12448K24841K22978K15276K09785
$$ 6785047 6719400 6716397 6781796 6911497 7092128 7304576 7529417 7752395 7967671 8177456
38721H177456K11056K19017K30290K41167K50576K60817K74778K90998L00329
$$ 8177456 8388512 8607529 8837819 9078986 9329562 9590379 9865157 10156155 10456484
38712A0456484K87713K39068J49111K4750j17914k59879l83947m75907n24780
$$ 10456484 10744197 10983265 11132376 11157126 11039212 10779333 10395386 9919479 9394699
38703I394699n24865m78810l98015k98576j95135r6864p652P0907J36692J86258
$$ 9394699 8869834 8391024 7993009 7694433 7499298 7402434 7394782 7465689 7602381 7788639
38693G788639K15732K22113K04190J63384J04605L6282l1399q9392j31993j57408
$$ 7788639 8004371 8226484 8430674 8594058 8698663 8734945 8703546 8614154 8482161 8324753
38683H324753j67516j67622j65622j69765j85858k16002k59217l12001l67426
$$ 8324753 8157237 7989615 7823993 7654228 7468370 7252368 6993151 6681150 6313724
38674F313724m14355m39650m33368l93329l25604k41087j51227o5477R268O8119
$$ 6313724 5899369 5459719 5026351 4633022 4307418 4066331 3915104 3849627 3858895 3927014
38664C927014J07623J26209J26046J15124J06921J16520J54955K25291L22227
$$ 3927014 4034637 4160846 4286892 4402016 4508937 4625457 4780412 5005703 5327930
38655E327930M34456N47848O48294P24058P67410P75401P49619O95468O21314
$$ 5327930 5762386 6310234 6958528 7682586 8449996 9225397 9975016 10670484 11291798
38646A1291798N37227M52918L75498L08930K56061K21153K09581K24095K61254
$$ 11291798 11829025 12281943 12657441 12966371 13222432 13443585 13653166 13877261 14138515
38637A4138515L12142L67345M22185M78163N40020O10823O88329P64677Q29580
$$ 14138515 14450657 14818002 15240187 15718350 16258370 16869193 17557522 18322199 19151779
38628A9151779Q75302R00573R11090R16248R24033R37374R54034R69037R76925
$$ 19151779 20027081 20927654 21838744 22754992 23679025 24616399 25570433 26539470 27516395
38619B7516395R72560R51760R13249Q60741Q02799P49757P09306O82553O61923
$$ 27516395 28488955 29440715 30353964 31214705 32017504 32767261 33476567 34159120 34821043
38610C4821043O32436N77236M85260L56438K01386L6965j18844k50940l50122
$$ 34821043 35453479 36030715 36515975 36872413 37073799 37110764 36991920 36740980 36390858
38601C6390858m14666m49108m59973m50938m20828l65993k85354j84499p6121
$$ 36390858 35976192 35527084 35067111 34616173 34195345 33829352 33543998 33359499 33283378
38592C3283378K3447R9551J44150J58717J54014J45993J48870J68581K00245K31059
$$ 33283378 33306825 33406376 33550526 33709243 33863257 34009250 34158120 34326701 34526946 34758005
38582C4758005K46906K39263K08862J64337J17172P7013N0415M2189N5416Q8421
$$ 34758005 35004911 35244174 35453036 35617373 35734545 35811558 35861973 35904162 35959578 36047999
38572C6047999J31794J70147J88868J81000J49037J01392M7600m433m9366q5079
$$ 36047999 36179793 36349940 36538808 36719808 36868845 36970237 37017837 37013404 36964038 36878959
38562C6878959j12892j35972j56263j72572j81570j80487j68920j48720j22960
$$ 36878959 36766067 36630095 36473832 36301260 36119690 35939203 35770283 35621563 35498603
38553C5498603r4965o7490m1910j7986N087K6690M3426M9784M0293J1154l9874
$$ 35498603 35403638 35336148 35294238 35276252 35281339 35308029 35351455 35401239 35441532 35452686 35412812
38542C5412812j13893k09287l18560m27074n16075n68484n73816n30518m46511
$$ 35412812 35298919 35089632 34771072 34343998 33827923 33259439 32685623 32155105 31708594
38533C1708594l38439k28851j41069r3457r5468j46546k37267l51681m70104n72506
$$ 31708594 31370155 31141304 31000235 30906778 30811310 30664764 30427497 30075816 29605712 29033206
38523B9033206o42902o74166o70709o46479o18401n98654n89505n82163n59325
$$ 29033206 28390304 27716138 27045429 26398950 25780549 25181895 24592390 24010227 23450902
38514B3450902n01044l93157k35397m4720J49245L14696M28232M79816M71182
$$ 23450902 22949858 22556701 22321304 22276584 22425829 22740525 23168757 23648573 24119755
38505B4119755M11538L14764J98811Q4520q091o5224q3437p0198m0241r012J3913
$$ 24119755 24531293 24846057 25044868 25129388 25121297 25056073 24972636 24902438 24862197 24853185 24867098
38494B4867098K7841L8684N2982P2180R0588R7881Q4545M7224q683p0263j21224
$$ 24867098 24894939 24933623 24986605 25058785 25149373 25247254 25331799 25379023 25370340 25300077 25178853
38483B5178853j47040j39050r5951k1969P6709J94045L22930M52902N71261O68574
$$ 25178853 25031813 24892763 24796812 24774843 24851552 25045597 25368527 25821429 26392690 27061264
38473B7061264P43889Q03885Q55863R00755R32414R43183R30351Q98603Q58047
$$ 27061264 27805153 28609038 29464901 30365656 31298070 32241253 33171604 34070207 34928254
38464C4928254Q20616P97004P94632Q16660Q62282R28157J009887J102737J201791
$$ 34928254 35748870 36545874 37340506 38157166 39019448 39947605 40957492 42060229 43262020
38455D3262020J302176J399410J489752J570632J641615J705490J768344J837504
$$ 43262020 44564196 45963606 47453358 49023990 50665605 52371095 54139439 55976943
38447E5976943J917620K007131K097934K179227K242865K286003K309448K314290
$$ 55976943 57894563 59901694 61999628 64178855 66421720 68707723 71017171 73331461
38439G3331461K300463K267550K215330K142597K045854J920544J764883J583435
$$ 73331461 75631924 77899474 80114804 82257401 84303255 86223799 87988682 89572117
38431H9572117J387152J189090R98406Q17007O41744M70850L09761J71663P1999
$$ 89572117 90959269 92148359 93146765 93963772 94605516 95076366 95386127 95557790 95629789
38422I5629789K0521J6046M7072R7464J52969K04303K45749K72311K79284K65120
$$ 95629789 95650310 95666356 95713428 95810892 95963861 96168164 96413913 96686224 96965508 97230628
38412I7230628K34873K00695J78550J83347K25490L10063M37577O05152Q08377
$$ 97230628 97465501 97666196 97844746 98028093 98253583 98563646 99001223 99606375 100414752
38403A00414752J044746J317440J636298K013943K458845K969410L532043M123610
$$ 100414752 101459498 102776938 104413236 106427179 108886024 111855434 115387477 119511087
38395A19511087M717252N288934N820114O292602O677221O924109O962571O712501
$$ 119511087 124228339 129517273 135337387 141629989 148307210 155231319 162193890 168906391
38387A68906391O104504N105059L741416K115230L91692j238596k609764l618551
$$ 168906391 175010895 180115954 183857370 185972600 186364292 185125696 182515932 178897381
38379A78897381m234726m487077m438707m163971l732624l202315k618415k017930
$$ 178897381 174662655 170175578 165736871 161572900 157840276 154637961 152019546 150001616
38371A50001616j432732q88911m03342J8554L80881O92085R60026J189961J385138
$$ 150001616 148568884 147679973 147276631 147295185 147676066 148368151 149328177 150518138 151903276
38362A51903276J548109J681927J791650J886338J979993K089537K229257K403812
$$ 151903276 153451385 155133312 156924962 158811300 160791293 162880830 165110087 167513899
38354A67513899K603554K806044K984515L119370L206012L254927L285678L320467
$$ 167513899 170117453 172923497 175908012 179027382 182233394 185488321 188773999 192094466
38346A92094466L381193L489329L664738L920865M257494M655494N077294N472907
$$ 192094466 195475659 198964988 202629726 206550591 210808085 215463579 220540873 226013780
38338B26013780N787417N965454N951040N686078N114446M198445K946263J436171
$$ 226013780 231801197 237766651 243717691 249403769 254518215 258716660 261662923 263099094
38330B63099094j83200j726049l022354l962224m510674m693516m570701m212961
$$ 263099094 262915894 261189845 258167491 254205267 249694593 245001077 240430376 236217415
38322B36217415l688467l058585k378952j701462j073436n33108j04402K04408
$$ 236217415 232528948 229470363 227091411 225389949 224316513 223783405 223679003 223883411
38314B23883411L96072M76866M52571L31486J30608j23161m00265o77969r43063
$$ 223883411 224279483 224756349 225208920 225540406 225671014 225547853 225147588 224469619 223526556
38305B23526556j186610j398570j569107j694012j776511j823121j839134j829509
$$ 223526556 222339946 220941376 219372269 217678257 215901746 214078625 212239491 210409982
38297B10409982j803252j774315j755952j753554j763224j777205j790349j802016
$$ 210409982 208606730 206832415 205076463 203322909 201559685 199782480 197992131 196190115
38289A96190115j814093j829937j856189j904143j987019k114337k288193k503833
$$ 196190115 194376022 192546085 190689896 188785753 186798734 184684397 182396204 179892371
38281A79892371k751926l018695l284069l521685l703409l806063l815399l724927
$$ 179892371 177140445 174121750 170837681 167315996 163612587 159806524 155991125 152266198
38273A52266198l532377l238772k852188k393058j895493j401363r49176n64077
$$ 152266198 148733821 145495049 142642861 140249803 138354310 136952947 136003771 135439694
38265A35439694k55135k1401J38113K18078K08582J02475r8183l80965p25984
$$ 135439694 135184559 135163158 135301271 135519349 135727931 135830406 135732223 135351258 134625274
38256A34625274j108881j502460j879289k216899k502969k735748k919105l057390
$$ 134625274 133516393 132013933 130134644 127917745 125414776 122679028 119759923 116702533
38248A16702533l155637l224378l282267l351184l446175l568260l705618l840963
$$ 116702533 113546896 110322518 107040251 103689067 100242892 96674632 92969014 89128051
38240H9128051l958214m044424m089004m084537m029730l930650l796929l634670
$$ 89128051 85169837 81125413 77036409 72951872 68922142 64991492 61194563 57559893
38232E7559893l441847l210410k933699k613596k262853j902342j555847j244538
$$ 57559893 54118046 50907636 47973937 45360341 43097488 41195146 39639299 38394761
38224C8394761r81948p70981o05235m74778l72416k95808k44820k17812k09790
$$ 38394761 37412813 36641832 36036597 35561819 35189403 34893595 34648775 34430963 34221173
38215C4221173k12256k13313j98455j53380o8709N5248K06056L60720M91713N75239
$$ 34221173 34008917 33795604 33597149 33443769 33375060 33430308 33636364 33997084 34488797 35064036
38205C5064036N97538N56565M60451L25958J77194M1712n7331j09656j21640j12748
$$ 35064036 35661574 36218139 36678590 37004548 37181742 37223454 37166123 37056467 36934827 36822079
38195C6822079j06576j21131j62772k25720k96071l57572l96788m06510l86850
$$ 36822079 36715503 36594372 36431600 36205880 35909809 35552237 35155449 34748939 34362089
38186C4362089l43829k86497k24357j66251j20016r1753q4446r6724j22714j53716
$$ 34362089 34018260 33731763 33507406 33341155 33221139 33129386 33044940 32948216 32825502 32671786
38176C2671786j81602k02312k17029k30222k46399k68143k96097l29660l67477
$$ 32671786 32490184 32287872 32070843 31840621 31594222 31326079 31029982 30700322 30332845
38167C0332845m07786m48619m87549n21179n45462n57315n56484n46182n31988
$$ 30332845 29925059 29476440 28988891 28467712 27922250 27364935 26808451 26262269 25730281
38158B5730281n19717n12850n10092n04135m83190m35725l56191k48163j22819
$$ 25730281 25210564 24697714 24187622 23683487 23200297 22764572 22408381 22160218 22037399
38149B2037399N963J26342K30475L13579L72117M02957M04056L75407L18740K35876
$$ 22037399 22043362 22169704 22400179 22713758 23085875 23488832 23892888 24268295 24587035 24822911
38139B4822911J27693m127j53009l04458m37474n30810n70770n56309m98814m17095
$$ 24822911 24950604 24946477 24793468 24489010 24051536 23520726 22949956 22393647 21894833 21477738
38129B1477738l30642k54584j97867j63921j51976j58032j75566j96747k14351
$$ 21477738 21147096 20892512 20694645 20530724 20378748 20220716 20045150 19848403 19634052
38120A9634052k23540k22185k09662j85919j52591j15002q1788o1022n5833o3270
$$ 19634052 19410512 19188327 18978665 18792746 18640155 18525153 18443365 18382343 18326510 18263240
38110A8263240p6686q8801r3795q9364p9215p3831q6864j28127j97897k86435
$$ 18263240 18186554 18097753 18003958 17914594 17835379 17761548 17674684 17546557 17348660 17062225
38100A7062225l78241m56944n07912n19384m84674m05595k93976j68532m8277
$$ 17062225 16683984 16227040 15719128 15199744 14715070 14309475 14015499 13846967 13798690
38091A3798690N3082J28455J74903J90684J74545J27289N3428l9023j40473k41452
$$ 13798690 13851772 13980227 14155130 14345814 14520359 14647648 14701076 14662053 14521580 14280128
38081A4280128l32759m04649m46687m49212m06252l18996j98123o2910O3770J62612
$$ 14280128 13947369 13542720 13096033 12646821 12240569 11921573 11723450 11660540 11724310 11886922
38071A1886922K23565K47362K42895K22057J94319J63088J25419P5187Q060p4244
$$ 11886922 12110487 12357849 12600744 12822801 13017120 13180208 13305627 13380814 13388874 13314630
38061A3314630j62567k42627l00049l25649l18330k84335k33764j76732j21294
$$ 13314630 13152063 12909436 12609387 12283738 11965408 11681073 11447309 11270577 11149283
38052A1149283p3636l8762j9775j6101k3213l4987m6530n4589n5877m6409k3404
$$ 11149283 11075647 11036885 11017110 11001009 10977796 10942809 10896279 10841690 10785813 10739404 10716000
38041A0716000J2062N3968R2246J15219J13553Q4821L5954j8944o4251q8069q4302
$$ 10716000 10728062 10782030 10874276 10989495 11103048 11187869 11223823 11204879 11140628 11052559 10968257
38030A0968257n2165M789P9236J60918K38444L01659L43668L61822L57524L34981
$$ 10968257 10916092 10920881 11000117 11161035 11399479 11701138 12044806 12406628 12764152 13099133
38020A3099133K99157K53735K00011J37355O4665j8110j08912k02941k92637l68682
$$ 13099133 13398290 13652025 13852036 13989391 14054056 14035946 13927034 13724093 13431456 13062774
38010A3062774m21720m43903m29898l78105k92664j85252p4283K0080Q3939J16344
$$ 13062774 12641054 12197151 11767253 11389148 11096484 10911232 10836949 10857029 10940968 11057312
38000A1057312J29874J43851J74083K25537K91538L58341M11171M38644M34593
$$ 11057312 11187186 11331037 11505120 11730657 12022195 12380536 12791707 13230351 13664944
37991A3664944L98114L33451K50724J66426J01236P4331R6670J66961K71927L89890
$$ 13664944 14063058 14396509 14647233 14813659 14914895 14989226 15085896 15252857 15524784 15914674
37981A5914674M96189N69665N99007N86521N46878N00778M66625M54547M65563
$$ 15914674 16410863 16980528 17579535 18166056 18712934 19213712 19680337 20134884 20600447
37972B0600447M95411N40178O00211O79980P83822R10132J048362J181956J295956
$$ 20600447 21095858 21636036 22236247 22916227 23700049 24610181 25658543 26840499 28136455
37963B8136455J384245J451530J509399J569905J640782J724390J819939J927087
$$ 28136455 29520700 30972230 32481629 34051534 35692316 37416706 39236645 41163732
37955D1163732K048725K191089K360820K560562K786214L028596L279469L538534
$$ 41163732 43212457 45403546 47764366 50324928 53111142 56139738 59419207 62957741
37947F2957741L816718M133374M509173M959544N492751O112783O823486P630258
$$ 62957741 66774459 70907833 75417006 80376550 85869301 91982084 98805570 106435828
37939A06435828Q538878R553480J0674966J1899616J3218092J4615915J6074864
$$ 106435828 114974706 124528186 135203152 147102768 160320860 174936775 191011639
37932A91011639J7572484J9077428K0540714K1883356K2980220K3642942K3611000
$$ 191011639 208584123 227661551 248202265 270085621 293065841 316708783 340319783
37925C40319783K2565319K0180405J6224866J0695046L923503l420914j0484896
$$ 340319783 362885102 383065507 399290373 409985419 413908922 410488008 400003112
37918D00003112j6480474k0903886k3616079k4776924k4709166k3774407k2296263
$$ 400003112 383522638 362618752 339002673 314225749 289516583 265742176 243445913
37911B43445913k0525957j8636311j6733808j4879288j3108229j1445396r912311
$$ 243445913 222919956 204283645 187549837 172670549 159562320 148116924 138204613
37904A38204613q527670p303043o238647n322957m536353l856937l266278k752328
$$ 138204613 129676943 122373900 116135253 110812296 106275943 102419006 99152728 96400400
37896I6400400k307356j922444j583454j271341r65177o45327k96440Q9772N13740
$$ 96400400 94093044 92170600 90587146 89315805 88350628 87705301 87408861 87498633 88012373
37887H8012373R70586J454271J960592K488128L037700L610690M206944M823803
$$ 88012373 88982959 90437230 92397822 94885950 97923650 101534340 105741284 110565087
37879A10565087N456900O101474O752644P404470Q048543Q674019R272538R849471
$$ 110565087 116021987 122123461 128876105 136280575 144329118 153003137 162275675 172125146
37871A72125146J0435549J1087588J1873006J2845657J4026693J5397863J6904252
$$ 172125146 182560695 193648283 205521289 218366946 232393639 247791502 264695754
37864B64695754J8458620J9940999K1191641K2000367K2099848K1175861J8913186
$$ 264695754 283154374 303095373 324287014 346287381 368387229 389563090 408476276
37857D08476276J5091894R719182L133350m004897j0869228j6709565k1053500
$$ 408476276 423568170 433287352 436420702 432415805 421546577 404837012 383783512
37850C83783512k3773890k5023385k5107212k4367557k3112331k1585574j9963383
$$ 383783512 360009622 334986237 309879025 285511468 262399137 240813563 220850180
37843B20850180j8360657j6840269j5423550j4104053j2863553j1685243j0560542
$$ 220850180 202489523 185649254 170225704 156121651 143258098 131572855 121012313
37836A21012313r490163q481996p547357o696682n936438n268508m691731m203866
$$ 121012313 111522150 103040154 95492797 88796115 82859677 77591169 72899438 68695572
37828F8695572l802309l482562l235400l045511k894009k763743k643342k527005
$$ 68695572 64893263 61410701 58175301 55129790 52235781 49472038 46828696 44301691
37820D4301691k411124k291356k162490k020531j864687j697718j524786j352013
$$ 44301691 41890567 39599211 37436721 35416190 33551503 31853785 30328999 28976986
37812B8976986j185667j031724q95356p80539o90619o29948o04939o22318o84162
$$ 28976986 27791319 26759595 25864239 25083700 24393081 23763133 23158194 22535876 21851714
37803B1851714p82579q98543j006835j084450j117405j102680j045678r55532
$$ 21851714 21069135 20170592 19163757 18079307 16961902 15859222 14813544 13858012
37795A3858012q40543p05447n51631l80305j96805j3419J51227K76574L46532
$$ 13858012 13017469 12312022 11760391 11380086 11183281 11169862 11321089 11597663 11944195
37786A1944195L54840L06924K18215J10552P560p1068j15354j27884j21590j13646
$$ 11944195 12299035 12605959 12824174 12934726 12942286 12871218 12755864 12627980 12506390 12392744
37776A2392744j18861j44952j90398k45095k93842l21453l17004k75644j98231
$$ 12392744 12273883 12128931 11938533 11693438 11399596 11078143 10761139 10485495 10287264
37767A0287264r0105L9963J80554L18905M43899N50679O44153P37827Q47377R82648
$$ 10287264 10197159 10237122 10417676 10736581 11180480 11731159 12375312 13113139 13960516 14943164
37757A4943164J143122J318687J494175J654917J791156J899358J979337K028147
$$ 14943164 16086286 17404973 18899148 20554065 22345221 24244579 26223916 28252063
37749B8252063K034394J976481J826240J557501J158164O41958N2907n43425j079940
$$ 28252063 30286457 32262938 34089178 35646679 36804843 37446801 37499708 36956283 35876343
37740C5876343j508437j809291j988195k066581k072911k036489j981918j924088
$$ 35876343 34367906 32558615 30570420 28503839 26430928 24394439 22412521 20488433
37732B0488433j865980j801069j719065j612011j478112j322300j154007r83685
$$ 20488433 18622453 16821384 15102319 13490308 12012196 10689896 9535889 8552204
37724H552204q20025o69266n36573m27635l48281l01500k84098k86148k94205
$$ 8552204 7732179 7062913 6526340 6098705 5750424 5448924 5164826 4878678 4584473
37715D584473k96168k84987k59974k26469j94439j75860j80726k12671k66206
$$ 4584473 4288305 4003318 3743344 3516875 3322436 3146576 2965850 2753179 2486973
37706B486973l27420l78399m03578l95194l55545k95085k27151j61784j02108
$$ 2486973 2159553 1781154 1377576 982382 626837 331752 104601 -57183 -159291
37697a59291m5405J2347P2330J31968J86719K32068K64276K80506K79826K64928
$$ -159291 -204696 -192349 -120019 11949 198668 430736 695012 975518 1255344 1520272
37687A520272K42754K22168K09281K04015K01249J95905J87297J78855J73629
$$ 1520272 1763026 1985194 2194475 2398490 2599739 2795644 2982941 3161796 3335425
37678C335425J69801J59880J34327Q7382K1577n1963j17790j62194j77603j63665
$$ 3335425 3505226 3665106 3799433 3886815 3908392 3856429 3738639 3576445 3398842 3235177
37668C235177j25915p3359j5960L7534Q0822J10252J24143J21727J02567O7325
$$ 3235177 3109262 3035903 3019943 3057477 3138299 3248551 3372694 3494421 3596988 3664313
37658C664313J9688l2606p9651j13409j30580j31931j19332r3803n6332j0100
$$ 3664313 3684001 3651395 3571744 3458335 3327755 3195824 3076492 2982689 2926357 2916257
37648B916257L8546Q1744J13220J30340J33481J23800J02038O9777L1605m646
$$ 2916257 2954803 3036547 3149767 3280107 3413588 3537388 3639426 3709203 3740808 3736162
37638C736162l0745m2113l9898k9366j5737q25J6858L8882O4093Q9403J13432
$$ 3736162 3705417 3663304 3623406 3594040 3578303 3577478 3594336 3633218 3697311 3786714 3900146
37627C900146J38570J68282K01747K31553K47568K44145K24600J99727J82080
$$ 3900146 4038716 4206998 4408745 4640298 4887866 5132011 5356611 5556338 5738418
37618E738418J80270J96071K24536K55965K78739K82595K61963K18139J58718
$$ 5738418 5918688 6114759 6339295 6595260 6873999 7156594 7418557 7636696 7795414
37609G795414R3919L1825k4209p4622j20666j61836j95242k17042k25218k21927
$$ 7795414 7889333 7921158 7896949 7822327 7701661 7539825 7344583 7127541 6902323 6680396
37599F680396k13228k05682k02282k01039j97105j86260j66932j39870j06552
$$ 6680396 6467168 6261486 6059204 5858165 5661060 5474800 5307868 5167998 5061446
37590E061446o8581k9393K997J6335km6924j12823j79610k32731k66621k82524
$$ 5061446 4992865 4963472 4966469 4982804 4982802 4935878 4823055 4643445 4410714 4144093 3861569
37579C861569k83094k69528k42381k03367j55885j04233n2263k002M6949R6389
$$ 3861569 3578475 3308947 3066566 2863199 2707314 2603081 2550818 2548816 2595765 2692154
37569B692154J47387J98847K47682K89606L19373L31230L21110K89945K45065
$$ 2692154 2839541 3038388 3286070 3575676 3895049 4226279 4547389 4837334 5082399
37560E082399J97638J57609J29748J13068J03211R5658Q8093Q1053P6965P8173
$$ 5082399 5280037 5437646 5567394 5680462 5783673 5879331 5967424 6048477 6125442 6203615
37550F203615Q4751R2989R5649Q4721N5972J2364l6561p9607j10011j28548j41680
$$ 6203615 6288366 6381355 6477004 6561725 6617697 6630061 6593500 6513893 6403882 6275334 6133654
37539F133654j56169j73728j89283j94009j81183j50766j09533o6948l0192k208
$$ 6133654 5977485 5803757 5614474 5420465 5239282 5088516 4978983 4912035 4881843 4879635
37529D879635J6187K2810J2931j8071p0696j39584k15557k89530l55177m08713
$$ 4879635 4895822 4918632 4931563 4913492 4842796 4703212 4487655 4198125 3842948 3434235
37519C434235m46791m64628m55993m15130l39486k31757j00392M1435J77724K91806
$$ 3434235 2987444 2522816 2066823 1651693 1312207 1080450 980058 1021493 1199217 1491023
37509A491023L68760L98322L77876L13884K20192J13500Q562q4406j59862k16407
$$ 1491023 1859783 2258105 2635981 2949865 3170057 3283557 3292119 3207713 3047851 2831444
37499B831444k56770k87475l16528l49380l85842m20670m47609m63302m67709
$$ 2831444 2574674 2287199 1970671 1621291 1235449 814779 367170 -96132 -563841
37490e63841m61377m43203m11143l64553l05154k35877j59513p8826K577Q0296
$$ -563841 -1025218 -1468421 -1879564 -2244117 -2549271 -2785148 -2944661 -3023487 -3020910 -2940614
37480b940614J50489K11440K64011L10585L53163L92044M26039M53799M74660
$$ -2940614 -2790125 -2578685 -2314674 -2004089 -1650926 -1258882 -832843 -379044 95616
37471I5616M88203M93163M87216M68000M34748L89667L38520K89938K53154K34876
$$ 95616 583819 1076982 1564198 2032198 2466946 2856613 3195133 3485071 3738225 3973101
37461C973101K37228K58308K94729L43329L99944M56668N01492N22558N14320
$$ 3973101 4210329 4468637 4763366 5106695 5506639 5963307 6464799 6987357 7501677
37452G501677M80348M30107L72445L11040K44733J71461R2210J2000o2523j26960
$$ 7501677 7982025 8412132 8784577 9095617 9340350 9511811 9604021 9616021 9553498 9426538
37442I426538j81413k29218k73208l12850l44915l66675l77944l79654l70775
$$ 9426538 9245125 9015907 8742699 8429849 8084934 7718259 7340315 6960661 6589886
37433F589886l47646l07173k50731j84479j15471m7260K0752Q9608J56156K11791
$$ 6589886 6242240 5935067 5684336 5499857 5384386 5337126 5357878 5447486 5603642 5815433
37423E815433K45965K51809K29568J86026J31641P8069L6330J4229J3304K7870
$$ 5815433 6061398 6313207 6542775 6728801 6860442 6938511 6974841 6989070 7002374 7030244
37413G030244M8199O6361Q0749R6078J18946J51869J90005K23123K41781K43489
$$ 7030244 7078443 7144804 7225553 7321631 7440577 7592446 7782451 8005574 8247355 8490844
37403H490844K34727K27538K32719K53248K81399L01241K95426K52619J72041
$$ 8490844 8725571 8953109 9185828 9439076 9720475 10021716 10317142 10569761 10741802
37394A0741802O4125n1723j51282k11469k17292j67450p5792L2539J29105J91400
$$ 10741802 10805927 10754204 10602922 10391453 10174161 10006711 9930919 9963458 10092563 10283963
37384A0283963K09718J88854J43648R0413L8666j2131o8787j36269k11000k80338
$$ 10283963 10493681 10682535 10826183 10916596 10955262 10943131 10874344 10738075 10527075 10246737
37374A0246737l28327l43577l24586k80224k25824j76701j41568j18866r8330
$$ 10246737 9918410 9574833 9250247 8970023 8744199 8567498 8425930 8307064 8208734
37365H208734o7383j8669M6061J17737J85383K40972K81095L05638L15490L10714
$$ 8208734 8141351 8122682 8168743 8286480 8471863 8712835 8993930 9299568 9615058 9925772
37355I925772K89550K48266J82328Q9561k5348j47635k53896l19162l26440k73248
$$ 9925772 10215322 10463588 10645916 10735477 10710129 10562494 10308598 9989436 9662996 9389748
37345I389748j71451m1235R6719K27011L41618M38719N19338N83363O27075O44225
$$ 9389748 9218297 9177062 9273781 9500792 9842410 10281129 10800467 11383830 12010905 12655130
37335A2655130O30650N89525N33231M80306M49546M54688N01224N85222O94217
$$ 12655130 13285780 13875305 14408536 14888842 15338388 15793076 16294300 16879522 17573739
37326A7573739Q10824R18424J006242J071279J116926J149999J177583J203940
$$ 17573739 18384563 19302987 20309229 21380508 22497434 23647433 24825016 26028956
37318B6028956J227672J240453J229008J180499J088886R58643Q03983O44874
$$ 26028956 27256628 28497081 29726089 30906588 31995474 32954117 33758100 34402974
37310C4402974N02464L95259L35944L29092L70589M48840N46830O44741P23572
$$ 34402974 34905438 35300697 35636641 35965733 36336322 36785162 37331992 37976733 38700305
37301C8700305P69003P73133P33160O49181N23663L62288J74270k7957k28580
$$ 38700305 39469308 40242441 40975601 41624782 42148445 42510733 42685003 42657046 42428466
37292D2428466m08520n48270o33568o60292o34717n68968m74645l58445k22738
$$ 42428466 42019946 41471676 40838108 40177816 39543099 38974131 38499486 38141041 37918303
37283C7918303p1525Q2146K14085K96013L08039K48282J34006n160j37572k39084
$$ 37918303 37846778 37928924 38143009 38439022 38747061 38995343 39129349 39124189 38986617 38747533
37273C8747533k98474l16855l02026k61839k00978j22337l0165O8732J66934K59879
$$ 38747533 38449059 38132204 37830178 37568339 37367361 37245024 37214859 37283591 37450525 37710404
37263C7710404L48078M36520N31446O36087P47446Q56046R49211J016715J055889
$$ 37710404 38058482 38495002 39026448 39662535 40409981 41266027 42215238 43231953 44287842
37254D4287842J073254J081279J091591J108060J123543J122304J086996J006555
$$ 44287842 45361096 46442375 47533966 48642026 49765569 50887873 51974869 52981424
37246E2981424Q81064P21266N43329L61986J86391K1459j26610k45520l17306
$$ 52981424 53862488 54583754 55127083 55489069 55675460 55696919 55570309 55324789 55007483
37237E5007483l24298k56658j17525P5452K91503M90913O32455O82558O22833
$$ 55007483 54683185 54426527 54309002 54384454 54675957 55166870 55799325 56481883 57104716
37228E7104716M53353J92212j27008m60133p61003r92616j136038j192950j181844
$$ 57104716 57558069 57750281 57623273 57163140 56402137 55409521 54273483 53080533 51898689
37219E1898689j131124j071614j029125j017834j036688j071029j099476j103562
$$ 51898689 50767565 49695951 48666826 47648992 46612304 45541275 44441799 43338237
37211D3338237j075888j022442r57457q94100q37713p85968p34086o79502o22882
$$ 43338237 42262349 41239907 40282450 39388350 38550637 37764669 37030583 36351081 35728199
37202C5728199n67200n17660m81772m66977m75900n03297n38348n70930n96774
$$ 35728199 35160999 34643339 34161567 33694590 33218690 32715393 32177045 31606115 31009341
37193C1009341o17960o39474o64951o93866p20957p38095p38203p19542o88060
$$ 31009341 30391381 29751907 29086956 28393090 27672133 26934038 26195835 25476293 24788233
37184B4788233o56312o38950o46252o78525p24952p68866p96715q04544p97099
$$ 24788233 24131921 23492971 22846719 22168194 21443242 20674376 19877661 19073117 18276018
37175A8276018p80728p56256p17792o58201n76358m80110l82900k97451k31662
$$ 18276018 17495290 16739034 16021242 15363041 14786683 14306573 13923673 13626222 13394560
37166A3394560j88624j68512j69429j86722k12564k37399k53069k55746k46382
$$ 13394560 13205936 13037424 12867995 12681273 12468709 12231310 11978241 11722495 11476113
37157A1476113k28023k02029j66528j18495n7700J0674P6388J27473J55268J58884
$$ 11476113 11248090 11046061 10879533 10761038 10703338 10714012 10790400 10917873 11073141 11232025
37147A1232025J46035J28841J16942J12763J11957J08043R7711Q3691P3899P7522
$$ 11232025 11378060 11506901 11623843 11736606 11848563 11956606 12054317 12138008 12211907 12289429
37137A2289429J00293J41702J95356K51538L00170L33234L46592L40815L20282
$$ 12289429 12389722 12531424 12726780 12978318 13278488 13611722 13958314 14299129 14619411
37128A4619411K90777K57434K25011K00273J93423K15382K71256L54653M48306
$$ 14619411 14910188 15167622 15392633 15592906 15786329 16001711 16272967 16627620 17075926
37119A7075926N31936N92200O27607O45424O54081O57478O54586O42634O19932
$$ 17075926 17607862 18200062 18827669 19473093 20127174 20784652 21439238 22081872 22701804
37110B2701804N86502N43560M92960M36475L75034L09484K43768J88030J57745
$$ 22701804 23288306 23831866 24324826 24761301 25136335 25445819 25689587 25877617 26035362
37101B6035362J68314K29331L42818N05193P09436R45322J199166J455472J700867
$$ 26035362 26203676 26433007 26775825 27281018 27990454 28935776 30134942 31590414 33291281
37092C3291281J928197K138110K336543K529208K716630K893623L053459L192611
$$ 33291281 35219478 37357588 39694131 42223339 44939969 47833592 50887051 54079662
37084E4079662L311038L406991L470500L481683L417552L265639L037539K773486
$$ 54079662 57390700 60797691 64268191 67749874 71167426 74433065 77470604 80244090
37076H0244090K533349K377728K348955K460504K696735L019840L380102L726504
$$ 80244090 82777439 85155167 87504122 89964626 92661361 95681201 99061303 102787807
37068A02787807M014816M210930M289858M233211M027961L667127L151718K493264
$$ 102787807 106802623 111013553 115303411 119536622 123564583 127231710 130383428 132876692
37060A32876692J716279Q60336j8484q48124j546758k037614k269046k229747
$$ 132876692 134592971 135453307 135434823 134586699 133039941 131002327 128733281 126503534
37052A26503534j950394j492461r32763l50851J80162O01853Q77769R96752R69743
$$ 126503534 124553140 123060679 122127916 121777065 121957227 122559080 123436849 124433601 125403344
37043A25403344Q20864N76977K61232j06424n04092r03900j272483j574516j776053
$$ 125403344 126224208 126801185 127062417 126955993 126451901 125548001 124275518 122701002 120924949
37034A20924949j847638j769371j537658j169435o99455j70768L77204R18000
$$ 120924949 119077311 117307940 115770282 114600847 113901392 113730624 114107828 115025828
37026A15025828J442374J957680K483111L041411L648481M304597M991271N674226
$$ 115025828 116468202 118425882 120908993 123950404 127598885 131903482 136894753 142568979
37018A42568979O308911O844976P230514P419395P382461P119146O664972O092116
$$ 142568979 148877890 155722866 162953380 170372775 177755236 184874382 191539354 197631470
37010A97631470N501783N007965M714905M694618M972142N522727O280128P152182
$$ 197631470 203133253 208141218 212856123 217550741 222522883 228045610 234325738 241477920
37002B41477920Q039699Q854612R532736J0036963J0350283J0463199J0362704
$$ 241477920 249517619 258372231 267904967 277941930 288292213 298755412 309118116
36995C09118116J0028171R435408Q567231P427644O054532M524244K943998J435271
$$ 309118116 319146287 328581695 337148926 344576570 350631102 355155346 358099344 359534615
36987C59534615J16004r12873j577517j841317j715912j269745o28653L6643N37632
$$ 359534615 359650619 358737746 357160229 355318912 353603000 352333255 351704602 351741245 352278877
36978C52278877P04097M18956l56586j571519l091216m726918o285741p621655
$$ 352278877 352982974 353401930 353045344 351473825 348382609 343655691 337369950 329748295
36970C29748295q661264r394206r842925j0036055r998554r756572r349388q841152
$$ 329748295 321087031 311692825 301849900 291813845 281815291 272058719 262709331 253868179
36962B53868179q324867p911336p702233p756560q066282q555020r103237r588677
$$ 253868179 245543312 237631976 229929743 222173183 214106901 205551881 196448644 186859967
36954A86859967r921511j0058404r995815r755393r372573q889783q350508p793216
$$ 186859967 176938456 166880052 156884237 147128844 137756271 128866488 120515980 112722764
36946A12722764p246836o728518o242820n782751n333993m881979m418836l947094
$$ 112722764 105475928 98747410 92504590 86721839 81387846 76505867 72087031 68139937
36938F8139937l478946l032018k624234k270398j981155j762833j616388j535797
$$ 68139937 64660991 61628973 59004739 56734341 54753186 52990353 51373965 49838168
36930D9838168j507532j512065j527143j532175j512380j460700j376380j261849
$$ 49838168 48330636 46818571 45291428 43759253 42246873 40786173 39409793 38147944
36922C8147944j121029r60327p90388o25981m83057l74271l05559k75839k80065
$$ 38147944 37026915 36066588 35276200 34650219 34167162 33792891 33487332 33211493 32931428
36913C2931428l13184l71892m53063n50738o54483p50572q25539q70134q81549
$$ 32931428 32618244 32246352 31793289 31242551 30588068 29837496 29011957 28141823 27260274
36904B7260274q62857q20767p63369o98397o31422n64405m96369m26779l59198
$$ 27260274 26397417 25576650 24813281 24114884 23483462 22919057 22422688 21995909 21636711
36895B1636711l01845k64330k53141k69299l09368l68141m40126n18344n91972
$$ 21636711 21334866 21070536 20817395 20548096 20238728 19870587 19430461 18912117 18320145
36886A8320145o46345o67072o46138n85407m94861l87153k72742j58875n2167
$$ 18320145 17673800 17006728 16360590 15775183 15280322 14893169 14620427 14461552 14409385
36877A4409385L8492J02117J29466J17924P3797J0290n7783j19676j71680k16028
$$ 14409385 14447877 14549994 14679460 14797384 14871181 14881471 14823688 14704012 14532332 14316304
36867A4316304k56918k97212l38445l83396m37653n07864n97913p06163q25063
$$ 14316304 14059386 13762174 13423729 13040333 12602680 12094816 11496903 10790740 9965677
36858I965677r41960j040020j100179j105575j047828r32073p77366o11484m62171
$$ 9965677 9023717 7983697 6883518 5777943 4730115 3798042 3020676 2409192 1947021
36849A947021l48878k78620k46834k41209k46235k47904k38521k19478j98865
$$ 1947021 1598143 1319523 1072689 831480 585245 337341 98820 -120658 -319523
36840c19523j84529j78057j74698j67919j53215j28303r2213m6051N733N6697
$$ -319523 -504052 -682109 -856807 -1024726 -1177941 -1306244 -1398457 -1444508 -1438775 -1382078
36830a382078J02274J42600J81515K22679K65875L05653L32515L35824L07548
$$ -1382078 -1279804 -1137204 -955689 -733010 -467135 -161482 171033 506857 814405
36821H14405K45858J57070N4514m5754j30137j90645k24939k34942k26087k06898
$$ 814405 1060263 1217333 1271847 1226093 1095956 905311 680372 445430 219343 12445
36811A2445j87171j74285j69744j68517j61748j41263j03596n1637O813O2806
$$ 12445 -174726 -349011 -518755 -687272 -849020 -990283 -1093879 -1145516 -1138703 -1075897
36801a075897J10161J47311J76199J99358K17242K27428K25783K08669J75222
$$ -1075897 -965736 -818425 -642226 -442868 -225626 1802 227585 436254 611476
36792F11476J28861P7433L1409P40p783Q816N0496J14492J94240K78162L50277
$$ 611476 740337 817770 849179 849919 842136 850952 901448 1015940 1210180 1488342 1838619
36781A838619L93263L93136L43960K50905J30068M706j01039j68952j92419j79428
$$ 1838619 2231882 2625018 2968978 3219883 3349951 3354657 3253618 3084666 2892247 2712819
36771B712819j51106j34831j53940k18768l23320m48253n67531o55627o93345
$$ 2712819 2561713 2426882 2272942 2054174 1730854 1282601 715070 59443 -633902
36762f33902o71339n90878m62259l02145j31020K9409J59443K45008K80250K67820
$$ -633902 -1305241 -1896119 -2358378 -2660523 -2791543 -2762134 -2602691 -2357683 -2077433 -1809613
36752a809613K16923J40136N0313m1407j26242j97480k50038k80102k84874k63030
$$ -1809613 -1592690 -1452554 -1402241 -1443648 -1569890 -1767370 -2017408 -2297510 -2582384 -2845414
36742b845414k16465j52317q2778k1319K2747M7503N7640O1009O5262P6024R6457
$$ -2845414 -3061879 -3214196 -3296974 -3318293 -3295546 -3248043 -3190403 -3129394 -3064132 -2988108 -2891651
36731b891651J27244J66359K08626K46297K71850K82090K80381K74509K71433
$$ -2891651 -2764407 -2598048 -2389422 -2143125 -1871275 -1589185 -1308804 -1034295 -762862
36722g62862K73105K76631K78280K77879K80055K91276L14769L46984L78042L95454
$$ -762862 -489757 -213126 65154 343033 623088 914364 1229133 1576117 1954159 2349613
36712B349613L88125L48782K75286J72150N1842o6095j59497k10478k11528j67632
$$ 2349613 2737738 3086520 3361806 3533956 3585798 3519703 3360206 3149728 2938200 2770568
36702B770568r3285o371P7625J48521K01576K36225K54069K56002K39542J98975
$$ 2770568 2677283 2670912 2748537 2897058 3098634 3334859 3588928 3844930 4084472 4283447
36692D283447J29722L4549p2889j69983k31524k37396j78957o2330R2846K59548
$$ 4283447 4413169 4447718 4374829 4204846 3973322 3735926 3556969 3494639 3587485 3847033
36682C847033M12547N36691O30702P05070P75369Q54130R44922J040942J127920
$$ 3847033 4259580 4796271 5426973 6132043 6907412 7761542 8706464 9747406 10875326
36673A0875326J189065J209365J177827J087678R35660P22053M52823J43226j80313
$$ 10875326 12064391 13273756 14451583 15539261 16474921 17196974 17649797 17793023 17612710
36664A7612710m83854p35492r16037j024047j071913j076370j050283j000326
$$ 17612710 17128856 16393364 15477327 14453280 13381367 12304997 11254714 10254388
36656A0254388r29800q42632p45530o47908n60403m92680m51035m36652m45020
$$ 10254388 9324588 8481956 7736426 7088518 6528115 6035435 5584400 5147748 4702728
36647D702728m66592m88651m98484m87156m52109l96835l27702k49848j64526
$$ 4702728 4236136 3747485 3249001 2761845 2309736 1912901 1585199 1335351 1170825
36638A170825o9613L6539J49923K58359L44471L92849L96379L57621K85491J90690
$$ 1170825 1101212 1137751 1287674 1546033 1890504 2283353 2679732 3037353 3322844 3513534
36628C513534Q2864k9953j40532k41361l23829l78022l93442l61378k79203j54783
$$ 3513534 3596398 3566445 3425913 3184552 2860723 2482701 2089259 1727881 1448678 1293895
36618A293895p251J38129K58404L38918L73739L63189L12980K35447J48897P2239
$$ 1293895 1286644 1424773 1683177 2022095 2395834 2759023 3072003 3307450 3456347 3528586
36608C528586J7699j2573k3158j8492J437L9427R5102J60011K18250K52939K54312
$$ 3528586 3546285 3533712 3510554 3492062 3493499 3532926 3628028 3788039 4006289 4259228 4513540
36597D513540K23852J71991J11752N3005K98m5915q6665j22572j53927j82581
$$ 4513540 4737392 4909383 5021135 5074140 5074438 5028523 4941858 4819286 4665359 4482778
36587D482778k13460k53154l05655l68701m34095m91452n31887n49360n40534
$$ 4482778 4269318 4016164 3710509 3341808 2907713 2416261 1884374 1335014 794480
36578G94480n05035m46164l70527k85624j96574j04502q372R0616J85525K64140
$$ 794480 289445 -156719 -527246 -812870 -1009444 -1113946 -1122318 -1031702 -846177 -582037
36568e82037L13514L25557L00371K45856J74486R9384L1919j8914m7222n2583
$$ -582037 -268523 57034 357405 603261 777747 877131 909050 890136 842914 790331
36558G90331m2178k9208k7284m4730q2317j33990j88809k34678k64312k79732
$$ 790331 748153 718945 691661 646931 564614 430624 241815 7137 -257175 -536907
36548e36907k89753l00996l10440l06663k78317k21638j41265m5667N7594J63259
$$ -536907 -826660 -1127656 -1438096 -1744759 -2023076 -2244714 -2385979 -2431646 -2374052 -2210793
36538b210793K66868L62659M42769M98153N20949N07554M60744L88597K99895
$$ -2210793 -1943925 -1581266 -1138497 -640344 -119395 388159 848903 1237500 1537395
36529A537395J99396Q7637l4075j58474k72276l61527m17664m40053m34537m09973
$$ 1537395 1736791 1824428 1790353 1631879 1359603 998076 580412 140359 -294178 -704151
36519g04151l74720l34204k90177k41814j87902j28864o7528q238M5182R1331
$$ -704151 -1078871 -1413075 -1703252 -1945066 -2132968 -2261832 -2329360 -2337598 -2292416 -2201085
36509b201085J31832J70304K10336K53323K97055L36016L63761L76342L74474
$$ -2201085 -2069253 -1898949 -1688613 -1435290 -1138235 -802219 -438458 -62116 312358
36500C12358L63055L48581L36309L28195L21497L08081K75375K09919J02919m4579
$$ 312358 675413 1023994 1360303 1688498 2009995 2318076 2593451 2803370 2906289 2861710
36490B861710k19695m00366n62091o86021p64571q01647q07919p94965p72149
$$ 2861710 2642015 2241649 1679558 993537 228966 -572681 -1380600 -2175565 -2947714
36481b947714p46748p24795p10535p04903p04710p03373o92889o66345o20003
$$ -2947714 -3694462 -4419257 -5129792 -5834695 -6539405 -7242778 -7935667 -8602012 -9222015
36472i222015n53940m71011l75201k70443j59961m5895P0298J86199K96869L95465
$$ -9222015 -9775955 -10246966 -10622167 -10892610 -11052571 -11098466 -11028168 -10841969 -10545100 -10149635
36462a0149635M76013N35802N74981N93958N91380N64869N13978M42825L59972
$$ -10149635 -9673622 -9137820 -8562839 -7968881 -7377501 -6812632 -6298654 -5855829 -5495857
36453e495857K75619J98638J35782R2581P3302P8907J05122J43290J83985K20611
$$ -5495857 -5220238 -5021600 -4885818 -4793237 -4719935 -4641028 -4535906 -4392616 -4208631 -3988020
36443c988020K50604K74466K94370L13321L34093L57016L77627L86912L75529
$$ -3988020 -3737416 -3462950 -3168580 -2855259 -2521166 -2164150 -1786523 -1399611 -1024082
36434a024082L39572K83063K15050J44094P5147J0757m5886q9855j16427j23820
$$ -1024082 -684510 -401447 -186397 -42303 32844 43601 -2285 -92140 -208567 -332387
36424c32387j13785q9669n4247r587M1429R4136J42681J80855K02049J99441J68444
$$ -332387 -446172 -535841 -590088 -599675 -558246 -464110 -321429 -140574 61475 260916 429360
36413D29360J10998L8077l2934q5584j11635j12982r7165p0954l7771j14L7270
$$ 429360 540358 578435 545501 459917 348282 235300 138135 67181 29410 29296 66566
36402F6566O7795Q6499R2734Q9789Q2627P5486P0129O5334N8738N0567M6274N5011
$$ 66566 134361 220860 313594 403383 486010 561496 631625 696959 755697 806264 852538 907549
36390I07549Q4325J34889J99267K65648L24160L71503M10897M47629M83517N13998
$$ 907549 991874 1126763 1326030 1591678 1915838 2287341 2698238 3145867 3629384 4143382
36380D143382N29320N18994M77180M06179L15861K19240J27072M4861k6542q7822
$$ 4143382 4672702 5191696 5668876 6075055 6390916 6610156 6737228 6782089 6755547 6667725
36370F667725j37657j70865j80052j60512j14921n3640R907O4697J04332J25694
$$ 6667725 6530068 6359203 6179151 6018639 5903718 5850078 5859985 5924682 6029014 6154708
36360F154708J26804J05967O2160l894q8070j81179k68845l34533l65320l57945
$$ 6154708 6281512 6387479 6449639 6445745 6357675 6176496 5907651 5573118 5207798 4849853
36350D849853l21482k74029k33979k10092j96572j76726j33307n8968L9698J46041
$$ 4849853 4528371 4254342 4020363 3810271 3613699 3436973 3303666 3244698 3284396 3430437
36340C430437K41318L11078L47276L47315L12352K45785J51693L3687j04559k56982
$$ 3430437 3671755 3982833 4330109 4677424 4989776 5235561 5387254 5420941 5316382 5059400
36330E059400m12779n56138o68728p33901p41064o89053n87617m56515l21951
$$ 5059400 4646621 4090483 3421755 2687854 1946790 1257737 670120 213605 -108346
36321a08346k10570j42239j24280j50160k03423k64123l13975l38747l29444k83797
$$ -108346 -318916 -461155 -585435 -735595 -939018 -1203141 -1517116 -1855863 -2185307 -2469104
36311b469104k07375j12507j4587P2652J40847J88212K17753K33390K36418K24555
$$ -2469104 -2676479 -2788986 -2803573 -2730921 -2590074 -2401862 -2184109 -1950719 -1714301 -1489746
36301a489746J93939J42217P0881j3769j01289j79748k39860k78337k98020l04682
$$ -1489746 -1295807 -1153590 -1082709 -1096478 -1197767 -1377515 -1617375 -1895712 -2193732 -2498414
36291b498414l02845k92979k71240k31872j71570r3669r102O7390J23959J57149
$$ -2498414 -2801259 -3094238 -3365478 -3597350 -3768920 -3862589 -3871691 -3804301 -3680342 -3523193
36281c523193J72922J82871J98254K25543K65687L16007L71474M23824M60448
$$ -3523193 -3350271 -3167400 -2969146 -2743603 -2477916 -2161909 -1790435 -1366611 -906163
36272i06163M66463M30499L51059K39385J16850P950o7978j02927j02403q3689
$$ -906163 -439700 -9201 341858 581243 698093 706043 638065 535138 432735 349046
36262C49046p0981q7742j47708k48688l73506m98058o01154o70447p03249p04198
$$ 349046 278065 190323 42615 -206073 -579579 -1077637 -1678791 -2349238 -3052487 -3756685
36252c756685o81648o43317n92681n28289m46849l47826k36156j20604q497R9364
$$ -3756685 -4438333 -5081650 -5674331 -6202620 -6649469 -6997295 -7233451 -7354055 -7362552 -7263188
36242g263188K08753L25927M49986N70223O70328P35431P57028P34364O73376
$$ -7263188 -7054435 -6728508 -6278522 -5708299 -5037971 -4302540 -3545512 -2811148 -2137772
36233b137772N84192M78019L65143K54963J56500P6965J8946k0463m7085o5951
$$ -2137772 -1553580 -1075561 -710418 -455455 -298955 -221990 -203044 -223507 -270592 -336543
36223c36543q0051r1873j05149j24472j53072j90547k32106k69878k95876l05080
$$ -336543 -416594 -508467 -613616 -738088 -891160 -1081707 -1313813 -1583691 -1879567 -2184647
36213b184647k96734k73150k37558j93289j44623r7352n7392k8439j0850k341
$$ -2184647 -2481381 -2754531 -2992089 -3185378 -3330001 -3427353 -3484745 -3513184 -3524034 -3526375
36203c526375J027M483J3999L4482O7344J08857J50044J78273J80881J50645R0850
$$ -3526375 -3525348 -3520865 -3506866 -3472384 -3405040 -3296183 -3146139 -2967866 -2786985 -2636340 -2545490
36192b545490J6474n0461q9620r0522n5539L746P3685J43731K06432K54102K76843
$$ -2545490 -2529016 -2579477 -2669097 -2759619 -2815158 -2811412 -2737727 -2593996 -2387564 -2133462 -1856619
36181a856619K64522K11387J20213L666j18077k23003k94150l24742l19422k91423
$$ -1856619 -1592097 -1380710 -1260497 -1256831 -1374908 -1597911 -1892061 -2216803 -2536225 -2827648
36171b827648k56635k26665k04341j84855j62007j34459j07381q9629q9963j14158
$$ -2827648 -3084283 -3310948 -3515289 -3700144 -3862151 -3996610 -4103991 -4193620 -4283583 -4397741
36161d397741j62328k26649k91914l40267l57545l37213k80733j96284r7602k370
$$ -4397741 -4560069 -4786718 -5078632 -5418899 -5776444 -6113657 -6394390 -6590674 -6688276 -6690646
36151f690646P1245J09907J10193Q0672L9064N014q380K02K1111L9716M3718K7825
$$ -6690646 -6619401 -6509494 -6399301 -6318629 -6279565 -6274551 -6282931 -6282729 -6261618 -6221902 -6178184 -6150359
36139f150359n716m9296r2675j25242j38232j27169r3648m5096P825N5092R0545
$$ -6150359 -6156075 -6205371 -6298046 -6423288 -6561520 -6688689 -6782337 -6827433 -6819608 -6764516 -6673971
36128f673971J13123J25904J34051J43069J57912J82337K17841K62525L10997
$$ -6673971 -6560848 -6434944 -6300893 -6157824 -5999912 -5817575 -5599734 -5337209 -5026212
36119e026212L56005L91137M12919M21005M16421L99252L67342L16814K44028
$$ -5026212 -4670207 -4279070 -3866151 -3445146 -3028725 -2629473 -2262131 -1945317 -1701289
36110a701289J48178L3493r0090k08614l07744l76520m09292m05383l67360k99188
$$ -1701289 -1553111 -1519618 -1609708 -1818322 -2126066 -2502586 -2911878 -3317261 -3684621 -3983809
36100c983809k05428r2309K9960J46302K40097K99845L24554L23617L11434L00730
$$ -3983809 -4189237 -4281546 -4251586 -4105284 -3865187 -3565342 -3240788 -2917171 -2605737 -2305007
36090b305007K97961L01833L04836K97552K74347K37385J96353J64307J52283
$$ -2305007 -2007046 -1705213 -1400377 -1102825 -828478 -591093 -394740 -230433 -78150
36081g8150J65118J99353K43717K82823L02998K97110K65313K12081J42929O3506
$$ -78150 86968 286321 530038 812861 1115859 1412969 1678282 1890363 2033292 2096798
36071B096798j9538r8155j63949k09869k31890k30565k11964j86609j66037j58845
$$ 2096798 2077260 1979105 1815156 1605287 1373397 1142832 930868 744259 578222 419377
36061D19377j68570j93839k29211k65692k91727k96098k72484k23355j60350r9845
$$ 419377 250807 56968 -172243 -437935 -729662 -1025760 -1298244 -1521599 -1681949 -1781794
36051a781794n5463l1720k2944j8081p771J1445L8005O9051J02781J37773J71192
$$ -1781794 -1837257 -1868977 -1891921 -1910002 -1917773 -1906328 -1868323 -1799272 -1696491 -1558718 -1387526
36040a387526J98839K17081K24023K18071J95687J51829Q3906l914j00048j89298
$$ -1387526 -1188687 -971606 -747583 -529512 -333825 -181996 -98090 -102004 -202052 -391350
36030c91350k58342k99625l12431l01802k76460k46397k20664k05757k04678k16518
$$ -391350 -649692 -949317 -1261748 -1563550 -1840010 -2086407 -2307071 -2512828 -2717506 -2934024
36020b934024k36597k57647k72164k75011k64797k43356k13920j79347j41463
$$ -2934024 -3170621 -3428268 -3700432 -3975443 -4240240 -4483596 -4697516 -4876863 -5018326
36011e018326j02229o6167m1789l9180o3738j10342j63312k03077k14726j92636
$$ -5018326 -5120555 -5186722 -5228511 -5267691 -5331429 -5441771 -5605083 -5808160 -6022886 -6215522
36001f215522j39582o3052K7878J23956K16285K96891L59511M00337M18673M17976
$$ -6215522 -6355104 -6418156 -6390278 -6266322 -6050037 -5753146 -5393635 -4993298 -4574625 -4156649
35991d156649M07097L99846M10562M46632N03058N64419O13581O40246O42977
$$ -4156649 -3749552 -3349706 -2939144 -2492512 -1989454 -1425035 -811454 -171208 471769
35982D71769O24755N87616N31222M55258L62428K59240J54180N4530l6098j17975
$$ 471769 1096524 1684140 2215362 2670620 3033048 3292288 3446468 3500998 3464900 3346925
35972C346925j93349k64362l32660m00108m68342n36180n97481o42702o64137
$$ 3346925 3153576 2889214 2556554 2156446 1688104 1151924 554443 -88259 -752396
35963g52396o60779o39054o09465n82366n65519n63247n75793n98327o20816o30025
$$ -752396 -1413175 -2052229 -2661694 -3244060 -3809579 -4372826 -4948619 -5546946 -6167762 -6797787
35953f797787o13851n66117m89157l92492k88493j87945r8104k3465L2474O6435
$$ -6797787 -7411638 -7977755 -8466912 -8859404 -9147897 -9335842 -9433946 -9457411 -9424937 -9358502
35943i358502P6211O2731L2218l116k7149k4935J1392P9424J68292K64370L56799
$$ -9358502 -9282291 -9219560 -9187342 -9190458 -9217607 -9242542 -9231150 -9151726 -8983434 -8719064 -8362265
35932h362265M39314N08045N58411N84206N79345N40098M66141L60832K32028
$$ -8362265 -7922951 -7414906 -6856495 -6272289 -5692944 -5152846 -4686705 -4325873 -4093845
35923d093845R2918l9324j47832k21124k55749k55782k30783j93567j57479j32744
$$ -4093845 -4000927 -4040251 -4188083 -4409207 -4664956 -4920738 -5151521 -5345088 -5502567 -5635311
35913e635311j23159j24898j28088j20385r1418l6767M0175J29683K19862L01088
$$ -5635311 -5758470 -5883368 -6011456 -6131841 -6223259 -6260026 -6219851 -6090168 -5870306 -5569218
35903e569218L68457M21722M63650M97803N26469N49085N62053N60182N39146
$$ -5569218 -5200761 -4779039 -4315389 -3817586 -3291117 -2742032 -2179979 -1619797 -1080651
35894a080651M97246M35665L57873K69364J77367Q9274R945n9861j22146j78734
$$ -1080651 -583405 -147740 210133 479497 656864 746138 756083 696222 574076 395342
35884C95342k29490k73059l08863l38478l65356l92585m19618m40168m43664m20110
$$ 395342 165852 -107207 -416070 -754548 -1119904 -1512489 -1932107 -2372275 -2815939 -3236049
35874c236049l65434k84052j87703r1618r879M8183P9215Q4949P0638M3887J3009
$$ -3236049 -3601483 -3885535 -4073238 -4164856 -4174735 -4126552 -4047337 -3962388 -3891750 -3847863 -3834854
35863c834854j5987m2395p0716j06384j49970j94216k25991k31772k03359j41287
$$ -3834854 -3850841 -3893236 -3963952 -4070336 -4220306 -4414522 -4640513 -4872285 -5075644 -5216931
35853e216931n4933M0508J29269K00516K51494K86805L14702L42874L75554M11997
$$ -5216931 -5271864 -5231356 -5102087 -4901571 -4650077 -4363272 -4048570 -3705696 -3330142 -2918145
35843b918145M45949M66551M61488M22170L49073K54460J60121Q9875N9896P2062
$$ -2918145 -2472196 -2005645 -1544157 -1121987 -772914 -518454 -358333 -268458 -208562 -136500
35833a36500J14108J66146K09333K32140K31814K11606J76243J28687O9933J353
$$ -136500 -22392 143754 353087 585227 817041 1028647 1204890 1333577 1403510 1404863
35823A404863p2704j44125k02889k40722k54472k47159k26101j99493j73568j51199
$$ 1404863 1332159 1188034 985145 744423 489951 242792 16691 -182802 -356370 -507569
35813e07569j31998j13936r6500q3396q1857r7879j31110j74047k16095k48458
$$ -507569 -639567 -753503 -850003 -933399 -1015256 -1113135 -1244245 -1418292 -1634387 -1882845
35803a882845k66111k67168k52298k25255j92714j62170j39013j24950j18168
$$ -1882845 -2148956 -2416124 -2668422 -2893677 -3086391 -3248561 -3387574 -3512524 -3630692
35794c630692j14135j06475q8628n6493j0805M2315R3020J30809J48018J42662
$$ -3630692 -3744827 -3851302 -3939930 -3996423 -4007228 -3964913 -3871893 -3741084 -3593066 -3450404
35784c450404J19190Q6482N4175K9646J6720J5386K1786K9077L0138K1179L648
$$ -3450404 -3331214 -3244732 -3190557 -3160911 -3144191 -3128805 -3107019 -3077942 -3047804 -3026625 -3022977
35773c022977j7160l5507m8000n4326n6570n8094o2108o9960q0095q8727r1828
$$ -3022977 -3040137 -3075644 -3123644 -3177970 -3234540 -3292634 -3354742 -3424702 -3504797 -3593524 -3685352
35762c685352q7011p4463n7090l9814k7311k0728j6042o361J2911L9773O5249
$$ -3685352 -3772363 -3846826 -3903916 -3943730 -3971041 -3991769 -4007811 -4014172 -4001261 -3961488 -3896239
35751c896239P7131O5993L0863j8651o6241r7533j07783j02754r2236q1899o9825
$$ -3896239 -3819108 -3753115 -3722252 -3740903 -3807144 -3904677 -4012460 -4115214 -4207450 -4289349 -4359174
35740d359174m9137j3379L9264J04034J69650K20711K42779K28002J77435R8381
$$ -4359174 -4408311 -4421690 -4382426 -4278392 -4108742 -3888031 -3645252 -3417250 -3239815 -3141434
35730c141434j31j09321k19534l19387l97745m47007m64565m51623m11525l49427
$$ -3141434 -3141565 -3250886 -3470420 -3789807 -4187552 -4634559 -5099124 -5550747 -5962272 -6311699
35720f311699k72979j92264j17844n7352j2566K0948N0839Q3474J20886J60877
$$ -6311699 -6584678 -6776942 -6894786 -6952138 -6964704 -6943756 -6892917 -6809443 -6688557 -6527680
35710f527680J99299K32422K58155K76317K88552K97698L06257L14511L20061
$$ -6527680 -6328381 -6095959 -5837804 -5561487 -5272935 -4975237 -4668980 -4354469 -4034408
35701d034408L20399L17436L20115L41210L89017M59778N37408O01385O36992
$$ -4034408 -3714009 -3396573 -3076458 -2735248 -2346231 -1886453 -1349045 -747660 -110668
35692a10668O40667O18247N79686N34844M91721M55884M29907M13102M01897L90398
$$ -110668 529999 1148246 1727932 2262776 2754497 3210381 3640288 4053390 4455287 4845685
35682D845685L70579L32620K66586J65954L1732j25450k87220m32931n45858o17227
$$ 4845685 5216264 5548884 5815470 5981424 6013156 5887706 5600486 5167555 4621697 4004470
35672D004470o47043o42282o13129n68156n10813m40067l55299k61209j67886
$$ 4004470 3357427 2715145 2102016 1533860 1023047 582980 227681 -33528 -201414
35663b01414q5551j8636L5889Q5126J34993J86809K37447K82296L19029L49638
$$ -201414 -286965 -305601 -269712 -184586 -49593 137216 374663 656959 975988 1325626
35653A325626L79250M12561M50595M89894N23698N43202N38311M99526M22126
$$ 1325626 1704876 2117437 2568032 3057926 3581624 4124826 4663137 5162663 5584789
35644E584789L10772J80642N3183n1571j21875j57322j67418j67004j70624j88048
$$ 5584789 5895561 6076203 6129386 6077815 5955940 5798618 5631200 5464196 5293572 5105524
35634E105524k22423k71028l27447l83833m32559m67026m81707m72009m34891
$$ 5105524 4883101 4612073 4284626 3900793 3468234 3001208 2519501 2047492 1612601
35625A612601l70795k85659j90924j00284k4813L0270O5025Q1538Q1013O3111
$$ 1612601 1241806 956147 765223 664939 640126 670396 735421 816959 897972 961083
35615I61083K7135k6678r6695j80274k74505l77090m86925o03605p25327q45985
$$ 961083 988218 961540 864845 684571 410066 32976 -453949 -1057554 -1782881 -2628866
35605b628866r53797j033538j071754j061770j005425r11442p92262o60828n27633
$$ -2628866 -3582663 -4616201 -5687955 -6749725 -7755150 -8666592 -9458854 -10119682 -10647315
35596a0647315l98826k76891j63658o2802K0992Q5488J33225J70054K00729K24980
$$ -10647315 -11046141 -11323032 -11486690 -11549492 -11528500 -11443012 -11309787 -11139733 -10939004 -10714024
35586a0714024K37093K29663J99448J51594R9209N8470M2665N8826J07824J85889
$$ -10714024 -10476931 -10247268 -10047820 -9896226 -9797017 -9738547 -9695882 -9637056 -9529232 -9343343
35576i343343K85537L96129N05671O03922O84883P46601P88592Q08993Q03535
$$ -9343343 -9057806 -8661677 -8156006 -7552084 -6867201 -6120600 -5332008 -4523015 -3719480
35567c719480P67198O98092O01450M90473L82145K90429K21645J74757J44548
$$ -3719480 -2952282 -2254190 -1652740 -1162267 -780122 -489693 -268048 -93291 51257
35558E1257J24542J08902R4332Q1683P5624Q2075J05039J44429J95182K47605
$$ 51257 175799 284701 379033 460716 536340 618415 723454 867883 1063065 1310670
35548A310670K89280L08370K97282K55208J88426J07586K2660o1477j45393k31019
$$ 1310670 1599950 1908320 2205602 2460810 2649236 2756822 2779482 2718005 2572612 2341593
35538B341593l16724l95464m56789m90619m90538m55518l89781l01298k00037
$$ 2341593 2024869 1629405 1172616 681997 191459 -264059 -653840 -955138 -1155175
35529a155175r6850k706P2496J21587J41624J34695J07941P2458M0655K2511K2290
$$ -1155175 -1252025 -1254731 -1182235 -1060648 -919024 -784329 -676388 -603930 -563275 -540764 -518474
35518e18474L7488O0546Q1949R2598Q4715N2698m532q0886j63068k34465k80644
$$ -518474 -480986 -420440 -338491 -245893 -161178 -108480 -113012 -193898 -356966 -591431 -872075
35507h72075k93045k69813k14986j37278m8723L6885J05892J47503J57062J38203
$$ -872075 -1165120 -1434933 -1649919 -1787197 -1835920 -1799035 -1693143 -1545640 -1388578 -1250375
35497a250375J01860O2141L1397J6698J8558L1792M8467O2209P1956Q2963J03964
$$ -1250375 -1148515 -1086374 -1054977 -1038279 -1019721 -987929 -939462 -877253 -805297 -722334 -618370
35486f18370J41419J93796K49809K92697L08253K91339K47094J87317J25140P0375
$$ -618370 -476951 -283155 -33346 259351 567604 858943 1106037 1293354 1418494 1488869
35476A488869K6450j0098m6387q6900j27725j55793j54590j13433l4641O5610
$$ 1488869 1515319 1505221 1458834 1371934 1244209 1088416 933826 820393 785752 851362
35466H51362J62962K33717K62508K45699J89850J07061J0751q5609j67652k20678
$$ 851362 1014324 1248041 1510549 1756248 1946098 2053159 2063910 1978301 1810649 1589971
35456A589971k33516k03409j37755n1129M0102J22305J86583K28254K44798K33916
$$ 1589971 1356455 1153046 1015291 964162 1004264 1126569 1313152 1541406 1786204 2020120
35446B020120J93506J23913L0256p7522j87065k86161l63928m11392m23023l99042
$$ 2020120 2213626 2337539 2367795 2290273 2103208 1817047 1453119 1041727 618704 219662
35436B19662l46783k79947k15944j71850j59169j78673k18225k55971k68037k37026
$$ 219662 -127121 -407068 -623012 -794862 -954031 -1132704 -1350929 -1606900 -1874937 -2111963
35426b111963j57477l6894J07314K53493L81938M79174N39048N61328N49478N08750
$$ -2111963 -2269440 -2306334 -2199020 -1945527 -1563589 -1084415 -545367 15961 565439 1074189
35416A074189M44998L64265K72960J78093Q6977O494n7876j03203j30225j43480
$$ 1074189 1519187 1883452 2156412 2334505 2421482 2427976 2370100 2266897 2136672 1993192
35406A993192j49551j54150j60013j67017j73824j79221j81913j79153j65728
$$ 1993192 1843641 1689491 1529478 1362461 1188637 1009416 827503 648350 482622
35397D82622j34888q1336m747Q8351J85154K68981L22455L31202K87678J94166
$$ 482622 347734 266398 261651 350002 535156 804137 1126592 1457794 1745472 1939638
35387A939638O3484q3156k20889l27519l89976m08606l97002l76543l67266l79045
$$ 1939638 2003122 1919966 1699077 1371558 981582 572976 175974 -200569 -567835 -946880
35377i46880m07483m36907m48802m30617l79905l02669k08752j08011q676Q2708
$$ -946880 -1354363 -1791270 -2240072 -2670689 -3050594 -3353263 -3562015 -3670026 -3678702 -3595994
35367c595994J60745K20741K59148K75469K74413K65867K61509K70020K94016
$$ -3595994 -3435249 -3214508 -2955360 -2679891 -2405478 -2139611 -1878102 -1608082 -1314066
35358a314066L29874L69433M02301M18531M11298L78494L22828K50937J72078
$$ -1314066 -984192 -614759 -212458 206073 617371 995865 1318693 1569630 1741708
35349A741708R5855K8924k7562p7513j26414j77113k27276k69467k93678k91301
$$ 1741708 1837563 1866487 1838925 1761412 1634998 1457885 1230609 961142 667464 376163
35339C76163k58742j98935j20522l5689M2625J04184J44496J65529J73406J75212
$$ 376163 117421 -81514 -202036 -237725 -195100 -90916 53580 219109 392515 567727
35329E67727J77292J85048K02562K30989K66348K98102L10303K86700K18603J10314
$$ 567727 745019 930067 1132629 1363618 1629966 1928068 2238371 2525071 2743674 2853988
35319B853988k2932j63668l00276m27675n41367o31528o83344o83581o28474n27450
$$ 2853988 2831056 2667388 2367112 1939437 1398070 766542 83198 -600383 -1228857 -1756307
35309a756307m00639k72181j63209q7299m9134m5873p0266j14051j69811k30579
$$ -1756307 -2156946 -2429127 -2592336 -2679635 -2728769 -2774642 -2844908 -2958959 -3128770 -3359349
35299c359349k88386l33713l57044l52153l19722k68761k13748j67673j34972
$$ -3359349 -3647735 -3981448 -4338492 -4690645 -5010367 -5279128 -5492876 -5660549 -5795521
35290e795521j09360p8245l0621L6424J15448J90902K44564K62489K40697J86659
$$ -5795521 -5904881 -5983126 -6013747 -5977323 -5861875 -5670973 -5426409 -5163920 -4923223 -4736564
35280d736564J15296M1534k5913q5883j41251j94111k43132k83939l10815l18280
$$ -4736564 -4621268 -4579734 -4605647 -4691530 -4832781 -5026892 -5270024 -5553963 -5864778 -6183058
35270f183058l02596k63670k06695j41734q0255k9921Q916M1990P5592J11009
$$ -6183058 -6485654 -6749324 -6956019 -7097753 -7178008 -7207929 -7199013 -7157023 -7081431 -6970422
35260f970422J43435J65695J72890J64285J42457J12064P9157N0101K9608J9050
$$ -6970422 -6826987 -6661292 -6488402 -6324117 -6181660 -6069596 -5990439 -5940338 -5910730 -5891680
35250e891680J6002J4452N183k2701p7800j61105k62870l64361m43879m83629
$$ -5891680 -5875678 -5861226 -5856043 -5878744 -5956544 -6117649 -6380519 -6744880 -7188759 -7672388
35240g672388m74086m14785l12751j80267l2374J16442K55916L81853M94378N93862
$$ -7672388 -8146474 -8561259 -8874010 -9054277 -9086651 -8970209 -8714293 -8332440 -7838062 -7244200
35230g244200O77845P41254P79083P89215P73694P38049O88952O31488N67723
$$ -7244200 -6566355 -5825101 -5046018 -4256803 -3483109 -2745060 -2056108 -1424620 -856897
35221h56897M97344M19339L33033K37935J33471J9676j00527k17983l15163l68748
$$ -856897 -359553 59786 392819 630754 764225 783901 683374 465391 150228 -218520
35211b18520l58543k79185j47440N51J21634J81566J66939Q7696l0077j56363
$$ -218520 -577063 -856248 -1003688 -1003137 -881503 -699937 -532998 -445302 -475379 -631742
35201f31742k67617l51203m04258m29831m32881m17874l88976l52093l16023k90361
$$ -631742 -899359 -1250562 -1654820 -2084651 -2517532 -2935406 -3324382 -3676475 -3992498 -4282859
35191d282859k81031k86741k98924l05019k93235k56510j93926j09343r115R9001
$$ -4282859 -4563890 -4850631 -5149555 -5454574 -5747809 -6004319 -6198245 -6307588 -6316703 -6217702
35181f217702K05595K99969L72084M14678M23863L98532L40267K54478J51428
$$ -6217702 -6012107 -5712138 -5340054 -4925376 -4501513 -4102981 -3762714 -3508236 -3356808
35172c356808M5505m7862j16468j54590j63500j49009j17693p4092k0223M2817
$$ -3356808 -3311303 -3359165 -3475633 -3630223 -3793723 -3942732 -4060425 -4134517 -4154740 -4111923
35162d111923J12683J84771K53080L12022L57835L89199M07573M17274M24691
$$ -4111923 -3999240 -3814469 -3561389 -3249367 -2891532 -2502333 -2094760 -1677486 -1252795
35153a252795M36425M57113M87449N22610N51890N61488N40836M89405M19243
$$ -1252795 -816370 -359257 128192 650802 1202692 1764180 2305016 2794421 3213664
35144C213664L50871L04538K91413L08788L41205L66404L62846L15688K20266
$$ 3213664 3564535 3869073 4160486 4469274 4810479 5176883 5539729 5855417 6075683
$$ [...]
##END NTUPLES=NMR SPECTRUM
##END=
