##TITLE=31Pdec_DE-59_oil
 
 64 sc
 5.6.2024
##JCAMPDX= 6.0         $$ Bruker NMR JCAMP-DX V2.0
##DATA TYPE= NMR SPECTRUM
##DATA CLASS= NTUPLES
##ORIGIN= UXNMR, Bruker Analytische Messtechnik GmbH
##OWNER= root
$$ XWIN-NMR		Version 3.5
$$ Wed Jun  5 15:20:52 2024 Russian Standard Time (UT+4h)  she@DPX200
##.OBSERVE FREQUENCY= 81.013821
##.OBSERVE NUCLEUS= ^31P
##.ACQUISITION MODE= SIMULTANEOUS
##.ACQUISITION SCHEME= undefined
##.AVERAGES= 64
##.DIGITISER RES= 16
##SPECTROMETER/DATA SYSTEM= spect
##.PULSE SEQUENCE= zgpg30
##.SOLVENT NAME= CDCl3
##.SHIFT REFERENCE= (INTERNAL, CDCl3, 0, 248.564)
##AUDIT TRAIL= $$ (NUMBER, WHEN, WHO, WHERE, WHAT)
$$ ##TITLE= Audit trail, XWIN-NMR		Version 3.5
$$ ##JCAMPDX= 5.01
$$ ##ORIGIN= Bruker BioSpin GmbH
$$ ##OWNER= she
$$ F:/spectra/data/she/nmr/P31/1/pdata/1/auditp.txt
$$ ##AUDIT TRAIL=  $$ (NUMBER, WHEN, WHO, WHERE, WHAT)
(   1,<2024-06-05 15:20:05.43 +0400>,<she>,<DPX200>,
      <continue with go, POWCHK disabled, PULCHK disabled
       configuration hash MD5:
       00 E9 B6 7A A2 85 ED C7 34 08 36 98 17 FE 4E 26
       data hash MD5: 32K
       35 1E 83 4D BA D5 8C 06 57 48 FE 71 7E 6A 7E 9B>)
(   2,<2024-06-05 15:20:07.23 +0400>,<she>,<DPX200>,
      <Start of raw data processing
       efp BC_mod = 2 LB = 10 FT_mod = 6 PKNL = 1 PHC0 = -135.5179 PHC1 = -105.6001 SI = 64K 
       data hash MD5: 64K
       CF 0E 97 0C 4F 70 2B 1E 5A 63 70 CD 04 C2 64 D3>)
(   3,<2024-06-05 15:20:23.51 +0400>,<she>,<DPX200>,
      <pk PHC0 = -33.42931 PHC1 = 76.20002 
       data hash MD5: 64K
       51 02 BC 8B D7 4C 00 50 FD 93 5C D7 84 5A 6E B0>)
$$ ##END=
$$ 
$$ hash MD5
$$ B4 E9 1C 25 3F 5D E2 DD 99 95 5F 90 40 88 5F 98
##$RELAX= 
##$RELAX= 
##$RELAX= 
##$RELAX= 
##$RELAX= 
##$RELAX= 
##$RELAX= 
##$RELAX= 
##$RELAX= 
$$ Bruker specific parameters
$$ --------------------------
##$DU= <F:/spectra>
##$EXPNO= 1
##$NAME= <P31>
##$PROCNO= 1
##$TYPE= <nmr>
##$USER= <she>
##$AMP= (0..31)
100 100 100 100 100 100 100 100 100 100 100 100 100 100 100 100 100 100 
100 100 100 100 100 100 100 100 100 100 100 100 100 100 
##$AQSEQ= 0
##$AQ_mod= 1
##$AUNM= <au_zg>
##$AUTOPOS= <>
##$BF1= 81.014009
##$BF2= 200.13
##$BF3= 200.13
##$BF4= 200.13
##$BF5= 200.13
##$BF6= 200.13
##$BF7= 200.13
##$BF8= 200.13
##$BYTORDA= 1
##$CFDGTYP= 0
##$CFRGTYP= 5
##$CHEMSTR= <none>
##$CNST= (0..31)
1 1 145 1 1 1 1 1 1 1 1 1 1 1 1 1 1 1 1 1 1 1 1 1 1 1 1 1 1 1 1 1 
##$CPDPRG= <waltz16>
##$CPDPRG1= <>
##$CPDPRG2= <waltz16>
##$CPDPRG3= <>
##$CPDPRG4= <mlev>
##$CPDPRG5= <mlev>
##$CPDPRG6= <mlev>
##$CPDPRG7= <mlev>
##$CPDPRG8= <mlev>
##$CPDPRGB= <>
##$CPDPRGT= <>
##$D= (0..31)
0 1 0 0 0 0 0 0 0 0 0 0.03 2e-05 3e-06 0 0 0 0 0 0 0 0 0 0 0 0 0 0 0 0 
0 0 
##$DATE= 1717586306
##$DBL= (0..7)
120 120 120 11 120 120 24 19 
##$DBP= (0..7)
150 150 150 150 150 150 150 150 
##$DBP07= 0
##$DBPNAM0= <>
##$DBPNAM1= <>
##$DBPNAM2= <>
##$DBPNAM3= <>
##$DBPNAM4= <>
##$DBPNAM5= <>
##$DBPNAM6= <>
##$DBPNAM7= <>
##$DBPOAL= (0..7)
0.5 0.5 0.5 0.5 0.5 0.5 0.5 0.5 
##$DBPOFFS= (0..7)
$$ [...]
##$SUBNAM2= <"">
##$SUBNAM3= <"">
##$SUBNAM4= <"">
##$SUBNAM5= <"">
##$SUBNAM6= <"">
##$SUBNAM7= <"">
##$SUBNAM8= <"">
##$SUBNAM9= <"">
##$SW= 501.771253377433
##$SWIBOX= (0..15)
0 1 3 0 0 0 0 0 0 0 0 0 0 0 0 0 
##$SW_h= 40650.406504065
##$TD= 32768
##$TD0= 1
##$TE= 0
##$TE2= 300
##$TE3= 300
##$TEG= 300
##$TL= (0..7)
0 120 53 12 22 120 120 120 
##$TP= (0..7)
150 150 150 150 150 150 150 150 
##$TP07= 0
##$TPNAME0= <>
##$TPNAME1= <>
##$TPNAME2= <>
##$TPNAME3= <>
##$TPNAME4= <>
##$TPNAME5= <>
##$TPNAME6= <>
##$TPNAME7= <>
##$TPOAL= (0..7)
0.5 0.5 0.5 0.5 0.5 0.5 0.5 0.5 
##$TPOFFS= (0..7)
0 0 0 0 0 0 0 0 
##$TUNHIN= 0
##$TUNHOUT= 0
##$TUNXOUT= 0
##$USERA1= <user>
##$USERA2= <user>
##$USERA3= <user>
##$USERA4= <user>
##$USERA5= <user>
##$V9= 5
##$VALIST= <valist>
##$VCLIST= <CCCCCCCCCCCCCCC>
##$VD= 0
##$VDLIST= <DDDDDDDDDDDDDDD>
##$VPLIST= <PPPPPPPPPPPPPPP>
##$VTLIST= <TTTTTTTTTTTTTTT>
##$WBST= 1024
##$WBSW= 4
##$XGAIN= (0..3)
0 0 0 0 
##$XL= 0
##$YL= 0
##$YMAX_a= 21073
##$YMIN_a= -24635
##$ZGOPTNS= <>
##$ZL1= 120
##$ZL2= 120
##$ZL3= 120
##$ZL4= 120
##$ABSF1= 0
##$ABSF2= 0
##$ABSG= 0
##$ABSL= 0
##$ALPHA= 0
##$AQORDER= 0
##$ASSFAC= 0
##$ASSFACI= 0
##$ASSFACX= 0
##$ASSWID= 0
##$AUNMP= <proc_1d>
##$AZFE= 0.1
##$AZFW= 0.5
##$BCFW= 0
##$BC_mod= 2
##$BYTORDP= 0
##$COROFFS= 0
##$CY= -3
##$DATMOD= 1
##$DC= 0
##$DFILT= <>
##$DTYPP= 0
##$F1P= 0
##$F2P= 0
##$FCOR= 1
##$FTSIZE= 65536
##$FT_mod= 6
##$GAMMA= 0
##$GB= 0
##$INTBC= 1
##$INTSCL= 6.047779e-11
##$ISEN= 30
##$LB= 10
##$LEV0= 0
##$LPBIN= 0
##$MAXI= 10000
##$MC2= 0
##$MEAN= 0
##$ME_mod= 0
##$MI= 50
##$NCOEF= 0
##$NC_proc= -7
##$NLEV= 6
##$NOISF1= 182.463
##$NOISF2= 159.3651
##$NSP= 0
##$NTH_PI= 0
##$NZP= 0
##$OFFSET= 248.5645
##$PC= 4
##$PHC0= -168.9472
##$PHC1= -29.40008
##$PH_mod= 1
##$PKNL= yes
##$PPARMOD= 0
##$PSCAL= 0
##$PSIGN= 0
##$REVERSE= no
##$SF= 81.0140089999694
##$SI= 65536
##$SIGF1= 159.3651
##$SIGF2= -187.1042
##$SINO= 113.3802
##$SIOLD= 16384
##$SREGLST= <1H.CDCl3>
##$SSB= 0
##$STSI= 65536
##$STSR= 0
##$SW_p= 40650.406504065
##$SYMM= 0
##$S_DEV= 0
##$TDeff= 32768
##$TDoff= 0
##$TI= <>
##$TILT= no
##$TM1= 0
##$TM2= 0
##$TOPLEV= 0
##$USERP1= <user>
##$USERP2= <user>
##$USERP3= <user>
##$USERP4= <user>
##$USERP5= <user>
##$WDW= 1
##$XDIM= 65536
##$YMAX_p= 311923373
##$YMIN_p= -9189358
$$ End of Bruker specific parameters
$$ ---------------------------------
##NTUPLES= NMR SPECTRUM
##VAR_NAME=  FREQUENCY,     SPECTRUM/REAL,   SPECTRUM/IMAG
##SYMBOL=    X,             R,               I
##VAR_TYPE=  INDEPENDENT,   DEPENDENT,       DEPENDENT
##VAR_FORM=  AFFN,          ASDF,            ASDF
##VAR_DIM=   65536,         65536,           65536
##UNITS=     HZ,            ARBITRARY UNITS, ARBITRARY UNITS
##FACTOR=    0.620285442955139, 1,           1
##FIRST=     20137.2065510682, 0,            0
##LAST=      -20513.1999529968, 0,           0
##MIN=       -20513.1999529968, -9189358,    0
##MAX=       20137.2065510682, 311923373,    0
$$ Real data points
##PAGE= N=1
##DATA TABLE= (X++(R..R)), XYDATA
$$ [...]
$$ plain form
41082 -5237862 -5075708 -4954912 -4886454 -4873012 -4910050 -4988362 -5096825 -5224744 -5363448 -5506584
41072 -5506584 -5648856 -5784033 -5903579 -5996687 -6051366 -6056014 -6001236 -5881627 -5696892 -5451874
41062 -5451874 -5155770 -4821348 -4464518 -4103927 -3759896 -3452300 -3197873 -3007989 -2887755
41053 -2887755 -2836215 -2846818 -2907960 -3004340 -3119642 -3239604 -3353821 -3455690 -3541489 -3609796
41043 -3609796 -3661304 -3698227 -3722897 -3736310 -3737801 -3726242 -3701942 -3667806 -3628896 -3590627 -3556561
41032 -3556561 -3526830 -3497811 -3463287 -3416596 -3352781 -3269839 -3168925 -3053968 -2930880 -2806121
41022 -2806121 -2684586 -2567724 -2453194 -2336611 -2214457 -2086539 -1956636 -1831169 -1716692
41013 -1716692 -1617582 -1534986 -1467282 -1411423 -1364292 -1323722 -1289223 -1262557 -1247776 -1250511 -1276822
$$ packed form
41082e237862J62154J20796O8458J3442l7038p8312j08463j27919j38704j43136
41072e506584j42272j35177j19546r3108n4679m648N4778J19609J84735K45018
41062e451874K96104L34422L56830L60591L44031L07596K54427J89884J20234
41053b887755N1540j0603o1142r6380j15302j19962j14217j01869q5799o8307
41043c609796n1508l6923k4670j3413j491J1559K4300L4136L8910L8269L4066
41032c556561K9731K9019L4524M6691O3815Q2942J00914J14957J23088J24759
41022b806121J21535J16862J14530J16583J22154J27918J29903J25467J14477
41013a716692R9110Q2596O7704N5859M7131M0570L4499K6666J4781k735k6311
$$ plain form
41002 -1276822 -1332263 -1421397 -1547472 -1712096 -1915072 -2154388 -2425962 -2722945 -3035200 -3349895
40992 -3349895 -3653356 -3933515 -4182008 -4395292 -4574252 -4722294 -4842801 -4937545 -5006952 -5051528
40982 -5051528 -5072923 -5073904 -5057853 -5028638 -4990911 -4950010 -4910778 -4875729 -4843937 -4811987 -4776960 -4739682
40970 -4739682 -4705912 -4684424 -4683101 -4705313 -4748386 -4804511 -4863408 -4915685 -4955713 -4982806 -5000049
40959 -5000049 -5011373 -5018477 -5019269 -5008462 -4979958 -4929875 -4858854 -4772546 -4680168 -4592098 -4517791 -4464466
40947 -4464466 -4436235 -4433428 -4452521 -4487147 -4529972 -4574668 -4617428 -4657751 -4698319 -4743678 -4798043
40936 -4798043 -4863278 -4938335 -5020492 -5107311 -5197693 -5291348 -5387481 -5484236 -5579468 -5671842 -5760859
40925 -5760859 -5845495 -5922592 -5986357 -6029298 -6044106 -6025833 -5973807 -5892475 -5790394 -5677460 -5561736
$$ packed form
41002a276822n5441q9134j26075j64624k02976k39316k71574k96983l12255l14695
40992c349895l03461k80159k48493k13284j78960j48042j20507r4744o9407m4576
40982e051528k1395r81J6051K9215L7727M0901L9232L5049L1792L1950L5027L7278
40970d739682L3770K1488J323k2212m3073n6125n8897n2277m0028k7093j7243
40959e000049j1324p104p92J0807K8504N0083P1021Q6308R2378Q8070P4307N3325
40947d464466K8231K807j9093l4626m2825m4696m2760m0323m0568m5359n4365
40936d798043o5235p5057q2157q6819r0382r3655r6133r6755r5232r2374q9017
40925e760859q4636p7097o3765m2941j4808J8273N2026Q1332J02081J12934J15724
$$ plain form
40914 -5561736 -5447605 -5336084 -5226664 -5119354 -5015826 -4919421 -4834400 -4765099 -4715161 -4686688
40904 -4686688 -4679187 -4688746 -4708223 -4728908 -4743244 -4747550 -4743278 -4735885 -4731816 -4735508 -4748456 -4770584 -4802172
40891 -4802172 -4844301 -4897513 -4960040 -5027231 -5092663 -5150237 -5195923 -5227949 -5245088 -5244031 -5217802
40880 -5217802 -5156808 -5052483 -4901504 -4707930 -4481843 -4235406 -3978874 -3718688 -3458030 -3198865
40870 -3198865 -2944408 -2701328 -2480870 -2297759 -2166409 -2095804 -2085857 -2127488 -2206320 -2307575
40860 -2307575 -2419496 -2534347 -2647898 -2758552 -2866450 -2972409 -3077099 -3181147 -3286176
40851 -3286176 -3395547 -3513553 -3643098 -3783473 -3930115 -4076692 -4217902 -4350803 -4474154
40842 -4474154 -4587272 -4689945 -4783004 -4867946 -4945263 -5013249 -5069076 -5111670 -5143968 -5172545 -5204669
$$ packed form
40914e561736J14131J11521J09420J07310J03528R6405Q5021O9301M9938K8473
40904d686688P501r559j9477k0685j4336m306M272P393M069l692j2948k2128l1588
40891d802172m2129n3212o2527o7191o5432n7574m5686l2026j7139J057K6229
40880e217802O0994J04325J50979J93574K26087K46437K56532K60186K60658K59165
40870c198865K54457K43080K20458J83111J31350P0605R947m1631p8832j01255
40860b307575j11921j14851j13551j10654j07898j05959j04690j04048j05029
40851c286176j09371j18006j29545j40375j46642j46577j41210j32901j23351
40842d474154j13118j02673r3059q4942p7317o7986n5827m2594l2298k8577l2124
$$ plain form
40831 -5204669 -5244556 -5290974 -5337390 -5374429 -5393321 -5388755 -5360051 -5310320 -5244069 -5164710 -5073682
40820 -5073682 -4971783 -4861468 -4748022 -4638815 -4541373 -4461603 -4402642 -4364302 -4343043 -4332665
40810 -4332665 -4325773 -4315574 -4297244 -4268164 -4227154 -4173781 -4108732 -4034976 -3958145 -3885121 -3821538
40799 -3821538 -3769875 -3729099 -3695514 -3664149 -3630640 -3593824 -3558436 -3536149 -3543201 -3594506 -3696799
40788 -3696799 -3844753 -4022615 -4210393 -4390600 -4551627 -4686711 -4790580 -4856829 -4877674 -4845801
40778 -4845801 -4757045 -4612656 -4420434 -4194333 -3952718 -3715786 -3502677 -3328602 -3202389 -3125332
40768 -3125332 -3091977 -3092565 -3115737 -3150401 -3186845 -3217792 -3239596 -3252775 -3261033 -3268681 -3277412 -3284084
40756 -3284084 -3281053 -3259406 -3213609 -3144901 -3061543 -2976109 -2901754 -2849272 -2825541 -2832943 -2869397 -2929058
$$ packed form
40831e204669l9887m6418m6416l7039j8892M566K8704M9731O6251P9359R1028
40820e073682J01899J10315J13446J09207R7442P9770N8961L8340K1259J0378
40810d332665O892J0199J8330K9080M1010N3373O5049P3756P6831P3024O3583
40799c821538N1663M0776L3585L1365L3509L6816L5388K2287p052n1305j02293
40788c696799j47954j77862j87778j80207j61027j35084j03869o6249k0845L1873
40778d845801Q8756J44389J92222K26101K41615K36932K13109J74075J26213P7057
40768c125332L3355n88k3172l4664l6444l0947k1804j3179q258p648q731o672
40756c284084L031K1647M5797O8708Q3358Q5434P4355N2482K3731p402l6454n9661
$$ plain form
40744 -2929058 -3003781 -3084859 -3164187 -3234527 -3289538 -3324536 -3338003 -3332683 -3315101 -3293641 -3276529
40733 -3276529 -3270809 -3282419 -3316588 -3377882 -3469443 -3591430 -3739409 -3904095 -4073496 -4236716
40723 -4236716 -4387179 -4523421 -4647503 -4762608 -4871105 -4973294 -5066545 -5144947 -5200001 -5222525
40713 -5222525 -5205221 -5144851 -5043090 -4905828 -4741569 -4560043 -4371742 -4187990 -4020565 -3880319
40703 -3880319 -3775443 -3710529 -3686832 -3702975 -3755177 -3836948 -3938911 -4049205 -4154325 -4240324
40693 -4240324 -4294727 -4309280 -4282596 -4221127 -4137718 -4048631 -3970759 -3919924 -3909850 -3950723 -4047145
40682 -4047145 -4196631 -4390123 -4614781 -4857593 -5107819 -5357428 -5600125 -5830115 -6041448
40673 -6041448 -6228246 -6385529 -6509860 -6599078 -6651360 -6664771 -6637943 -6571179 -6466818 -6328936
$$ packed form
40744b929058p4723q1078p9328p0340n5011l4998j3467N320J7582K1460J7112
40733c276529N720j1610l4169o1294r1561j21987j47979j64686j69401j63220
40723d236716j50463j36242j24082j15105j08497j02189r3251p8402n5054k2524
40713e222525J7304O0370J01761J37262J64259J81526J88301J83752J67425J40246
40703c880319J04876O4914K3697j6143n2202q1771j01963j10294j05120q5999
40693d240324n4403j4553K6684O1469Q3409Q9087P7872N0835J0074m0873r6422
40682d047145j49486j93492k24658k42812k50226k49609k42697k29990k11333
40673f041448j86798j57283j24331q9218n2282j3411K6828O6764J04361J37882
$$ plain form
40663 -6328936 -6163480 -5979286 -5788761 -5606599 -5446310 -5316180 -5216844 -5141800 -5080582 -5022993
40653 -5022993 -4962326 -4896252 -4825522 -4751738 -4675463 -4595431 -4509135 -4414566 -4312103 -4205099 -4098429
40642 -4098429 -3995958 -3898769 -3805187 -3712063 -3616188 -3515257 -3408352 -3295900 -3179091 -3059368
40632 -3059368 -2938954 -2822548 -2718927 -2640835 -2602747 -2617494 -2693315 -2832320 -3030450 -3278406
40622 -3278406 -3562999 -3868701 -4179522 -4481215 -4763187 -5019203 -5246366 -5442819 -5605548
40613 -5605548 -5729888 -5811301 -5848209 -5843576 -5803949 -5736855 -5648669 -5543934 -5425570 -5295098 -5153002
40602 -5153002 -4999667 -4836429 -4665708 -4489916 -4310091 -4125514 -3934727 -3737284 -3535154
40593 -3535154 -3332749 -3135332 -2946514 -2766291 -2590860 -2414449 -2232276 -2043268 -1851484
$$ packed form
40663f328936J65456J84194J90525J82162J60289J30130R9336P5044O1218N7589
40653e022993O0667O6074P0730P3784P6275Q0032Q6296R4569J02463J07004J06670
40642d098429J02471R7189R3582R3124R5875J00931J06905J12452J16809J19723
40632c059368J20414J16406J03621P8092L8088j4747p5821j39005j98130k47956
40622c278406k84593l05702l10821l01693k81972k56016k27163j96453j62729
40613e605548j24340q1413l6908M633L9627O7094Q8186J04735J18364J30472J42096
40602e153002J53335J63238J70721J75792J79825J84577J90787J97443K02130
40593c535154K02405J97417J88818J80223J75431J76411J82173J89008J91784
$$ plain form
40584 -1851484 -1665949 -1499478 -1367264 -1285291 -1267817 -1323474 -1451071 -1637453 -1859163 -2087544
40574 -2087544 -2295223 -2461885 -2578103 -2646459 -2679538 -2695378 -2712350 -2745627 -2805794 -2898428 -3023636
40563 -3023636 -3176019 -3346146 -3523454 -3699031 -3866749 -4022769 -4164603 -4290669 -4400341
40554 -4400341 -4493902 -4572144 -4635636 -4683869 -4714510 -4723247 -4704707 -4654353 -4570447 -4454985 -4313275
40543 -4313275 -4152727 -3981655 -3808457 -3641030 -3486022 -3347650 -3226308 -3117857 -3014607
40534 -3014607 -2908160 -2792996 -2669199 -2543266 -2426859 -2333845 -2276361 -2261205 -2288152 -2350967
40524 -2350967 -2440328 -2546848 -2662812 -2782474 -2901528 -3016309 -3123117 -3218099 -3298019 -3361621
40514 -3361621 -3410594 -3449353 -3483728 -3519379 -3560528 -3609192 -3664988 -3725668 -3788156 -3849400 -3906457
$$ packed form
40584a851484J85535J66471J32214Q1973J7474n5657j27597j86382k21710k28381
40574b087544k07679j66662j16218o8356l3079j5840j6972l3277o0167r2634j25208
40563c023636j52383j70127j77308j75577j67718j56020j41834j26066j09672
40554d400341r3561p8242o3492m8233l0641q737J8540N0354Q3906J15462J41710
40543d313275J60548J71072J73198J67427J55008J38372J21342J08451J03250
40534c014607J06447J15164J23797J25933J16407R3014N7484J5156k6947o2815
40524b350967q9361j06520j15964j19662j19054j14781j06808r4982p9920o3602
40514c361621m8973l8759l4375l5651m1149m8664n5796o0680o2488o1244n7057
$$ plain form
40503 -3906457 -3955882 -3992925 -4011030 -4002229 -3958975 -3877223 -3759231 -3614076 -3455146 -3296081 -3147634
40492 -3147634 -3017042 -2909538 -2830294 -2784926 -2777916 -2809838 -2875044 -2961125 -3050677 -3125102 -3169394
40481 -3169394 -3175859 -3144743 -3081543 -2993111 -2885274 -2762872 -2630923 -2495233 -2361817 -2235702
40471 -2235702 -2119913 -2015356 -1921858 -1839897 -1771877 -1721850 -1693651 -1688552 -1703850 -1733151 -1768088
40460 -1768088 -1800586 -1824778 -1838160 -1842023 -1841457 -1845087 -1864385 -1911976 -1998582 -2129172 -2300162 -2499539
40448 -2499539 -2710069 -2913734 -3095197 -3243506 -3352673 -3421590 -3453123 -3452239 -3424025 -3372570 -3300746
40437 -3300746 -3210035 -3100004 -2968148 -2811148 -2627467 -2420107 -2198144 -1976451 -1773549 -1607795
40427 -1607795 -1492648 -1432668 -1422347 -1448637 -1495753 -1549546 -1599444 -1638023 -1659845 -1661164 -1640871
$$ packed form
40503c906457m9425l7043j8105Q801M3254Q1752J17992J45155J58930J59065J48447
40492c147634J30592J07504P9244M5368P010l1922o5206q6081q9552p4425m4292
40481c169394o465L1116O3200Q8432J07837J22402J31949J35690J33416J26115
40471b235702J15789J04557R3498Q1961O8020N0027K8199N099j5298k9301l4937
40460a768088l2498k4192j3382l863N66l630j9298m7591q6606j30590j70990j99377
40448b499539k10530k03665j81463j48309j09167o8917l1533Q84K8214N1455P1824
40437c300746R0711J10031J31856J57000J83681K07360K21963K21693K02902J65754
40427a607795J15147N9980J0321k6290m7116n3793m9898l8579k1822j319K0293
$$ plain form
40416 -1640871 -1601646 -1549895 -1494038 -1442237 -1401170 -1376434 -1373643 -1398968 -1458663 -1557898 -1699234
40405 -1699234 -1881110 -2097069 -2336484 -2586673 -2835261 -3071674 -3287620 -3477033 -3635922
40396 -3635922 -3762323 -3856563 -3921800 -3964314 -3992805 -4016686 -4044311 -4082118 -4134789 -4205713 -4297010
40385 -4297010 -4409259 -4541437 -4691170 -4854770 -5026770 -5199643 -5364601 -5513416 -5640079
40376 -5640079 -5741470 -5817327 -5870070 -5904190 -5924594 -5934284 -5932708 -5915659 -5876481 -5807987 -5704761
40365 -5704761 -5565264 -5392721 -5194229 -4978843 -4755943 -4534230 -4320877 -4120580 -3935112
40356 -3935112 -3763832 -3604813 -3455844 -3315102 -3181860 -3057494 -2946319 -2855265 -2791595 -2759111
40346 -2759111 -2754785 -2768135 -2784224 -2788810 -2772921 -2734895 -2679778 -2616959 -2557112 -2509272 -2479083 -2468966
$$ packed form
40416a640871L9225N1751N5857N1801M1067K4736K791k5325n9695r9235j41336
40405a699234j81876k15959k39415k50189k48588k36413k15946j89413j58889
40396c635922j26401r4240o5237m2514k8491k3881k7625l7807n2671p0924r1297
40385d297010j12249j32178j49733j63600j72000j72873j64958j48815j26663
40376e640079j01391p5857n2743l4120k0404r690J576J7049L9178O8494J03226
40365e704761J39497J72543J98492K15386K22900K21713K13353K00297J85468
40356c935112J71280J59019J48969J40742J33242J24366J11175R1054O3670L2484
40346b759111M326j3350j6089m586J5889L8026N5117O2819N9847M7840L0189J0117
$$ plain form
40334 -2468966 -2479945 -2513595 -2572482 -2658778 -2772176 -2908581 -3060169 -3216434 -3365393 -3494491
40324 -3494491 -3591469 -3645707 -3650141 -3602797 -3506726 -3368094 -3193592 -2988616 -2756592 -2499033
40314 -2499033 -2216148 -1908491 -1579658 -1238915 -902011 -589270 -321622 -116299 16039
40305 16039 72037 54639 -28641 -167544 -350821 -567836 -809702 -1069665 -1342924 -1626301
40295 -1626301 -1917922 -2216796 -2522076 -2832099 -3143543 -3451054 -3747505 -4024773 -4274642
40286 -4274642 -4489637 -4663713 -4792837 -4875244 -4911225 -4902545 -4851869 -4762314 -4637009 -4478626
40276 -4478626 -4289264 -4071142 -3827771 -3564438 -3287022 -2999669 -2703382 -2397270 -2082071
40267 -2082071 -1763455 -1452896 -1165951 -919601 -729899 -609774 -566306 -597943 -693397 -833707
$$ packed form
40334b468966j0979l3650n8887q6296j13398j36405j51588j56265j48959j29098
40324c494491r6978n4238m434M7344R6071J38632J74502K04976K32024K57559
40314b499033K82885L07657L28833L40743L36904L12741K67648K05323J32338
40305A6039N5998j7398q3280j38903j83277k17015k41866k59963k73259k83377
40295a626301k91621k98874l05280l10023l11444l07511k96451k77268k49869
40286d274642k14995j74076j29124q2407l5981Q680N0676Q9555J25305J58383
40276d478626J89362K18122K43371K63333K77416K87353K96287L06112L15199
40267b082071L18616L10559K86945K46350J89702J20125M3468l1637r5454j40310
$$ plain form
40257 -833707 -997110 -1164583 -1323582 -1468736 -1599928 -1719204 -1828005 -1925654 -2009287 -2074890
40247 -2074890 -2118836 -2139469 -2138568 -2122382 -2101587 -2089416 -2098065 -2134747 -2199462 -2285772 -2384078 -2485387
40235 -2485387 -2583568 -2675561 -2760568 -2839425 -2914355 -2988339 -3063761 -3141001 -3218062 -3291539 -3358141
40224 -3358141 -3415776 -3463735 -3502254 -3531882 -3553033 -3565904 -3570827 -3568829 -3561948 -3552779 -3543119 -3532221
40212 -3532221 -3515732 -3486218 -3435380 -3357004 -3249196 -3114783 -2959727 -2790457 -2611653 -2425771
40202 -2425771 -2234510 -2041001 -1851125 -1673190 -1516618 -1390655 -1303277 -1259746 -1260679 -1300703
40192 -1300703 -1368998 -1451891 -1536065 -1610602 -1667091 -1698652 -1699475 -1666088 -1600100 -1510638 -1414269 -1331507
40180 -1331507 -1281247 -1275701 -1317779 -1401077 -1511543 -1630223 -1737032 -1815208 -1855102 -1855546 -1822217
$$ packed form
40257h33707j63403j67473j58999j45154j31192j19276j08801r7649q3633o5603
40247b074890m3946k0633R01J6186K0795J2171q649l6682o4715q6310r8306j01309
40235b485387r8181r1993q5007p8857p4930p3984p5422p7240p7061p3477o6602
40224c358141n7635m7959l8519k9628k1151j2871m923J998O881R169R660J0898
40212c532221J6489K9514N0838P8376J07808J34413J55056J69270J78804J85882
40202b425771J91261J93509J89876J77935J56572J25963Q7378M3531r33m0024
40192a300703o8295q2893q4174p4537n6489l1561q23L3387O5988Q9462R6369Q2762
40180a331507N0260N546m2078q3298j10466j18680j06809p8176l9894m44L3329
$$ plain form
40169 -1822217 -1764118 -1690237 -1607842 -1522475 -1438650 -1360211 -1290148 -1230640 -1184154 -1155312 -1151886
40158 -1151886 -1183436 -1258016 -1379216 -1545521 -1751783 -1990873 -2254073 -2530769 -2808978 -3077448
40148 -3077448 -3328307 -3558533 -3769204 -3963007 -4141509 -4303613 -4445600 -4562169 -4647577 -4696614
40138 -4696614 -4705588 -4673436 -4602574 -4499015 -4371670 -4231040 -4087608 -3950212 -3824731 -3713388
40128 -3713388 -3614575 -3523234 -3432077 -3333967 -3224619 -3103753 -2973489 -2835213 -2687880 -2529517
40118 -2529517 -2360580 -2186132 -2014860 -1855672 -1714026 -1589837 -1477499 -1367769 -1250899
40109 -1250899 -1120068 -973907 -817001 -658088 -506961 -371807 -258177 -169243 -106213 -68348
40099 -68348 -53403 -59400 -87239 -142228 -232973 -367859 -550988 -779549 -1043464 -1326944 -1611110
$$ packed form
40169a822217N8099P3881Q2395Q5367Q3825P8439P0063N9508M6486K8842L426
40158a151886l1550p4580j21200j66305k06262k39090k63200k76696k78209k68470
40148c077448k50859k30226k10671j93803j78502j62104j41987j16569q5408m9037
40138d696614q974L2152P0862J03559J27345J40630J43432J37396J25481J11343
40128c713388R8813R1341R1157R8110J09348J20866J30264J38276J47333J58363
40118b529517J68937J74448J71272J59188J41646J24189J12338J09730J16870
40109a250899J30831J46161J56906J58913J51127J35154J13630Q8934O3030L7865
40099f8348J4945n997k7839n4989r0745j34886j83129k28561k63915k83480k84166
$$ plain form
40088 -1611110 -1876885 -2107721 -2291689 -2422542 -2499602 -2526682 -2510394 -2458209 -2376857 -2271876
40078 -2271876 -2148575 -2013623 -1875952 -1746455 -1636932 -1558828 -1521425 -1529273 -1579762 -1662694
40068 -1662694 -1762803 -1864293 -1955218 -2030080 -2090337 -2143429 -2200884 -2275752 -2379543 -2519347
40058 -2519347 -2696027 -2904025 -3132550 -3367490 -3593594 -3796694 -3965794 -4094742 -4183248 -4236816
40048 -4236816 -4265105 -4278765 -4286037 -4291124 -4295247 -4299237 -4305429 -4317618 -4339655 -4373959 -4420691 -4477553
40036 -4477553 -4540191 -4603388 -4662953 -4717600 -4769805 -4825213 -4890965 -4973581 -5076846 -5199972 -5336525
40025 -5336525 -5474616 -5598547 -5691568 -5739109 -5731527 -5665435 -5543090 -5370499 -5155616 -4907497
40015 -4907497 -4636156 -4352306 -4066817 -3790362 -3533556 -3307123 -3121311 -2984080 -2898481 -2860510
$$ packed form
40088a611110k65775k30836j83968j30853p7060k7080J6288N2185Q1352J04981
40078b271876J23301J34952J37671J29497J09523P8104L7403p848n0489q2932
40068a662694j00109j01490r0925p4862o0257n3092n7455p4868j03791j39804
40058b519347j76680k07998k28525k34940k26104k03100j69100j28948q8506n3568
40048d236816k8289j3660p272n087m123l990o192j2189k2037l4304m6732n6862
40036d477553o2638o3197n9565n4647n2205n5408o5752q2616j03265j23126j36553
40025e336525j38091j23931r3021m7541P582O6092J22345J72591K14883K48119
40015d907497K71341K83850K85489K76455K56806K26433J85812J37231Q5599L7971
$$ plain form
40005 -2860510 -2858970 -2878000 -2901243 -2915623 -2913302 -2891857 -2853577 -2804390 -2752493 -2706733 -2675039 -2662986
39993 -2662986 -2672389 -2700275 -2739254 -2780020 -2815129 -2841835 -2862212 -2880731 -2901017 -2923556 -2945107
39982 -2945107 -2959610 -2960058 -2940518 -2897598 -2831003 -2743434 -2640017 -2527201 -2411056 -2295452 -2181068
39971 -2181068 -2065780 -1946094 -1818719 -1681458 -1533188 -1373403 -1202132 -1020700 -832857
39962 -832857 -645160 -465678 -301058 -153086 -16512 120351 272192 452111 668286 923044
39952 923044 1213615 1533167 1871730 2217605 2559780 2891017 3210760 3527034 3856668 4223408
39942 4223408 4654154 5174254 5803062 6550557 7415279 8383624 9430412 10520376 11610131
39933 11610131 12650242 13587530 14368166 14942290 15270461 15331005 15125718 14680870 14042126
$$ packed form
40005b860510J540j9030k3243j4380K321K1445L8280M9187N1897M5760L1694J2053
39993b662986r403k7886l8979m0766l5109k6706k0377j8519k0286k2539k1551
39982b945107j4503m48J9540M2920O6595Q7569J03417J12816J16145J15604J14384
39971b181068J15288J19686J27375J37261J48270J59785J71271J81432J87843
39962h32857J87697J79482J64620J47972J36574J36863J51841J79919K16175K54758
39952I23044K90571L19552L38563L45875L42175L31237L19743L16274L29634L66740
39942D223408M30746N20100O28808P47495Q64722R68345J046788J089964J089755
39933A1610131J040111R37288P80636N74124L28171O0544k05287m44848o38744
$$ plain form
39924 14042126 13265144 12405856 11513950 10630345 9787007 9007031 8304451 7684611 7145825
39915 7145825 6681903 6284483 5944694 5654409 5407229 5198630 5024715 4880050 4755980
39906 4755980 4640605 4520614 4384364 4225278 4044483 3851583 3662954 3497851 3373529
39897 3373529 3301056 3283367 3316265 3391471 3499723 3632341 3781409 3940081 4103899 4272279
39887 4272279 4448408 4636670 4838690 5050312 5261276 5457641 5625508 5754541 5840538 5886686
39877 5886686 5902845 5902489 5898182 5897818 5903659 5914391 5928685 5948036 5977484 6024104 6094417 6192281
39865 6192281 6318283 6470620 6646811 6845494 7067852 7318224 7603514 7931383 8307811
39856 8307811 8735026 9210648 9728212 10278625 10851826 11438125 12028914 12616853 13195890
$$ packed form
39924A4042126p76982q59288q91906q83605q43338p79976p02580o19840n38786
39915G145825m63922l97420l39789k90285k47180k08599j73915j44665j24070
39906D755980j15375j19991j36250j59086j80795j92900j88629j65103j24322
39897C373529p2473j7689L2898P5206J08252J32618J49068J58672J63818J68380
39887D272279J76129J88262K02020K11622K10964J96365J67867J29033Q5997M6148
39877E886686J6159l56m307l64N841J0732J4294J9351K9448M6620P0313R7864
39865F192281J26002J52337J76191J98683K22358K50372K85290L27869L76428
39856H307811M27215M75622N17564N50413N73201N86299N90789N87939N79037
$$ plain form
39847 13195890 13761696 14312752 14851563 15385176 15924628 16483683 17077255 17719579 18421993
39838 18421993 19190495 20023698 20911736 21836461 22772706 23689824 24552685 25322168 25956381
39829 25956381 26414003 26659874 26671369 26443314 25989637 25341038 24539579 23632202 22665245
39820 22665245 21680862 20714973 19796044 18944434 18172222 17483371 16874108 16333879 15847348
39811 15847348 15397569 14969545 14553006 14143444 13741398 13350925 12978212 12630529 12315016
39802 12315016 12037189 11799945 11603729 11447469 11329050 11244793 11188852 11153818 11132852 11122279
39792 11122279 11123258 11141720 11186739 11267845 11391724 11558731 11760009 11976704 12182745 12351141
39782 12351141 12461476 12504963 12484509 12410074 12292288 12137790 11948393 11723675 11464808 11176976
$$ packed form
39847A3195890N65806N51056N38811N33613N39452N59055N93572O42324P02414
39838A8421993P68502Q33203Q88038R24725R36245R17118Q62861P69483O34213
39829B5956381M57622K45871J1495k28055m53677o48599q01459r07377r66957
39820B2665245r84383r65889r18929q51610p72212o88851o09263n40229m86531
39811A5847348m49779m28024m16539m09562m02046l90473l72713l47683l15513
39802A2315016k77827k37244j96216j56260j18419q4257n5941l5034k0966j0573
39792A1122279R79J8462M5019Q1106J23879J67007K01278K16695K06041J68396
39782A2351141J10335M3487k0454p4435j17786j54498j89397k24718k58867k87832
$$ plain form
39772 11176976 10868886 10549866 10226540 9901137 9572244 9237301 8895432 8549333 8205487
39763 8205487 7872728 7559790 7272894 7014241 6781845 6570442 6372905 6181615 5989645
39754 5989645 5791996 5586871 5376488 5166518 4963854 4773604 4596915 4430863 4270346
39745 4270346 4110809 3950218 3789278 3629987 3473658 3319882 3167308 3015862 2869085
39736 2869085 2734904 2623885 2545412 2503609 2495223 2510425 2535680 2556860 2561387 2539585 2485841
39725 2485841 2399715 2286386 2155829 2020567 1892560 1780167 1686252 1608012 1538461 1469073
39715 1469073 1393069 1308641 1220869 1141036 1083040 1058417 1072260 1121952 1199085 1293551 1397655
39704 1397655 1507952 1623904 1744539 1865645 1979328 2075860 2146508 2186093 2194557 2177088
$$ packed form
39772A1176976l08090l19020l23326l25403l28893l34943l41869l46099l43846
39763H205487l32759l12938k86896k58653k32396k11403j97537j91290j91970
39754E989645j97649k05125k10383k09970k02664j90250j76689j66052j60517
39745D270346j59537j60591j60940j59291j56329j53776j52574j51446j46777
39736B869085j34181j11019p8473m1803q386J5202K5255K1180M527k1802n3744
39725B485841q6126j13329j30557j35262j28007j12393r3915p8240o9551o9388
39715A469073p6004q4428q7772p9833n7996k4623J3843M9692P7133R4466J04104
39704A397655J10297J15952J20635J21106J13683R6532P0648L9585Q464j7469
$$ plain form
39694 2177088 2142608 2101041 2060568 2026182 1999982 1982486 1973757 1973659 1981399 1994898 2010351 2022224
39682 2022224 2024106 2010707 1980305 1936044 1884917 1834927 1792096 1758707 1732804 1708397 1676037
39671 1676037 1623853 1538969 1409020 1223708 976667 667744 304968 -95155 -510149 -916622
39661 -916622 -1296101 -1638996 -1944855 -2219105 -2468371 -2696719 -2903901 -3085224 -3232298 -3334497
39651 -3334497 -3381289 -3365248 -3284739 -3145091 -2957578 -2736572 -2496286 -2248585 -2002528 -1764954
39641 -1764954 -1540926 -1333574 -1143714 -969904 -809243 -658915 -518160 -389758 -279764
39632 -279764 -194985 -139435 -111962 -106560 -114927 -129578 -145765 -161404 -175355 -185394 -187426 -176647
39620 -176647 -150072 -109042 -60442 -15931 11032 9775 -23138 -81797 -152429 -217704 -261641 -273262
$$ packed form
39694B177088l4480m1567m0473l4386k6200j7496q729r8P740J3499J5453J1873
39682B022224J882j3399l0402m4261n1127m9990m2831l3389k5903k4407l2360
39671A676037n2184q4884j29949j85312k47041l08923l62776m00123m14994m06473
39661i16622l79479l42895l05859k74250k49266k28348k07182j81323j47074j02199
39651c334497m6792J6041Q0509J39648J87513K21006K40286K47701K46057K37574
39641a764954K24028K07352J89860J73810J60661J50328J40755J28402J09994
39632b79764Q4779N5550K7473N402q367j4651j6187j5639j3951j0039k032J0779
39620a76647K6575M1030M8600M4511K6963j257l2913n8659p0632o5275m3937j1621
$$ plain form
39608 -273262 -248497 -190776 -110511 -23100 54805 109827 135190 131164 102707 56152 -2917 -69799
39596 -69799 -139512 -205822 -261632 -301133 -322812 -331281 -335991 -346814 -368893 -399934 -431434 -452735
39584 -452735 -455324 -435472 -394796 -339479 -278793 -223032 -180878 -156913 -150293 -155053 -161382 -157084
39572 -157084 -129124 -65730 41029 193141 386172 610742 855453 1110096 1368007 1626847
39562 1626847 1887898 2154499 2430274 2717579 3016543 3325023 3639401 3955795 4271353
39553 4271353 4585601 4901610 5226303 5569189 5939584 6343182 6779114 7238662 7706588
39544 7706588 8165298 8600679 9007120 9389342 9760205 10135845 10530793 10955310 11415348
39535 11415348 11913864 12451966 13029353 13644112 14291779 14963614 15645046 16315831 16952407
$$ packed form
39608b73262K4765N7721Q0265Q7411P7905N5022K5363m026k8457m6555n9069o6882
39596f9799o9713o6310n5810l9501k1679q469m710j0823k2079l1041l1500k1301
39584d52735k589J9852M0676N5317O0686N5761M2154K3965O620m760o329M298
39572a57084K7960O3394J06759J52112J93031K24570K44711K54643K57911K58840
39562A626847K61051K66601K75775K87305K98964L08480L14378L16394L15558
39553D271353L14248L16009L24693L42886L70395M03598M35932M59548M67926
39544G706588M58710M35381M06441L82222L70863L75640L94948M24517M60038
39535A1415348M98516N38102N77387O14759O47667O71835O81432O70785O36576
$$ plain form
39526 16952407 17531020 18029843 18429854 18715666 18877010 18910164 18818287 18610513 18300544 17905403
39516 17905403 17444610 16939789 16414393 15892837 15398432 14950599 14562866 14242829 13993943
39507 13993943 13817975 13716980 13694210 13753595 13897926 14126665 14435019 14815153 15258987 15761047
39497 15761047 16320302 16940825 17631618 18405764 19278729 20265621 21377517 22617618 23978343
39488 23978343 25439960 26970343 28525114 30048271 31474313 32732920 33756250 34487935
39480 34487935 34891860 34958179 34704225 34169879 33409487 32483401 31451015 30365454 29269709
39471 29269709 28194473 27158033 26167892 25223334 24318393 23445029 22596157 21768047 20961888
39462 20961888 20184555 19448459 18770016 18166497 17651804 17232619 16906575 16663478 16489252
$$ packed form
39526A6952407N78613M98823M00011K85812J61344L3154r1877k07774l09969l95141
39516A7905403m60793n04821n25396n21556m94405m47833l87733l20037k48886
39507A3993943j75968j00995k2770N9385J44331K28739L08354L80134M43834N02060
39497A5761047N59255O20523O90793P74146Q72965R86892J111896J240101J360725
39488B3978343J461617J530383J554771J523157J426042J258607J023330P31685
39480C4487935M03925O6319k53954n34346p60392r26086j032386j085561j095745
39471B9269709j075236j036440r90141r44558r04941q73364q48872q28110q06159
39462B0961888p77333p36096o78443o03519n14693m19185l26044k43097j74226
$$ plain form
39453 16489252 16371011 16300931 16277196 16301763 16376204 16497732 16657260 16840291 17030190 17212356
39443 17212356 17377648 17524018 17656077 17783019 17915770 18064307 18235914 18434538 18660840
39434 18660840 18912232 19182458 19460904 19732707 19980761 20189695 20350055 20460173 20524608
39425 20524608 20550544 20544743 20512656 20459081 20388831 20306524 20215984 20120240 20022520 19927624 19842491
39414 19842491 19775238 19732971 19719651 19735366 19777588 19843737 19933363 20048222 20189665 20354579
39404 20354579 20532235 20704012 20846369 20936063 20955895 20899205 20771587 20589192 20374245 20149371
39394 20149371 19932329 19732323 19548763 19373061 19193092 18998678 18785816 18558265 18326497
39385 18326497 18105097 17909586 17753128 17643170 17578206 17545770 17523413 17484023 17404445 17273747
$$ packed form
39453A6489252j18241p0080k3735K4567P4441J21528J59528J83031J89899J82166
39443A7212356J65292J46370J32059J26942J32751J48537J71607J98624K26302
39434A8660840K51392K70226K78446K71803K48054K08934J60360J10118O4435
39425B0524608K5936n801l2087n3575p0250q2307r0540r5744r7720r4896q5133
39414A9842491o7253m2267j3320J5715M2222O6149Q9626J14859J41443J64914
39404B0354579J77656J71777J42357Q9694J9832n6690j27618j82395k14947k24874
39394B0149371k17042k00006j83560j75702j79969j94414k12862k27551k31768
39385A8326497k21400j95511j56458j09958o4964l2436k2357l9390p9578j30698
$$ plain form
39375 17273747 17096690 16890623 16678076 16479637 16310585 16181414 16100019 16073276 16107343 16207198
39365 16207198 16376058 16614826 16921498 17290351 17710773 18165984 18632536 19081662 19482514
39356 19482514 19805919 20027213 20128160 20098988 19940709 19666172 19298000 18863535 18388954
39347 18388954 17895079 17396196 16901752 16419975 15961890 15543858 15187044 14913387 14739509
39338 14739509 14671476 14703559 14822237 15013562 15269620 15590372 15980190 16441500 16969099 17547821
39328 17547821 18154386 18762298 19347026 19888712 20371575 20781866 21107068 21337416 21468499
39319 21468499 21502959 21450281 21324715 21141718 20913330 20643569 20325861 19944656 19481856 18925898
39309 18925898 18279315 17561039 16802536 16040087 15306721 14626474 14012050 13465631 12981851
$$ packed form
39375A7273747j77057k06067k12547j98439j69052j29171q1395k6743L4067R9855
39365A6207198J68860K38768L06672L68853M20422M55211M66552M49126M00852
39356A9482514L23405K21294J00947k9172j58279k74537l68172m34465m74581
39347A8388954m93875m98883m94444m81777m58085m18032l56814k73657j73878
39338A4739509o8033L2083J18678J91325K56058L20752L89818M61310N27599N78722
39328A7547821O06565O07912N84728N41686M82863M10291L25202K30348J31083
39319B1468499L4460n2678j25566j82997k28388k69761l17708l81205m62800n55958
39309A8925898o46583p18276p58503p62449p33366o80247o14424n46419m83780
$$ plain form
39300 12981851 12551434 12164207 11810975 11484469 11179605 10893140 10622938 10367332 10125089
39291 10125089 9895953 9681309 9484538 9310756 9165888 9055143 8980965 8940729 8924815 8916180
39281 8916180 8892395 8830078 8710358 8523608 8272158 7970458 7642579 7317518 7023531 6783320
39271 6783320 6611521 6514923 6494638 6548829 6674608 6868230 7123382 7428339 7763634 8102335
39261 8102335 8413962 8670876 8854131 8956097 8979271 8932786 8828560 8678414 8492810 8281185
39251 8281185 8053076 7818717 7588262 7370064 7169218 6987332 6823528 6675905 6542497
39242 6542497 6421129 6308411 6198954 6085734 5961608 5820845 5659623 5475454 5266522
39233 5266522 5031805 4771902 4489998 4192633 3890383 3598229 3334800 3119730 2969549
$$ packed form
39300A2981851m30417l87227l53232l26506l04864k86465k70202k55606k42243
39291A0125089k29136k14644j96771j73782j44868j10745p4178m0236j5914q635
39281H916180k3785o2317j19720j86750k51450l01700l27879l25061k93987k40211
39271F783320j71799r6598k0285N4191J25779J93622K55152L04957L35295L38701
39261H102335L11627K56914J83255J01966K3174m6485j04226j50146j85604k11625
39251H281185k28109k34359k30455k18198k00846j81886j63804j47623j33408
39242F542497j21368j12718j09457j13220j24126j40763j61222j84169k08932
39233E266522k34717k59903k81904k97365l02250k92154k63429k15070j50181
$$ plain form
39224 2969549 2893801 2893333 2961750 3089468 3268245 3493760 3765006 4081498 4440540 4836265
39214 4836265 5260463 5704129 6158581 6615366 7064677 7492971 7881536 8207798 8449656
39205 8449656 8591075 8626200 8560063 8405839 8180308 7899780 7578066 7226599 6855627 6475223
39195 6475223 6095541 5726590 5377949 5058427 4775459 4534521 4339252 4192505 4097473 4057758
39185 4057758 4076189 4153400 4287167 4472828 4704673 4978053 5291559 5648155 6054479 6518796
39175 6518796 7048789 7649710 8322585 9062253 9855786 10682035 11512535 12313603 13049766
39166 13049766 13688636 14206616 14593758 14855782 15011896 15088147 15107437 15079226 14993623 14824088
39156 14824088 14539033 14117133 13558422 12885940 12138727 11361323 10594874 9871866 9213914
$$ packed form
39224B969549p5748m68O8417J27718J78777K25515K71246L16492L59042L95725
39214D836265M24198M43666M54452M56785M49311M28294L88565L26262K41858
39205H449656J41419L5125o6137j54224k25531k80528l21714l51467l70972l80404
39195F475223l79682l68951l48641l19522k82968k40938j95269j46747r5032l9715
39185D057758J8431P7211J33767J85661K31845K73380L13506L56596M06324M64317
39175F518796N29993O00921O72875P39668P93533Q26249Q30500Q01068P36163
39166A3049766O38870N17980L87142K62024J56114P6251J9290k8211q5603j69535
39156A4824088k85055m21900n58711o72482p47213p77404p66449p23008o57952
$$ plain form
39147 9213914 8631489 8125069 7687599 7307934 6974553 6678782 6416824 6190208 6004663
39138 6004663 5868112 5788709 5773540 5827733 5953512 6149161 6408318 6719802 7067900 7433490
39128 7433490 7796763 8141201 8456548 8738281 8983466 9185808 9333223 9409487 9399311 9294817
39118 9294817 9100758 8835831 8529000 8212510 7915061 7658184 7456430 7319930 7257143 7276149
39108 7276149 7384065 7585505 7881632 8270836 8750585 9319169 9976478 10724039 11564743
39099 11564743 12501814 13536180 14662404 15865060 17117781 18385711 19630217 20814174
39091 20814174 21906784 22887528 23748582 24494740 25140388 25704150 26202394 26642685 27018445
39082 27018445 27307229 27475668 27491823 27340553 27033918 26610760 26126486 25639667 25202120
$$ packed form
39147I213914n82425n06420m37470l79665l33381k95771k61958k26616j85545
39138F004663j36551p9403j5169N4193J25779J95649K59157L11484L48098L65590
39128G433490L63273L44438L15347K81733K45185K02342J47415P6264j0176j04494
39118I294817j94059k64927l06831l16490k97449k56877k01754j36500o2787J9006
39108G276149J07916K01440K96127L89204M79749N68584O57309P47561Q40704
39099A1564743R37071J034366J126224J202656J252721J267930J244506J183957
39091B0814174J092610R80744Q61054P46158O45648N63762M98244M40291L75760
39082B7018445K88784J68439J6155j51270l06635m23158m84274m86819m37547
$$ plain form
39073 25202120 24854869 24628565 24545876 24624034 24876291 25311616 25932902 26734984 27703853 28817453
39063 28817453 30047279 31359788 32717473 34080310 35407919 36661627 37805639 38807908
39055 38807908 39642288 40291706 40749411 41015337 41088332 40959109 40608938 40015585 39163670
39046 39163670 38054524 36711118 35175919 33502789 31746515 29954194 28161081 26391122
39038 26391122 24660529 22982071 21368081 19831106 18382478 17030273 15778465 14628190
39030 14628190 13580395 12637973 11805667 11087660 10484348 9990198 9593610 9278342 9025535
39021 9025535 8815710 8630692 8455515 8279936 8098931 7912030 7721906 7532956 7350146
39012 7350146 7178172 7020862 6880941 6760067 6659025 6578166 6518195 6481185 6471180 6493891
$$ packed form
39073B5202120l47251k26304q2689P8158K52257M35325O21286Q02082R68869J113600
39063B8817453J229826J312509J357685J362837J327609J253708J144012J002269
39055C8807908Q34380O49418M57705K65926P2995j29223l50171n93353q51915
39046C9163670j109146j343406j535199j673130j756274j792321j793113j769959
39038B6391122j730593j678458j613990j536975j448628j352205j251808j150275
39030A4628190j047795r42422q32306p18007o03312m94150l96588l15268k52807
39021I025535k09825j85018j75177j75579j81005j86901j90124j88950j82810
39012G350146j71974j57310j39921j20874j01042q0859n9971l7010j0005K2711
$$ plain form
39002 6493891 6555596 6661878 6816928 7023688 7284466 7601441 7976550 8410966 8904843 9457923
38992 9457923 10070833 10746255 11489127 12305824 13203070 14187576 15266623 16448720 17742969
38983 17742969 19156484 20690635 22337911 24080927 25893933 27746071 29605199 31441144
38975 31441144 33227350 34940365 36557840 38057213 39417310 40622670 41667331 42554164
38967 42554164 43289071 43873731 44302488 44566496 44663267 44605904 44426128 44168906 43881431 43602171
38957 43602171 43354950 43149456 42985859 42859704 42764171 42689422 42621078 42540444 42427621 42266134
38947 42266134 42046038 41762888 41412435 40984198 40458719 39811533 39022669 38086839 37019184
38938 37019184 35854288 34639592 33426323 32261170 31181010 30211438 29368425 28661643
$$ packed form
39002F493891O1705J06282J55050K06760K60778L16975L75109M34416M93877N53080
38992I457923O12910O75422P42872Q16697Q97246R84506J079047J182097J294249
38983A7742969J413515J534151J647276J743016J813006J852138J859128J835945
38975C1441144J786206J713015J617475J499373J360097J205360J044661Q86833
38967D2554164P34907N84660M28757K64008R6771n7363j79776k57222k87475k79260
38957D3602171k47221k05494j63597j26155r5533p4749o8344q0634j12823j61487
38947D2266134k20096k83150l50453m28237n25479o47186p88864r35830j067655
38938C7019184j164896j214696j213269j165153j080160r69572q43013p06782
$$ plain form
38930 28661643 28098048 27684632 27429457 27340687 27424180 27681005 28106200 28689268 29415940 30269934
38920 30269934 31233296 32284706 33396605 34533188 35651210 36704116 37648303 38449441
38912 38449441 39086750 39553749 39854835 39998372 39988732 39820995 39481305 38952943 38224707 37297117
38902 37297117 36184033 34910485 33509137 32017080 30473112 28914854 27375591 25881590
38894 25881590 24450975 23094529 21817716 20622595 19508645 18472461 17507189 16602765
38886 16602765 15747629 14931488 14147704 13393856 12670247 11977639 11315884 10684197 10082540
38877 10082540 9512894 8979364 8486847 8038933 7636174 7275482 6950596 6653241 6374862
38868 6374862 6108715 5851534 5603833 5368724 5150345 4953179 4782411 4644461 4546666 4495792
$$ packed form
38930B8661643n63595m13416k55175q8770Q3493K56825M25195N83068P26672Q53994
38920C0269934R63362J051410J111899J136583J118022J052906R44187Q01138
38912C8449441O37309M66999L01086J43537r640j67737l39690n28362p28236r27590
38902C7297117j113084j273548j401348j492057j543968j558258j539263j494001
38894B5881590j430615j356446j276813j195121j113950j036184r65272r04424
38886A6602765q55136q16141p83784p53848p23609o92608o61755o31687o01657
38877A0082540n69646n33530m92517m47914m02759l60692l24886k97355k78379
38868F374862k66147k57181k47701k35109k18379j97166j70768j37950r7795n0874
$$ plain form
38858 4495792 4495787 4545716 4638898 4763827 4906578 5053739 5194839 5323698 5438440 5540296 5631664
38847 5631664 5714342 5788802 5854777 5912547 5963898 6011916 6059602 6108023 6155031 6195310 6221954
38836 6221954 6229159 6215011 6183087 6142075 6103746 6080346 6082244 6115874 6181917 6274331 6381345
38825 6381345 6488594 6583152 6656452 6704941 6728768 6729889 6710680 6673276 6619135 6548589 6460907
38814 6460907 6355506 6234014 6101663 5966541 5836601 5716205 5604501 5496848 5388489
38805 5388489 5278094 5168977 5067493 4980062 4910826 4860830 4828061 4807351 4790082 4764641 4718512
38794 4718512 4641672 4529754 4385393 4217176 4037121 3858173 3692769 3552419 3447497 3386447
38784 3386447 3374257 3410775 3489800 3599730 3725797 3853226 3970206 4069586 4148699 4207417
$$ packed form
38858D495792nM9929R3182J24929J42751J47161J41100J28859J14742J01856R1368
38847E631664Q2678P4460O5975N7770N1351M8018M7686M8421M7008M0279K6644
38836F221954P205j4148l1924m1012l8329k3400J898L3630O6043R2414J07014
38825F381345J07249R4558P3300M8489K3827J121j9209l7404n4141p0546q7682
38814F460907j05401j21492j32351j35122j29940j20396j11704j07653j08359
38805E388489j10395j09117j01484q7431o9236m9996l2769k0710j7269k5441m6129
38794D718512p6840j11918j44361j68217j80055j78948j65404j40350j04922o1050
38784C386447j2190L6518P9025J09930J26067J27429J16980R9380P9113N8718
$$ plain form
38774 4207417 4245414 4260256 4247574 4203329 4126705 4021914 3898150 3767997 3644824 3539539
38764 3539539 3457594 3397830 3354274 3319927 3290035 3262984 3238992 3218165 3199153 3178973 3154158
38753 3154158 3122640 3084948 3043236 2998499 2948221 2886624 2807599 2708405 2591745 2465030 2337173
38742 2337173 2214575 2098438 1984746 1866641 1737597 1593711 1434276 1260936 1076502
38733 1076502 884397 688957 495847 311850 143991 -1454 -119789 -208732 -269160 -305019
38723 -305019 -321632 -322815 -308416 -273989 -213057 -120761 3072 152996 319292 490648 656792
38712 656792 810206 946718 1065389 1168067 1258668 1341858 1421163 1497264 1567707 1628668 1677938
38701 1677938 1717393 1753471 1795589 1853607 1935495 2045773 2184800 2349091 2532767 2729571
$$ packed form
38774D207417L7997J4842j2682m4245p6624j04791j23764j30153j23173j05285
38764C539539q1945n9764m3556l4347k9892k7051k3992k0827j9012k0180k4815
38753C154158l1518l7692m1712m4737n0278o1597p9025r9194j16660j26715j27857
38742B337173j22598j16137j13692j18105j29044j43886j59435j73340j84434
38733A076502j92105j95440j93110j83997j67859j45445j18335q8943o0428l5859
38723c05019j6613j183J4399L4427O0932R2296J23833J49924J66296J71356J66144
38712F56792J53414J36512J18671J02678R0601Q3190P9305P6101P0443O0961M9270
38701A677938L9455L6078M2118N8018Q1888J10278J39027J64291J83676J96804
$$ plain form
38691 2729571 2934337 3143203 3352885 3559901 3760286 3949939 4125828 4287946 4441053
38682 4441053 4594637 4760376 4948110 5162279 5400307 5653457 5909764 6157924 6390514
38673 6390514 6605031 6802326 6983338 7146084 7284858 7392519 7464689 7503209 7516657 7517853
38663 7517853 7520083 7533975 7565983 7618422 7690291 7777669 7873050 7964561 8036887 8074590 8066219 8006795
38651 8006795 7897736 7745347 7559482 7352792 7139855 6935390 6751783 6597059 6474238
38642 6474238 6381998 6315713 6268468 6232415 6200766 6169630 6138453 6108948 6083723 6065720 6058317
38631 6058317 6065060 6088492 6128441 6180715 6236907 6285539 6314242 6312300 6272940 6195012 6083698
38620 6083698 5949826 5807529 5670800 5550354 5452113 5377658 5325908 5294925 5283069 5289014 5310513
$$ packed form
38691B729571K04766K08866K09682K07016K00385J89653J75889J62118J53107
38682D441053J53584J65739J87734K14169K38028K53150K56307K48160K32590
38673F390514K14517J97295J81012J62746J38774J07661P2170L8520J3448J196
38663G517853K230J3892L2008N2439P1869Q7378R5381R1511P2326L7703q371n9424
38651H006795j09059j52389j85865k06690k12937k04465j83607j54724j22821
38642F474238r2240o6285m7245l6053l1649l1136l1177k9505k5225j8003p403
38631F058317O743K3432L9949N2274N6192M8632K8703j942l9360p7928j11314
38620F083698j33872j42297j36729j20446r8241p4455n1750l0983j1856N945K1499
$$ plain form
38609 5310513 5342611 5376755 5402267 5410003 5396224 5364342 5323666 5285964 5261439 5255409 5266735 5288685
38597 5288685 5311910 5327989 5331652 5320966 5296209 5258564 5209148 5148387 5075914 4991365 4896123
38586 4896123 4795259 4698439 4618985 4571328 4568004 4617414 4722857 4882592 5090767 5339384
38576 5339384 5621200 5932401 6273255 6645937 7050628 7481865 7926473 8363220 8764170
38567 8764170 9097885 9334259 9449787 9431589 9279235 9004471 8629382 8183303 7698671 7206389
38557 7206389 6731822 6292578 5898491 5553082 5255191 5000112 4780663 4589114 4419844
38548 4419844 4271337 4146095 4048493 3982066 3947652 3942723 3961376 3994680 4031830 4062416 4079125
38537 4079125 4079508 4065999 4044730 4024373 4015473 4029676 4078133 4169466 4308547 4496954 4734629
$$ packed form
38609E310513L2098L4144K5512P736j3779l1882m0676l7702k4525o030J1326K1950
38597E288685K3225J6079L663j0686k4757l7645m9416o0761p2473q4549r5242
38586D896123j00864r6820p9454m7657l324M9410J05443J59735K08175K48617
38576E339384K81816L11201L40854L72682M04691M31237M44608M36747M00950
38567H764170L33715K36374J15528j8198j52354k74764l75089m46079m84632m92282
38557G206389m74567m39244l94087l45409k97891k55079k19449j91549j69270
38548D419844j48507j25242r7602o6427l4414m929J8653L3304L7150L0586J6709
38537D079125L83j3509k1269k0357q900J4203M8457R1333J39081J88407K37675
$$ plain form
38526 4734629 5021507 5358075 5744598 6179188 6655295 7159752 7672706 8169916 8626442
38517 8626442 9020161 9334441 9560532 9700032 9766521 9784769 9786871 9806373 9872371 10005194
38507 10005194 10214374 10498655 10847477 11243132 11662961 12081259 12471158 12807143 13068384
38498 13068384 13241965 13324408 13320680 13241468 13100202 12910840 12686773 12440983 12187188 11940709
38488 11940709 11717546 11531433 11390654 11296593 11244497 11225396 11228218 11241980 11258066 11272040 11284013
38477 11284013 11297380 11316859 11347349 11394324 11464817 11567140 11708410 11891015 12110324 12355088
38467 12355088 12610331 12861490 13098502 13318678 13527336 13735773 13957352 14203321 14479760
38458 14479760 14786208 15116039 15458492 15801995 16137677 16461573 16774733 17081834 17389710
$$ packed form
38526D734629K86878L36568L86523M34590M76107N04457N12954M97210M56526
38517H626442L93719L14280K26091J39500O6489J8248K102J9502O5998J32823
38507A0005194K09180K84281L48822L95655M19829M18298L89899L35985K61241
38498A3068384J73581Q2443l728p9212j41266j89362k24067k45790k53795k46479
38488A1940709k23163j86113j40779r4061n2096j9101K822J3762J6086J3974J1973
38477A1284013J3367J9479L0490M6975P0493J02323J41270J82605K19309K44764
38467A2355088K55243K51159K37012K20176K08658K08437K21579K45969K76439
38458A4479760L06448L29831L42453L43503L35682L23896L13160L07101L07876
$$ plain form
38449 17389710 17706579 18041560 18403667 18800379 19236759 19715986 20240935 20815427 21443955
38440 21443955 22129739 22872321 23666418 24503044 25372549 26268042 27187748 28135713 29121173
38431 29121173 30157112 31258642 32441789 33723061 35119539 36648946 38329520 40180215
38423 40180215 42221676 44477382 46973716 49738070 52795353 56164066 59853187 63860655
38415 63860655 68173494 72768927 77615659 82675285 87904650 93259575 98698837 104186404
38407 104186404 109690945 115183660 120636227 126019737 131304080 136456792 141441133 146214327
38399 146214327 150727627 154929432 158770976 162212521 165228034 167807902 169960579 171713553
38391 171713553 173112877 174220608 175110865 175865758 176571461 177313280 178169083 179202458 180458334
$$ packed form
38449A7389710L16869L34981L62107L96712M36380M79227N24949N74492O28528
38440B1443955O85784P42582P94097Q36626Q69505Q95493R19706R47965R85460
38431B9121173J035939J101530J183147J281272J396478J529407J680574J850695
38423D0180215K041461K255706K496334K764354L057283L368713L689121M007468
38415F3860655M312839M595433M846732N059626N229365N354925N439262N487567
38407A04186404N504541N492715N452567N383510N284343N152712M984341M773194
38399A46214327M513300M201805L841544L441545L015513K579868K152677J752974
38391A71713553J399324J107731Q90257P54893P05703P41819Q55803J033375J255876
$$ plain form
38382 180458334 181962434 183722919 185730976 187959036 190359352 192867477 195411907 197925568
38374 197925568 200352665 202648383 204775193 206701713 208406180 209881151 211134451 212184767
38366 212184767 213054966 213767853 214346446 214816656 215208319 215552639 215878075 216208184 216562435
38357 216562435 216957404 217405653 217913401 218481185 219110232 219812399 220618230 221578967 222762391
38348 222762391 224245529 226107613 228425097 231268369 234698186 238759507 243472177 248820792
38340 248820792 254747917 261153847 267902986 274833692 281766687 288507743 294843919 300538858
38332 300538858 305336636 308979842 311236653 311923373 310913066 308134453 303574008 297288113
38324 297288113 289417681 280190257 269901717 258883521 247469238 235970881 224666916
$$ packed form
38382A80458334J504100J760485K008057K228060K400316K508125K544430K513661
38374A97925568K427097K295718K126810J926520J704467J474971J253300J050316
38366B12184767Q70199P12887N78593M70210L91663L44320L25436L30109L54251
38357B16562435L94969M48249N07748N67784O29047P02167Q05831R60737J183424
38348B22762391J483138J862084K317484K843272L429817M061321M712670N348615
38340B48820792N927125O405930O749139O930706O932995O741056O336176N694939
38332C00538858M797778L643206K256811O86720j010307k778613m560445o285895
38324B97288113p870432r227424j0288540j1018196j1414283j1498357j1303965
$$ plain form
38317 224666916 213797780 203564338 194127675 185610815 178102765 171663902 166331229 162123040
38309 162123040 159043458 157087240 156244251 156502652 157850284 160274440 163760402 168288659
38301 168288659 173830141 180339147 187745039 195945277 204802969 214150697 223799683 233550336
38293 233550336 243199457 252542527 261375643 269504671 276764049 283037313 288266264 292443332
38285 292443332 295595736 297776662 299070201 299601668 299538074 299071165 298389518 297653580 296983210
38276 296983210 296457389 296119283 295979786 296015888 296164071 296313538 296308398 295966480 295112305 293609458
38266 293609458 291375939 288379339 284625317 280156037 275061848 269493048 263655876 257789447
38258 257789447 252135190 246913563 242313717 238490722 235561819 233598245 232615846 232569728
$$ packed form
38317B24666916j0869136j0233442r436663q516860p508050o438863n332673m208189
38309A62123040l079582j956218q42989K58401J347632K424156L485962M528257
38301A68288659N541482O509006P405892Q200238Q857692R347728R648986R750653
38293B33550336R649121R343070Q833116Q129028P259378O273264N228951M177068
38285B92443332L152404K180926J293539N31467o3594m66909o81647p35938o70370
38276B96983210n25821l38106j39497L6102J48183J49467n140l41918q54175j502847
38266B93609458k233519k996600l754022m469280n094189n568800n837172n866429
38258B57789447n654257n221627m599846l822995k928903j963574r82399m6118
$$ plain form
38250 232569728 233354986 234811103 236726226 238841631 240862349 242480376 243408367 243410652 242317205
38241 242317205 240018815 236456846 231622767 225568666 218415221 210343476 201570268 192319576
38233 192319576 182802172 173206617 163696796 154410678 145458876 136924135 128862540 121306035
38225 121306035 114265830 107736921 101703843 96146858 91046867 86387539 82154135 78329893
38217 78329893 74891703 71807142 69034423 66525615 64231986 62109420 60122067 58243511
38209 58243511 56456082 54749511 53119911 51569094 50103566 48732532 47465083 46307401
38201 46307401 45261005 44322535 43484953 42739348 42076127 41484856 40953292 40467238 40012307
38192 40012307 39576728 39153103 38737760 38328512 37922807 37517794 37112304 36709474 36318194
$$ packed form
38250B32569728P85258J456117J915123K115405K020718J618027R27991K285j093447
38241B42317205k298390l561969m834079o054101p153445q071745q773208r250692
38233A92319576r517404r595555r509821r286118q951802q534741q061595p556505
38225A21306035p040205o528909o033078n556985n099991m659328m233404l824242
38217G8329893l438190l084561k772719k508808k293629k122566j987353j878556
38209E8243511j787429j706571j629600j550817j465528j371034j267449j157682
38201D6307401j046396r38470q37582p45605o63221n91271n31564m86054m54931
38192D0012307m35579m23625m15343m09248m05705m05013m05490m02830l91280
$$ plain form
38183 36318194 35951942 35624886 35346776 35119128 34934473 34778798 34635649 34489980 34330448
38174 34330448 34149850 33944252 33711574 33450262 33158401 32833328 32471795 32070678 31628008
38165 31628008 31143719 30619526 30057851 29460632 28828953 28163725 27466674 26740848 25990437
38156 25990437 25220202 24434709 23637452 22830303 22013981 21189771 20361725 19537957 18730082
38147 18730082 17951086 17212879 16524854 15894028 15326111 14826189 14397959 14041802 13753126
38138 13753126 13522574 13338413 13189784 13068849 12970641 12890965 12823876 12760286 12688313 12594832
38128 12594832 12467384 12296034 12075249 11805505 11493761 11152171 10795491 10438238 10092240
38119 10092240 9764628 9456632 9164075 8879769 8596728 8310649 8020925 7730434 7444379
$$ packed form
38183C6318194l66252l27056k78110k27648j84655j55675j43149j45669j59532
38174C4330448j80598k05598k32678k61312k91861l25073l61533m01117m42670
38165C1628008m84289n24193n61675n97219o31679o65228o97051p25826p50411
38156B5990437p70235p85493p97257q07149q16322q24210q28046q23768q07875
38147A8730082p78996p38207o88025o30826n67917m99922m28230l56157k88676
38138A3753126k30552j84161j48629j20935r8208p9676o7089o3590p1973r3481
38128A2594832j27448j71350k20785k69744l11744l41590l56680l57253l45998
38119A0092240l27612l07996k92557k84306k83041k86079k89724k90491k86055
$$ plain form
38110 7444379 7168460 6907168 6663210 6438211 6233453 6049382 5884069 5732065 5584857
38101 5584857 5432807 5267541 5083890 4881053 4662745 4435950 4208074 3983446 3761151
38092 3761151 3535943 3302148 3058373 2810302 2570246 2354080 2177445 2052704 1987006 1980967
38082 1980967 2027522 2111503 2210938 2300699 2357772 2366490 2321924 2230342 2106765 1970703 1841644
38071 1841644 1735654 1663850 1632677 1645274 1702685 1803961 1945215 2118867 2314303 2519915
38061 2519915 2725328 2922677 3106761 3274708 3425566 3559663 3677428 3777826 3857150 3909057
38051 3909057 3926067 3901975 3834126 3724718 3580787 3412882 3232671 3050136 2871367 2697856
38041 2697856 2527444 2356161 2180150 1997324 1808704 1618964 1435398 1265225 1112662
$$ packed form
38110G444379k75919k61292k43958k24999k04758j84071j65313j52004j47208
38101E584857j52050j65266j83651k02837k18308k26795k27876k24628k22295
38092C761151k25208k33795k43775k48071k40056k16166j76635j24741o5698o039
38082A980967M6555Q3981R9435Q9761N7073Q718m4566r1582j23577j36062j29059
38071A841644j05990p1804l1173J2597N7411J01276J41254J73652J95436K05612
38061B519915K05413J97349J84084J67947J50858J34097J17765J00398P9324N1907
38051C909057J7010k4092o7849j09408j43931j67905j80211j82535j78769j73511
38041B697856j70412j71283j76011j82826j88620j89740j83566j70173j52563
$$ plain form
38032 1112662 977799 858234 752191 660751 587489 535795 505777 492852 488942 485531 476904
38021 476904 462214 445947 436848 445383 480159 544566 635324 743646 858221 968509 1067256
38010 1067256 1151756 1223512 1286259 1343079 1393984 1435140 1459901 1461010 1432996 1373835 1285290
37999 1285290 1172022 1040200 896318 746485 596167 450538 315518 199119 112175 67590
37989 67590 77889 151655 290295 486865 727922 997470 1280629 1564919 1839100 2091374
37979 2091374 2309009 2479927 2595086 2649902 2643907 2579328 2460016 2291638 2082850 1846284
37969 1846284 1598070 1355408 1133120 941192 784829 666655 589035 554852 566718 625717
37959 625717 730514 876966 1058194 1265220 1488105 1717255 1944579 2164135 2371825 2563991
$$ packed form
38032A112662j34863j19565j06043r1440p3262n1694l0018j2925l910l411q627
38021D76904j4690j6267r099Q535L4776O4407R0758J08322J14575J10288R8747
38010A067256Q4500P1756O2747N6820N0905M1156K4761J109k8014n9161q8545
37999A285290j13268j31822j43882j49833j50318j45629j35020j16399q6944m4585
37989F7590J0299P3766J38640J96570K41057K69548K83159K84290K74181K52274
37979B091374K17635J70918J15159N4816n995o4579j19312j68378k08788k36566
37969A846284k48214k42662k22288j91928j56363j18174p7620l4183J1866N8999
37959F25717J04797J46452J81228K07026K22885K29150K27324K19556K07690J92166
$$ plain form
37949 2563991 2735642 2879727 2988316 3055148 3078100 3060287 3009356 2935461 2849006 2759306 2674510
37938 2674510 2602166 2549467 2522922 2528036 2569468 2651524 2778354 2953643 3180025 3458448 3787290
37927 3787290 4160942 4568202 4991559 5408541 5795450 6132444 6408004 6620820 6778330
37918 6778330 6892931 6977950 7045052 7103455 7160323 7221636 7292899 7378947 7482490 7602157 7731691
37907 7731691 7861187 7979585 8076684 8143795 8173603 8160270 8100269 7993641 7845058 7664119
37897 7664119 7464520 7262316 7073936 6914629 6797268 6730961 6719267 6758789 6839271 6945583
37887 6945583 7060868 7169764 7260927 7328324 7370890 7390537 7389372 7367417 7321647 7246276 7133935
37876 7133935 6977523 6772533 6519286 6224460 5901511 5569763 5251858 4969505 4738549
$$ packed form
37949B563991J71651J44085J08589O6832K2952j7813n0931p3895q6455q9700q4796
37938B674510p2344n2699k6545N114M1432Q2056J26830J75289K26382K78423L28842
37927C787290L73652M07260M23357M16982L86909L36994K75560K12816J57510
37918F778330J14601Q5019O7102N8403N6868O1313P1263Q6048J03543J19667J29534
37907G731691J29496J18398R7099O7111K9808j3333o0001j06628j48583j80939
37897G664119j99599k02204j88380j59307j17361o6307j1694L9522Q0482J06312
37887F945583J15285J08896R1163O7397M2566J9647j165k1955m5770p5371j12341
37876G133935j56412k04990k53247k94826l22949l31748l17905k82353k30956
$$ plain form
37867 4738549 4565295 4446019 4370010 4324530 4299174 4287820 4288208 4300457 4325784 4365905 4422797
37856 4422797 4498382 4593785 4708054 4836727 4971165 5099516 5209410 5291622 5343297 5369485
37846 5369485 5382271 5397865 5432955 5501739 5614265 5775823 5986821 6242983 6536130 6855877
37836 6855877 7192153 7537661 7889077 8246375 8611027 8984488 9367774 9761651 10166513
37827 10166513 10581559 11003616 11426076 11838208 12225092 12568640 12850061 13053538 13170103
37818 13170103 13200331 13154659 13051038 12910535 12752284 12589270 12426176 12259692 12080829 11878162
37808 11878162 11640922 11361388 11036556 10669224 10268322 9848072 9425936 9020049 8647246
37799 8647246 8322222 8057299 7861737 7740252 7691696 7709291 7782843 7901540 8055253 8233430
$$ packed form
37867D738549j73254j19276p6009m5480k5356j1354L88J2249K5327M0121N6892
37856D422797P5585R5403J14269J28673J34438J28351J09894Q2212N1675K6188
37846E369485J2786J5594L5090O8784J12526J61558K10998K56162K93147L19747
37836F855877L36276L45508L51416L57298L64652L73461L83286L93877M04862
37827A0166513M15046M22057M22460M12132L86884L43548K81421K03477J16565
37818A3170103L0228m5672j03621j40503j58251j63014j63094j66484j78863k02667
37808A1878162k37240k79534l24832l67332m00902m20250m22136m05887l72803
37799H647246l25024k64923j95562j21485m8556J7595P3552J18697J53713J78177
$$ plain form
37789 8233430 8422934 8607154 8767724 8887983 8956227 8967324 8922616 8828854 8696869 8540217
37779 8540217 8373574 8210719 8062493 7935509 7832105 7751240 7689761 7643860 7610777 7590396
37769 7590396 7585841 7602428 7645299 7716742 7814274 7929982 8050968 8160318 8238339 8264596 8221491
37758 8221491 8098867 7897479 7628888 7311338 6963598 6599856 6227854 5850647 5470479
37749 5470479 5092359 4725235 4380295 4067798 3794537 3563307 3374226 3226731 3121032
37740 3121032 3058442 3040841 3069903 3146587 3270885 3441520 3655330 3906413 4185526 4480286
37730 4480286 4776245 5058309 5311856 5523473 5681712 5778011 5807278 5767691 5660063 5487668
37720 5487668 5256950 4978461 4666993 4340437 4017814 3717223 3454184 3240431 3082927
$$ packed form
37789H233430J89504J84220J60570J20259O8244J1097m4708r3762j31985j56652
37779H540217j66643j62855j48226j26984j03404q0865o1479m5901l3083k0381
37769G590396m555J6587M2871P1443R7532J15708J20986J09350P8021K6257m3105
37758H221491j22624k01388k68591l17550l47740l63742l72002l77207l80168
37749E470479l78120l67124l44940l12497k73261k31230j89081j47495j05699
37740C121032o2590j7601K9062P6684J24298J70635K13810K51083K79113K94760
37730D480286K95959K82064K53547K11617J58239R6299K9267l9587j07628j72395
37720E487668k30718k78489l11468l26556l22623l00591k63039k13753j57504
$$ plain form
37711 3082927 2983113 2936645 2934020 2962077 3005992 3051240 3085229 3098527 3085596 3045080 2979778
37700 2979778 2896262 2803710 2711638 2627121 2553038 2488694 2432640 2385800 2352576 2339048 2349623
37689 2349623 2384716 2441061 2514065 2600172 2697630 2805572 2922394 3044659 3167235 3284558
37679 3284558 3392057 3486592 3565460 3624685 3657822 3656224 3611003 3516036 3370514 3179451 2951749
37668 2951749 2697024 2423082 2135204 1837308 1534324 1234656 951502 702353 506906
37659 506906 384046 348136 404834 547697 757723 1007072 1265923 1509686 1723741 1904201
37649 1904201 2054971 2183001 2294277 2392195 2478121 2552718 2616947 2672704 2723490 2775017 2835042
37638 2835042 2911849 3011610 3135737 3279653 3433848 3587152 3731176 3864289 3993594 4134114
$$ packed form
37711C082927r9814m6468k625K8057M3915M5248L3989J3298j2931m0516o5302
37700B979778q3516r2552r2072q4517p4083o4344n6054m6840l3224j3528J0575
37689B349623L5093N6345P3004Q6107R7458J07942J16822J22265J22576J17323
37679C284558J07499R4535P8868N9225L3137j598m5221r4967j45522j91063k27702
37668B951749k54725k73942k87878k97896l02984k99668k83154k49149j95447
37659E06906j22860l5910N6698J42863K10026K49349K58851K43763K14055J80460
37649A904201J50770J28030J11276R7918Q5926P4597O4229N5757N0786N1527O0025
37638B835042P6807R9761J24127J43916J54195J53304J44024J33113J29305J40520
$$ plain form
37628 4134114 4305627 4528484 4819885 5191701 5650271 6197812 6834262 7558215 8366632
37619 8366632 9254218 10213419 11234746 12306030 13409638 14518595 15594359 16589179 17453981
37610 17453981 18149294 18654065 18967469 19102482 19074825 18893609 18558855 18066783 17419109
37601 17419109 16630507 15730024 14756354 13750319 12748444 11779565 10864051 10014439 9236637
37592 9236637 8531252 7894690 7319885 6797240 6316547 5869844 5453841 5070388 4724771
37583 4724771 4423089 4170204 3968807 3819065 3718105 3659177 3631063 3618792 3606230 3579950
37573 3579950 3532866 3466094 3388359 3313113 3254114 3220919 3216118 3235590 3271406 3315539 3362225
37562 3362225 3408046 3450367 3485851 3510539 3521843 3521302 3516476 3520944 3552445 3629871 3770050 3985122
$$ packed form
37628D134114J71513K22857K91401L71816M58570N47541O36450P23953Q08417
37619H366632Q87586R59201J021327J071284J103608J108957J075764R94820Q64802
37610A7453981O95313N04771L13404J35013k7657j81216l34754m92072o47674
37601A7419109p88602r00483r73670j006035j001875r68879r15514q49612p77802
37592I236637p05385o36562n74805n22645m80693m46703m16003l83453l45617
37583D724771l01682k52885k01397j49742j00960n8928k8114j2271j2562k6280
37573C579950m7084o6772p7735p5246n8999l3195m801J9472L5816M4133M6686
37562C362225M5821M2321L5484K4688J1304n41m826M468L1501P7426J40179K15072
$$ plain form
37550 3985122 4281000 4657043 5107022 5621451 6190891 6808986 7473686 8186179 8948403
37541 8948403 9760499 10618717 11513564 12427935 13335806 14202954 14991147 15665700 16203407
37532 16203407 16596031 16846229 16957933 16927674 16743190 16390611 15865550 15181201 14369049
37523 14369049 13472585 12537864 11605196 10704358 9853368 9059623 8322245 7635209 6991235
37514 6991235 6385937 5820826 5303596 4845485 4457163 4145133 3909677 3744319 3636760
37505 3636760 3571363 3532749 3509018 3493052 3481452 3472078 3461630 3444693 3414896 3367622 3302453
37494 3302453 3223528 3137634 3051608 2970832 2899375 2841150 2801109 2785453 2800015 2846946 2921391
37483 2921391 3010579 3096342 3159720 3185146 3162728 3088849 2965971 2802127 2609887 2404715
$$ packed form
37550C985122K95878L76043M49979N14429N69440O18095O64700P12493P62224
37541H948403Q12096Q58218Q94847R14371R07871Q67148P88193O74553N37707
37532A6203407L92624K50198J11704l0259j84484l52579n25061o84349q12152
37523A4369049q96464r34721r32668r00838q50990p93745p37378o87036o43974
37514F991235o05298n65111n17230m58111l88322l12030k35456j65358j07559
37505C636760o5397l8614k3731j5966j1600r374j0448j6937k9797m7274o5169
37494C302453p8925q5894q6026q0776p1457n8225m0041j5656J4562M6931P4445
37483B921391Q9188Q5763O3378K5426k2418p3879j22878j63844j92240k05172
$$ plain form
37473 2404715 2202988 2020099 1868861 1758259 1692544 1670667 1686083 1727223 1779239 1827282
37463 1827282 1860556 1875519 1876741 1875060 1883840 1914772 1974815 2065289 2182863 2321064 2471164
37452 2471164 2622881 2766145 2894281 3007046 3111292 3218309 3339037 3479757 3640580
37443 3640580 3817198 4004069 4196540 4390772 4582564 4766941 4939267 5097087 5241224
37434 5241224 5375071 5502096 5622790 5732877 5824083 5887207 5916060 5910695 5878922 5835594 5799637
37423 5799637 5789618 5819483 5896226 6020242 6187578 6392294 6627519 6885257 7156153 7430293
37413 7430293 7699000 7956915 8203745 8445390 8693863 8965419 9277110 9643159 10072712
37404 10072712 10569439 11132227 11756038 12432754 13152639 13906900 14690707 15505059 16356325
$$ packed form
37473B404715k01727j82889j51238j10602o5715k1877J5416M1140N2016M8043
37463A827282L3274J4963J222j681Q780L0932O0043R0474J17574J38201J50100
37452B471164J51717J43264J28136J12765J04246J07017J20728J40720J60823
37443C640580J76618J86871J92471J94232J91792J84377J72326J57820J44137
37434E241224J33847J27025J20694J10087R1206O3124K8853n365l1773m3328l5957
37423E799637j0019K9865P6743J24016J67336K04716K35225K57738K70896K74140
37413G430293K68707K57915K46830K41645K48473K71556L11691L66049M29553
37404A0072712M96727N62788O23811O76716P19885P54261P83807Q14352Q51266
$$ plain form
37395 16356325 17254003 18208617 19231307 20334945 21535388 22851696 24305125 25917291
37387 25917291 27707858 29692002 31878137 34266526 36848842 39607716 42514824 45526953
37379 45526953 48581247 51592250 54453675 57047281 59259857 61006548 62254621 63038776
37371 63038776 63460364 63669210 63834634 64116580 64645809 65516074 66785072 68478621 70593605
37362 70593605 73098040 75928884 78989623 82150516 85254794 88132697 90621656 92586617
37354 92586617 93933357 94611566 94611230 93959190 92719565 90994912 88921838 86658207 84365497
37345 84365497 82192847 80266932 78687356 77524919 76820844 76586680 76805221 77432170 78397656
37336 78397656 79607542 80946497 82286325 83501854 84492462 85202459 85631889 85832594 85890766
$$ packed form
37395A6356325Q97678R54614J022690J103638J200443J316308J453429J612166
37387B5917291J790567J984144K186135K388389K582316K758874K907108L012129
37379D5526953L054294L011003K861425K593606K212576J746691J248073P84155
37371F3038776M21588K08846J65424K81946N29229Q70265J268998J693549K114984
37362G0593605K504435K830844L060739L160893L104278K877903K488959J964961
37354I2586617J346740O78209l36o52040j239625j724653k073074k263631k292710
37345H4365497k172650j925915j579576j162437p04075k34164K18541O26949R65486
37336G8397656J209886J338955J339828J215529R90608P09997M29430K00705N8172
$$ plain form
37327 85890766 85902688 85951756 86092837 86346916 86706306 87148071 87650163 88202935 88810829 89485074
37317 89485074 90234394 91061872 91970864 92975274 94105658 95405424 96917724 98668337
37309 98668337 100650429 102815455 105072701 107298336 109352312 111098968 112426540 113262235
37301 113262235 113581405 113410330 112822474 111928435 110860434 109752640 108719477 107835391 107120991
37292 107120991 106540592 106013562 105436635 104708995 103750736 102510266 100963797 99113941 96991375
37283 96991375 94657232 92200522 89727181 87342355 85130995 83141845 81377905 79794758
37275 79794758 78307747 76808558 75189440 73368995 71310584 69026579 66568507 64009792
37267 64009792 61429419 58901241 56489019 54244930 52209426 50411127 48866261 47578227
$$ packed form
37327H5890766J1922M9068J41081K54079L59390M41765N02092N52772O07894O74245
37317H9485074P49320Q27478R08992J004410J130384J299766J512300J750613
37309I8668337J982092K165026K257246K225635K053976J746656J327572Q35695
37301A13262235L19170j71075n87856q94039j068001j107794j033163q84086p14400
37292A07120991n80399n27030n76927p27640r58259j240470j546469j849856k122566
37283I6991375k334143k456710k473341k384826k211360j989150j763940j583147
37275G9794758j487011j499189j619118j820445k058411k284005k458072k558715
37267F4009792k580373k528178k412222k244089k035504j798299j544866j288034
$$ plain form
37259 47578227 46538759 45731673 45138280 44742191 44532041 44502515 44654890 44997389 45544668
37250 45544668 46316000 47332748 48616109 50185656 52058484 54248567 56766293 59618509
37242 59618509 62809556 66343249 70225003 74462619 79064411 84034303 89364798 95029790
37234 95029790 100979640 107140971 113423007 119730516 125980591 132117740 138121741 144005655
37226 144005655 149805314 155563370 161310756 167048718 172736404 178289859 183594606 188526670
37218 188526670 192971615 196833013 200030170 202493132 204163964 205006674 205020195 204246173
37210 204246173 202766350 200688935 198126330 195169160 191864694 188208992 184157924 179653187
37202 179653187 174651752 169146355 163171210 156795872 150114764 143238065 136284130 129370094
$$ packed form
37259D7578227j039468q07086n93393l96089k10150k9526J52375L42499N47279
37250D5544668P71332J016748J283361J569547J872828K190083K517726K852216
37242E9618509L191047L533693L881754M237616M601792M969892N330495N664992
37234I5029790N949850O161331O282036O307509O250075O137149O004001N883914
37226A44005655N799659N758056N747386N737962N687686N553455N304747M932064
37218A88526670M444945L861398L197157K462962J670832Q42710J3521p74022
37210B04246173j479823k077415k562605k957170l304466l655702m051068m504737
37202A79653187n001435n505397n975145o375338o681108o876699o953935o914036
$$ plain form
37194 129370094 122598679 116043928 109741950 103692069 97869290 92243554 86797803 81537580
37186 81537580 76489628 71692462 67184689 62995780 59141276 55622291 52428282 49541641
37178 49541641 46942352 44611089 42529677 40679060 39036252 37572683 36255611 35052486
37170 35052486 33936212 32888807 31901753 30972904 30101559 29284234 28513126 27777452 27066208
37161 27066208 26370805 25686838 25014877 24360144 23731103 23137421 22587892 22088702 21642031
37152 21642031 21245063 20889792 20564190 20255080 19952344 19652921 19362362 19092495 18855827
37143 18855827 18659366 18500877 18369134 18247512 18118758 17968634 17787342 17569069 17311036
37134 17311036 17013249 16679136 16316091 15934674 15546049 15158758 14776535 14398261 14019934
$$ packed form
37194A29370094o771415o554751o301978o049881n822779n625736n445751n260223
37186H1537580n047952m797166m507773m188909l854504l518985l194009k886641
37178D9541641k599289k331263k081412j850617j642808j463569j317072j203125
37170C5052486j116274j047405r87054r28849q71345q17325p71108p35674p11244
37161B7066208o95403o83967o71961o54733o29041n93682n49529m99190m46671
37152B1642031l96968l55271l25602l09110l02736k99423k90559k69867k36668
37143A8855827j96461j58489j31743j21622j28754j50124j81292k18273k58033
37134A7311036k97787l34113l63045l81417l88625l87291l82223l78274l78327
$$ plain form
37125 14019934 13637806 13251565 12866239 12491471 12137929 11812442 11514391 11234923 10958805
37116 10958805 10667832 10344866 9977829 9562652 9104163 8614690 8111247 7612489 7136183
37107 7136183 6697301 6306613 5969694 5686333 5450544 5251625 5076643 4913824 4755367
37098 4755367 4598220 4442774 4291033 4145906 4011727 3894654 3801558 3737454 3702828 3692589
37088 3692589 3697542 3707777 3716186 3720208 3721255 3723040 3730418 3749101 3785140 3843086 3923317 4020360
37076 4020360 4123782 4221391 4303018 4363203 4402302 4426300 4445572 4472608 4519264 4594701 4704686
37065 4704686 4851661 5034520 5248069 5483238 5728710 5973164 6206738 6421195 6609580
37056 6609580 6766288 6887590 6972044 7020462 7035696 7022530 6987512 6938303 6882383 6825510 6770423
$$ packed form
37125A4019934l82128l86241l85326l74768l53542l25487k98051k79468k76118
37116A0958805k90973l22966l67037m15177m58489m89473n03443m98758m76306
37107G136183m38882l90688l36919k83361k35789j98919j74982j62819j58457
37098D755367j57147j55446j51741j45127j34179j17073r3096o4104l4626j0239
37088C692589M953J0235Q409M022J047J785P378J8683L6039N7946Q0231R7043
37076D020360J03422R7609Q1627O0185L9099K3998J9272K7036M6656P5437J09985
37065D704686J46975J82859K13549K35169K45472K44454K33574K14457J88385
37056F609580J56708J21302Q4454M8418J5234j3166l5018m9209n5920n6873n5087
$$ plain form
37045 6770423 6716314 6659385 6594638 6518217 6429021 6328746 6220992 6111015 6006718 5919546
37035 5919546 5863293 5850447 5887870 5974339 6101122 6254999 6422352 6593182 6764150 6939634
37025 6939634 7130077 7347951 7603117 7899705 8235866 8606231 9005896 9434184 9896526
37016 9896526 10403340 10966236 11593315 12286102 13039889 13847132 14701389 15599062 16538311
37007 16538311 17517291 18534277 19589969 20689824 21844521 23068723 24379682 25796528
36999 25796528 27340046 29032680 30898988 32966568 35266495 37831771 40693089 43872743
36991 43872743 47378644 51199853 55303290 59629708 64087293 68543766 72821182 76699873
36983 76699873 79937305 82302888 83621945 83814938 82916803 81068287 78482985 75403381
$$ packed form
37045F770423n4109n6929o4747p6421q9196j00275j07754j09977j04297q7172
37035E919546n6253j2846L7423Q6469J26783J53877J67353J70830J70968J75484
37025F939634J90443K17874K55166K96588L36161L70365L99665M28288M62342
37016I896526N06814N62896O27079O92787P53787Q07243Q54257Q97673R39249
37007A6538311R78980J016986J055692J099855J154697J224202J310959J416846
36999B5796528J543518J692634J866308K067580K299927K565276K861318L179654
36991D3872743L505901L821209M103437M326418M457585M456473M277416L878691
36983G6699873L237432K365583J319057J92993q98135j848516k585302l079604
$$ plain form
36975 75403381 72061036 68650652 65319868 62171366 59272414 56667327 54388784 52464732
36967 52464732 50919873 49773618 49038038 48718451 48816971 49337476 50289896 51692638 53573150
36958 53573150 55967239 58917481 62470703 66674800 71575461 77212784 83616837 90800694
36950 90800694 98749640 107405257 116643942 126251558 135899051 145127370 153354844 159923906
36942 159923906 164197797 165693819 164208328 159876719 153137541 144618748 134999179 124896767
36934 124896767 114806893 105086455 95966896 87579823 79983559 73184441 67151743 61828302
36926 61828302 57139309 53000700 49327691 46042902 43082143 40395773 37945705 35700782
36918 35700782 33633834 31721572 29945939 28294642 26759933 25336596 24020830 22810544
$$ packed form
36975G5403381l342345l410384l330784l148502k898952k605087k278543j924052
36967E2464732j544859j146255p35580l19587R8520N20505R52420J402742J880512
36958E3573150K394089K950242L553222M204097M900661N637323O404053P183857
36950I0800694P948946Q655617R238685R607616R647493R228319Q227474O569062
36942A59923906M273891J496022j485491m331609o739178q518793r619569j0102412
36934A24896767j0089874r720438r119559q387073p596264o799118o032698n323441
36926F1828302m688993m138609l673009l284789k960759k686370k450068k244923
36918C5700782k066948j912262j775633j651297j534709j423337j315766j210286
$$ plain form
36910 22810544 21705965 20708872 19820025 19035976 18346954 17736759 17184661 16668765 16169910
36901 16169910 15674893 15177878 14679770 14186404 13706797 13252017 12834337 12465984 12157306
36892 12157306 11914942 11740888 11633028 11586949 11598057 11662895 11779321 11946134 12162942 12430186
36882 12430186 12748606 13117753 13534058 13989331 14470152 14958092 15430701 15863368 16232053
36873 16232053 16516399 16702335 16783144 16758335 16630751 16403555 16078983 15659566 15150592 14561967
36863 14561967 13908430 13208412 12482053 11748647 11023748 10316845 9630624 8962199 8305704
36854 8305704 7655425 7008847 6369148 5746303 5156045 4616737 4145415 3754834 3452508
36845 3452508 3241148 3118978 3079082 3108611 3189195 3298956 3415174 3516656 3585803 3610751
$$ packed form
36910B2810544j104579r97093q88847p84049o89022o10195n52098n15896m98855
36901A6169910m95017m97015m98108m93366m79607m54780m17680l68353l08678
36892A2157306k42364j74054j07860m6079J1108O4838J16426J66813K16808K67244
36882A2430186L18420L69147M16305M55273M80821M87940M72609M32667L68685
36873A6232053K84346J85936Q0809k4809j27584k27196l24572m19417n08974n88625
36863A4561967o53537p00018p26359p33406p24899p06903o86221o68425o56495
36854H305704o50279o46578o39699o22845n90258n39308m71322l90581l02326
36845C452508k11360j22170l9896K9529Q0584J09761J16218J01482O9147K4948
$$ plain form
36835 3610751 3587197 3518829 3415634 3290340 3154271 3014339 2872489 2727642 2578553 2425631
36825 2425631 2271039 2117831 1969143 1827617 1694793 1570635 1453628 1341509 1232057
36816 1232057 1123368 1013562 900329 780652 650908 507456 347928 173117 -11322
36807 -11322 -194469 -361668 -497524 -589367 -630409 -622114 -575084 -507682 -442221 -399577 -393758
36796 -393758 -428052 -494362 -576532 -656724 -721998 -767924 -798033 -820145 -841894 -867506 -896969
36785 -896969 -927571 -956528 -983030 -1008786 -1037330 -1073060 -1120659 -1185106 -1271854 -1386232 -1531320
36774 -1531320 -1704988 -1898537 -2099081 -2295128 -2481693 -2661193 -2839471 -3019825 -3198963
36765 -3198963 -3366878 -3510063 -3616070 -3677594 -3694910 -3676159 -3635511 -3589899 -3555485 -3544873 -3565517
$$ packed form
36835C610751k3554o8368j03195j25294j36069j39932j41850j44847j49089j52922
36825B425631j54592j53208j48688j41526j32824j24158j17007j12119j09452
36816A232057j08689j09806j13233j19677j29744j43452j59528j74811j84439
36807a1322j83147j67199j35856r1843m1042Q295M7030O7402O5461M2644N819
36796c93758l4294o6310q2170q0192o5274m5926l0109k2112k1749k5612k9463
36785h96969l0602k8957k6502k5756k8544l5730m7599o4447q6748j14378j45088
36774a531320j73668j93549k00544j96047j86565j79500j78278j80354j79138
36765c198963j67915j43185j06007o1524j7316J8751M0648M5612L4414J0612k0644
$$ plain form
36754 -3565517 -3619301 -3703093 -3809967 -3930631 -4054452 -4169860 -4264441 -4325391 -4340805 -4301780
36744 -4301780 -4204624 -4052081 -3852679 -3618283 -3361059 -3091353 -2817035 -2543793 -2275603 -2015056
36734 -2015056 -1763833 -1523478 -1296387 -1086688 -900672 -746409 -632273 -564465 -544159 -565453
36724 -565453 -615206 -675123 -725305 -747887 -729633 -663067 -546246 -381600 -174501 67834 336989
36713 336989 623882 919523 1215731 1505357 1781831 2038245 2266389 2456328 2597175 2679205
36703 2679205 2696512 2648871 2541896 2385540 2191560 1970965 1732417 1482087 1224552 963773
36693 963773 703645 448201 201582 -32226 -249634 -447107 -620293 -763580 -870932 -937739
36683 -937739 -962589 -948261 -901903 -834519 -759679 -691533 -642573 -621608 -632501 -674274 -742957
$$ packed form
36754c565517n3784q3792j06874j20664j23821j15408r4581o0950j5414L9025
36744d301780R7156J52543J99402K34396K57224K69706K74318K73242K68190K60547
36734b015056K51223K40355K27091K09699J86016J54263J14136O7808K0306k1294
36724e65453m9753n9917n0182k2582J8254O6566J16821J64646K07099K42335K69155
36713C36989K86893K95641K96208K89626K76474K56414K28144J89939J40847Q2030
36703B679205J7307m7641j06975j56356j93980k20595k38548k50330k57535k60779
36693I63773k60128k55444k46619k33808k17408j97473j73186j43287j07352o6807
36683i37739k4850J4328M6358O7384P4840O8146M8960K0965j0893m1773o8683
$$ plain form
36672 -742957 -834483 -946832 -1079768 -1232161 -1398712 -1568515 -1726651 -1858068 -1951591 -2002240
36662 -2002240 -2011349 -1985248 -1933377 -1866281 -1793731 -1723348 -1660044 -1606283 -1562727 -1528828 -1503130
36651 -1503130 -1483267 -1465843 -1446448 -1419946 -1380997 -1324756 -1247859 -1149692 -1033473 -906224 -776960
36640 -776960 -653792 -541734 -442700 -357503 -288126 -238644 -214633 -221997 -266059 -350986 -479196
36629 -479196 -650453 -860772 -1101645 -1360197 -1620637 -1866839 -2085449 -2268665 -2415753 -2532454
36619 -2532454 -2628150 -2711853 -2788920 -2859952 -2922083 -2971652 -3006773 -3028800 -3042551 -3055861 -3078839
36608 -3078839 -3122606 -3197160 -3308646 -3457069 -3635544 -3831545 -4030026 -4217583 -4386044 -4533598
36598 -4533598 -4662779 -4776695 -4876109 -4959209 -5023850 -5070588 -5104609 -5135461 -5174453 -5230664 -5307232
$$ packed form
36672g42957r1526j12349j32936j52393j66551j69803j58136j31417r3523n0649
36662b002240r109K6101N1871O7096P2550P0383O3304N3761M3556L3899K5698
36651a503130J9863J7424J9395K6502L8949N6241P6897R8167J16219J27249J29264
36640g76960J23168J12058R9034Q5197O9377M9482K4011p364m4062q4927j28210
36629d79196j71257k10319k40873k58552k60440k46202k18610j83216j47088j16701
36619b532454r5696q3703p7067p1032o2131m9569l5121k2027j3751j3310k2978
36608c078839m3767p4554j11486j48423j78475j96001j98481j87557j68461j47554
36598d533598j29181j13916r9414q3100o4641m6738l4021l0852l8992n6211p6568
$$ plain form
36587 -5307232 -5399668 -5496965 -5584756 -5648994 -5679038 -5669869 -5623334 -5548000 -5457363 -5367152 -5293012
36576 -5293012 -5248957 -5245783 -5288605 -5374196 -5490065 -5616856 -5733822 -5825245 -5884765 -5915481 -5925935
36565 -5925935 -5924294 -5913955 -5892406 -5853024 -5788061 -5691210 -5559327 -5393570 -5199968 -4988825 -4772618
36554 -4772618 -4563162 -4369571 -4197909 -4052114 -3935169 -3849866 -3798906 -3784095 -3804753 -3856296
36544 -3856296 -3930314 -4016420 -4104586 -4186168 -4253213 -4297435 -4310734 -4287607 -4227602 -4135395 -4017931
36533 -4017931 -3880706 -3725837 -3552798 -3360566 -3149733 -2924079 -2691629 -2464709 -2258545
36524 -2258545 -2088706 -1968533 -1907494 -1910559 -1978145 -2106027 -2285002 -2500754 -2734905 -2967775
36514 -2967775 -3182130 -3366236 -3514997 -3629173 -3713395 -3773466 -3813348 -3832778 -3826962 -3789238 -3715716
$$ packed form
36587e307232r2436r7297q7791o4238l0044R169M6535P5334R0637R0211P4140
36576e293012M4055L174m2822q5591j15869j26791j16966r1423n9520l0716j0454
36565e925935J641J0339K1549L9382O4963R6851J31883J65757J93602K11143K16207
36554d772618K09456J93591J71662J45795J16945Q5303N0960J4811k0658n1543
36544c856296p4018q6106q8166q1582o7045m4222j3299K3127O0005R2207J17464
36533d017931J37225J54869J73039J92232K10833K25654K32450K26920K06164
36524b258545J69839J20173O1039l065o7586j27882j78975k15752k34151k32870
36514b967775k14355j84106j48761j14176q4222o0071l9882j9430N816L7724P3522
$$ plain form
36503 -3715716 -3609321 -3480560 -3344356 -3214956 -3102214 -3011225 -2944612 -2905013 -2896044 -2921732
36493 -2921732 -2985408 -3088578 -3229766 -3403695 -3601651 -3813280 -4028696 -4239251 -4436477 -4610567
36483 -4610567 -4750335 -4845390 -4889370 -4882142 -4829540 -4740822 -4625333 -4490098 -4339325 -4175609
36473 -4175609 -4001837 -3822510 -3643775 -3472331 -3314051 -3173097 -3051714 -2950378 -2868036 -2802535
36463 -2802535 -2751384 -2712640 -2685299 -2668834 -2662178 -2662933 -2667345 -2670833 -2668433 -2654804 -2624248 -2571355
36451 -2571355 -2492441 -2387140 -2259105 -2115143 -1963114 -1809916 -1660983 -1521535 -1398338 -1300255
36441 -1300255 -1236859 -1215943 -1241376 -1312232 -1423108 -1564873 -1725290 -1889650 -2042163 -2168638
36431 -2168638 -2260002 -2315230 -2342156 -2355458 -2372322 -2407259 -2467986 -2553702 -2655816 -2760165 -2849717
$$ packed form
36503c715716J06395J28761J36204J29400J12742R0989O6613L9599Q969k5688
36493b921732o3676j03170j41188j73929j97956k11629k15416k10555j97226j74090
36483d610567j39768r5055m3980P228N2602Q8718J15489J35235J50773J63716
36473d175609J73772J79327J78735J71444J58280J40954J21383J01336Q2342O5501
36463b802535N1151L8744K7341J6465O656p55m412l488K400J3629L0556N2893
36451b571355P8914J05301J28035J43962J52029J53198J48933J39448J23197R8083
36441a300255O3396K0916k5433p0856j10876j41765j60417j64360j52513j26475
36431b168638r1364n5228k6926j3302j6864l4937o0727q5716j02114j04349q9552
$$ plain form
36420 -2849717 -2907344 -2918607 -2874312 -2772435 -2618970 -2427374 -2216352 -2006389 -1816103 -1659475
36410 -1659475 -1544143 -1470564 -1432368 -1418606 -1417705 -1421449 -1426901 -1435447 -1449784 -1470626 -1494918 -1516639
36398 -1516639 -1529879 -1532410 -1527581 -1523561 -1530644 -1558198 -1612401 -1695088 -1803459 -1930416 -2065566
36387 -2065566 -2197239 -2315527 -2415540 -2499161 -2573908 -2648935 -2730044 -2816372 -2900485 -2971724 -3020823
36376 -3020823 -3043368 -3040650 -3018116 -2982736 -2940687 -2896221 -2851844 -2809453 -2771655 -2742374 -2726209
36365 -2726209 -2726802 -2745192 -2779149 -2823692 -2872287 -2918055 -2954737 -2977453 -2983203 -2971035 -2941969 -2899021
36353 -2899021 -2847352 -2794021 -2746635 -2710920 -2688208 -2674467 -2661925 -2642846 -2613542 -2576348 -2538521
36342 -2538521 -2508968 -2494814 -2499533 -2523120 -2563558 -2618279 -2684698 -2759848 -2839899 -2920173 -2995375
$$ packed form
36420b849717n7627j1263M4295J01877J53465J91596K11022K09963J90286J56628
36410a659475J15332P3579L8196J3762R01l744n452q546j4337k0842k4292k1721
36398a516639j3240k531M829M020p083k7554n4203q2687j08371j26957j35150
36387b065566j31673j18288j00013q3621p4747p5027q1109q6328q4113p1239m9099
36376c020823k2545K718K2534L5380M2049M4466M4377M2391L7798K9281J6165
36365b726209n93j8390l3957m4543m8595m5768l6682k2716n750J2168K9066M2948
36353b899021N1669N3331M7386L5715K2712J3741J2542J9079K9304L7194L7827
36342b538521K9553J4154m719k3587m0438n4721o6419p5150q0051q0274p5202
$$ plain form
36331 -2995375 -3059463 -3105198 -3124241 -3108471 -3052249 -2954783 -2821764 -2665573 -2503383 -2353129
36321 -2353129 -2228746 -2136925 -2076745 -2041738 -2022838 -2011110 -1999895 -1986227 -1971147 -1958628 -1953352
36310 -1953352 -1958199 -1972640 -1993027 -2014847 -2035807 -2058048 -2088409 -2136924 -2214339 -2329529 -2487408
36299 -2487408 -2687846 -2925714 -3191776 -3474114 -3759933 -4037568 -4298032 -4535385 -4745972
36290 -4745972 -4927368 -5077794 -5196000 -5281168 -5332747 -5350644 -5335975 -5291982 -5224293 -5140195 -5047415
36279 -5047415 -4953268 -4864376 -4786364 -4722963 -4674977 -4640183 -4614612 -4594458 -4577389 -4562683 -4550322
36268 -4550322 -4539617 -4527976 -4510626 -4481707 -4436273 -4371987 -4289361 -4190317 -4075873 -3944371 -3791511
36257 -3791511 -3612387 -3404484 -3169856 -2915327 -2650980 -2388283 -2139190 -1916296 -1732784
$$ packed form
36331b995375o4088m5735j9043J5770N6222R7466J33019J56191J62190J50254
36321b353129J24383R1821O0180L5007J8900J1728J1215J3668J5080J2519N276
36310a953352m847j4441k0387k1820k0960k2241l0361m8515p7415j15190j57879
36299b487408k00438k37868k66062k82338k85819k77635k60464k37353k10587
36290d745972j81396j50426j18206q5168n1579j7897J4669M3993O7689Q4098R2780
36279e047415R4147Q8892P8012O3401M7986L4794K5571K0154J7069J4706J2361
36268d550322J0705J1641J7350K8919M5434O4286Q2626R9044J14444J31502J52860
36257c791511J79124K07903K34628K54529K64347K62697K49093K22894J83512
$$ plain form
36248 -1732784 -1600719 -1527741 -1514029 -1551651 -1626871 -1724217 -1830526 -1937640 -2042994 -2148007
36238 -2148007 -2255209 -2365707 -2478290 -2590195 -2698757 -2803122 -2905399 -3010465 -3123939
36229 -3123939 -3248835 -3382622 -3516596 -3638168 -3734925 -3798270 -3825010 -3816973 -3779946 -3723021 -3658081
36218 -3658081 -3598521 -3556804 -3541561 -3555524 -3595199 -3652438 -3717059 -3779061 -3829437 -3859758 -3861712
36207 -3861712 -3827587 -3751601 -3631251 -3467948 -3266832 -3036052 -2785796 -2527195 -2271303 -2028413
36197 -2028413 -1807704 -1616750 -1460326 -1338815 -1247558 -1178190 -1121457 -1069829 -1018696 -966483
36187 -966483 -914539 -866980 -829877 -809457 -809955 -832347 -874744 -934188 -1008432 -1096193 -1195490 -1301391
36175 -1301391 -1405239 -1496407 -1565792 -1609039 -1627689 -1627709 -1616262 -1598607 -1576857 -1551184 -1522326 -1493492
$$ packed form
36248a732784J32065P2978J3712l7622p5220r7346j06309j07114j05354j05013
36238b148007j07202j10498j12583j11905j08562j04365j02277j05066j13474
36229c123939j24896j33787j33974j21572r6757o3345k6740Q037L7027N6925O4940
36218c658081N9560M1717J5243j3963l9675n7239o4621o2002n0376l0321j954
36207c861712L4125P5986J20350J63303K01116K30780K50256K58601K55892K42890
36197b028413K20709J90954J56424J21511R1257O9368N6733N1628N1133N2213
36187i66483N1944M7559L7103K0420m98k2392m2397n9444p4244q7761r9297j05901
36175a301391j03848r1168o9385m3247j8650k0J1447J7655K1750K5673K8858K8834
$$ plain form
36163 -1493492 -1470444 -1460045 -1468602 -1501036 -1560879 -1650311 -1769605 -1915995 -2082653 -2258689 -2430771
36152 -2430771 -2586220 -2716469 -2819348 -2899175 -2964746 -3026331 -3092971 -3170955 -3263488 -3370950
36142 -3370950 -3490837 -3617095 -3739536 -3844649 -3918702 -3952413 -3945047 -3905554 -3849812 -3795104 -3754313
36131 -3754313 -3732220 -3725131 -3723474 -3715826 -3692508 -3647687 -3580129 -3493209 -3394308 -3293152 -3199106 -3118454
36119 -3118454 -3053096 -3001269 -2959623 -2925275 -2896628 -2872633 -2851312 -2829187 -2802576 -2770023 -2733717
36108 -2733717 -2698279 -2667316 -2639788 -2608194 -2559370 -2477630 -2349405 -2168071 -1937240 -1671146
36098 -1671146 -1392011 -1125470 -895428 -719359 -604804 -548193 -536779 -553266 -581239 -609284
36088 -609284 -632554 -651826 -670811 -693097 -720123 -751032 -783888 -816939 -848930 -878608 -904064
$$ packed form
36163a493492K3048J0399q557l2434n9843q9432j19294j46390j66658j76036j72082
36152b430771j55449j30249j02879p9827o5571o1585o6640p7984r2533j07462
36142c370950j19887j26258j22441j05113p4053l3711P366L9493N5742N4708M0791
36131c754313K2093P089J657P648K3318M4821O7558Q6920R8901J01156R4046Q0652
36119c118454O5358N1827M1646L4348K8647K3995K1321K2125K6611L2553L6306
36108b733717L5438L0963K7528L1594M8824Q1740J28225J81334K30831K66094
36098a671146K79135K66541K30042J76069J14555N6611J1414j6487k7973k8045
36088f09284k3270j9272j8985k2286k7026l0909l2856l3051l1991k9678k5456
$$ plain form
36077 -904064 -922150 -927783 -913299 -868660 -783316 -649367 -464687 -234641 28065 305151 575684
36066 575684 819584 1020729 1168363 1256434 1281984 1244335 1145726 992390 794510 564558
36056 564558 314947 56363 -202637 -455244 -695918 -919950 -1122798 -1299357 -1444186 -1553536
36046 -1553536 -1628466 -1676812 -1711998 -1748875 -1798913 -1867332 -1953304 -2052516 -2160378 -2274221 -2393483
36035 -2393483 -2517986 -2645293 -2768624 -2876480 -2954320 -2987646 -2965215 -2881077 -2735055 -2532311
36025 -2532311 -2283048 -2002524 -1710580 -1429806 -1182539 -987765 -858956 -803057 -820329 -904623
36015 -904623 -1043955 -1221377 -1416360 -1606910 -1772442 -1897056 -1972556 -2000279 -1990742 -1960724
36005 -1960724 -1928610 -1909863 -1914206 -1944888 -1999352 -2070711 -2149681 -2226559 -2292614 -2340628 -2365218
$$ packed form
36077i04064j8086n633J4484M4639Q5344J33949J84680K30046K62706K77086K70533
36066E75684K43900K01145J47634Q8071K5550l7649r8609j53336j97880k29952
36056E64558k49611k58584k59000k52607k40674k24032k02848j76559j44829j09350
36046a553536p4930m8346l5186l6877n0038o8419q5972r9212j07862j13843j19262
36035b393483j24503j27307j23331j07856p7840l3326K2431Q4138J46022K02744
36025b532311K49263K80524K91944K80774K47267J94774J28809N5899j7272q4294
36015i04623j39332j77422j94983j90550j65532j24614p5500k7723R537L0018
36005a960724L2114J8747m343l0682n4464p1359p8970p6878o6055m8014k4590
$$ plain form
35994 -2365218 -2363740 -2337818 -2294414 -2245178 -2203905 -2183428 -2193554 -2240472 -2326630 -2450274 -2605292
35983 -2605292 -2782569 -2972814 -3169026 -3367008 -3564136 -3757918 -3945395 -4123202 -4287552
35974 -4287552 -4433911 -4556595 -4648724 -4702896 -4712685 -4674640 -4589986 -4465131 -4310454 -4137575
35964 -4137575 -3956276 -3772610 -3589137 -3406850 -3227361 -3054120 -2892318 -2747717 -2624887
35955 -2624887 -2525593 -2448217 -2388621 -2341690 -2302432 -2266303 -2229645 -2191027 -2153031 -2122843 -2110512
35944 -2110512 -2125412 -2172753 -2251944 -2357353 -2480653 -2613417 -2748862 -2882413 -3011329 -3134029
35934 -3134029 -3249642 -3358058 -3460308 -3558616 -3655299 -3750333 -3838580 -3908684 -3945105 -3932814 -3862230
35923 -3862230 -3731832 -3547651 -3320903 -3065650 -2797424 -2532552 -2287387 -2076931 -1912883
$$ packed form
35994b365218J478K5922M3404M9236M1273K0477j0126m6918q6158j23644j55018
35983b605292j77277j90245j96212j97982j97128j93782j87477j77807j64350
35974d287552j46359j22684r2129n4172r789L8045Q4654J24855J54677J72879
35964d137575J81299J83666J83473J82287J79489J73241J61802J44601J22830
35955b624887R9294P7376N9596M6931L9258L6129L6658L8618L7996L0188J2331
35944b110512j4900m7341p9191j05409j23300j32764j35445j33551j28916j22700
35934c134029j15613j08416j02250r8308r6683r5034q8247p0104l6421J2291P0584
35923c862230J30398J84181K26748K55253K68226K64872K45165K10456J64048
$$ plain form
35914 -1912883 -1801675 -1743406 -1732300 -1758318 -1808671 -1868466 -1921146 -1950091 -1941936 -1890375 -1798581
35903 -1798581 -1679111 -1551491 -1438307 -1360818 -1334946 -1368470 -1460162 -1601300 -1779371 -1982552
35893 -1982552 -2202848 -2436251 -2680305 -2931203 -3182518 -3425863 -3652204 -3852687 -4019199
35884 -4019199 -4145537 -4229178 -4272402 -4281552 -4264728 -4229355 -4180765 -4121783 -4052843 -3972537 -3878713
35873 -3878713 -3769657 -3644642 -3503571 -3346403 -3173082 -2983962 -2780051 -2562686 -2333141
35864 -2333141 -2093325 -1848031 -1607608 -1388823 -1212477 -1098523 -1060953 -1104431 -1223349 -1403149
35854 -1403149 -1623483 -1862265 -2099118 -2317214 -2503767 -2650199 -2752431 -2810740 -2828766 -2812086
35844 -2812086 -2767331 -2702251 -2626011 -2548603 -2479001 -2423119 -2383333 -2360292 -2355755 -2374183 -2421850
$$ packed form
35914a912883J11208N8269J1106k6018n0353n9795n2680k8945Q155N1561R1794
35903a798581J19470J27620J13184P7489K5872l3524r1692j41138j78071k03181
35893a982552k20296k33403k44054k50898k51315k43345k26341k00483j66512
35884d019199j26338q3641m3224r150J6824L5373M8590N8982O8940Q0306R3824
35873c878713J09056J25015J41071J57168J73321J89120K03911K17365K29545
35864b333141K39816K45294K40423K18785J76346J13954L7570m3478j18918j79800
35854a403149k20334k38782k36853k18096j86553j46432j02232n8309j8026J6680
35844b812086M4755O5080P6240P7408O9602N5882L9786K3041M537j8428m7667
$$ plain form
35833 -2421850 -2504114 -2622513 -2773034 -2946127 -3128362 -3304985 -3462147 -3587901 -3672226 -3707315
35823 -3707315 -3689000 -3618732 -3504366 -3358435 -3194445 -3023381 -2852626 -2687563 -2533944 -2398664
35813 -2398664 -2288135 -2205522 -2148903 -2111606 -2084450 -2058652 -2028116 -1990500 -1947332 -1903672 -1867438
35802 -1867438 -1848059 -1854332 -1892047 -1962387 -2061825 -2183608 -2320269 -2466327 -2620144 -2784151
35792 -2784151 -2963311 -3162471 -3383650 -3624243 -3876687 -4129649 -4370254 -4586613 -4769990
35783 -4769990 -4916227 -5026186 -5105003 -5160004 -5197649 -5220555 -5225984 -5206713 -5153976 -5061011 -4925602
35772 -4925602 -4750985 -4545500 -4321679 -4094867 -3881262 -3695607 -3549167 -3448617 -3395850 -3388456
35762 -3388456 -3420632 -3484547 -3572185 -3677357 -3797089 -3931552 -4082467 -4251009 -4436563 -4636549
$$ packed form
35833b421850q2264j18399j50521j73093j82235j76623j57162j25754q4325l5089
35823c707315J8315P0268J14366J45931J63990J71064J70755J65063J53619J35280
35813b398664J10529Q2613N6619L7297K7156K5798L0536L7616M3168M3660L6234
35802a867438J9379o273l7715p0340r9438j21783j36661j46058j53817j64007
35792b784151j79160j99160k21179k40593k52444k52962k40605k16359j83377
35783d769990j46237j09959p8817n5001l7645k2906n429J9271N2737R2965J35409
35772d925602J74617K05485K23821K26812K13605J85655J46440J00550N2767P394
35762c388456l2176o3915q7638j05172j19732j34463j50915j68542j85554j99986
$$ plain form
35752 -4636549 -4846333 -5058359 -5261033 -5438895 -5574865 -5653889 -5666500 -5611127 -5494647 -5331024
35742 -5331024 -5138268 -4934621 -4735366 -4551443 -4390012 -4256047 -4153591 -4085533 -4051716 -4046405
35732 -4046405 -4057000 -4065622 -4053469 -4005909 -3915572 -3782182 -3610183 -3406483 -3179859 -2941661
35722 -2941661 -2706229 -2489830 -2308295 -2174454 -2096520 -2077612 -2116011 -2205478 -2335453 -2491433
35712 -2491433 -2656360 -2813540 -2950590 -3062619 -3152692 -3229005 -3300354 -3372484 -3447175 -3524024
35702 -3524024 -3603233 -3687329 -3780754 -3888058 -4012317 -4154619 -4313900 -4486124 -4663126 -4832761
35692 -4832761 -4981419 -5097970 -5176982 -5219533 -5231491 -5220328 -5192041 -5149470 -5092522 -5019890 -4931212
35681 -4931212 -4828621 -4717056 -4603433 -4495362 -4400113 -4323895 -4270981 -4242635 -4236803 -4249395 -4276581
$$ packed form
35752d636549k09784k12026k02674j77862j35970p9024j2611N5373J16480J63623
35742e331024J92756K03647J99255J83923J61431J33965J02456O8058L3817N311
35732d046405j0595q622J2153M7560R0337J33390J71999K03700K26624K38198
35722b941661K35432K16399J81535J33841P7934J8908l8399q9467j29975j55980
35712b491433j64927j57180j37050j12029r0073p6313p1349p2130p4691p6849
35702c524024p9209q4096r3425j07304j24259j42302j59281j72224j77002j69635
35692d832761j48658j16551p9012m2551j1958J1163K8287M2571N6948P2632Q8678
35681d931212J02591J11565J13623J08071R5249P6218N2914K8346N832j2592k7186
$$ plain form
35670 -4276581 -4316217 -4367214 -4427547 -4492865 -4557095 -4614876 -4664460 -4709447 -4758411 -4822723 -4913762
35659 -4913762 -5040526 -5207797 -5414508 -5652548 -5906797 -6157021 -6381241 -6559573 -6677574
35650 -6677574 -6728438 -6713542 -6641044 -6522803 -6370705 -6193841 -5997567 -5784337 -5555251 -5311354
35640 -5311354 -5054761 -4790422 -4528488 -4285503 -4082239 -3938033 -3864380 -3861472 -3919221 -4021387
35630 -4021387 -4150105 -4288986 -4424475 -4545928 -4644830 -4713604 -4744592 -4729892 -4662392 -4537773
$$ packed form
35670d276581l9636n0997o0333o5318o4230n7781m9584m4987m8964o4312r1039
35659d913762j26764j67271k06711k38040k54249k50224k24220j78332j18001
35650f677574n0864J4896P2498J18241J52098J76864J96274K13230K29086K43897
35640e311354K56593K64339K61934K42985K03264J44206P3653K908n7749j02166
35630d021387j28718j38881j35489j21453r8902o8774l0988J4700O7500J24619
$$ [...]
##END NTUPLES=NMR SPECTRUM
##END=
