##TITLE=31Pdec_DE-59_TFA
 DMSO-d6
 64 sc
 24.6.2024
##JCAMPDX= 6.0         $$ Bruker NMR JCAMP-DX V2.0
##DATA TYPE= NMR SPECTRUM
##DATA CLASS= NTUPLES
##ORIGIN= UXNMR, Bruker Analytische Messtechnik GmbH
##OWNER= root
$$ XWIN-NMR		Version 3.5
$$ Mon Jun 24 16:03:55 2024 Russian Standard Time (UT+4h)  she@DPX200
##.OBSERVE FREQUENCY= 81.013821
##.OBSERVE NUCLEUS= ^31P
##.ACQUISITION MODE= SIMULTANEOUS
##.ACQUISITION SCHEME= undefined
##.AVERAGES= 64
##.DIGITISER RES= 16
##SPECTROMETER/DATA SYSTEM= spect
##.PULSE SEQUENCE= zgpg30
##.SOLVENT NAME= CDCl3
##.SHIFT REFERENCE= (INTERNAL, CDCl3, 0, 248.564)
##AUDIT TRAIL= $$ (NUMBER, WHEN, WHO, WHERE, WHAT)
$$ ##TITLE= Audit trail, XWIN-NMR		Version 3.5
$$ ##JCAMPDX= 5.01
$$ ##ORIGIN= Bruker BioSpin GmbH
$$ ##OWNER= she
$$ F:/spectra/data/she/nmr/P31/1/pdata/1/auditp.txt
$$ ##AUDIT TRAIL=  $$ (NUMBER, WHEN, WHO, WHERE, WHAT)
(   1,<2024-06-24 16:03:04.04 +0400>,<she>,<DPX200>,
      <created by zg, POWCHK disabled, PULCHK disabled
       configuration hash MD5:
       00 E9 B6 7A A2 85 ED C7 34 08 36 98 17 FE 4E 26
       data hash MD5: 32K
       EA 8A DC 47 9D D8 2F F0 B9 C4 89 FD 53 27 53 F8>)
(   2,<2024-06-24 16:03:06.39 +0400>,<she>,<DPX200>,
      <Start of raw data processing
       efp BC_mod = 2 LB = 10 FT_mod = 6 PKNL = 1 PHC0 = -237.9421 PHC1 = 180.4 SI = 64K 
       data hash MD5: 64K
       64 4B 35 7D 37 1B 72 41 53 CF 19 EC AD FC 04 A1>)
(   3,<2024-06-24 16:03:22.70 +0400>,<she>,<DPX200>,
      <pk PHC0 = 154.2371 PHC1 = 0 
       data hash MD5: 64K
       9A 28 FC DE 83 BF 27 3E DC 8F 9F CF DC CD AC 8B>)
(   4,<2024-06-24 16:03:26.62 +0400>,<she>,<DPX200>,
      <abs ABSG = 5 
       data hash MD5: 64K
       2E 96 C4 F8 3F 77 C1 2A CE E2 96 F1 1B EF 67 BE>)
$$ ##END=
$$ 
$$ hash MD5
$$ 4C 85 3A 20 51 DA 3F E0 CF 63 53 04 4A 84 34 DC
##$RELAX= 
##$RELAX= 
##$RELAX= 
##$RELAX= 
##$RELAX= 
##$RELAX= 
##$RELAX= 
##$RELAX= 
##$RELAX= 
$$ Bruker specific parameters
$$ --------------------------
##$DU= <F:/spectra>
##$EXPNO= 1
##$NAME= <P31>
##$PROCNO= 1
##$TYPE= <nmr>
##$USER= <she>
##$AMP= (0..31)
100 100 100 100 100 100 100 100 100 100 100 100 100 100 100 100 100 100 
100 100 100 100 100 100 100 100 100 100 100 100 100 100 
##$AQSEQ= 0
##$AQ_mod= 1
##$AUNM= <au_zg>
##$AUTOPOS= <>
##$BF1= 81.014009
##$BF2= 200.13
##$BF3= 200.13
##$BF4= 200.13
##$BF5= 200.13
##$BF6= 200.13
##$BF7= 200.13
##$BF8= 200.13
##$BYTORDA= 1
##$CFDGTYP= 0
##$CFRGTYP= 5
##$CHEMSTR= <none>
##$CNST= (0..31)
1 1 145 1 1 1 1 1 1 1 1 1 1 1 1 1 1 1 1 1 1 1 1 1 1 1 1 1 1 1 1 1 
##$CPDPRG= <waltz16>
##$CPDPRG1= <>
##$CPDPRG2= <waltz16>
##$CPDPRG3= <>
##$CPDPRG4= <mlev>
##$CPDPRG5= <mlev>
##$CPDPRG6= <mlev>
##$CPDPRG7= <mlev>
##$CPDPRG8= <mlev>
##$CPDPRGB= <>
##$CPDPRGT= <>
##$D= (0..31)
0 1 0 0 0 0 0 0 0 0 0 0.03 2e-05 3e-06 0 0 0 0 0 0 0 0 0 0 0 0 0 0 0 0 
0 0 
##$DATE= 1719230583
##$DBL= (0..7)
120 120 120 11 120 120 24 19 
##$DBP= (0..7)
150 150 150 150 150 150 150 150 
##$DBP07= 0
##$DBPNAM0= <>
##$DBPNAM1= <>
$$ [...]
##$SUBNAM3= <"">
##$SUBNAM4= <"">
##$SUBNAM5= <"">
##$SUBNAM6= <"">
##$SUBNAM7= <"">
##$SUBNAM8= <"">
##$SUBNAM9= <"">
##$SW= 501.771253377433
##$SWIBOX= (0..15)
0 1 3 0 0 0 0 0 0 0 0 0 0 0 0 0 
##$SW_h= 40650.406504065
##$TD= 32768
##$TD0= 1
##$TE= 0
##$TE2= 300
##$TE3= 300
##$TEG= 300
##$TL= (0..7)
0 120 53 12 22 120 120 120 
##$TP= (0..7)
150 150 150 150 150 150 150 150 
##$TP07= 0
##$TPNAME0= <>
##$TPNAME1= <>
##$TPNAME2= <>
##$TPNAME3= <>
##$TPNAME4= <>
##$TPNAME5= <>
##$TPNAME6= <>
##$TPNAME7= <>
##$TPOAL= (0..7)
0.5 0.5 0.5 0.5 0.5 0.5 0.5 0.5 
##$TPOFFS= (0..7)
0 0 0 0 0 0 0 0 
##$TUNHIN= 0
##$TUNHOUT= 0
##$TUNXOUT= 0
##$USERA1= <user>
##$USERA2= <user>
##$USERA3= <user>
##$USERA4= <user>
##$USERA5= <user>
##$V9= 5
##$VALIST= <valist>
##$VCLIST= <CCCCCCCCCCCCCCC>
##$VD= 0
##$VDLIST= <DDDDDDDDDDDDDDD>
##$VPLIST= <PPPPPPPPPPPPPPP>
##$VTLIST= <TTTTTTTTTTTTTTT>
##$WBST= 1024
##$WBSW= 4
##$XGAIN= (0..3)
0 0 0 0 
##$XL= 0
##$YL= 0
##$YMAX_a= 8078
##$YMIN_a= -2055
##$ZGOPTNS= <>
##$ZL1= 120
##$ZL2= 120
##$ZL3= 120
##$ZL4= 120
##$ABSF1= 248.5645
##$ABSF2= -253.2056
##$ABSG= 5
##$ABSL= 3
##$ALPHA= 0
##$AQORDER= 0
##$ASSFAC= 0
##$ASSFACI= 0
##$ASSFACX= 0
##$ASSWID= 0
##$AUNMP= <proc_1d>
##$AZFE= 0.1
##$AZFW= 0.5
##$BCFW= 0
##$BC_mod= 2
##$BYTORDP= 0
##$COROFFS= 0
##$CY= -3
##$DATMOD= 1
##$DC= 0
##$DFILT= <>
##$DTYPP= 0
##$F1P= 0
##$F2P= 0
##$FCOR= 1
##$FTSIZE= 65536
##$FT_mod= 6
##$GAMMA= 0
##$GB= 0
##$INTBC= 1
##$INTSCL= 6.047779e-11
##$ISEN= 30
##$LB= 10
##$LEV0= 0
##$LPBIN= 0
##$MAXI= 10000
##$MC2= 0
##$MEAN= 0
##$ME_mod= 0
##$MI= 50
##$NCOEF= 0
##$NC_proc= -11
##$NLEV= 6
##$NOISF1= 182.463
##$NOISF2= 159.3651
##$NSP= 0
##$NTH_PI= 0
##$NZP= 0
##$OFFSET= 248.5645
##$PC= 4
##$PHC0= -83.70499
##$PHC1= 180.4
##$PH_mod= 1
##$PKNL= yes
##$PPARMOD= 0
##$PSCAL= 0
##$PSIGN= 0
##$REVERSE= no
##$SF= 81.0140089999694
##$SI= 65536
##$SIGF1= 159.3651
##$SIGF2= -187.1042
##$SINO= 113.3802
##$SIOLD= 16384
##$SREGLST= <1H.CDCl3>
##$SSB= 0
##$STSI= 65536
##$STSR= 0
##$SW_p= 40650.406504065
##$SYMM= 0
##$S_DEV= 0
##$TDeff= 32768
##$TDoff= 0
##$TI= <>
##$TILT= no
##$TM1= 0
##$TM2= 0
##$TOPLEV= 0
##$USERP1= <user>
##$USERP2= <user>
##$USERP3= <user>
##$USERP4= <user>
##$USERP5= <user>
##$WDW= 1
##$XDIM= 65536
##$YMAX_p= 306238373
##$YMIN_p= -94475343
$$ End of Bruker specific parameters
$$ ---------------------------------
##NTUPLES= NMR SPECTRUM
##VAR_NAME=  FREQUENCY,     SPECTRUM/REAL,   SPECTRUM/IMAG
##SYMBOL=    X,             R,               I
##VAR_TYPE=  INDEPENDENT,   DEPENDENT,       DEPENDENT
##VAR_FORM=  AFFN,          ASDF,            ASDF
##VAR_DIM=   65536,         65536,           65536
##UNITS=     HZ,            ARBITRARY UNITS, ARBITRARY UNITS
##FACTOR=    0.620285442955139, 1,           1
##FIRST=     20137.2065510682, 0,            0
##LAST=      -20513.1999529968, 0,           0
##MIN=       -20513.1999529968, -94475343,   0
##MAX=       20137.2065510682, 306238373,    0
$$ Real data points
##PAGE= N=1
##DATA TABLE= (X++(R..R)), XYDATA
$$ [...]
14166 15949947 12542277 8653247 4433180 65935 -4238677 -8258764 -11787433 -14668836
14158 -14668836 -16825736 -18261271 -19033197 -19216803 -18877945 -18067317 -16831050 -15223645 -13313358
14149 -13313358 -11181946 -8927206 -6670706 -4560750 -2757481 -1399120 -565338 -258973
14141 -258973 -414860 -925902 -1668290 -2516237 -3351297 -4077120 -4642408 -5061985 -5420283 -5847157
14131 -5847157 -6469779 -7359870 -8503915 -9816349 -11192689 -12576332 -14005737 -15619985
14123 -15619985 -17618350 -20184645 -23399975 -27176861 -31245491 -35203767 -38614693 -41113269
14115 -41113269 -42481170 -42662728 -41724187 -39786793 -36975249 -33406816 -29213550 -24567083
14107 -24567083 -19680460 -14787777 -10123305 -5916173 -2390654 255357 1906374 2594568
14099 2594568 2524843 2028030 1458924 1093601 1076309 1428918 2099636 3017217 4128453 5411148
14089 5411148 6862816 8471158 10180807 11876419 13396622 14576606 15298671 15521988
14081 15521988 15273128 14604431 13551214 12119332 10308381 8147193 5714417 3136286
14073 3136286 569383 -1826362 -3925151 -5675378 -7119867 -8377071 -9588742 -10862645
14065 -10862645 -12238912 -13689707 -15143706 -16521327 -17769200 -18884272 -19917203 -20948107
14057 -20948107 -22039757 -23188834 -24301787 -25211256 -25729331 -25718300 -25153607 -24154847 -22968405
14048 -22968405 -21902236 -21234431 -21128748 -21584593 -22434487 -23389772 -24124436 -24371475 -23994010
14039 -23994010 -23001319 -21510095 -19680981 -17666770 -15592111 -13564005 -11699313 -10148796
14031 -10148796 -9096472 -8724278 -9154625 -10401318 -12356817 -14822251 -17563189 -20363620
14023 -20363620 -23055991 -25521351 -27670399 -29423632 -30703038 -31436349 -31568747 -31077886
14015 -31077886 -29990197 -28395121 -26451410 -24378178 -22424643 -20819042 -19710556 -19130178
14007 -19130178 -18993392 -19146049 -19429247 -19728966 -19988633 -20188214 -20314476 -20348575 -20277728 -20113765
13997 -20113765 -19895364 -19667620 -19453915 -19239558 -18974029 -18585713 -18001316 -17167486 -16073450
13988 -16073450 -14767692 -13356750 -11980064 -10770291 -9818861 -9159293 -8763188 -8537527 -8324421
13979 -8324421 -7918181 -7108904 -5740158 -3753207 -1195175 1812047 5124673 8623029
13971 8623029 12227557 15882430 19526264 23073554 26416052 29437810 32035247 34138844
13963 34138844 35732393 36859048 37604066 38059070 38290547 38336447 38232758 38044113 37865143
13954 37865143 37781668 37814088 37880375 37801775 37345836 36282500 34430514 31685599 28033858
13945 28033858 23555495 18419288 12865816 7179722 1654097 -3448067 -7926946 -11661890
13937 -11661890 -14604687 -16759344 -18166807 -18903643 -19086211 -18866602 -18416721 -17905524 -17472622
13928 -17472622 -17199489 -17087125 -17056587 -16980991 -16736893 -16248639 -15505299 -14550708 -13464336
13919 -13464336 -12350872 -11340734 -10587620 -10247237 -10435283 -11180790 -12399315 -13903575 -15450689
13910 -15450689 -16805542 -17791375 -18307078 -18310459 -17786285 -16726571 -15142455 -13102191 -10764338
13901 -10764338 -8373208 -6211739 -4537933 -3533727 -3274861 -3719318 -4720091 -6069636
13893 -6069636 -7561491 -9034157 -10374850 -11496237 -12318156 -12771669 -12817684 -12464320 -11775803
13884 -11775803 -10873831 -9931073 -9151945 -8737240 -8837689 -9510619 -10695805 -12220623 -13835559
13875 -13835559 -15272691 -16312009 -16835233 -16849682 -16475627 -15901843 -15321548 -14868564 -14579793
13866 -14579793 -14402273 -14237087 -13988757 -13592071 -13013717 -12243972 -11288773 -10160059 -8862828
13857 -8862828 -7388343 -5726582 -3898025 -1984728 -131799 1494819 2776383 3693892
13849 3693892 4333094 4846079 5402286 6156453 7233518 8714574 10618948 12896143 15442021
13840 15442021 18134772 20869538 23572874 26194640 28687999 30989388 33004545 34603024
13832 34603024 35624751 35904294 35315057 33822511 31519552 28616562 25384190 22080845
13824 22080845 18905366 15987795 13398420 11152180 9208729 7484442 5882848 4331065
13816 4331065 2804598 1332271 -17064 -1161007 -2036406 -2627560 -2977120 -3172863 -3314952
13807 -3314952 -3476974 -3674626 -3851668 -3890169 -3648748 -3020176 -1981292 -602749 992170
13798 992170 2695006 4461793 6313525 8289252 10384210 12514306 14529037 16259432
13790 16259432 17563474 18340700 18520442 18051591 16915355 15157325 12915538 10419986
13782 10419986 7954028 5790029 4126854 3053950 2549477 2504185 2759608 3151977 3552851
13773 3552851 3895313 4178380 4452329 4797032 5306832 6086283 7246477 8886737 11060809
13764 11060809 13746991 16842381 20179826 23549251 26713309 29425139 31457554 32638994
13756 32638994 32883413 32205011 30712949 28582621 26009080 23163353 20174752 17142795
13748 17142795 14159186 11315928 8690989 6321339 4181898 2186359 214627 -1842974
13740 -1842974 -4044116 -6372348 -8739456 -11005155 -13002519 -14562021 -15535314 -15823916
13732 -15823916 -15411875 -14389564 -12949520 -11343577 -9811034 -8507993 -7473164 -6648019
13724 -6648019 -5937362 -5273030 -4646717 -4103254 -3709800 -3522308 -3562518 -3810213 -4211961 -4704395
13714 -4704395 -5244355 -5833044 -6522163 -7398269 -8552545 -10049365 -11904446 -14076362 -16471325
13705 -16471325 -18960468 -21405862 -23685122 -25703330 -27389835 -28688703 -29554031 -29955003
13697 -29955003 -29888727 -29395706 -28569718 -27550982 -26495990 -25532174 -24720190 -24045845 -23445369
13688 -23445369 -22846016 -22196272 -21471178 -20658576 -19746330 -18728031 -17626321 -16512203 -15495067
13679 -15495067 -14679054 -14110460 -13750318 -13487457 -13180875 -12711149 -12027853 -11183911 -10341605
13670 -10341605 -9735601 -9599184 -10087115 -11234032 -12962634 -15121676 -17519939 -19939045
13662 -19939045 -22137860 -23875695 -24965845 -25339730 -25083795 -24422704 -23653111 -23060039 -22855788
13653 -22855788 -23164329 -24040667 -25488540 -27447985 -29764050 -32179800 -34383313 -36092457
13645 -36092457 -37132189 -37471231 -37213711 -36553590 -35700424 -34797300 -33871683 -32854582 -31660770
13636 -31660770 -30276357 -28794621 -27382433 -26208873 -25383417 -24928816 -24783303 -24817335 -24861426
13627 -24861426 -24749821 -24374742 -23728664 -22909833 -22084496 -21423102 -21040290 -20964313 -21144120
13618 -21144120 -21480005 -21851556 -22126606 -22159406 -21799405 -20919101 -19446453 -17381704 -14793537
13609 -14793537 -11803894 -8569862 -5263940 -2054698 905367 3481533 5555757 7034105
13601 7034105 7864550 8055079 7680007 6869460 5784811 4588211 3417084 2371822 1516206
13592 1516206 883607 486330 333022 453793 916062 1809658 3201681 5090324 7389776
13583 7389776 9951511 12598998 15149951 17420133 19224217 20394143 20820304 20496289
13575 20496289 19534362 18131893 16500429 14792981 13063593 11273242 9334637 7174121
13567 7174121 4783447 2240785 -302942 -2661026 -4655885 -6160390 -7127282 -7600965
13559 -7600965 -7710887 -7648249 -7625313 -7818883 -8313898 -9076141 -9973851 -10839713 -11542239 -12033977
13549 -12033977 -12356444 -12599884 -12839647 -13089707 -13305921 -13434012 -13462138 -13438734 -13448317 -13567299
13539 -13567299 -13826914 -14197680 -14594901 -14895961 -14959859 -14646645 -13841497 -12485804 -10607253
13530 -10607253 -8334203 -5884033 -3525596 -1523781 -77823 731409 966928 819025
13522 819025 546240 393974 523484 978476 1696570 2553141 3416188 4192575 4852341 5425216
13512 5425216 5971652 6538353 7114915 7611607 7873659 7730673 7058330 5820103 4069243
13503 4069243 1916317 -514242 -3114913 -5803655 -8516809 -11200099 -13807146 -16306023
13495 -16306023 -18689569 -20984828 -23256285 -25596994 -28106768 -30864317 -33900826 -37175970
13487 -37175970 -40557725 -43818858 -46668488 -48820353 -50072258 -50360532 -49768278 -48490597
13479 -48490597 -46775900 -44865504 -42947527 -41130373 -39432573 -37784802 -36043539 -34017135
13471 -34017135 -31503212 -28334347 -24425120 -19805555 -14622484 -9103232 -3499389 1960330
13463 1960330 7091919 11758805 15870812 19386218 22312836 24704277 26655691 28304965
13455 28304965 29834550 31458162 33382329 35753100 38611737 41877331 45360636 48806526
13447 48806526 51956705 54610783 56655706 58051488 58794344 58890868 58356981 57230574 55583238
13438 55583238 53525224 51199046 48753882 46301138 43868512 41377944 38664104 35532696
13430 35532696 31840548 27566706 22842870 17927792 13136647 8756964 4986900 1918207
13422 1918207 -439291 -2117563 -3161820 -3619498 -3534032 -2936309 -1844468 -283924 1679971
13413 1679971 3918882 6244793 8441648 10317078 11757748 12764396 13448342 13994652
13405 13994652 14616805 15520978 16875661 18775196 21203244 24019821 26989921 29847433
13397 29847433 32366320 34406284 35913666 36884307 37319038 37206191 36542064 35368240 33791601
13388 33791601 31968684 30064697 28215625 26517923 25048367 23891605 23144270 22883168
13380 22883168 23117760 23764069 24661043 25618296 26467250 27094998 27454688 27551905 27409558
13371 27409558 27024621 26342080 25266770 23709888 21643505 19133480 16337896 13476809
13363 13476809 10786521 8470456 6657720 5380732 4579057 4126013 3865735 3648555 3359225
13354 3359225 2936683 2382418 1752304 1130474 593360 180703 -110822 -309299 -439102
13345 -439102 -500482 -463280 -268765 163330 915988 2042503 3537816 5338148 7352773
13336 7352773 9502508 11734455 14006233 16258518 18398615 20304308 21844726 22910712
13328 22910712 23444214 23452115 22994075 22152721 21012654 19668033 18245991 16908785 15812823
13319 15812823 15045216 14582952 14302310 14029753 13605985 12938911 12031293 10975568 9917850
13310 9917850 9008023 8361859 8054039 8140728 8689696 9789073 11520720 13912852 16905766
13301 16905766 20355667 24072958 27869855 31593336 35134567 38420406 41400252 44041758
13293 44041758 46339142 48322750 50053283 51597332 52999700 54270501 55389233 56313472
13285 56313472 56982844 57322173 57253286 56717067 55696235 54226328 52388253 50285847 48021271
13276 48021271 45683074 43350982 41103889 39012378 37114169 35393274 33783994 32198448
13268 32198448 30557790 28811126 26940073 24951865 22862517 20676682 18377975 15937329
13260 15937329 13329617 10542452 7574692 4438161 1172865 -2132968 -5339869 -8285177
13252 -8285177 -10833035 -12918837 -14563814 -15857621 -16926250 -17902446 -18903405 -20014970
13244 -20014970 -21285212 -22728737 -24333428 -26059752 -27836359 -29566449 -31149826 -32506935
13236 -32506935 -33587984 -34364319 -34811702 -34895671 -34566172 -33768221 -32469977 -30695321 -28537464
13227 -28537464 -26138538 -23643416 -21154712 -18714630 -16320677 -13960920 -11644785 -9411814
13219 -9411814 -7316106 -5396909 -3649603 -2007990 -343523 1517610 3761716 6543490
13211 6543490 9937768 13899232 18245845 22677956 26831570 30349512 32948365 34464758
13203 34464758 34873776 34278517 32874104 30896148 28571333 26088934 23602561 21255399
13195 21255399 19208229 17645409 16744382 16617513 17258137 18526277 20186815 21980541
13187 21980541 23692792 25194020 26447525 27493732 28423240 29347307 30369471 31559734
13179 31559734 32936539 34467315 36093479 37767328 39473400 41215855 42981811 44710098
13171 44710098 46287034 47567731 48409173 48706493 48430486 47657979 46575939 45444516 44527960
13162 44527960 44026002 44038794 44574359 45579963 46970374 48639846 50464389 52307016 54027124
13153 54027124 55481560 56509453 56916214 56488146 55053108 52562664 49145143 45093006
13145 45093006 40788339 36603293 32818625 29587454 26945219 24843819 23183043 21829862
13137 21829862 20637242 19472793 18245931 16910991 15441008 13793214 11892200 9639000
13129 9639000 6937474 3726776 12158 -4113698 -8466860 -12789086 -16781898 -20150677
13121 -20150677 -22650724 -24127045 -24541192 -23981398 -22652424 -20839733 -18848166 -16930964
13113 -16930964 -15237284 -13798853 -12553249 -11384746 -10167201 -8806024 -7278779 -5663321
13105 -5663321 -4134878 -2922343 -2236093 -2198027 -2805636 -3944189 -5435442 -7093481 -8759864
13096 -8759864 -10308535 -11631384 -12622602 -13172704 -13172395 -12522452 -11148357 -9020559 -6178195
13087 -6178195 -2747616 1057420 4962766 8682867 11971859 14655733 16638964 17893332
13079 17893332 18437904 18313561 17558219 16196720 14254230 11781876 8871562 5650956
13071 5650956 2272594 -1086132 -4215415 -6878436 -8845288 -9950501 -10151641 -9561439
13063 -9561439 -8434102 -7104801 -5902010 -5064283 -4690563 -4739218 -5071737 -5518886 -5939982
13054 -5939982 -6256824 -6463907 -6626223 -6868227 -7347279 -8208075 -9528277 -11275229 -13293129
13045 -13293129 -15331144 -17107145 -18382708 -19016508 -18976356 -18315699 -17134914 -15542115 -13617694
13036 -13617694 -11388291 -8825032 -5878673 -2542664 1090175 4816035 8366508 11488840
13028 11488840 14016778 15900431 17191888 18005488 18476650 18735115 18893780 19042621 19237952
13019 19237952 19491519 19775258 20048407 20290169 20509678 20721022 20900799 20961346 20762598
13010 20762598 20159785 19063001 17480758 15530609 13414019 11362216 9567520 8123667
13002 8123667 7000799 6066316 5138576 4046175 2670476 964119 -1049201 -3281950
12994 -3281950 -5587411 -7764864 -9581894 -10825633 -11369412 -11219884 -10516454 -9483175 -8357318
12985 -8357318 -7324753 -6484798 -5853362 -5395921 -5069129 -4849808 -4740162 -4749085 -4859649 -5003203
12975 -5003203 -5061080 -4896264 -4393755 -3487197 -2170833 -508429 1362904 3251617 4958504
12966 4958504 6328633 7278736 7792324 7896415 7634629 7043896 6142848 4941578 3469639
12957 3469639 1799509 40180 -1701624 -3365953 -4954361 -6499691 -8009591 -9422049
12949 -9422049 -10599715 -11359770 -11518042 -10933071 -9548036 -7423080 -4737494 -1748805 1273774
12940 1273774 4104192 6580081 8598827 10113743 11141429 11768595 12137245 12398378 12648913
12931 12648913 12886542 13013194 12888288 12401530 11528112 10346391 9018993 7750010 6736553
12922 6736553 6133488 6040122 6500750 7503580 8971729 10754047 12628680 14329133 15596053
12913 15596053 16245930 16231856 15665453 14784737 13880298 13210708 12938415 13106291 13659283
12904 13659283 14496912 15526912 16690171 17946751 19239796 20467739 21484413 22121812
12896 22121812 22215274 21620681 20234197 18028144 15094096 11662210 8072834 4707011
12888 4707011 1906687 -84995 -1148559 -1277895 -542722 963278 3171399 6063391
12880 6063391 9655922 13943876 18832043 24103957 29459547 34605833 39346000 43615373
12872 43615373 47451825 50928820 54093015 56932864 59378403 61317723 62620912 63173219
12864 63173219 62915984 61877990 60175347 57978396 55469982 52822237 50197215 47754699
12856 47754699 45646984 43992515 42836443 42118993 41675162 41275948 40697318 39785963 38493270
12847 38493270 36867759 35018079 33071720 31151061 29368797 27825033 26589573 25675923
12839 25675923 25030569 24549294 24105998 23572773 22829973 21782307 20387788 18684075 16791320
12830 16791320 14886924 13164640 11792300 10875170 10429029 10370601 10535275 10725096 10773459
12821 10773459 10597231 10209664 9693515 9162505 8740528 8559516 8751132 9414227 10570342
12812 10570342 12138870 13952459 15806188 17515783 18960821 20100946 20965710 21626678
12804 21626678 22164526 22643584 23100531 23545195 23967199 24346239 24667876 24941151 25204909
12795 25204909 25513619 25911974 26418637 27027278 27712432 28425659 29085475 29579241 29789577
12786 29789577 29639421 29134747 28381661 27566278 26905655 26592360 26752946 27427904 28572769
12777 28572769 30078926 31808429 33629100 35437144 37165842 38786072 40299937 41725508
12769 41725508 43077046 44349719 45511195 46496667 47209944 47538230 47376302 46641797 45273377
12760 45273377 43228920 40504935 37170090 33380635 29355879 25324894 21473993 17915206
12752 17915206 14677923 11718008 8941649 6243237 3550636 860662 -1755402 -4182742
12744 -4182742 -6314113 -8093244 -9532182 -10702851 -11712818 -12674768 -13677858 -14770066
12736 -14770066 -15957714 -17219939 -18528467 -19861554 -21204672 -22538428 -23823650 -24996856
12728 -24996856 -25980136 -26695933 -27074495 -27052969 -26575049 -25597169 -24097724 -22083006 -19589420
12719 -19589420 -16687206 -13489631 -10163405 -6926341 -4016884 -1636010 111320 1236186
12711 1236186 1830466 2000119 1811155 1274945 366854 -942975 -2660928 -4748302 -7111832
12702 -7111832 -9611490 -12082138 -14357413 -16289154 -17767713 -18748408 -19272134 -19455409 -19439185
12693 -19439185 -19319143 -19099731 -18698379 -17991008 -16868260 -15277986 -13247485 -10887953 -8380821
12684 -8380821 -5943074 -3774504 -2001606 -641198 397416 1271321 2145382 3145144 4336416
12675 4336416 5725581 7265914 8863027 10384828 11685881 12649952 13240622 13535024 13713770
12666 13713770 14001139 14582537 15542216 16846799 18366575 19908400 21242803 22126953 22333464
12657 22333464 21688063 20106239 17611623 14323751 10419756 6092398 1529471 -3079497
12649 -3079497 -7530404 -11616077 -15171613 -18127311 -20525544 -22479178 -24094094 -25407535
12641 -25407535 -26380363 -26938188 -27023417 -26623898 -25772555 -24535021 -23001367 -21283266 -19507387
12632 -19507387 -17797589 -16247805 -14896603 -13718263 -12640424 -11585323 -10516878 -9469749
12624 -9469749 -8545048 -7876167 -7585403 -7755300 -8424548 -9597034 -11243238 -13285267 -15578804
12615 -15578804 -17913349 -20038462 -21704874 -22705357 -22909912 -22295195 -20961857 -19127736
12607 -19127736 -17092165 -15181258 -13690677 -12836940 -12721648 -13313458 -14455237 -15898076
12599 -15898076 -17351321 -18531054 -19196796 -19179481 -18407291 -16926163 -14900899 -12584260 -10255472
12590 -10255472 -8145986 -6379483 -4950292 -3748924 -2621843 -1437988 -136665 1255238
12582 1255238 2636643 3869395 4825067 5420548 5625639 5444058 4886720 3955682 2641927
12573 2641927 929241 -1200201 -3753778 -6704367 -9958441 -13331247 -16546978 -19274077
12565 -19274077 -21190727 -22060184 -21788593 -20444111 -18231748 -15434529 -12341969 -9190565
12557 -9190565 -6137469 -3274443 -667499 1607425 3456002 4783790 5521871 5641727
12549 5641727 5155414 4107675 2568190 629090 -1592694 -3955876 -6306622 -8499135
12541 -8499135 -10411022 -11944830 -13024732 -13603401 -13679465 -13311630 -12619726 -11775696 -10988314
12532 -10988314 -10476700 -10428321 -10950926 -12038056 -13562953 -15303456 -16992087 -18380803 -19303671
12523 -19303671 -19714808 -19682700 -19340033 -18813244 -18169694 -17408433 -16489739 -15375844 -14058539
12514 -14058539 -12568340 -10970722 -9352128 -7796546 -6360444 -5059611 -3875386 -2775644
12506 -2775644 -1740103 -782242 36718 607811 796683 490623 -345854 -1641227 -3242069
12497 -3242069 -4986018 -6775803 -8603814 -10515439 -12543912 -14661218 -16767511 -18713207
12489 -18713207 -20335324 -21493532 -22100574 -22145306 -21701769 -20913877 -19954500 -18975697 -18073168
12480 -18073168 -17273842 -16539678 -15783217 -14900373 -13817467 -12525254 -11067467 -9484402 -7755619
12471 -7755619 -5794143 -3506180 -879597 1955937 4732223 7103894 8735898 9384128
12463 9384128 8948404 7486996 5189576 2319092 -852067 -4085924 -7196189 -10052066
12455 -10052066 -12581075 -14765670 -16619280 -18142977 -19290012 -19970952 -20103861 -19675107
12447 -19675107 -18764050 -17512624 -16062662 -14503451 -12857450 -11101074 -9194911 -7097440
12439 -7097440 -4757350 -2105610 926098 4359676 8129224 12076897 15986415 19627023
12431 19627023 22787835 25305421 27090541 28144415 28552742 28466354 28090160 27683887 27549385
12422 27549385 27978443 29168346 31146569 33747162 36649054 39450475 41744223 43177781
12414 43177781 43503454 42622226 40607696 37691865 34212800 30544200 27028465 23926240
12406 23926240 21393030 19491310 18229155 17594265 17555894 18040823 18917206 20010339 21140866
12397 21140866 22157131 22944691 23417687 23505664 23143329 22262530 20785400 18624183 15697828
12388 15697828 11968729 7486695 2415488 -2976277 -8357257 -13388517 -17770783 -21274872
12380 -21274872 -23759068 -25181236 -25607808 -25211768 -24247129 -22995781 -21700769 -20513792
12372 -20513792 -19480932 -18570243 -17722097 -16894394 -16085492 -15337591 -14733513 -14391119 -14444418
12363 -14444418 -15001405 -16091164 -17634031 -19461631 -21379939 -23238229 -24965814 -26563001
12355 -26563001 -28059055 -29461447 -30719881 -31722285 -32328601 -32430457 -32007750 -31150522 -30031609
12346 -30031609 -28843551 -27733850 -26772372 -25962051 -25273905 -24672780 -24114848 -23529546 -22817395
12337 -22817395 -21881775 -20680520 -19263256 -17768840 -16383208 -15278985 -14564194 -14260791
12329 -14260791 -14320155 -14665921 -15240691 -16030447 -17052462 -18314004 -19767866 -21295311 -22732192
12320 -22732192 -23927365 -24801255 -25372028 -25736866 -26021215 -26324224 -26688509 -27108704 -27570768
12311 -27570768 -28093464 -28741002 -29597254 -30719755 -32101149 -33653400 -35215944 -36586777
12303 -36586777 -37574633 -38057597 -38019162 -37539026 -36743585 -35745190 -34600704 -33304737 -31816543
12294 -31816543 -30106379 -28197103 -26177138 -24178740 -22340136 -20779001 -19588899 -18845559
12286 -18845559 -18600320 -18852180 -19514241 -20403278 -21271227 -21872003 -22034781 -21710269 -20970896
12277 -20970896 -19969555 -18881247 -17855766 -16994889 -16346973 -15904286 -15599737 -15314311 -14906120
12268 -14906120 -14256414 -13312751 -12107154 -10737899 -9322465 -7947325 -6645173 -5412872
12260 -5412872 -4253154 -3205264 -2341030 -1733199 -1423576 -1411580 -1659728 -2099271 -2631094
12251 -2631094 -3137020 -3515273 -3727539 -3824326 -3927186 -4178562 -4688480 -5499302 -6574020
12242 -6574020 -7806440 -9048078 -10140282 -10939305 -11333262 -11259616 -10725007 -9815873 -8689563
12233 -8689563 -7550952 -6626223 -6135620 -6259173 -7099195 -8656953 -10836217 -13467185 -16335037
12224 -16335037 -19206672 -21859568 -24111823 -25841940 -26989868 -27545867 -27541919 -27052252 -26196962
12215 -26196962 -25139174 -24069389 -23173522 -22585826 -22340256 -22345497 -22403717 -22269571 -21723600
12206 -21723600 -20631472 -18974813 -16853597 -14463517 -12049714 -9842612 -7994381 -6544187
12198 -6544187 -5431915 -4554213 -3831853 -3252927 -2872836 -2775333 -3016047 -3576432 -4349784
12189 -4349784 -5163622 -5825631 -6175406 -6128795 -5702527 -5004320 -4183674 -3364440 -2597888 -1861503
12179 -1861503 -1095375 -248080 689113 1664459 2563684 3227281 3490373 3237216 2448137
12170 2448137 1212600 -303914 -1924334 -3519734 -5031931 -6453984 -7792676 -9044660
12162 -9044660 -10201701 -11276782 -12328839 -13464965 -14811138 -16459856 -18418662 -20588059
12154 -20588059 -22783983 -24793403 -26431387 -27571605 -28146795 -28138119 -27573212 -26535230 -25167621
12145 -25167621 -23656302 -22183992 -20871452 -19734564 -18682666 -17562733 -16229761 -14612187
12137 -14612187 -12745830 -10763508 -8843724 -7138076 -5708280 -4501612 -3376534 -2166641
12129 -2166641 -754074 878572 2635673 4334188 5753850 6697463 7049922 6822975 6169556
12120 6169556 5357105 4704110 4498101 4919153 5992509 7587895 9467312 11360726 13036002
12111 13036002 14338437 15198457 15622313 15678541 15480631 15159583 14826117 14535517 14274916
12102 14274916 13983243 13592065 13059611 12376978 11550823 10586849 9493600 8302764 7084785
12093 7084785 5943010 4987900 4306034 3938301 3873688 4057057 4403896 4813268 5174463
12084 5174463 5370894 5289392 4839873 3982062 2747155 1237177 -408737 -2068998 -3678857
12075 -3678857 -5221628 -6677491 -7973833 -8978268 -9534504 -9506255 -8797493 -7347238 -5121737
12066 -5121737 -2127360 1553735 5730619 10108944 14348168 18145041 21299758 23741115
12058 23741115 25518618 26777907 27724203 28574273 29508954 30644169 32026127 33640911
12050 33640911 35428344 37300127 39165988 40964746 42688618 44386303 46136099 47995215
12042 47995215 49950290 51900620 53686774 55144755 56149545 56627583 56547645 55912744 54762515
12033 54762515 53175749 51258305 49114470 46814996 44380213 41788758 39006023 36012049
12025 36012049 32810981 29425566 25898460 22311278 18799667 15530334 12638170 10167409
12017 10167409 8065674 6234634 4594652 3120443 1841663 829872 186712 27625
12009 27625 452323 1509181 3172480 5343598 7871030 10578071 13292931 15880000 18266051
12000 18266051 20450184 22490936 24474910 26478856 28538218 30631536 32682041 34569031
11992 34569031 36142317 37245696 37762203 37676646 37121621 36367243 35746785 35553220 35957673
11983 35957673 36981377 38518443 40382043 42344657 44162651 45598085 46452000 46601843
11975 46601843 46020363 44767280 42969979 40810357 38511993 36310034 34403087 32907657
11967 32907657 31833933 31084977 30473785 29758033 28693754 27098273 24900236 22154252
11959 22154252 19014411 15685786 12386388 9336815 6761774 4871778 3815249 3627632
11951 3627632 4214750 5384177 6906425 8572122 10216180 11701477 12884590 13603079
11943 13603079 13706722 13115124 11860146 10084848 8001158 5827303 3729775 1792787
11935 1792787 28432 -1581695 -3043740 -4336101 -5425777 -6298788 -6982871 -7551117 -8108108
11926 -8108108 -8767745 -9631660 -10770835 -12208309 -13903004 -15740529 -17539786 -19082786
11918 -19082786 -20168487 -20677151 -20616391 -20122274 -19413963 -18726350 -18247584 -18074470 -18192237
11909 -18192237 -18486263 -18782561 -18893441 -18643246 -17875709 -16467012 -14357895 -11589033 -8312221
11900 -8312221 -4764913 -1216774 2091820 4997306 7430610 9404786 10988952 12286392
11892 12286392 13419618 14511495 15653986 16870520 18089804 19149344 19835894 19951631
11884 19951631 19377977 18106723 16226159 13878104 11217120 8391723 5539954 2776629
11876 2776629 163761 -2316120 -4753942 -7266239 -9927651 -12719635 -15520337 -18138731
11868 -18138731 -20377322 -22097034 -23257565 -23918570 -24207552 -24276851 -24273328 -24328248 -24554516
11859 -24554516 -25032380 -25780354 -26730104 -27727400 -28561390 -29003533 -28838128 -27883411 -26013857
11850 -26013857 -23188942 -19479834 -15076404 -10260977 -5352688 -647335 3616882 7256725
11842 7256725 10121204 12075173 13001752 12818498 11496803 9075933 5664748 1428951
11834 1428951 -3427593 -8673852 -14053405 -19293820 -24141082 -28414158 -32051184 -35117864
11826 -35117864 -37770648 -40193087 -42535991 -44885995 -47268241 -49666986 -52037087 -54290373
11818 -54290373 -56268284 -57732970 -58402430 -58025254 -56462310 -53737120 -50032888 -45638468
11810 -45638468 -40866788 -35979975 -31149893 -26462062 -21948412 -17625811 -13524332 -9700697
11802 -9700697 -6239013 -3242662 -820626 929968 1944350 2211901 1795915 847476 -392118
11793 -392118 -1610345 -2473263 -2701714 -2149005 -847621 992796 3030667 4863369 6109001
11784 6109001 6487938 5887940 4389876 2238474 -231971 -2681230 -4818507 -6417892
11776 -6417892 -7312200 -7391355 -6616394 -5042473 -2837734 -285228 2243260 4345524 5667830
11767 5667830 5978393 5208863 3451104 914655 -2136723 -5446981 -8811059 -12093503
11759 -12093503 -15225226 -18183626 -20961674 -23535704 -25846194 -27802043 -29305504 -30281750
11751 -30281750 -30695691 -30550091 -29873706 -28713164 -27134678 -25230607 -23122913 -20960222
11743 -20960222 -18908874 -17137411 -15794728 -14986743 -14758655 -15085590 -15871747 -16962173 -18173159
11734 -18173159 -19335937 -20332945 -21106453 -21638952 -21922786 -21936083 -21631425 -20939374 -19790635
11725 -19790635 -18154279 -16074302 -13680784 -11167679 -8752392 -6639046 -4994591 -3933754
11717 -3933754 -3509311 -3709867 -4465436 -5654659 -7109282 -8621362 -9963678 -10927309 -11369001
11708 -11369001 -11252849 -10667396 -9804412 -8903558 -8189776 -7835665 -7959534 -8640684 -9924689
11699 -9924689 -11806932 -14203474 -16928939 -19701108 -22184341 -24066975 -25145904 -25380597
11691 -25380597 -24891167 -23903208 -22665504 -21372134 -20112046 -18857241 -17490740 -15865289
11683 -15865289 -13872933 -11499335 -8841437 -6081930 -3430831 -1055575 975570 2715726
11675 2715726 4317114 5971647 7839519 9998540 12436377 15081812 17846269 20643594
11667 20643594 23379038 25927082 28125153 29792601 30763228 30915230 30191115 28606980
11659 28606980 26250440 23265725 19827433 16109792 12263659 8413737 4677176 1185306
11651 1185306 -1917385 -4504246 -6504567 -7916770 -8787359 -9176161 -9135885 -8717466 -7992401
11642 -7992401 -7074834 -6129739 -5361610 -4985546 -5187129 -6079906 -7672104 -9856299 -12431157
11633 -12431157 -15150614 -17781659 -20149628 -22160920 -23805324 -25143207 -26279440 -27326708
11625 -27326708 -28368204 -29433481 -30493572 -31469533 -32246876 -32697419 -32713022 -32242925 -31313458
11616 -31313458 -30017065 -28481516 -26841342 -25219988 -23714639 -22379744 -21220145 -20203463
11608 -20203463 -19282999 -18413923 -17560073 -16703772 -15862743 -15098440 -14500081 -14151447 -14103914
11599 -14103914 -14369790 -14931338 -15756052 -16814731 -18097333 -19612948 -21363313 -23299972
11591 -23299972 -25293931 -27142920 -28617482 -29522057 -29738312 -29231052 -28023329 -26166186
11583 -26166186 -23723379 -20770636 -17397561 -13708249 -9825857 -5900363 -2107508 1369928
11575 1369928 4371299 6780700 8531146 9590632 9940807 9564586 8454353 6635322
11567 6635322 4183204 1219763 -2109270 -5656282 -9282826 -12861945 -16278675 -19433269
11559 -19433269 -22248514 -24676682 -26695022 -28284162 -29404567 -29999309 -30034054 -29549806 -28687933
11550 -28687933 -27666456 -26719353 -26027815 -25669697 -25603632 -25693499 -25764446 -25666161 -25314199 -24692973
11540 -24692973 -23826692 -22741369 -21441507 -19911714 -18137612 -16133295 -13965746 -11771373
11532 -11771373 -9757498 -8176945 -7270772 -7196033 -7973124 -9478941 -11482436 -13698033 -15836865
11523 -15836865 -17650052 -18959306 -19662724 -19710877 -19072792 -17724930 -15677595 -13017359 -9927094
11514 -9927094 -6663219 -3504364 -703803 1535427 3072926 3853523 3944039 3556994 3024609
11505 3024609 2711146 2892263 3657783 4891087 6342299 7759105 9002533 10085477 11124077
11496 11124077 12244205 13499854 14838339 16115520 17143632 17748695 17820151 17344366 16415691
11487 16415691 15215608 13956872 12811150 11856131 11068735 10360803 9630394 8801550 7839207
11478 7839207 6740770 5516581 4175097 2721953 1170158 -448115 -2076930 -3645244
11470 -3645244 -5090214 -6384898 -7548071 -8619312 -9609187 -10460133 -11052995 -11264491 -11044340
11461 -11044340 -10463848 -9703757 -8988217 -8504669 -8351904 -8534280 -8994309 -9663458 -10506740
11452 -10506740 -11537409 -12793171 -14293774 -16015682 -17901819 -19890082 -21930561 -23979096
11444 -23979096 -25978993 -27849025 -29485938 -30778775 -31627835 -31961651 -31748693 -31003352 -29784983
11435 -29784983 -28187089 -26318198 -24284663 -22185425 -20114684 -18156228 -16361539 -14727426
11427 -14727426 -13200309 -11716659 -10257512 -8880144 -7705460 -6870324 -6474131 -6546351 -7043677
11418 -7043677 -7867709 -8887226 -9954314 -10914102 -11614932 -11924912 -11754755 -11081452 -9964217
11409 -9964217 -8542281 -7006240 -5546818 -4303496 -3342426 -2675425 -2301772 -2241033 -2539820
11400 -2539820 -3258619 -4451439 -6141573 -8292936 -10787056 -13425380 -15967737 -18195244
11392 -18195244 -19969285 -21259486 -22129410 -22689996 -23047725 -23276589 -23424880 -23541438 -23693597
11383 -23693597 -23960606 -24408442 -25063486 -25898477 -26834324 -27754697 -28526283 -29014694 -29088180
11374 -29088180 -28612437 -27453098 -25504175 -22742809 -19284517 -15401698 -11484600 -7956325
11366 -7956325 -5176892 -3372738 -2613491 -2838652 -3917267 -5708702 -8093323 -10961997
11358 -10961997 -14179731 -17552916 -20826531 -23723690 -26018711 -27611331 -28559985 -29052618
11350 -29052618 -29333811 -29631912 -30117466 -30890827 -31977226 -33316187 -34753917 -36058024 -36963954
11341 -36963954 -37241655 -36757798 -35512907 -33646306 -31410577 -29120542 -27088225 -25564217
11333 -25564217 -24703344 -24555810 -25072107 -26115502 -27487343 -28967232 -30356546 -31510922
11325 -31510922 -32359109 -32912598 -33263053 -33558171 -33956286 -34576104 -35461027 -36566640 -37769479
11316 -37769479 -38892815 -39744505 -40158670 -40030485 -39335283 -38127737 -36522465 -34664396 -32701939
11307 -32701939 -30772181 -28995924 -27473201 -26274125 -25429214 -24925682 -24710739 -24698743 -24781016
11298 -24781016 -24840020 -24767376 -24480407 -23931023 -23105568 -22019978 -20716361 -19263695 -17759423
11289 -17759423 -16324623 -15087358 -14156353 -13595111 -13407724 -13541084 -13899857 -14367331 -14828226
11280 -14828226 -15192709 -15418593 -15522891 -15572945 -15656877 -15847045 -16175780 -16633802 -17186297 -17792155
11270 -17792155 -18413718 -19012979 -19538599 -19913022 -20029862 -19768540 -19025846 -17753280 -15980529
11261 -15980529 -13808529 -11373555 -8804384 -6198095 -3621830 -1127268 1237725 3423375
11253 3423375 5374066 7027767 8325231 9227461 9728128 9849272 9625049 9091542 8295584
11244 8295584 7316426 6281352 5362753 4761517 4689053 5350461 6919188 9497077 13069219
11235 13069219 17472314 22390983 27388452 31972319 35685991 38199089 39360822 39194530
11227 39194530 37842708 35496577 32346461 28570741 24354772 19912752 15487306 11321990
11219 11321990 7622708 4527453 2092275 292110 -964214 -1803703 -2348808 -2681404
11211 -2681404 -2826691 -2762108 -2442480 -1826250 -892038 356763 1897762 3704084 5761500
11202 5761500 8073172 10638560 13413777 16283914 19075161 21602848 23720491 25335099
11194 25335099 26384289 26803681 26521336 25493286 23757545 21463259 18846959 16167931
11186 16167931 13643764 11420305 9579200 8162729 7195749 6698048 6689203 7187602 8201827
11177 8201827 9713925 11661319 13930360 16370534 18822989 21144450 23213058 24922392
11169 24922392 26181393 26927027 27136739 26824689 26023742 24772267 23119750 21144177 18960894
11160 18960894 16710113 14528269 12519588 10742078 9211993 7919808 6844331 5953978
11152 5953978 5194896 4477160 3673430 2637939 1242510 -584232 -2833585 -5421993 -8218005
11143 -8218005 -11067466 -13799729 -16225002 -18151863 -19439241 -20061121 -20141678 -19933069 -19741932
11134 -19741932 -19836366 -20370988 -21357389 -22686253 -24182824 -25663409 -26969858 -27983560 -28636171
11125 -28636171 -28925718 -28926197 -28771677 -28612109 -28561815 -28669817 -28925660 -29289046 -29718328 -30181708
11115 -30181708 -30654576 -31115978 -31548593 -31934366 -32239921 -32401029 -32324130 -31912922 -31109467
11106 -31109467 -29929731 -28477060 -26925822 -25477070 -24300737 -23490462 -23054159 -22941966
11098 -22941966 -23089373 -23448245 -23993067 -24707151 -25560931 -26495265 -27421792 -28245145 -28895363
11089 -28895363 -29346672 -29607193 -29688488 -29579718 -29244423 -28639618 -27745034 -26587401 -25245834
11080 -25245834 -23831750 -22453312 -21187747 -20078069 -19148454 -18419359 -17912229 -17648807 -17652283
11071 -17652283 -17948897 -18564723 -19518126 -20814014 -22443689 -24386873 -26607952 -29041230
11063 -29041230 -31569381 -34009360 -36122456 -37656203 -38409349 -38295599 -37376684 -35847107
11055 -35847107 -33979077 -32058498 -30341570 -29038504 -28310588 -28266309 -28952173 -30339717 -32313513
11046 -32313513 -34672291 -37156985 -39502546 -41487162 -42951406 -43786262 -43914725 -43290927
11038 -43290927 -41918217 -39868279 -37282369 -34350758 -31282973 -28284703 -25544156 -23217280
11030 -23217280 -21405524 -20137119 -19369080 -19011504 -18956689 -19095313 -19318949 -19522758 -19620696
11021 -19620696 -19570222 -19386884 -19128069 -18847069 -18547354 -18171690 -17632605 -16857913 -15820662
11012 -15820662 -14543895 -13088321 -11531506 -9943592 -8367994 -6818165 -5292747 -3797274
11004 -3797274 -2355411 -1001916 235021 1344356 2321807 3142077 3735588 3993633 3806866
10995 3806866 3116698 1949388 416028 -1314416 -3048357 -4593391 -5779350 -6482265
10987 -6482265 -6645771 -6281228 -5436821 -4152969 -2437027 -273914 2342246 5382800 8775631
10978 8775631 12400864 16081720 19581829 22628777 24963374 26387480 26783495 26107356
10970 26107356 24380123 21693812 18218243 14184001 9836543 5385092 976470 -3295952
10962 -3295952 -7361877 -11143184 -14534187 -17394182 -19551806 -20823994 -21051101 -20141582
10954 -20141582 -18111365 -15103225 -11380073 -7295690 -3249807 367331 3235821 5161099
10946 5161099 6105698 6183864 5619287 4681281 3621476 2630903 1828679 1277631 1004861
10937 1004861 1001986 1199986 1441330 1479896 1021027 -209613 -2390427 -5543680 -9509996
10928 -9509996 -13968398 -18496310 -22649246 -26037439 -28382392 -29542596 -29507256 -28371332
10920 -28371332 -26311411 -23567569 -20417305 -17130435 -13917448 -10896968 -8093664 -5456919
10912 -5456919 -2888408 -277794 2453424 5313543 8229480 11072671 13709129 16046431
10904 16046431 18053940 19750188 21171008 22341785 23270902 23964561 24448296 24777007 25023877
10895 25023877 25253318 25495533 25740604 25955274 26107140 26177215 26156591 26037933 25809796 25450107
10885 25450107 24916948 24150424 23101033 21773091 20244905 18639756 17067236 15583992
10877 15583992 14203551 12939668 11842643 11000716 10508447 10424783 10746260 11409657 12321840
10868 12321840 13400569 14604293 15933055 17397023 18971249 20570655 22069273 23353578
10860 23353578 24371495 25143679 25735210 26212198 26611210 26936245 27180203 27351882 27484279
10851 27484279 27614035 27747075 27838945 27807512 27572903 27103915 26448990 25738762 25159891 24909704
10841 24909704 25144524 25935130 27244856 28942851 30847926 32777290 34572685 36098362
10833 36098362 37226452 37825825 37760808 36904499 35172351 32569347 29224235 25382665 21355890
10824 21355890 17450756 13914397 10911521 8530634 6803113 5719818 5239141 5290678
10816 5290678 5783340 6622831 7732953 9065422 10584469 12229994 13884035 15367835
10808 15367835 16474093 17011104 16829074 15817957 13892283 10990480 7105946 2339469
10800 2339469 -3063725 -8729887 -14231418 -19187021 -23341484 -26599330 -29013553 -30743286
10792 -30743286 -31996484 -32975312 -33840312 -34697817 -35602151 -36563295 -37560180 -38563594 -39564036
10783 -39564036 -40588877 -41694251 -42931935 -44309516 -45769954 -47207317 -48513969 -49635021
10775 -49635021 -50601122 -51521663 -52538653 -53758176 -55186459 -56697526 -58048109 -58937771
10767 -58937771 -59096454 -58372672 -56793270 -54571797 -52059921 -49659823 -47730650 -46518668
10759 -46518668 -46124663 -46507748 -47518306 -48949653 -50593958 -52286397 -53926566 -55476244
10751 -55476244 -56940954 -58344841 -59704374 -61002981 -62172115 -63091499 -63618545 -63636712 -63091800
10742 -63091800 -61990099 -60364806 -58244617 -55652385 -52630936 -49271166 -45720813 -42168371
10734 -42168371 -38808736 -35803009 -33247493 -31164705 -29520171 -28257787 -27339129 -26770194
10726 -26770194 -26603601 -26916381 -27777157 -29219766 -31230586 -33745305 -36649134 -39779394
10718 -39779394 -42932298 -45875099 -48364311 -50170211 -51104300 -51042387 -49936781 -47816667
10710 -47816667 -44780868 -40987808 -36643153 -31980212 -27229196 -22583079 -18179687 -14113317
10702 -14113317 -10464415 -7318991 -4761938 -2856184 -1629856 -1078409 -1171294 -1852543 -3034776
10693 -3034776 -4592673 -6363879 -8165484 -9826637 -11221901 -12283085 -12984978 -13327808
10685 -13327808 -13343216 -13122649 -12837542 -12722428 -13022711 -13936422 -15579878 -17984777 -21111499
10676 -21111499 -24858591 -29062629 -33500363 -37907677 -42014381 -45578748 -48409812 -50383277
10668 -50383277 -51462936 -51722568 -51344655 -50579394 -49676943 -48826884 -48131023 -47611014 -47234842
10659 -47234842 -46944225 -46670756 -46335842 -45839095 -45049128 -43812290 -41984313 -39473510 -36274003
10650 -36274003 -32471234 -28217535 -23691874 -19064030 -14477579 -10054871 -5917738 -2210711
10642 -2210711 889583 3190514 4523478 4792910 4014808 2330167 -12917 -2705192
10634 -2705192 -5436612 -7950782 -10075683 -11723692 -12865682 -13493369 -13590090 -13127950 -12093861
10625 -12093861 -10526248 -8536213 -6299024 -4020798 -1894929 -62565 1409665 2523682
10617 2523682 3315361 3808076 3979144 3754001 3025152 1684474 -339171 -3041074 -6307538
10608 -6307538 -9900071 -13467492 -16590881 -18859044 -19961306 -19769496 -18373615 -16050668
10600 -16050668 -13179733 -10142771 -7248601 -4692834 -2545010 -752034 842472 2458194
10592 2458194 4320835 6603776 9388381 12652347 16280959 20089575 23849019 27310563
10584 27310563 30228829 32381969 33591182 33742539 32809137 30865248 28083602 24713542
10576 24713542 21046573 17381176 13997329 11142557 9022253 7786540 7515308 8210703
10568 8210703 9802726 12164068 15126861 18498755 22079789 25680017 29135000 32316454
10560 32316454 35137904 37557796 39583462 41275090 42740242 44106785 45475965 46879365
10552 46879365 48269198 49548830 50619845 51414376 51902944 52091979 52025443 51785083 51471750
10543 51471750 51163642 50873392 50535953 50040564 49288532 48241449 46933648 45448396 43878722
10534 43878722 42297334 40747766 39253118 37830382 36498282 35271226 34141276 33062721
10526 33062721 31959524 30762272 29455031 28098727 26812396 25723199 24914443 24397225
10518 24397225 24115160 23974714 23882342 23767964 23584216 23286333 22807953 22047736 20873013
10509 20873013 19135942 16692217 13415814 9210920 4024510 -2140751 -9215436 -17054086
10501 -17054086 -25430867 -34052343 -42599616 -50793781 -58456487 -65531998 -72050236 -78033618
10493 -78033618 -83378729 -87766671 -90651417 -91341172 -89155384 -83630227 -74731085 -62988107
10485 -62988107 -49449957 -35425107 -22121628 -10372864 -564762 7265588 13275251
10478 13275251 17697724 20789544 22822183 24084540 24868124 25432919 25977978 26637726 27496242
10469 27496242 28595874 29932684 31453543 33067979 34669519 36152217 37415606 38363236
10461 38363236 38906091 38979365 38569473 37734085 36595560 35302806 33976541 32662666 31314612
10452 31314612 29812875 28012860 25797540 23110517 19961179 16413460 12576052 8601744
10444 8601744 4688389 1067237 -2028807 -4409456 -5966087 -6691513 -6677849 -6095422 -5154068
10435 -5154068 -4052432 -2934262 -1875061 -903439 -33925 717594 1341795 1847405 2255200
10426 2255200 2574871 2785264 2838112 2686448 2318379 1771797 1120445 444844 -187038 -716067
10416 -716067 -1076274 -1192147 -1002294 -496456 263898 1164037 2090849 2995863 3927707 5009143
10406 5009143 6368223 8065955 10065562 12255495 14499101 16673515 18681210 20442586
10398 20442586 21885175 22939157 23542601 23655789 23277784 22453069 21258440 19771626 18035987
10389 18035987 16042273 13743563 11102888 8152840 5036289 2005272 -623804 -2540284
10381 -2540284 -3508189 -3413515 -2282773 -275946 2341675 5247629 8128522 10754261 13039361
10372 13039361 15065249 17045171 19235939 21829702 24873144 28246951 31705677 34953588
10364 34953588 37727772 39865006 41333264 42218156 42674031 42866801 42934225 42972343 43041378
10355 43041378 43179029 43409474 43740734 44154249 44601959 45022263 45365921 45608692 45739532
10346 45739532 45741035 45590681 45291819 44910797 44583214 44470123 44679025 45189555 45825043 46289434
10336 46289434 46256599 45473122 43830932 41384856 38318789 34884489 31340596 27909883
10328 27909883 24758478 21989641 19643202 17699711 16095640 14751854 13605855 12634037
10320 12634037 11858835 11344271 11181520 11461665 12239947 13509156 15199196 17199075 19376860
10311 19376860 21576614 23597440 25182548 26042669 25911806 24609643 22084674 18431379
10303 18431379 13890539 8838670 3758204 -824924 -4434975 -6745348 -7642370 -7223973
10295 -7223973 -5735984 -3481231 -744174 2247550 5329998 8392062 11353742 14138121
10287 14138121 16650158 18778123 20419113 21510796 22047797 22075282 21668893 20916384 19910375
10278 19910375 18749753 17538266 16370404 15306950 14353962 13458572 12524412 11439666
10270 11439666 10106912 8463996 6488772 4189502 1592217 -1263429 -4319215 -7494951
10262 -7494951 -10697753 -13845276 -16891890 -19839429 -22717570 -25535272 -28226119 -30620091
10254 -30620091 -32462468 -33475490 -33437000 -32243115 -29930590 -26655337 -22646653 -18165371
10246 -18165371 -13480881 -8859982 -4552833 -773315 2314773 4595513 5987006 6431027
10238 6431027 5897475 4401339 2019968 -1100324 -4751520 -8683494 -12634024 -16364822
10230 -16364822 -19693980 -22515792 -24807477 -26626299 -28092307 -29346219 -30486640 -31515146
10222 -31515146 -32321131 -32713844 -32482788 -31462411 -29584227 -26903587 -23592044 -19898653
10214 -19898653 -16095875 -12425343 -9052520 -6042029 -3369158 -967541 1216782 3204605
10206 3204605 5008027 6671600 8288199 9971317 11801775 13785343 15847648 17865322
10198 17865322 19711106 21290513 22563347 23554688 24356689 25114955 25995351 27138279 28614729
10189 28614729 30395768 32340821 34209205 35701822 36534648 36526963 35667073 34119313 32165964
10180 32165964 30115599 28224033 26656685 25491350 24741576 24379305 24344293 24540378 24829714
10171 24829714 25038701 24980920 24489276 23442736 21777814 19487444 16619610 13284698 9664147
10162 9664147 6000036 2554391 -446016 -2846227 -4560907 -5544707 -5765126 -5198845 -3848789
10153 -3848789 -1763519 957575 4177139 7743234 11512511 15365479 19209974 22971846
10145 22971846 26576632 29931793 32919475 35402750 37241880 38318766 38571023 38030451
10137 38030451 36845888 35265593 33572614 31996965 30645210 29477236 28333005 26991758
10129 26991758 25243011 22953282 20113346 16850544 13400066 10046983 7061887 4648761
10121 4648761 2913197 1855109 1388619 1382142 1697168 2204055 2774373 3272344 3567017
10112 3567017 3562673 3225294 2588696 1744374 827811 3234 -562090 -736319 -459919 239852
10102 239852 1267594 2505885 3870034 5345655 6987978 8883180 11098171 13650989
10094 13650989 16511038 19611336 22852695 26100090 29186386 31931261 34166480 35754494
10086 35754494 36598950 36657661 35965223 34656668 32971665 31224480 29743748 28802164 28559676
10077 28559676 29037407 30128989 31642030 33349165 35026639 36473104 37518825 38038102
10069 38038102 37965277 37304350 36125040 34548771 32733738 30863766 29135764 27735930
10061 27735930 26803223 26395230 26478722 26952709 27686506 28544509 29384251 30040344 30321185
10052 30321185 30037097 29054528 27347220 25009787 22220177 19172433 16021908 12873519
10044 12873519 9809882 6929050 4361094 2253559 737205 -110295 -291468 98336
10036 98336 879150 1821908 2707376 3388078 3825836 4088360 4309712 4636809 5188005 6038278
10026 6038278 7224962 8753184 10585221 12620396 14689529 16581705 18095837 19089636
10018 19089636 19501553 19342808 18676788 17605449 16267111 14833017 13489195 12406370
10010 12406370 11715340 11500477 11804693 12628934 13922054 15578224 17461802 19456245 21506411
10001 21506411 23621945 25837168 28154929 30509836 32766434 34742560 36240471 37079538
9993 37079538 37135469 36385458 34941484 33046221 31021123 29184091 27771947 26897924 26553481
9984 26553481 26642173 27021153 27526688 27974740 28150551 27815906 26753259 24835091 22080720
9975 22080720 18666312 14885376 11087295 7623831 4810706 2890993 1990435 2075569 2939976
9966 2939976 4237490 5558963 6526911 6873804 6479599 5366539 3667744 1587482 -640442
9957 -640442 -2796404 -4714135 -6299822 -7520328 -8368161 -8827202 -8863506 -8448042 -7595674
9948 -7595674 -6394344 -5007898 -3654176 -2567617 -1950127 -1912245 -2419933 -3276583 -4163022
9939 -4163022 -4728628 -4695546 -3927957 -2436396 -323291 2291298 5317646 8695924 12361264
9930 12361264 16209590 20094251 23859101 27387137 30633110 33622402 36425173 39128640
9922 39128640 41820967 44584805 47495553 50623444 54036439 57797094 61953242 66532408
9914 66532408 71547596 77010367 82942219 89379049 96366831 103951554 112177148 121106139
9906 121106139 130855102 141614218 153631340 167171652 182467278 199645014 218611788
9899 218611788 238903081 259526298 278853031 294663330 304481465 306238373 299030568
9892 299030568 283546027 261857411 236691336 210605755 185470421 162350994 141654480
9885 141654480 123356704 107212157 92910851 80171503 68778385 58582427 49481955
9878 49481955 41388863 34192681 27746217 21886887 16480207 11454007 6800854 2550670
9870 2550670 -1266665 -4649510 -7636344 -10302032 -12737672 -15014853 -17148609 -19084166
9862 -19084166 -20719532 -21946650 -22681245 -22870281 -22491927 -21565427 -20169011 -18448549 -16603662
9853 -16603662 -14854044 -13401810 -12406352 -11976784 -12173063 -13003174 -14413704 -16282726 -18425452
9844 -18425452 -20616542 -22627231 -24271682 -25451179 -26179865 -26579790 -26845583 -27189937 -27784113
9835 -27784113 -28706954 -29915647 -31249336 -32467911 -33314603 -33580078 -33145958 -31998989 -30224569
9826 -30224569 -27994613 -25554367 -23198899 -21231741 -19915463 -19436273 -19896357 -21326016
9818 -21326016 -23694165 -26901887 -30763346 -34996125 -39244561 -43140482 -46377761 -48764227
9810 -48764227 -50231162 -50812524 -50621736 -49839383 -48700708 -47466939 -46382362 -45634576 -45329880
9801 -45329880 -45480543 -45997998 -46696990 -47320684 -47585783 -47233421 -46071673 -44004393 -41045364
9792 -41045364 -37315284 -33020508 -28416827 -23762752 -19268147 -15053371 -11142229 -7498272
9784 -7498272 -4081396 -884158 2071564 4759555 7165657 9285495 11114593 12640982
9776 12640982 13839266 14665154 15058334 14960808 14343623 13224262 11664095 9752803 7596413
9767 7596413 5319263 3075877 1057422 -525085 -1489213 -1746758 -1348036 -466736 675321
9758 675321 1898545 3117981 4341638 5637218 7092445 8775869 10702147 12817687
9750 12817687 15017605 17177799 19172011 20864923 22103161 22729392 22621791 21739876 20152630
9741 20152630 18029806 15590226 13024374 10431195 7806212 5085109 2210478 -819187
9733 -819187 -3937044 -7022957 -9927037 -12492068 -14576338 -16077357 -16948892 -17204647 -16913694
9724 -16913694 -16198135 -15230796 -14215625 -13339815 -12713817 -12334330 -12095139 -11840778 -11434017
9715 -11434017 -10804618 -9960418 -8961924 -7878379 -6749467 -5571255 -4311886 -2947445 -1495629
9706 -1495629 -22407 1387690 2679628 3859688 4988678 6145666 7393267 8769161
9698 8769161 10303124 12036854 14020885 16279414 18759614 21300139 23648324 25526589
9690 25526589 26716264 27117426 26762008 25785331 24376238 22724916 20982533 19244644 17564567
9681 17564567 15987196 14576420 13408908 12531446 11912440 11430825 10922196 10259792 9422570
9672 9422570 8513029 7719564 7244373 7226576 7687883 8519826 9515474 10429239 11040213 11202980
9662 11202980 10880743 10155427 9205247 8249020 7476901 6998754 6831007 6919775 7180137 7526998
9652 7526998 7881101 8150788 8209246 7895125 7051404 5588977 3538095 1052464 -1640302
9643 -1640302 -4311452 -6781417 -8923266 -10636142 -11830023 -12447304 -12506518 -12128242 -11515611
9634 -11515611 -10896743 -10460201 -10310939 -10456244 -10819723 -11281237 -11738278 -12170491 -12673089
9625 -12673089 -13428284 -14615516 -16303299 -18384388 -20592498 -22588714 -24067711 -24833389
9617 -24833389 -24822260 -24082808 -22733252 -20921145 -18801633 -16536168 -14294857 -12240358 -10489823
9608 -10489823 -9078175 -7951756 -6999336 -6100805 -5167608 -4162189 -3098089 -2027356 -1022182
9599 -1022182 -157345 503145 917925 1082569 1042378 891457 749572 722116 859242 1129894
9589 1129894 1419623 1554687 1348147 655467 -577642 -2289142 -4303004 -6361725 -8185510
9580 -8185510 -9544078 -10316636 -10517673 -10281890 -9817617 -9344818 -9034996 -8970450 -9135165 -9435761
9570 -9435761 -9738038 -9903651 -9819889 -9420201 -8689551 -7646780 -6306470 -4641938 -2581572
9561 -2581572 -56266 2920477 6188095 9432805 12244199 14204800 14981240 14403764 12525659
9552 12525659 9640493 6231631 2855871 2304 -2017500 -3112737 -3389887 -3085344
9544 -3085344 -2481947 -1834145 -1321440 -1038364 -1010491 -1213738 -1582897 -2017329 -2400212 -2630939
9534 -2630939 -2650087 -2440535 -2011921 -1388926 -612033 258981 1151296 1995356 2741674 3369864
9524 3369864 3888699 4330274 4740489 5166435 5644370 6198168 6856031 7677090 8763727
9515 8763727 10241548 12215746 14731817 17760258 21202168 24901819 28659939 32252460
9507 32252460 35461693 38119348 40147897 41576379 42512299 43077339 43342265 43297470 42867399
9498 42867399 41947618 40438641 38266912 35399394 31860627 27752508 23265847 18668795
9490 18668795 14267314 10352886 7163410 4870622 3581559 3329456 4044557 5522420
9482 5522420 7420866 9305639 10737608 11368454 11003801 9610674 7279913 4177427 511412
9473 511412 -3483918 -7563672 -11493385 -15066560 -18109681 -20481178 -22078867 -22859748 -22859818
9464 -22859818 -22197163 -21050997 -19622522 -18092369 -16591335 -15194671 -13936442 -12827996
9456 -12827996 -11864495 -11017442 -10226609 -9406902 -8472546 -7366083 -6077372 -4647068 -3156606
9447 -3156606 -1706329 -383199 772331 1783030 2724391 3694506 4783074 6052334 7529799
9438 7529799 9207087 11042281 12967640 14905358 16789317 18580798 20260725 21795024
9430 21795024 23099312 24043010 24505794 24450912 23959755 23202165 22365676 21588140 20922496
9421 20922496 20336534 19738145 19015690 18081429 16901570 15498763 13925765 12224913 10395327
9412 10395327 8383508 6099402 3448583 367946 -3144760 -7013193 -11080725 -15129279
9404 -15129279 -18920708 -22253378 -25012860 -27188572 -28840869 -30033540 -30772153 -30984029
9396 -30984029 -30542890 -29312167 -27182970 -24105473 -20122161 -15395286 -10204141 -4898187
9388 -4898187 177659 4749541 8644458 11778689 14122509 15669493 16431496 16456795 15845799
9379 15845799 14739982 13285972 11600835 9763663 7837962 5909150 4111028 2617052
9371 2617052 1591502 1127412 1215496 1767574 2673746 3847647 5230598 6762439 8349084
9362 8349084 9850785 11092680 11881680 12016872 11301593 9579379 6799333 3079811 -1277193
9353 -1277193 -5842279 -10161565 -13859145 -16702629 -18620580 -19679965 -20040144 -19899519 -19445920
9344 -19445920 -18819375 -18099310 -17326052 -16547306 -15856269 -15388138 -15273643 -15583725 -16304689
9335 -16304689 -17356612 -18636829 -20059533 -21573718 -23160599 -24821995 -26567197 -28396496
9327 -28396496 -30280380 -32146219 -33890404 -35417020 -36676575 -37670579 -38412262 -38868386 -38922142
9318 -38922142 -38384735 -37056869 -34815022 -31680607 -27832926 -23554677 -19137634 -14797715
9310 -14797715 -10636710 -6656173 -2803809 973029 4686341 8291551 11700962 14817217
9302 14817217 17564121 19892731 21758994 23091526 23774226 23655635 22581426 20441351
9294 20441351 17222437 13053676 8217956 3111598 -1842767 -6294973 -10033475 -12992824
9286 -12992824 -15208805 -16752640 -17678590 -18002227 -17707801 -16777626 -15237715 -13204349 -10899249
9277 -10899249 -8605270 -6573803 -4937375 -3680334 -2674724 -1743824 -711918 572411
9269 572411 2226847 4324940 6882865 9851688 13122352 16541025 19925364 23076488
9261 23076488 25791996 27887278 29220539 29706963 29315153 28056810 25985210 23202135
9253 23202135 19856622 16124463 12180044 8184848 4302203 719650 -2350379 -4700936
9245 -4700936 -6172168 -6677708 -6209424 -4832569 -2677552 81859 3270364 6752935 10441076
9236 10441076 14250650 18041582 21589237 24613798 26852446 28136262 28439074 27883132
9228 27883132 26701815 25172233 23540640 21965386 20493530 19076319 17619641 16052661
9220 16052661 14381777 12697153 11128405 9783599 8712716 7907828 7322636 6893261 6557506
9211 6557506 6274111 6035816 5869822 5828752 5978753 6384056 7084580 8072816 9284930 10614729
9201 10614729 11943486 13168160 14211773 15010561 15489682 15552751 15105172 14104513 12603715
9192 12603715 10751426 8741471 6737778 4816572 2955524 1070653 -923507 -3060858
9184 -3060858 -5296242 -7507202 -9521514 -11162903 -12300550 -12884762 -12959323 -12653354 -12158150
9175 -12158150 -11689469 -11437842 -11521013 -11958090 -12674397 -13531174 -14369509 -15059361 -15540760 -15839729
9165 -15839729 -16050498 -16297412 -16702338 -17370343 -18381572 -19769470 -21485400 -23376039 -25202854
9156 -25202854 -26706534 -27687054 -28060801 -27874684 -27284029 -26514079 -25819793 -25447246 -25596016
9147 -25596016 -26387767 -27851416 -29929001 -32492151 -35354908 -38283547 -41021360 -43339306
9139 -43339306 -45093547 -46252635 -46876476 -47067944 -46934688 -46578891 -46102853 -45608524 -45181020
9130 -45181020 -44861229 -44619667 -44344623 -43855369 -42944240 -41439200 -39265793 -36481931 -33266777
9121 -33266777 -29866842 -26527508 -23446810 -20770101 -18612917 -17082351 -16276662 -16263990 -17052868
9112 -17052868 -18567350 -20638870 -23027122 -25472087 -27757374 -29751488 -31406934 -32726610
9104 -32726610 -33723710 -34394585 -34710768 -34632614 -34144505 -33297521 -32229994 -31142668 -30235385
9095 -30235385 -29639305 -29378800 -29374601 -29476761 -29507900 -29302412 -28736727 -27750610 -26357833 -24642108
9085 -24642108 -22737681 -20801168 -18982984 -17401845 -16123724 -15152263 -14439826 -13917411 -13525670
9076 -13525670 -13227351 -12996660 -12796976 -12561644 -12187056 -11543585 -10507584 -9009299 -7077551
9067 -7077551 -4855815 -2575685 -496881 1159890 2260151 2767840 2721850 2189984 1224849
9058 1224849 -151830 -1926021 -4045582 -6384584 -8743623 -10891985 -12639924 -13917193
9050 -13917193 -14823903 -15620708 -16649643 -18216154 -20485319 -23431699 -26847930 -30393932
9042 -30393932 -33669003 -36297263 -38014730 -38734672 -38564266 -37761463 -36648690 -35519831 -34575752
9033 -34575752 -33905180 -33504973 -33318283 -33266600 -33263192 -33213470 -33017107 -32579101 -31822813 -30695567
9023 -30695567 -29168517 -27241029 -24953757 -22401877 -19734640 -17133691 -14774513 -12786199
9015 -12786199 -11227992 -10091426 -9320562 -8835956 -8556344 -8419818 -8398616 -8491636 -8690322
9006 -8690322 -8942193 -9147282 -9197184 -9029337 -8657704 -8161809 -7644064 -7179235 -6779320 -6388370
8996 -6388370 -5908814 -5247385 -4361254 -3284876 -2123764 -1014274 -68867 659573 1172393
8987 1172393 1490667 1627830 1594935 1431262 1232943 1159125 1411848 2194034 3652367 5819034
8977 5819034 8575946 11664124 14743776 17486079 19660758 21184990 22118657 22616491 22862707
8968 22862707 23012079 23151230 23285974 23355121 23262893 22913360 22231674 21170508 19712728
8959 19712728 17879040 15736009 13393319 10987706 8662175 6548302 4750757 3333704
8951 3333704 2318532 1701205 1476631 1640881 2158628 2922137 3745478 4410901 4740027
8942 4740027 4644252 4128243 3255101 2104002 749378 -731163 -2238239 -3647211 -4829086
8933 -4829086 -5682304 -6155538 -6252623 -6022186 -5538966 -4887221 -4158955 -3469622 -2971624 -2834998
8923 -2834998 -3186195 -4036770 -5254137 -6601525 -7822606 -8714671 -9151258 -9061701 -8404166
8914 -8404166 -7156862 -5322929 -2935118 -59824 3192298 6654553 10110213 13327611
8906 13327611 16113376 18359050 20060147 21299931 22204924 22891851 23430010 23832754 24073197
8897 24073197 24107672 23893476 23398521 22609426 21545561 20278629 18945511 17737366 16859088
8888 16859088 16473283 16654583 17373880 18515607 19917593 21418273 22897691 24302893 25651954
8879 25651954 27013482 28463906 30035801 31681070 33269466 34622439 35559903 35933818
8871 35933818 35640173 34621808 32878984 30491037 27634642 24577356 21634108 19094430
8863 19094430 17148201 15844642 15106020 14789269 14762242 14952582 15341841 15909313 16563914
8854 16563914 17116792 17325229 16987652 16028895 14521562 12638409 10576038 8494214 6487974
8845 6487974 4587262 2775774 1021337 -696258 -2374835 -3995665 -5527125 -6913392
8837 -6913392 -8059165 -8832505 -9090525 -8708512 -7592772 -5680010 -2942646 588924 4797829
8828 4797829 9468366 14304615 18976801 23177379 26665899 29291382 30994404 31796078
8820 31796078 31776139 31039399 29677465 27742003 25242479 22167418 18518073 14343189 9765597
8811 9765597 4990626 288473 -4048290 -7760848 -10678136 -12753012 -14068637 -14812432
8803 -14812432 -15227246 -15555175 -15986456 -16623389 -17470746 -18458303 -19481773 -20433548 -21206420
8794 -21206420 -21683690 -21744592 -21297368 -20323179 -18902967 -17212441 -15489224 -13983739 -12903320
8785 -12903320 -12359638 -12337377 -12705627 -13278442 -13900240 -14510114 -15148942 -15910260 -16871019 -18045693
8775 -18045693 -19385346 -20811405 -22254765 -23675572 -25059984 -26408075 -27726990 -29030866
8767 -29030866 -30340469 -31679237 -33069254 -34528896 -36065716 -37656185 -39216034 -40582021
8759 -40582021 -41529006 -41825616 -41301622 -39888920 -37618300 -34586634 -30922862 -26768718 -22271843
8750 -22271843 -17583073 -12853345 -8227187 -3829497 251715 3974235 7329509 10311640
8742 10311640 12887625 14991909 16552186 17532194 17968177 17982243 17767689 17549038 17525567
8733 17525567 17816582 18433408 19294182 20273366 21257053 22175842 23006410 23752586 24422830
8724 24422830 25015157 25512452 25887047 26113044 26183916 26128684 26015456 25932269 25945916 26055011
8714 26055011 26163687 26096728 25654898 24683891 23122024 21009287 18468159 15678722 12858913
8705 12858913 10243670 8054443 6461737 5552012 5309651 5620864 6302445 7149777 7986732
8696 7986732 8697668 9235183 9613220 9895614 10177164 10547840 11042735 11598622 12042727 12125067
8686 12125067 11583838 10217678 7936307 4773180 864873 -3581892 -8316298 -13061278
8678 -13061278 -17537448 -21504390 -24811874 -27437690 -29490119 -31169187 -32698444 -34248000
8670 -34248000 -35870714 -37472076 -38829443 -39661388 -39723892 -38893217 -37201587 -34817382 -31985770
8661 -31985770 -28956079 -25922402 -22998333 -20231590 -17642556 -15260422 -13141981 -11374870
8653 -11374870 -10068410 -9327752 -9213281 -9705534 -10698372 -12020187 -13462806 -14806649 -15852237
8644 -15852237 -16467385 -16633718 -16460642 -16152763 -15949132 -16064942 -16651595 -17772908 -19394389
8635 -19394389 -21391834 -23584070 -25777308 -27794877 -29476066 -30655729 -31154477 -30799952
8627 -30799952 -29472991 -27153034 -23937918 -20028937 -15690346 -11203764 -6835747 -2822493
8619 -2822493 638644 3401181 5381477 6557156 6947294 6589255 5534018 3865444 1724169
8610 1724169 -690914 -3154102 -5462766 -7478597 -9139045 -10435257 -11371856 -11936000 -12099571
8601 -12099571 -11856527 -11270844 -10500325 -9776309 -9344793 -9392374 -9985110 -11045461 -12381760
8592 -12381760 -13762503 -15001635 -16011710 -16803060 -17445142 -18028238 -18650450 -19421407 -20455151
8583 -20455151 -21838763 -23592865 -25652758 -27883090 -30114264 -32179872 -33943500 -35313653
8575 -35313653 -36247126 -36739917 -36809040 -36474285 -35746749 -34622222 -33074805 -31055174 -28507025
8566 -28507025 -25408666 -21826080 -17948628 -14083205 -10601727 -7855361 -6080346 -5326254
8558 -5326254 -5435120 -6083355 -6872489 -7436236 -7530359 -7082546 -6191339 -5075206 -3988531
8549 -3988531 -3135385 -2613333 -2404841 -2412344 -2517204 -2636960 -2758180 -2931490 -3230802 -3696857
8539 -3696857 -4296534 -4922600 -5434179 -5713225 -5706876 -5441510 -5013859 -4570881 -4283858 -4315783
8529 -4315783 -4781988 -5710983 -7020131 -8522188 -9968004 -11110826 -11763711 -11827048 -11284756
8520 -11284756 -10186387 -8633420 -6773168 -4787754 -2863651 -1142948 320786 1571243
8512 1571243 2708348 3813440 4878978 5780661 6309240 6251087 5484235 4049180 2164123
8503 2164123 176806 -1530632 -2650254 -3031514 -2708317 -1860123 -724642 498453 1710218
8494 1710218 2919276 4203285 5657142 7354310 9324802 11540569 13908576 16284816
8486 16284816 18514814 20482115 22134266 23471861 24515044 25276084 25755384 25954121 25881233
8477 25881233 25539930 24903245 23906137 22472576 20566019 18229029 15583873 12793325 10006061
8468 10006061 7317678 4766351 2360337 115726 -1920141 -3669331 -5039682 -5944606
8460 -5944606 -6323444 -6164721 -5525921 -4533511 -3354009 -2148290 -1034446 -75448 711832
8451 711832 1338680 1824884 2179599 2387777 2408420 2182364 1640268 708979 -672273 -2518164
8441 -2518164 -4760766 -7239487 -9732682 -12016198 -13916876 -15336127 -16239265 -16626477 -16511915
8432 -16511915 -15929687 -14959422 -13740331 -12448743 -11248147 -10247133 -9490764 -8979292 -8690515
8423 -8690515 -8590432 -8631498 -8742592 -8816433 -8707535 -8256107 -7336435 -5902840 -4000751 -1735758
8413 -1735758 773434 3422733 6116639 8744078 11165337 13228684 14812022 15867769
8405 15867769 16449180 16709443 16877659 17218566 17979996 19334333 21330920 23883147 26802632
8396 26802632 29865830 32877532 35701081 38251866 40472448 42307143 43680945 44484095
8388 44484095 44572446 43797111 42062140 39386121 35933652 31993959 27909654 23984477 20411489
8379 20411489 17253174 14475506 12009104 9802887 7850946 6192953 4895868 4022583
8371 4022583 3594885 3566553 3824907 4224974 4637885 4985344 5244616 5429789 5565196 5662586
8361 5662586 5707605 5660028 5469967 5103984 4567566 3911689 3219386 2577732 2049995 1667394
8351 1667394 1449468 1436371 1699078 2309222 3289344 4586070 6088838 7676260 9252421
8342 9252421 10751512 12119056 13292886 14199713 14767750 14945655 14715497 14088965 13083403
8333 13083403 11688832 9851011 7493674 4580380 1187795 -2450942 -5963049 -8915259
8325 -8915259 -10927234 -11774082 -11439625 -10107979 -8106990 -5827206 -3638100 -1821786 -542887
8316 -542887 139127 230767 -232471 -1199515 -2593696 -4297921 -6157909 -8013148 -9740229
8307 -9740229 -11274940 -12589571 -13639346 -14324025 -14503703 -14064123 -12985293 -11364293 -9379208
8298 -9379208 -7222563 -5045103 -2930686 -896485 1095029 3117079 5251563 7558052
8290 7558052 10047919 12670314 15313223 17823453 20046011 21870795 23264331 24271672
8282 24271672 24993921 25560188 26107557 26767293 27647084 28806227 30236290 31866283 33597118
8273 33597118 35345444 37066460 38741188 40340535 41793409 42982090 43772059 44063350
8265 44063350 43834646 43152388 42138667 40917669 39570043 38116695 36540652 34841734
8257 34841734 33100152 31509965 30351322 29904930 30349404 31693901 33777566 36328815
8249 36328815 39046066 41658387 43951113 45772068 47038438 47743419 47947032 47746092 47237301
8240 47237301 46489952 45533327 44358055 42932973 41234955 39276605 37113311 34825929
8232 34825929 32493159 30169756 27876148 25599601 23310288 20993829 18687188 16492395
8224 16492395 14552422 13001460 11920509 11321162 11158278 11359423 11860346 12637939 13728781
8215 13728781 15220661 17213798 19763200 22825816 26240666 29760562 33127248 36152255
8207 36152255 38760074 40975478 42868693 44485302 45785135 46612871 46721011 45847888 43822595
8198 43822595 40650585 36544795 31895672 27196524 22948935 19571412 17329516 16300050
8190 16300050 16374622 17297799 18724978 20283134 21626191 22484895 22706760 22271638 21271474
8181 21271474 19862108 18211914 16470762 14767462 13227182 11988547 11198014 10973211
8173 10973211 11351797 12256369 13495799 14802075 15889972 16524916 16580282 16062297 15092588
8164 15092588 13861498 12577010 11424126 10535198 9971057 9720187 9720598 9894812 10178112
8155 10178112 10525931 10903072 11270269 11582896 11805320 11932824 12008557 12123885 12394593 12915602
8145 12915602 13712717 14718142 15783388 16716816 17319232 17402081 16793916 15350646 12979475
8136 12979475 9674756 5552180 860079 -4049003 -8783801 -12992439 -16422613 -18946309
8128 -18946309 -20551468 -21315775 -21378283 -20915248 -20116837 -19162101 -18199221 -17341858 -16680553
8119 -16680553 -16293475 -16241702 -16550239 -17189069 -18068932 -19058957 -20022714 -20856821 -21509080 -21962340
8109 -21962340 -22192897 -22129436 -21638386 -20549008 -18715408 -16094385 -12802919 -9121174 -5432581
8100 -5432581 -2125830 499302 2288598 3242656 3492356 3262539 2835873 2512294 2556497
8091 2556497 3140246 4300356 5930884 7813856 9679705 11279612 12445674 13117107 13325870
8082 13325870 13153539 12679862 11942586 10924553 9575252 7855835 5781395 3438895 978415
8073 978415 -1412590 -3544721 -5266362 -6495359 -7227168 -7514691 -7430235 -7026288 -6310510
8064 -6310510 -5247736 -3793755 -1947994 204474 2490117 4691727 6623834 8204613
8056 8204613 9488329 10639665 11862452 13321170 15093515 17167201 19466185 21881364
8048 21881364 24290495 26569142 28604048 30314996 31675289 32711737 33476253 34005790
8040 34005790 34299813 34329482 34064215 33488777 32599232 31390834 29858390 28014252 25910120
8031 25910120 23646586 21367431 19246333 17471310 16224326 15652148 15831493 16738964 18238994
8022 18238994 20099827 22038699 23784326 25134634 25987753 26335223 26221884 25691732 24749231
8013 24749231 23363481 21522144 19309629 16960885 14846885 13380921 12878876 13437547
8005 13437547 14892476 16878190 18959912 20771959 22104369 22914607 23277747 23308614 23093416
7996 23093416 22659998 21995827 21096533 20010505 18848755 17751441 16827967 16102796 15496667
7987 15496667 14853887 14001360 12810794 11240589 9348920 7279132 5220557 3352942
7979 3352942 1793146 566988 -382207 -1154317 -1838266 -2461351 -2962739 -3209430 -3053685
7970 -3053685 -2401690 -1252907 306308 2136576 4079723 5985555 7738942 9286483
7962 9286483 10647511 11899576 13148802 14503454 16056715 17871737 19964162 22284943
7954 22284943 24707075 27018845 28933336 30129140 30323414 29351946 27219604 24101355
7946 24101355 20300241 16181630 12101972 8347347 5094236 2396858 195543 -1660586
7938 -1660586 -3376649 -5159552 -7160472 -9436636 -11955097 -14637916 -17418148 -20265605
7930 -20265605 -23165447 -26073360 -28890279 -31477550 -33694445 -35424647 -36577693 -37079170
7922 -37079170 -36872056 -35938194 -34328421 -32177328 -29683524 -27058468 -24469824 -22007208
7914 -22007208 -19678263 -17423504 -15136657 -12686507 -9942542 -6807552 -3257833 619146
7906 619146 4613911 8431844 11767860 14378683 16117943 16933026 16844014 15917832 14241393
7897 14241393 11905713 9018654 5742437 2321206 -936331 -3717814 -5775600 -6966931
7889 -6966931 -7258905 -6716052 -5488879 -3804200 -1942595 -191879 1213602 2139264 2557145
7880 2557145 2513337 2080732 1326151 304876 -925612 -2291150 -3698736 -5045714 -6230810
7871 -6230810 -7161838 -7763939 -7992355 -7844559 -7362817 -6627089 -5747727 -4862952 -4132800 -3717052
7861 -3717052 -3735684 -4225217 -5110581 -6208366 -7265354 -8018301 -8247259 -7801240 -6601389
7852 -6601389 -4646084 -2029950 1042840 4282271 7378427 10077826 12228294 13774374
7844 13774374 14717608 15072335 14844065 14040280 12700736 10917660 8820838 6530053 4106391
7835 4106391 1538121 -1227692 -4227832 -7433206 -10730734 -13941258 -16862221 -19317142
7827 -19317142 -21194683 -22465778 -23175543 -23414842 -23282155 -22849168 -22143268 -21155104 -19867924
7818 -19867924 -18291898 -16482029 -14529540 -12535980 -10589481 -8755742 -7082170 -5607066
7810 -5607066 -4369090 -3416110 -2811274 -2631952 -2959313 -3860587 -5367380 -7452554 -10010724
7801 -10010724 -12853264 -15729460 -18373452 -20557473 -22123320 -22977926 -23066437 -22352619 -20826733
7792 -20826733 -18534446 -15600771 -12224570 -8637881 -5046482 -1580073 1725427 4911575
7784 4911575 8064669 11286317 14673153 18298731 22190668 26304470 30502543 34550833
7776 34550833 38145659 40973866 42790055 43479721 43081343 41759157 39735597 37203954
7768 37203954 34253389 30844758 26858576 22195604 16875478 11080474 5126814 -616193
7760 -616193 -5821712 -10281604 -13941605 -16889026 -19303309 -21392497 -23339703 -25271480
7752 -25271480 -27244767 -29243953 -31186732 -32944575 -34379401 -35386875 -35931912 -36066134
7744 -36066134 -35921486 -35677237 -35507657 -35533777 -35806108 -36324274 -37072156 -38041100 -39231398
7735 -39231398 -40640279 -42247274 -44001942 -45816578 -47567473 -49107219 -50287410 -50987776
7727 -50987776 -51143631 -50759973 -49903712 -48675964 -47175627 -45466453 -43555661 -41388730 -38862199
7718 -38862199 -35851334 -32245540 -27984387 -23088015 -17673377 -11946979 -6172710 -627281
7710 -627281 4437921 8818520 12367887 15009079 16751419 17700704 18047787 18031970 17892759
7701 17892759 17829948 17983494 18431136 19195128 20251777 21543110 22992826 24525360 26079596
7692 26079596 27606088 29046449 30310928 31277195 31819927 31857349 31387515 30493368 29314922
7683 29314922 28005434 26694317 25468446 24366028 23372467 22420393 21406634 20227793
7675 20227793 18814594 17143083 15224631 13097490 10834981 8559668 6439954 4657517
7667 4657517 3355822 2592388 2314612 2366628 2522019 2531282 2173796 1304056 -121417 -2047945
7657 -2047945 -4353667 -6886512 -9486380 -11991770 -14247685 -16127746 -17563496 -18559013
7649 -18559013 -19172457 -19466122 -19451237 -19065898 -18208795 -16812303 -14906242 -12628884 -10180505
7640 -10180505 -7750780 -5456087 -3304986 -1196360 1046040 3602831 6571353 9901568
7632 9901568 13392511 16752743 19690193 21986158 23529450 24314496 24418031 23965253 23093435
7623 23093435 21922745 20541907 19008443 17358647 15623271 13843469 12076370 10382078
7615 10382078 8797610 7314155 5869356 4354224 2629878 551811 -2001367 -5101704
7607 -5101704 -8754381 -12892577 -17390303 -22098640 -26895527 -31719055 -36556554 -41392985
7599 -41392985 -46153052 -50673651 -54720953 -58043010 -60435679 -61795889 -62142713 -61603843
7591 -61603843 -60381838 -58716892 -56852951 -55005826 -53332599 -51906267 -50702440 -49604992
7583 -49604992 -48433563 -46987735 -45095426 -42652335 -39643160 -36139961 -32279385 -28229591
7575 -28229591 -24161266 -20228930 -16557342 -13229020 -10279978 -7713583 -5528960 -3745213
7567 -3745213 -2403884 -1548783 -1199432 -1338572 -1922888 -2908193 -4270411 -6009929 -8140930
7558 -8140930 -10673669 -13593936 -16841786 -20296920 -23781686 -27085861 -30005337 -32379657
7550 -32379657 -34113489 -35173055 -35560146 -35279649 -34320083 -32656287 -30270359 -27183081 -23488775
7541 -23488775 -19380918 -15147986 -11125135 -7610908 -4782594 -2649289 -1063367 220080
7533 220080 1470967 2934149 4809973 7244439 10305697 13950751 18010351 22212001
7525 22212001 26229867 29732753 32415894 34028879 34416158 33561909 31606073 28805583
7517 28805583 25452578 21795034 18002281 14182240 10421647 6813272 3453972 423207
7509 423207 -2236168 -4518318 -6433913 -7978822 -9106148 -9714131 -9658870 -8793928 -7026380
7500 -7026380 -4366222 -945306 3003245 7194790 11350288 15238853 18692655 21597415
7492 21597415 23878252 25501886 26495932 26962603 27063207 26972192 26820740 26652772 26407565
7483 26407565 25935704 25047128 23577312 21448130 18703829 15514599 12148094 8913497
7475 8913497 6092145 3880123 2365734 1544303 1350695 1684633 2417242 3386946 4404503
7466 4404503 5281417 5875688 6130588 6082696 5832828 5490901 5114587 4666564 4014514 2980575
7456 2980575 1415368 -746251 -3474568 -6672085 -10211022 -13959027 -17785817 -21555076
7448 -21555076 -25113075 -28286297 -30891358 -32749440 -33697861 -33602207 -32377323 -30017640 -26627351
7439 -26627351 -22437518 -17797157 -13128286 -8849091 -5291800 -2650816 -977980 -212037
7431 -212037 -216596 -810429 -1788543 -2938580 -4056651 -4964457 -5525529 -5655606 -5325416 -4561164
7421 -4561164 -3447895 -2130076 -794691 370467 1228873 1727215 1885573 1754653 1374916
7412 1374916 768407 -38144 -990419 -2014275 -3054725 -4115700 -5265169 -6593184 -8142575
7403 -8142575 -9849829 -11526955 -12892445 -13638441 -13511162 -12379226 -10266759 -7339547 -3853588
7394 -3853588 -92114 3685191 7272805 10531814 13384095 15787505 17701975 19067185
7386 19067185 19807504 19861203 19215867 17931636 16143385 14042613 11845475 9755710 7930928
7377 7930928 6458158 5341966 4507302 3818139 3109314 2223446 1042629 -491052 -2365175
7368 -2365175 -4494071 -6724981 -8857782 -10677797 -11993086 -12664447 -12619965 -11851623 -10397195
7359 -10397195 -8317467 -5682615 -2575234 896969 4594634 8356275 12019539 15441122
7351 15441122 18504592 21114666 23186518 24643559 25430527 25533100 24985302 23855570 22224488
7342 22224488 20177497 17821419 15308887 12845006 10664290 8988176 7984448 7743038
7334 7743038 8267569 9473657 11190060 13170398 15127503 16793112 17989695 18690569 19044921
7325 19044921 19354380 20003583 21363555 23696644 27089972 31433563 36446099 41739453
7317 41739453 46902894 51581791 55528507 58615353 60814985 62164466 62731324 62592804
7309 62592804 61828233 60517218 58737777 56562700 54053471 51251792 48174570 44822434
7301 44822434 41202346 37348186 33322413 29203166 25078496 21058127 17286953 13937462
7293 13937462 11178675 9141057 7897425 7465098 7821217 8917920 10685945 13025012
7285 13025012 15793056 18810418 21882076 24823230 27471644 29686364 31348417 32375855
7277 32375855 32745278 32496372 31705661 30445103 28759826 26682833 24267429 21600707 18781989
7268 18781989 15882762 12915212 9823568 6500738 2831185 -1244975 -5670873 -10252448
7260 -10252448 -14701207 -18723197 -22106114 -24760274 -26702976 -28009390 -28762498 -29022494
7252 -29022494 -28821219 -28178573 -27130478 -25749981 -24145000 -22433507 -20714955 -19057434
7244 -19057434 -17504747 -16094334 -14875054 -13917891 -13315056 -13164617 -13540805 -14454762 -15817516
7235 -15817516 -17425233 -18986609 -20193346 -20805557 -20709574 -19921481 -18543371 -16704696 -14523025
7226 -14523025 -12100872 -9551377 -7028435 -4734201 -2888434 -1664576 -1119176 -1153777 -1538480
7217 -1538480 -1991737 -2273218 -2238573 -1835202 -1059396 86424 1608578 3503835 5721064
7208 5721064 8126576 10498318 12562049 14060368 14826678 14833496 14198225 13149302 11969747
7199 11969747 10937500 10275283 10116033 10488876 11330905 12523669 13941139 15488260 17113977
7190 17113977 18796186 20509013 22189652 23722813 24955215 25739760 25992070 25731900 25088552
7181 25088552 24270222 23515595 23046897 23030330 23540794 24534480 25844779 27214870 28361104
7172 28361104 29042674 29112781 28541564 27413581 25902535 24223197 22569142 21062129 19742739
7163 19742739 18608172 17666703 16963272 16553835 16448328 16566062 16735300 16735861 16358847 15455595
7153 15455595 13961857 11897763 9351010 6450849 3338931 143294 -3036693 -6128684
7145 -6128684 -9072222 -11803799 -14255590 -16367098 -18095845 -19418072 -20327277 -20842819 -21023571
7136 -21023571 -20965922 -20775793 -20530782 -20258302 -19937494 -19511143 -18893316 -17973960 -16631389
7127 -16631389 -14758888 -12301253 -9289587 -5860484 -2249506 1241334 4292762 6622077
7119 6622077 8031902 8444487 7911428 6594507 4726212 2566816 369586 -1646798 -3324422
7110 -3324422 -4588642 -5453864 -6000595 -6328292 -6507827 -6560636 -6473021 -6227843 -5825765 -5282291
7100 -5282291 -4610189 -3806511 -2853065 -1724127 -392343 1167166 2967982 4996509 7194792
7091 7194792 9450194 11598428 13445413 14809674 15573907 15719999 15325529 14524545 13459505
7082 13459505 12251104 10992740 9759787 8622601 7658033 6956192 6618792 6747190 7421421
7073 7421421 8672759 10455077 12627243 14963854 17203345 19120794 20593855 21630519
7065 21630519 22346938 22907365 23453402 24053189 24692842 25311169 25851271 26290602 26630337
7056 26630337 26861657 26945406 26825028 26460647 25856300 25061234 24145159 23162067 22123095
7047 22123095 20993873 19716348 18239753 16543773 14648474 12615503 10544576 8565151
7039 8565151 6823192 5465498 4624198 4403006 4866413 6030549 7850576 10202624 12871463
7030 12871463 15564883 17964925 19798782 20893821 21190844 20718726 19555071 17795501
7022 17795501 15536663 12865944 9854079 6556115 3026567 -656136 -4370987 -7955165
7014 -7955165 -11226629 -14018763 -16210577 -17737498 -18578226 -18728869 -18185469 -16949480 -15051063
7005 -15051063 -12569734 -9635177 -6408871 -3061415 241503 3344253 6105522 8406528
6997 8406528 10160630 11320013 11879410 11879234 11407777 10597888 9612314 8615083 7733619 7026937
6987 7026937 6480443 6036642 5645074 5296718 5020032 4850349 4806784 4896221 5129540 5521594
6977 5521594 6069701 6736146 7459308 8186321 8896605 9597872 10306225 11033343 11787593 12577328
6967 12577328 13404927 14253739 15079599 15816768 16398817 16783101 16960949 16944099 16738752 16331465
6957 16331465 15699607 14834220 13752470 12490081 11083024 9552223 7897123 6098040
6949 6098040 4128149 1975389 -332471 -2713251 -5037324 -7155458 -8936078 -10297772
6941 -10297772 -11226476 -11771020 -12015517 -12036801 -11867218 -11485653 -10843957 -9910674 -8700636
6932 -8700636 -7270489 -5687939 -4002160 -2237439 -407587 1469754 3373183 5283138
6924 5283138 7173271 8983693 10597201 11844235 12541106 12541358 11774748 10261999 8109492
6915 8109492 5492789 2631942 -244195 -2942575 -5344654 -7419222 -9201979 -10754599
6907 -10754599 -12123873 -13314209 -14279318 -14938985 -15222101 -15119982 -14719954 -14198751 -13781793
6898 -13781793 -13691498 -14103524 -15118045 -16748874 -18932176 -21549752 -24453535 -27479667 -30452411
6889 -30452411 -33187915 -35506990 -37257893 -38342692 -38737384 -38496789 -37740195 -36622551 -35303986
6880 -35303986 -33931538 -32637857 -31547658 -30774787 -30399562 -30434851 -30804757 -31355982 -31899741
6871 -31899741 -32261427 -32315600 -32001984 -31330641 -30378047 -29265900 -28122608 -27047503 -26100206
6862 -26100206 -25312446 -24696114 -24230446 -23842349 -23408011 -22785629 -21862816 -20595904 -19028826
6853 -19028826 -17287846 -15551138 -13999228 -12764354 -11900642 -11385489 -11145350 -11089722 -11138330
6844 -11138330 -11232602 -11330232 -11390513 -11364702 -11203190 -10878928 -10413100 -9886024 -9424888 -9171312
6834 -9171312 -9238341 -9670119 -10420376 -11362558 -12329462 -13162883 -13751038 -14044472 -14053367 -13830526
6824 -13830526 -13444213 -12952138 -12390648 -11780027 -11130752 -10440548 -9692614 -8870013 -7978818
6815 -7978818 -7053453 -6132505 -5227195 -4315752 -3371917 -2404783 -1482483 -730276 -309208 -383813
6805 -383813 -1085776 -2482998 -4563779 -7237690 -10345956 -13676223 -16986502 -20045953 -22688364
6796 -22688364 -24858039 -26622968 -28142531 -29600167 -31132004 -32785314 -34520150 -36238356
6788 -36238356 -37812789 -39105387 -39983448 -40343205 -40132480 -39356564 -38064799 -36332157 -34251471
6779 -34251471 -31940346 -29555159 -27299297 -25414041 -24150251 -23733101 -24336895 -26075368
6771 -26075368 -28997393 -33076042 -38190207 -44107811 -50481310 -56865196 -62763382 -67704204
6763 -67704204 -71322351 -73415432 -73953821 -73050104 -70914843 -67820407 -64072282 -59974320
6755 -59974320 -55785601 -51686479 -47771887 -44068012 -40551337 -37158168 -33794128 -30358181
6747 -30358181 -26780024 -23054629 -19257260 -15530452 -12042485 -8928067 -6235495 -3907320
6739 -3907320 -1804425 241526 2373776 4673711 7147661 9735020 12332231 14824170
6731 14824170 17110946 19118403 20788371 22057523 22841724 23037493 22537871 21251291 19117241
6722 19117241 16122008 12317586 7837280 2896690 -2223437 -7205029 -11723005 -15478871
6714 -15478871 -18242575 -19897669 -20470351 -20121431 -19097077 -17655195 -15994166 -14206498
6706 -14206498 -12269636 -10073974 -7475710 -4353974 -653772 3594325 8277972 13224879
6698 13224879 18231800 23086691 27576512 31487259 34611569 36773901 37869953 37905367
6690 37905367 37013612 35436439 33465927 31369048 29326225 27404675 25566887 23703014
6682 23703014 21675531 19365304 16707206 13707186 10441169 7039920 3660564 444657
6674 444657 -2527471 -5263892 -7848067 -10383709 -12923372 -15421937 -17744803 -19728038
6666 -19728038 -21257372 -22325458 -23042812 -23601657 -24210788 -25029494 -26127469 -27483260 -29012572
6657 -29012572 -30604629 -32148392 -33544043 -34705808 -35564485 -36073867 -36217596 -36006491 -35459027
6648 -35459027 -34572501 -33308183 -31610545 -29453567 -26878395 -23987752 -20898391 -17690026
6640 -17690026 -14389974 -10997249 -7517081 -3978059 -429413 3066435 6434689 9583670
6632 9583670 12403886 14779539 16614058 17857628 18515899 18630417 18247775 17407200 16158855
6623 16158855 14595420 12868637 11175761 9719147 8652140 8029515 7783254 7736939 7653016
6614 7653016 7290916 6454971 5024570 2968447 344076 -2719262 -6049632 -9461880 -12777056
6605 -12777056 -15833735 -18501538 -20699793 -22409091 -23661100 -24509202 -25001608 -25177080 -25081828
6596 -25081828 -24786640 -24383592 -23957971 -23548467 -23117803 -22555466 -21722396 -20524341 -18977109
6587 -18977109 -17223905 -15492255 -14018200 -12984796 -12504167 -12636156 -13415163 -14862337 -16977262
6578 -16977262 -19714379 -22954930 -26491841 -30046114 -33317674 -36048473 -38065434 -39288037
6570 -39288037 -39712674 -39396634 -38452149 -37043044 -35371268 -33649467 -32067596 -30765363 -29816992
6561 -29816992 -29226546 -28929398 -28799682 -28668109 -28351742 -27688678 -26565437 -24929042 -22784938
6552 -22784938 -20187056 -17225351 -14013603 -10680272 -7365191 -4221212 -1414316 885360
6544 885360 2523021 3382916 3407720 2608804 1066865 -1076295 -3633421 -6391401 -9130740
6535 -9130740 -11644125 -13757053 -15351365 -16385671 -16903150 -17021683 -16909270 -16752211 -16723819
6526 -16723819 -16959557 -17540944 -18485656 -19739850 -21175271 -22601673 -23802721 -24588558 -24844830
6517 -24844830 -24559554 -23822910 -22806127 -21727165 -20808705 -20235611 -20121811 -20494871 -21300909
6508 -21300909 -22428181 -23744591 -25137387 -26534402 -27889522 -29138243 -30156823 -30762040
6500 -30762040 -30759689 -30014072 -28499177 -26309355 -23631245 -20692824 -17710561 -14855514 -12249661
6491 -12249661 -9984575 -8139787 -6781588 -5940815 -5584229 -5598984 -5803547 -5984463 -5942936
6482 -5942936 -5530329 -4663415 -3326576 -1570966 489890 2695086 4862024 6813069 8392730
6473 8392730 9472152 9944983 9722615 8736399 6948163 4362497 1034072 -2929606 -7367550
6464 -7367550 -12071169 -16803557 -21327323 -25425256 -28906484 -31610426 -33424489 -34313115
6456 -34313115 -34338496 -33657586 -32497497 -31120912 -29789259 -28724815 -28073276 -27874987 -28058091
6447 -28058091 -28462905 -28892014 -29164858 -29153774 -28793883 -28076613 -27040218 -25761892 -24348667
6438 -24348667 -22924435 -21613034 -20517942 -19700576 -19163929 -18851651 -18669216 -18523745 -18367443
6429 -18367443 -18222906 -18172981 -18315612 -18706250 -19319434 -20048453 -20738397 -21232702 -21413561 -21224663
6419 -21224663 -20673231 -19817060 -18749475 -17592960 -16498957 -15639574 -15181416 -15249110 -15898779
6410 -15898779 -17117208 -18845119 -21006212 -23519733 -26288125 -29174478 -31996271 -34548499
6402 -34548499 -36642951 -38139448 -38958015 -39077754 -38529206 -37379767 -35713076 -33610790 -31142845
6393 -31142845 -28361520 -25292940 -21932108 -18255430 -14253381 -9966512 -5501937 -1019291
6385 -1019291 3308076 7340460 11008256 14320819 17341521 20139913 22745600 25127352
6377 25127352 27204131 28874938 30047507 30654375 30657002 30042818 28818528 27003954 24634263
6368 24634263 21776525 18555550 15170975 11884056 8964811 6615584 4909438 3778995
6360 3778995 3058568 2547575 2060259 1453790 647341 -364545 -1519200 -2723554 -3906707
6351 -3906707 -5056108 -6217561 -7463781 -8853018 -10401438 -12082852 -13851635 -15668136
6343 -15668136 -17504101 -19321524 -21039428 -22512516 -23537803 -23887755 -23353512 -21779586
6335 -21779586 -19082997 -15265000 -10428008 -4799528 1250994 7223190 12536648 16616182
6327 16616182 18991407 19385739 17771360 14370188 9591920 3926201 -2165561 -8311791
6319 -8311791 -14234127 -19720633 -24602152 -28739998 -32016925 -34333331 -35622103 -35883778
6311 -35883778 -35221684 -33852370 -32083011 -30265039 -28740611 -27797774 -27643503 -28392254 -30060745
6302 -30060745 -32566237 -35736222 -39335358 -43102298 -46782771 -50152296 -53029661 -55283299
6294 -55283299 -56834195 -57663785 -57830902 -57484373 -56847041 -56162082 -55622563 -55320492 -55238936
6285 -55238936 -55284595 -55338178 -55295841 -55086406 -54668704 -54024621 -53155374 -52072606 -50776537 -49234387
6275 -49234387 -47386898 -45194008 -42694206 -40032865 -37433561 -35126176 -33272221 -31923527
6267 -31923527 -31024392 -30443316 -30014402 -29577905 -29018846 -28300984 -27485003 -26717484 -26187566
6258 -26187566 -26064479 -26439756 -27296374 -28515437 -29916576 -31317010 -32588477 -33690642 -34665609
6249 -34665609 -35594105 -36535382 -37484811 -38372219 -39096112 -39566458 -39727852 -39552407 -39013205
6240 -39013205 -38063497 -36645887 -34734448 -32381300 -29726092 -26952083 -24217440 -21610615
6232 -21610615 -19154585 -16844086 -14682384 -12696489 -10928920 -9413687 -8147772 -7072980
6224 -7072980 -6080682 -5040012 -3836970 -2409258 -768194 994631 2715878 4182715
6216 4182715 5164826 5450462 4880784 3376864 953639 -2283912 -6163985 -10486144 -15061585
6207 -15061585 -19736696 -24387429 -28891525 -33104346 -36863769 -40028978 -42534384 -44429945
6199 -44429945 -45884676 -47144956 -48458702 -49995552 -51799764 -53796678 -55842431 -57783055
6191 -57783055 -59491096 -60871616 -61853464 -62386606 -62450748 -62062063 -61263529 -60103152 -58622691
6182 -58622691 -56874208 -54953191 -53014219 -51244934 -49809796 -48800828 -48223110 -48011277
6174 -48011277 -48054790 -48219185 -48368726 -48397026 -48255652 -47958622 -47549335 -47040500 -46359818 -45339205
6164 -45339205 -43765694 -41474207 -38430663 -34757501 -30693647 -26522411 -22507482 -18852625
6156 -18852625 -15679249 -13018470 -10825807 -9023521 -7556898 -6435701 -5735526 -5554725
6148 -5554725 -5948846 -6880023 -8210637 -9742292 -11275141 -12658435 -13817629 -14755759 -15529054
6139 -15529054 -16200586 -16790252 -17252142 -17500567 -17473702 -17194553 -16788159 -16442272 -16333092 -16554061
6129 -16554061 -17079274 -17774070 -18445263 -18907772 -19037935 -18793713 -18205343 -17357920 -16381796
6120 -16381796 -15444706 -14728519 -14387973 -14510790 -15100885 -16086899 -17341083 -18696989 -19969630
6111 -19969630 -20987077 -21630793 -21867691 -21756021 -21420272 -21004400 -20618609 -20295740 -19973909
6102 -19973909 -19518432 -18779673 -17659104 -16144485 -14292534 -12173592 -9818574 -7204474
6094 -7204474 -4286776 -1056995 2411309 5958056 9379505 12495618 15204497 17496950
6086 17496950 19431210 21089004 22535629 23795210 24843877 25622748 26070340 26163881 25949624
6077 25949624 25546473 25123951 24868958 24953118 25499747 26544522 27995967 29619624 31071603
6068 31071603 31983480 32065781 31180662 29352201 26721537 23482011 19826506 15916182 11863267
6059 11863267 7723849 3508057 -785324 -5118666 -9374920 -13351259 -16793172 -19453858
6051 -19453858 -21154937 -21830291 -21545328 -20490070 -18946110 -17230925 -15631189 -14344949
6043 -14344949 -13453579 -12933690 -12700900 -12661561 -12745882 -12908535 -13102641 -13248053 -13217309 -12853123
6033 -12853123 -12014443 -10631751 -8744769 -6503114 -4129647 -1864787 84643 1577899
6025 1577899 2553885 3032268 3105653 2921390 2652135 2460033 2464148 2720004 3215340 3881178
6015 3881178 4613310 5296555 5824270 6111086 6104600 5803068 5275592 4666922 4168132 3954999
6005 3954999 4122379 4649901 5413783 6231489 6914691 7313921 7348834 7020677 6404222 5621570
5995 5621570 4806252 4067403 3463726 2997179 2630716 2319533 2034353 1763171 1497912 1221843
5985 1221843 905041 505703 -21525 -704148 -1521567 -2388602 -3175098 -3757274 -4068529 -4118090
5975 -4118090 -3973491 -3726885 -3463817 -3237528 -3047488 -2832062 -2489579 -1923635 -1084043 25228
5965 25228 1371308 2923461 4663427 6572824 8616049 10737767 12880234 15010926 17143113
5956 17143113 19333787 21654917 24150231 26800690 29519038 32178921 34665786 36924710
5948 36924710 38980020 40913924 42811875 44700897 46511587 48081709 49198017 49657700
5940 49657700 49327018 48177933 46291048 43827307 40987987 37986151 35034062 32328500
5932 32328500 30018005 28163010 26718233 25552596 24492661 23365609 22033676 20427108
5924 20427108 18576086 16624167 14802773 13367185 12521711 12369692 12904936 14033322 15601425
5915 15601425 17418833 19276189 20965861 22307740 23177566 23530962 23412699 22943286 22287330
5906 22287330 21619792 21104115 20883397 21076959 21775131 23029337 24840226 27154529 29882475
5897 29882475 32932772 36242273 39777407 43507429 47370492 51252941 54989887 58386913
5889 58386913 61257201 63459839 64922641 65644489 65685354 65150077 64163458 62839674 61264924
5880 61264924 59511877 57679229 55924700 54462198 53519876 53279959 53826538 55117034 56980260
5871 56980260 59137678 61243297 62934285 63878166 63803238 62512588 59896257 55952571 50809820
5862 50809820 44725459 38047910 31148664 24350539 17880319 11860743 6335934 1308873
5854 1308873 -3230065 -7290778 -10882036 -14013932 -16701648 -18971401 -20868784 -22465911
5846 -22465911 -23858439 -25143520 -26381462 -27560449 -28586610 -29305285 -29540899 -29140300 -28012691
5837 -28012691 -26161819 -23700799 -20840026 -17849480 -15007569 -12549464 -10623434 -9264386
5829 -9264386 -8398711 -7890137 -7613641 -7517792 -7634364 -8029575 -8735567 -9711295 -10851347 -12025295
5819 -12025295 -13121493 -14079684 -14902174 -15634266 -16318593 -16950031 -17461784 -17749860 -17716827
5810 -17716827 -17309018 -16531451 -15437321 -14100415 -12587397 -10944627 -9200239 -7372367
5802 -7372367 -5479706 -3557865 -1677351 53854 1515320 2616134 3328072 3692556 3803286
5793 3803286 3777451 3728177 3745988 3890458 4187464 4628320 5174609 5773939 6380397 6962786
5783 6962786 7492131 7921648 8181928 8199504 7925276 7353520 6523680 5510517 4412648
5774 4412648 3346933 2449927 1879321 1802482 2363470 3635011 5576610 8022981 10716064
5765 10716064 13374750 15775611 17805194 19453542 20753666 21710934 22274705 22369250 21952643
5756 21952643 21055347 19775503 18243543 16580644 14865016 13111787 11274781 9275691
5748 9275691 7048509 4572750 1879482 -959901 -3842052 -6633771 -9183687 -11354118
5740 -11354118 -13059644 -14285911 -15076277 -15499991 -15627112 -15523467 -15258067 -14906337 -14540620
5731 -14540620 -14212560 -13936185 -13676148 -13344333 -12813032 -11953082 -10691172 -9061382 -7221776
5722 -7221776 -5424351 -3952440 -3053735 -2892087 -3525557 -4905978 -6894541 -9292462 -11884534
5713 -11884534 -14484031 -16961666 -19248299 -21315200 -23144591 -24704099 -25936726 -26772592
5705 -26772592 -27156155 -27069736 -26535583 -25596193 -24288759 -22629197 -20609527 -18204792 -15387007
5696 -15387007 -12145984 -8514528 -4589838 -539143 3419861 7061213 10196811 12701281
5688 12701281 14504611 15568459 15877611 15464925 14454859 13086572 11686293 10594876
5680 10594876 10088053 10326195 11341384 13042696 15220452 17552380 19633780 21048839
5672 21048839 21470858 20748976 18937790 16261306 13043583 9645397 6417651 3657711
5664 3657711 1563666 204773 -472521 -607087 -376866 36613 465531 754991 751904 301258
5654 301258 -733597 -2430993 -4778103 -7670243 -10942017 -14408352 -17895522 -21259492
5646 -21259492 -24399171 -27265882 -29859539 -32204582 -34316223 -36181358 -37769585 -39062728
5638 -39062728 -40072812 -40828199 -41336753 -41556009 -41395660 -40752994 -39558159 -37800898 -35525671
5629 -35525671 -32804595 -29709626 -26300192 -22627954 -18749185 -14733546 -10663706 -6627115
5621 -6627115 -2703856 1047191 4601974 7977671 11221873 14383751 17483957 20505768
5613 20505768 23412503 26170985 28754550 31119059 33171970 34763169 35711263 35854477
5605 35854477 35101531 33463105 31060165 28114353 24922005 21809022 19071784 16924252
5597 16924252 15474254 14734039 14646382 15101400 15936677 16937202 17856595 18461297 18574336
5588 18574336 18092001 16969398 15195692 12782961 9775792 6272375 2442930 -1468097
5580 -1468097 -5167611 -8369201 -10861505 -12559952 -13520092 -13913076 -13979625 -13977885 -14132152
5571 -14132152 -14585800 -15364196 -16356824 -17329940 -17978796 -18016258 -17273224 -15770535 -13729357
5562 -13729357 -11515293 -9540000 -8155971 -7576247 -7840678 -8835619 -10353546 -12161544 -14047410
5553 -14047410 -15832014 -17360686 -18495901 -19123889 -19170226 -18609909 -17463722 -15787835 -13670920
5544 -13670920 -11242554 -8678722 -6186149 -3963753 -2160017 -848559 -28808 358878
5536 358878 419021 294072 158193 199934 589225 1437969 2772052 4528252 6576826 8759751
5526 8759751 10930949 12986806 14879723 16612383 18215522 19717409 21118327 22382563
$$ [...]
##END NTUPLES=NMR SPECTRUM
##END=
