##TITLE=31Pdec_DE-59_NaOH
 CDCl3, 64 sc
 28.6.2024
##JCAMPDX= 6.0         $$ Bruker NMR JCAMP-DX V2.0
##DATA TYPE= NMR SPECTRUM
##DATA CLASS= NTUPLES
##ORIGIN= UXNMR, Bruker Analytische Messtechnik GmbH
##OWNER= root
$$ XWIN-NMR		Version 3.5
$$ Fri Jun 28 14:51:58 2024 Russian Standard Time (UT+4h)  she@DPX200
##.OBSERVE FREQUENCY= 81.013821
##.OBSERVE NUCLEUS= ^31P
##.ACQUISITION MODE= SIMULTANEOUS
##.ACQUISITION SCHEME= undefined
##.AVERAGES= 64
##.DIGITISER RES= 17
##SPECTROMETER/DATA SYSTEM= spect
##.PULSE SEQUENCE= zgpg30
##.SOLVENT NAME= DMSO
##.SHIFT REFERENCE= (INTERNAL, DMSO, 0, 198.062)
##AUDIT TRAIL= $$ (NUMBER, WHEN, WHO, WHERE, WHAT)
$$ ##TITLE= Audit trail, XWIN-NMR		Version 3.5
$$ ##JCAMPDX= 5.01
$$ ##ORIGIN= Bruker BioSpin GmbH
$$ ##OWNER= she
$$ F:/spectra/data/she/nmr/P31/2/pdata/1/auditp.txt
$$ ##AUDIT TRAIL=  $$ (NUMBER, WHEN, WHO, WHERE, WHAT)
(   1,<2024-06-28 14:50:50.76 +0400>,<she>,<DPX200>,
      <created by zg, POWCHK disabled, PULCHK disabled
       configuration hash MD5:
       00 E9 B6 7A A2 85 ED C7 34 08 36 98 17 FE 4E 26
       data hash MD5: 32K
       C9 C0 B0 17 EF 69 1E 73 9F B6 84 E9 F0 C6 51 E7>)
(   2,<2024-06-28 14:50:53.10 +0400>,<she>,<DPX200>,
      <Start of raw data processing
       efp BC_mod = 2 LB = 1.5 FT_mod = 6 PKNL = 1 PHC0 = 2777.86 PHC1 = 177.2863 SI = 64K 
       data hash MD5: 64K
       1A EB 5A 1C 90 64 97 9C 2C BA EB 1F 72 AB E5 EB>)
(   3,<2024-06-28 14:51:22.68 +0400>,<she>,<DPX200>,
      <pk PHC0 = 67.75182 PHC1 = 17.6 
       data hash MD5: 64K
       EC 31 F6 BA 96 F7 BE 24 13 25 B0 E2 AA 2B 7E 79>)
$$ ##END=
$$ 
$$ hash MD5
$$ 27 17 41 12 B3 0A B5 93 BD B1 B9 B6 4A 29 57 C6
##$RELAX= 
##$RELAX= 
##$RELAX= 
##$RELAX= 
##$RELAX= 
##$RELAX= 
##$RELAX= 
##$RELAX= 
$$ Bruker specific parameters
$$ --------------------------
##$DU= <F:/spectra>
##$EXPNO= 2
##$NAME= <P31>
##$PROCNO= 1
##$TYPE= <nmr>
##$USER= <she>
##$AMP= (0..31)
100 100 100 100 100 100 100 100 100 100 100 100 100 100 100 100 100 100 
100 100 100 100 100 100 100 100 100 100 100 100 100 100 
##$AQSEQ= 0
##$AQ_mod= 1
##$AUNM= <au_zg>
##$AUTOPOS= <>
##$BF1= 81.014009
##$BF2= 200.13
##$BF3= 200.13
##$BF4= 200.13
##$BF5= 200.13
##$BF6= 200.13
##$BF7= 200.13
##$BF8= 200.13
##$BYTORDA= 1
##$CFDGTYP= 0
##$CFRGTYP= 5
##$CHEMSTR= <none>
##$CNST= (0..31)
1 1 145 1 1 1 1 1 1 1 1 1 1 1 1 1 1 1 1 1 1 1 1 1 1 1 1 1 1 1 1 1 
##$CPDPRG= <waltz16>
##$CPDPRG1= <>
##$CPDPRG2= <waltz16>
##$CPDPRG3= <>
##$CPDPRG4= <mlev>
##$CPDPRG5= <mlev>
##$CPDPRG6= <mlev>
##$CPDPRG7= <mlev>
##$CPDPRG8= <mlev>
##$CPDPRGB= <>
##$CPDPRGT= <>
##$D= (0..31)
0 1 0 0 0 0 0 0 0 0.06 0 0.03 2e-05 3e-06 0 0 0.0002 0 0 0 0 0 0 0 0 0 
0 0 0 0 0 0 
##$DATE= 1719571850
##$DBL= (0..7)
120 120 120 11 120 120 24 19 
##$DBP= (0..7)
150 150 150 150 150 150 150 150 
##$DBP07= 0
##$DBPNAM0= <>
##$DBPNAM1= <>
##$DBPNAM2= <>
##$DBPNAM3= <>
##$DBPNAM4= <>
##$DBPNAM5= <>
##$DBPNAM6= <>
##$DBPNAM7= <>
##$DBPOAL= (0..7)
0.5 0.5 0.5 0.5 0.5 0.5 0.5 0.5 
##$DBPOFFS= (0..7)
$$ [...]
##$SUBNAM2= <"">
##$SUBNAM3= <"">
##$SUBNAM4= <"">
##$SUBNAM5= <"">
##$SUBNAM6= <"">
##$SUBNAM7= <"">
##$SUBNAM8= <"">
##$SUBNAM9= <"">
##$SW= 400.765351723535
##$SWIBOX= (0..15)
0 1 3 0 0 0 0 0 0 0 0 0 0 0 0 0 
##$SW_h= 32467.5324675325
##$TD= 32768
##$TD0= 1
##$TE= 0
##$TE2= 300
##$TE3= 300
##$TEG= 300
##$TL= (0..7)
0 120 53 12 22 120 120 120 
##$TP= (0..7)
150 150 150 150 150 150 150 150 
##$TP07= 0
##$TPNAME0= <>
##$TPNAME1= <>
##$TPNAME2= <>
##$TPNAME3= <>
##$TPNAME4= <>
##$TPNAME5= <>
##$TPNAME6= <>
##$TPNAME7= <>
##$TPOAL= (0..7)
0.5 0.5 0.5 0.5 0.5 0.5 0.5 0.5 
##$TPOFFS= (0..7)
0 0 0 0 0 0 0 0 
##$TUNHIN= 0
##$TUNHOUT= 0
##$TUNXOUT= 0
##$USERA1= <user>
##$USERA2= <user>
##$USERA3= <user>
##$USERA4= <user>
##$USERA5= <user>
##$V9= 5
##$VALIST= <valist>
##$VCLIST= <CCCCCCCCCCCCCCC>
##$VD= 0
##$VDLIST= <DDDDDDDDDDDDDDD>
##$VPLIST= <PPPPPPPPPPPPPPP>
##$VTLIST= <TTTTTTTTTTTTTTT>
##$WBST= 1024
##$WBSW= 4
##$XGAIN= (0..3)
0 0 0 0 
##$XL= 0
##$YL= 0
##$YMAX_a= 5369
##$YMIN_a= -4789
##$ZGOPTNS= <>
##$ZL1= 120
##$ZL2= 120
##$ZL3= 120
##$ZL4= 120
##$ABSF1= 0
##$ABSF2= 0
##$ABSG= 0
##$ABSL= 0
##$ALPHA= 0
##$AQORDER= 0
##$ASSFAC= 0
##$ASSFACI= 0
##$ASSFACX= 0
##$ASSWID= 0
##$AUNMP= <proc_1d>
##$AZFE= 0.1
##$AZFW= 0.5
##$BCFW= 0
##$BC_mod= 2
##$BYTORDP= 0
##$COROFFS= 0
##$CY= -3
##$DATMOD= 1
##$DC= 0
##$DFILT= <>
##$DTYPP= 0
##$F1P= 0
##$F2P= 0
##$FCOR= 1
##$FTSIZE= 65536
##$FT_mod= 6
##$GAMMA= 0
##$GB= 0
##$INTBC= 1
##$INTSCL= 9.790993e-09
##$ISEN= 30
##$LB= 1.5
##$LEV0= 0
##$LPBIN= 0
##$MAXI= 10000
##$MC2= 0
##$MEAN= 0
##$ME_mod= 0
##$MI= 50
##$NCOEF= 0
##$NC_proc= -9
##$NLEV= 6
##$NOISF1= 182.463
##$NOISF2= 159.3651
##$NSP= 0
##$NTH_PI= 0
##$NZP= 0
##$OFFSET= 198.0616
##$PC= 4
##$PHC0= 2845.612
##$PHC1= 194.8863
##$PH_mod= 1
##$PKNL= yes
##$PPARMOD= 0
##$PSCAL= 0
##$PSIGN= 0
##$REVERSE= no
##$SF= 81.0140089999434
##$SI= 65536
##$SIGF1= 159.3651
##$SIGF2= -187.1042
##$SINO= 113.3802
##$SIOLD= 16384
##$SREGLST= <1H.CDCl3>
##$SSB= 0
##$STSI= 65536
##$STSR= 0
##$SW_p= 32467.5324675325
##$SYMM= 0
##$S_DEV= 0
##$TDeff= 32768
##$TDoff= 0
##$TI= <>
##$TILT= no
##$TM1= 0
##$TM2= 0
##$TOPLEV= 0
##$USERP1= <user>
##$USERP2= <user>
##$USERP3= <user>
##$USERP4= <user>
##$USERP5= <user>
##$WDW= 1
##$XDIM= 65536
##$YMAX_p= 345551041
##$YMIN_p= -259987205
$$ End of Bruker specific parameters
$$ ---------------------------------
##NTUPLES= NMR SPECTRUM
##VAR_NAME=  FREQUENCY,     SPECTRUM/REAL,   SPECTRUM/IMAG
##SYMBOL=    X,             R,               I
##VAR_TYPE=  INDEPENDENT,   DEPENDENT,       DEPENDENT
##VAR_FORM=  AFFN,          ASDF,            ASDF
##VAR_DIM=   65536,         65536,           65536
##UNITS=     HZ,            ARBITRARY UNITS, ARBITRARY UNITS
##FACTOR=    0.49542278885378, 1,            1
##FIRST=     16045.7642231865, 0,            0
##LAST=      -16421.768244346, 0,            0
##MIN=       -16421.768244346, -259987205,   0
##MAX=       16045.7642231865, 345551041,    0
$$ Real data points
##PAGE= N=1
##DATA TABLE= (X++(R..R)), XYDATA
$$ [...]
##PAGE= N=2
##DATA TABLE= (X++(I..I)), XYDATA
7370G657594O170905l4205r859541j0234597j921830L507373J763823o98953n7648
$$ 7657594 13828499 13794294 3934753 -6299844 -8221674 -4714301 -2950478 -3649431 -3707079
7361c707079l63037l542559m433123j4673M458134L598033j21593j613978j092495
$$ -3707079 -4070116 -7612675 -12045798 -12060471 -7602337 -4004304 -4125897 -5739875 -6832370
7352f832370j322696j379469R89014L870518L782813J704469J307455K752903
$$ -6832370 -8155066 -9534535 -8545521 -4675003 -892190 812279 2119734 4872637
7344D872637L208308K260403J795183J370238j040653l936445l489300o49124
$$ 4872637 8080945 10341348 12136531 13506769 12466116 8529671 5040371 4391247
7336D391247j297943o825618r704957k925868R249837J5199449R948552O06947
$$ 4391247 3093304 -3732314 -13437271 -16363139 -7113302 8086147 18034699 18641646
7328A8641646l220812n35966K191693P02012k479841k938684k05483K694323K900699
$$ 18641646 15420834 14884868 17076561 17778573 15298732 12360048 12154565 14848888 17749587
7319A7749587q25605p811297j4128070j3826303n130466N761181J0670891Q375317
$$ 17749587 16923982 9112685 -5015385 -18841688 -23972154 -18210973 -7540082 835235
7311H35235L844065p3106m640241q917978q213590j549382M944060N938183L743738
$$ 835235 4679300 4606194 -34047 -8952025 -17165615 -18714997 -13770937 -7832754 -4089016
7302d089016L237033M233134L814198K665954L320751M354929K168527k602270
$$ -4089016 -851983 3381151 7195349 9861303 13182054 17536983 19705510 17103240
7294A7103240n793770o107256n696368m890056j688622L151939N606127M041168
$$ 17103240 11309470 5202214 -494154 -5384210 -7072832 -3920893 1685234 5726402
7286E726402J221844l30251j205027k518289m072136n763447p346090o597979
$$ 5726402 6948246 6617995 5412968 2894679 -1177457 -6940904 -14286994 -20884973
7278b0884973j755872M037783N451594K797914J959263N212196P809669O025268
$$ -20884973 -22640845 -18603062 -13151468 -10353554 -8394291 -3182095 4627574 10652842
7270A0652842K749882J495432M16608k752861m622048j244541L989696M393931
$$ 10652842 13402724 14898156 15314764 12561903 7939855 6695314 10685010 15078941
7262A5078941K73914j714141N74394J293688m023664j0986339j1673117m468346
$$ 15078941 15352855 13638714 14213108 15506796 11483132 496793 -11176324 -15644670
7254a5644670M555812Q692613O761721K819494J309073K752895M032339K734318
$$ -15644670 -11088858 -2396245 4365476 7184970 8494043 11246938 15279277 18013595
7246A8013595J17514j186649j183964k303178n690895r633342j1528149r897204
$$ 18013595 18131109 16944460 15760496 13457318 7766423 -1866919 -13395068 -23292272
7238b3292272m949307J048952M567628M196488K812725L971912O691894O981406
$$ -23292272 -28241579 -27192627 -22624999 -18428511 -15615786 -11643874 -4951980 2029426
7230B029426M300300K254949J905983o18911o728172j0140069m534011N944769
$$ 2029426 6329726 8584675 10490658 9871747 3143575 -6996494 -11530505 -5585736
7222e585736J0219515M288890m419113q146386p940474p988818o669821q9088
$$ -5585736 4633779 8922669 4503556 -3642830 -11583304 -19572122 -26241943 -26331031
7214b6331031Q392735J0230205L763270k893035l298157o81343p76895k441845
$$ -26331031 -17938296 -7708091 -3944821 -6837856 -10136013 -10817356 -11594251 -14036096
7206a4036096j109264K456778L649410K243893K310217M434949M655778J829500
$$ -14036096 -15145360 -12688582 -9039172 -6795279 -4485062 -50113 4605665 6435165
7198F435165k29646L81666N05303j947075m070957l126081p28893J207895L681744
$$ 6435165 6205519 6587185 7092488 5145413 1074456 -2051625 -2780518 -1572623 2109121
7189B109121O095728M068060k998556p183133j835220P336631Q700162N32521
$$ 2109121 8204849 12272909 9274353 2091220 256000 7592631 16292793 16825314
7181A6825314p339424p423084k483083J407952K484908J557975j091061l806501
$$ 16825314 9485890 2062806 -420277 987675 3472583 5030558 3939497 132996
7173A32996l423271j39438J752438P97902J399642O289312J0477243P766666L09223
$$ 132996 -3290275 -3429713 -1677275 -879373 520269 6809581 17286824 25053490 25362713
7164B5362713l900544j881712J084320o49604o014783r410168p525347k426814
$$ 25362713 21462169 19580457 20664777 20015173 14000390 4590222 -2935125 -5361939
7156e361939J332718J729798J020694K259766M975941N931511L633384l16995
$$ -5361939 -4029221 -2299423 -1278729 981037 5956978 11888489 15521873 15204878
7148A5204878m158798p146524p593864l738170K096812M288941J182347k128685
$$ 15204878 11046080 3899556 -3694308 -7432478 -5335666 -1046725 135622 -1993063
7140a993063r46438K773371M457854L502521J963647J38289k055659k379115O4698
$$ -1993063 -2939501 -166130 4291724 7794245 9757892 9896181 7840522 5461407 5526105
7131E526105J223327k380673o940015o193506r67729K652920L039635L517914
$$ 5526105 6749432 4368759 -2571256 -8764762 -9732491 -7079571 -4039936 -522022
7123e22022M145262J405717l459544m590869j645138p99656k945605p91458P336724
$$ -522022 3623240 5028957 1569413 -3021456 -4666594 -5466250 -8411855 -9203313 -1866589
7114a866589J1019920L180145o748755n810318K564391M130941l857641r314768
$$ -1866589 9153331 12333476 5584721 -225597 2338794 6469735 2612094 -6702674
7106f702674m762039K741947M846043L792342M686764M943072n3516o524396o600673
$$ -6702674 -11464713 -8722766 -3876723 -84381 4602383 9545455 9491939 2967543 -3633130
7097c633130n05318L587455J264413l398794n347841m739550l852103k690192
$$ -3633130 -4138448 -550993 713420 -2685374 -8033215 -12772765 -16624868 -19315060
7089a9315060m13314K049007L434010M066140M229555K616458j241607m585185
$$ -19315060 -19728374 -17679367 -14245357 -10179217 -5949662 -3333204 -4574811 -9159996
7081i159996m253361j154244R05322Q28420J718658N639069R376638P770474K68878
$$ -9159996 -13413357 -14567601 -13662279 -12833859 -11115201 -5476132 3900506 11670980 11939858
7072A1939858p991746j1431617q601234j763211N676746J0329437R568169L641252
$$ 11939858 3948112 -7483505 -16084739 -17847950 -12171204 -1841767 7726402 11367654
7064A1367654l144172n485652k485221R34784n67567n990121q275063k551355
$$ 11367654 8223482 2737830 252609 1187393 619826 -5370295 -13645358 -16196713
7056a6196713P188276J2118731R155929M241215L613118N353604L324627k868504
$$ -16196713 -9008437 3110294 12266223 16507438 20120556 25474160 28798787 25930283
7048B5930283p205853o413437m322380n156040p005924n292335J29211M618555
$$ 25930283 18724430 12310993 7988613 2832573 -4173351 -9465686 -9336475 -4717920
7040d717920L998849j947026r435755j2519331p567937J951568P946792P256488
$$ -4717920 -719071 -2666097 -12101852 -24621183 -32189120 -30237552 -22290760 -15034272
7032a5034272N313086P230562R627966O677776O58462j046905J848756J666340
$$ -15034272 -9721186 -2490624 7137342 13815118 14473580 13426675 15275431 16941771
7024A6941771m519371r108284m966376L569690O177252J37282o718067o074753
$$ 16941771 12422400 3314116 -1652260 1917430 8094682 8231964 1513897 -4560856
7016d560856J472936P749216O051445j800114p494342n415571J357674N547330
$$ -4560856 -3087920 4661296 10712741 8912627 1418285 -3997286 -2639612 2907718
7008B907718M393405R21407k038683m512047n982116m338553K7531L180969K900100
$$ 2907718 7301123 8222530 6183847 1671800 -4310316 -8648869 -8621338 -5440369 -2540269
6999b540269J524583J416827J082159j508006m791260n837861m384123j943595
$$ -2540269 -1015686 401141 1483300 -24706 -4815966 -10653827 -15037950 -16981545
6991a6981545R58325M009141N501610M155258J156600j564601l450021m157297
$$ -16981545 -16023220 -12014079 -6512469 -2357211 -1200611 -2765212 -6215233 -10372530
6983a0372530k664232L75764J689165p19900m452135n591609l099728J196521
$$ -10372530 -13036762 -12660998 -10971833 -11691733 -16143868 -21735477 -24835205 -23638684
6975b3638684M937342O125700M162573J478622J491531L749756M414500K610593
$$ -23638684 -18701342 -12575642 -8413069 -6934447 -5442916 -1693160 2721340 5331933
6967E331933J764073K897769K159886j927937m710611l259669j984295m602792
$$ 5331933 7096006 9993775 12153661 10225724 5515113 2255444 271149 -4331643
6959d331643o318108j537716N333734N657557J2010l385415j933556p58581j945881
$$ -4331643 -10649751 -12187467 -6853733 -1196176 -1184166 -4569581 -6503137 -7261718 -9207599
6950i207599j379774K151022L492298l84017n474524p006347m639912K74097O299010
$$ -9207599 -10587373 -8436351 -4944053 -5328070 -10802594 -17808941 -22448853 -22174756 -15875746
6941a5875746R303552N308205j984694l760088J295801M597171J038218l602193
$$ -15875746 -6572194 -1263989 -3248683 -7008771 -5712970 -1115799 -77581 -3679774
6933c679774l405965j976467m315510o339932j567423O524120Q551987L568527
$$ -3679774 -7085739 -9062206 -13377716 -19717648 -21285071 -14760951 -6208964 -2640437
6925b640437K27666L475503P867717O058336j641707q531172q914007k723193
$$ -2640437 -2412771 1062732 8930449 14988785 13347078 4815906 -4098101 -6821294
6917f821294M872037P753927M470668n05625k356326j343450p34299j301841j125339
$$ -6821294 -1949257 5804670 10275338 9769713 7413387 6069937 5335638 4033797 2908458
6908B908458J94656N48123j398476m339563n926326m821081j627082J247978J829977
$$ 2908458 3103114 3651237 2252761 -2086802 -8013128 -12834209 -14461291 -13213313 -11383336
6899a1383336J499309L584709P834275R209227M535063k423936n672978m490601
$$ -11383336 -9884027 -6299318 1534957 10744184 15279247 12855311 7182333 2691732
6891B691732k691504k230786j610627J24022J695379K143019K187672K615699
$$ 2691732 228 -2230558 -3841185 -3717163 -2021784 121235 2308907 4924606
6883D924606L211181L329530K225378m84904l349295l311203P43176N630642O803272
$$ 4924606 8135787 11465317 13690695 13205791 9856496 6545293 7288469 12919111 19722383
6874A9722383K933431l467546q678096r978528o999375k212057J327270L246743
$$ 19722383 22655814 19188268 10510172 531644 -6467731 -8679788 -7352518 -4105775
6866d105775M849333N178658K101057k200515k295391J675988K130255m850256
$$ -4105775 743558 5922216 8023273 5822758 3527367 5203355 7333610 2483354
6858B483354j1837161r214332J763133J1095701J2587155Q493798L729108J138209
$$ 2483354 -9353807 -18568139 -16805006 -5709305 6877850 15371648 19100756 20238965
6850B0238965J250205J860913p58050o249418q516167m205264J048797R80205
$$ 20238965 21489170 23350083 22592033 16342615 7826448 3621184 4669981 5650186
6842E650186r48612K132328P165024M671477n232096j1514280q703932l944568
$$ 5650186 4701574 6833902 13998926 18670403 13438307 1924027 -6779905 -10724473
6834a0724473l671157l336291K972667J0512240R909052J084175o533015o236408
$$ -10724473 -14395630 -17731921 -14759254 -4247014 5662038 6746213 213198 -6023210
6826f023210o32642L693849L707657J364334n5126J34966k1690j176039o98804
$$ -6023210 -6655852 -2962003 745654 2109988 2054862 2189828 2168138 992099 293295
6817B93295K906729N741855L098830k868440n531816l621200k479475m618067
$$ 293295 3200024 8941879 12040709 9172269 3640453 19253 -2460222 -7078289
6809g078289n719426k546348J419116K000252Q60028J767609M268209N164858
$$ -7078289 -12797715 -15344063 -13924947 -11924695 -11064667 -9297058 -5028849 136009
6801A36009L365587l5762l738437n677447l651249R53572L407676K096620J128537
$$ 136009 3501596 3465834 -272603 -5950050 -9601299 -8647727 -5240051 -3143431 -2014894
6792b014894L852818P591504P865884M259631r41869o202467r639116q442197
$$ -2014894 1837924 9429428 17295312 21554943 20613074 14410607 4771491 -3670706
6784c670706l178216Q39773K73932j493544l5317L301918M438399L063786J603214
$$ -3670706 -6848922 -6009149 -5735217 -7228761 -7264078 -3962160 476239 3540025 5143239
6775E143239O02995m14748k46840J415185J426321k211312n730270m250910J215419
$$ 5143239 5746234 5331486 5084646 6499831 7926152 5714840 -15430 -4266340 -3050921
6766c050921N802590P231330N675316M08821p527269j1736486o277356N515231
$$ -3050921 2751669 9982999 15658315 16067136 8539867 -3196619 -9473975 -3958744
6758c958744J3558134J2018522L390412o715609j3403514j2723210m688459L967601
$$ -3958744 9599390 21617912 25008324 18292715 4889201 -7834009 -12522468 -8554867
6750h554867N896935K124731m57635M1916j069611n377656p692092m656882l44134
$$ -8554867 -2657932 -533201 -990836 -948920 -2018531 -7396187 -15088279 -19745161 -20089295
6741b0089295O35755J81913K185641N059806M185062j69082k438834O17666N421442
$$ -20089295 -19453540 -19271627 -17085986 -12026180 -7841118 -8010200 -10449034 -9831368 -4409926
6732d409926N884471N85578n606235o936227k951888J649441K964219J566980
$$ -4409926 1474545 2060123 -3546112 -10482339 -13434227 -11784786 -8820567 -7253587
6724g253587l21901k321813m272396l914742K14483N308965P422487O657686N389419
$$ -7253587 -7575488 -9897301 -14169697 -18084439 -17869956 -12560991 -5138504 1519182 6908601
6715F908601L014597k378919p857745p278794l48891N438215M486513K73675m37252
$$ 6908601 9923198 7544279 -313466 -7592260 -7941151 -2502936 1983577 2257252 1820000
6706A820000K937817N264591L755294J124526L51651k7043k865008o236239m213149
$$ 1820000 4757817 10022408 13777702 14902228 15253879 15226836 12361828 6125589 1912440
6697A912440M524880J2066364R553080j037602q652503p152425j653142R01469
$$ 1912440 6437320 18503684 28056764 27019162 18366659 11214234 9561092 10462561
6689A0462561O49453K43480j700884n905715o698138O48947J0297126J2154749
$$ 10462561 11112014 11355494 9654610 3748895 -2949243 -2300296 7996830 20151579
6681B0151579N618966j394274n058438p733057q629954l480752M955190O855133
$$ 20151579 25770545 24376271 19317833 11584776 2954822 -525930 4429260 11284393
6673A1284393l66140o985346m898907J627810M510772L618991L496413M270324
$$ 11284393 10918253 3932907 -966000 661810 5172582 8791573 12287986 16558310
6665A6558310K848705n97601l260556l997877k713729J032302M754632K750683
$$ 16558310 19407015 18809414 15548858 11550981 8837252 9869554 14624186 17374869
6657A7374869n839899j2648930r640079j84987N421297L627956P33761K739374
$$ 17374869 11534970 -1113960 -10754039 -10939026 -5517729 -1889773 -1156012 1583362
6649A583362P564634Q813410M088119k263286m113250p54089J962622q23218o048119
$$ 1583362 9147996 17961406 22049525 19786239 15672989 14918900 16881522 16058304 10010185
6640A0010185o989469k954059Q55484K467467M796050P279045M484913l602089
$$ 10010185 3020716 66657 922141 3389608 8185658 15464703 19949616 16347527
6632A6347527q358200m793341M85417l43887n046288p289266o923057o225797
$$ 16347527 7989327 3195986 3681403 3337516 -1708772 -8998038 -15921095 -22146892
6624b2146892k458200O116333J2171413Q267436J21823o87474N029428N593162
$$ -22146892 -24605092 -18488759 -6317346 1950090 2071913 1384439 6413867 12007029
6616A2007029k055471p437168l857969J448198M3409m590271l834967K813110
$$ 12007029 9951558 2514390 -1343579 104619 148028 -4442243 -8277210 -5464100
6608e464100Q445841Q687696M987970N27994k414307k607689q46667K35840p90090
$$ -5464100 2981741 11669437 16657407 17185401 14771094 12163405 11316738 11552578 10762488
6599A0762488k775560m549206o313073p285534m818693K008813R503196J1734182
$$ 10762488 7986928 3437722 -2875351 -10160885 -14979578 -12970765 -3467569 8266613
6591H266613N658572n569202j3657973j1680269j792922N877600N010375O33517
$$ 8266613 13925185 8355983 -5301990 -16982259 -18775181 -12897581 -7887206 -7253689
6583g253689P31412M298360M550480J052868k05697J966208K059328j693800m041940
$$ -7253689 -6522277 -2223917 2326563 3379431 3173734 5139942 7199270 5505470 1463530
6574A463530k239215j77355Q6890K180628O657643P229460J412517l372538j374599
$$ 1463530 -775685 -953040 -866150 1314478 7972121 15201581 16614098 13241560 11866961
6565A1866961J426909k647181r369906r216449l248691j221386n236846o215772
$$ 11866961 13293870 10646689 1276783 -7939666 -11188357 -12409743 -17646589 -23862361
6557b3862361J639175J1778877J4194964P288842k462762q319244p838910k881830
$$ -23862361 -22223186 -10444309 3750655 11039497 8576735 257491 -7581419 -10463249
6549a0463249K214259M098445L426828L264865M472226M640047J887650k054687
$$ -10463249 -8248990 -4150545 -723717 2541148 7013374 11653421 13541071 11486384
6541A1486384l233114L95052N813467O579733J22374o878041m994303M803364
$$ 11486384 8253270 8648322 14461789 21041522 21163896 14285855 9291552 14094916
6533A4094916J0469165M789734m567107o892216l909611m249439p150064l890402
$$ 14094916 24564081 29353815 24786708 17894492 13984881 9735442 2585378 -1305024
6525a305024N285104Q741646J435164o367592m783143J122515J306449k344137
$$ -1305024 3980080 12721726 14156890 7789298 3006155 4128670 5435119 3090982
6517C090982m19005O499893P147246k505590j1463404q794896J025652M751351
$$ 3090982 2671977 9171870 16319116 13813526 2350122 -6444774 -5419122 -667771
6509f67771j684639r257786r122030k802928L091881O629151J0029361J2521305
$$ -667771 -2352410 -11610196 -20732226 -23535154 -20443273 -13814122 -3784761 8736544
6501H736544J0257136L577149j679683k432150k662480n800916p793947l555801
$$ 8736544 18993680 22570829 20891146 18458996 15796516 9995600 2201653 -1354148
6493a354148L301335M686633N22996j177131K550844M825387M88265n145872m659390
$$ -1354148 1947187 6633820 7156816 5979685 8530529 13355916 13844181 8698309 4038919
6484D038919L7230J478732j578795l328176o84671K685981K777778M56388j377474
$$ 4038919 4076149 5554881 3976086 647910 -36761 2649220 5426998 5883386 4505912
6475D505912k031072k345584k115222k33962L240637O138029N597939J163738
$$ 4505912 2474840 129256 -1985966 -2219928 1020709 7158738 12756677 13920415
6467A3920415l584612m329323j518885k6503k173248m521648l878809k408385
$$ 13920415 10335803 6006480 4487595 4461092 2287844 -2233804 -6112613 -8520998
6459h520998k738738j943043L509865R440257Q164843N38266m036069j054985
$$ -8520998 -11259736 -13202779 -9692914 -252657 7912186 8450452 4414383 3359398
6451C359398L140430J889294k334470l709794k405677j961791j548875K032748
$$ 3359398 6499828 8389122 6054652 2344858 -60819 -2022610 -3571485 -1538737
6443a538737O631689O185322J23276m813831l941663j006223k337755p860259
$$ -1538737 5092952 11278274 11401550 6587719 2646056 1639833 -697922 -8558181
6435h558181j1472768r202975l686201J23820J320778K972050O521696R289927
$$ -8558181 -20030949 -29233924 -32920125 -32796305 -31475527 -28503477 -21981781 -12691854
6427a2691854Q685316O066388L875743J484572k282497m718073k796456N1184
$$ -12691854 -4006538 2059850 5935593 7420165 5137668 419595 -2376861 -2325677
6419b325677k356956q092009p943067L67527P114357M606988j423777j382561
$$ -2325677 -4682633 -12774642 -20717709 -20350182 -13235825 -8628837 -10052614 -11435175
6411a1435175L798157O264515M262023K253814J427397m01578j687710M85562
$$ -11435175 -7637018 -1372503 2889520 5143334 6570731 6169153 4481443 4967005
6403D967005K661909m05740m725615j695190O418417P855562q359o105924l603669
$$ 4967005 7628914 7223174 2497559 802369 7220786 15076348 15067989 8962065 5358396
6394E358396L49149j084737k699896J424167N488985J601399o175862q467358
$$ 5358396 5707545 4622808 1922912 3347079 8836064 10437463 4261601 -4205757
6386d205757n223658k980929k557814k79854K666545K918473L379940P823588
$$ -4205757 -9429415 -12410344 -14968158 -15248012 -12581467 -9662994 -6283054 1540534
6378A540534J0294326K459381j0024795j2021519q65007R317052Q502585L561197
$$ 1540534 11834860 14294241 4269446 -7752073 -8617080 699972 9202557 12763754
6370A2763754M398568Q157994N665032l362762j0153717q785029k048815L018380
$$ 12763754 17162322 25320316 30985348 27622586 17468869 8683840 6635025 9653405
6362I653405J807063m130472q220249n810852j08099K365620J431323K502002
$$ 9653405 11460468 7329996 -890253 -6701105 -6809204 -4443584 -3012261 -510259
6354e10259O233301O683695J911898j654014L40708K582352j303848q187995r892615
$$ -510259 5723042 12406737 14318635 12664621 13005329 15587681 14283833 6095838 -3796777
6345c796777m444716K941361P295734P178573L044376k742960o030837n142208
$$ -3796777 -8241493 -5300132 1995602 9174175 12218551 9475591 3444754 -1697454
6337a697454l401386m091528n129670k357705L861776Q867537R018435M158772
$$ -1697454 -5098840 -9190368 -14320038 -16677743 -12815967 -3948430 5070005 9228777
6329I228777l187871q583498q057825k432441K907848M577851M599884N387521
$$ 9228777 6040906 -2542592 -10600417 -13032858 -10125010 -5547159 -947275 4440246
6321D440246N465519L168873L62008j312599l790929p831201r008690l898983
$$ 4440246 9905765 13074638 13436646 12124047 8333118 501917 -8506773 -12405756
6313a2405756L021360M663723J291236q29267O76515J841241l61674l721288m702457
$$ -12405756 -9384396 -4720673 -3429437 -4258704 -3582189 -1740948 -2102622 -5823910 -10526367
6304a0526367k762824J45716J794625J143154o19041j061787J66057O26317j006303
$$ -10526367 -13289191 -13143475 -11348850 -10205696 -10824737 -11886524 -11720467 -11094150 -12100453
6295a2100453k825631k970909j810872P06339N438626R406680O320961m080349
$$ -12100453 -14926084 -17896993 -19707865 -19001526 -13562900 -4156220 2164741 -1915608
6287a915608j2497348j1096804l325948K729197N451768P366212P060855K276563
$$ -1915608 -14412956 -25509760 -28835708 -26106511 -20654743 -13288531 -6227676 -3951113
6279c951113k597291j540774K765753K822762j079426j610531K992444O669409
$$ -3951113 -6548404 -8089178 -5323425 -2500663 -3580089 -5190620 -2198176 4471233
6271D471233O068971L969082J498504l526290q952243q461223k026472K502947
$$ 4471233 10540204 14509286 16007790 12481500 3529257 -4931966 -6958438 -4455491
6263d455491J227075o73928J212396L747928L090044P42516j132189l355075n131675
$$ -4455491 -3228416 -3902344 -2689948 1057980 4148024 4890540 3758351 403276 -4728399
6254d728399l158859J060967Q48146m583802o965155j963467L118335J101891
$$ -4728399 -7887258 -6826291 -5978145 -10561947 -17527102 -19490569 -16372234 -15270343
6246a5270343l557630k792864K262778M845244L519483J282018j623440n661914
$$ -15270343 -18827973 -21620837 -19358059 -14512815 -10993332 -9711314 -11334754 -16996668
6238a6996668o698961j021425P335044J1664107J1633845J0113107N568620l321212
$$ -16996668 -23695629 -24717054 -17382010 -5717903 5915942 16029049 21597669 18276457
6230A8276457r525766n107895N081956Q407231K856013j059817J712822K849531
$$ 18276457 8750691 3642796 8724752 17131983 19987996 18928179 20641001 23490532
6222B3490532m579246j3750605j3904333n637624J384302K058005J18054M53028
$$ 23490532 18911286 5160681 -8743652 -14381276 -12996974 -10938969 -10820915 -10367887
6214a0367887K926163M146350K053965j848179l709225j304124K918629M346869
$$ -10367887 -7441724 -3295374 -1241409 -3089588 -6798813 -8102937 -5184308 -837439
6206h37439J898130j170937k392525k778209l296415k234476J493852N120494
$$ -837439 1060691 -110246 -2502771 -5280980 -8577395 -10811871 -9318019 -4197525
6198d197525N172299K380387N93637J466017K807709K267793L87167r15567j316260
$$ -4197525 974774 3355161 3948798 5414815 8222524 10490317 10877484 9961917 8645657
6189H645657j932429k789508k472681q85169k20503j396668j523971J905433N701100
$$ 8645657 6713228 3923720 1451039 565870 345367 -1051301 -2575272 -669839 5031261
6180E031261M358421j410562m847209k977913l72360n26733l8843L784535N733177
$$ 5031261 9389682 7979120 3131911 153998 -218362 -745095 -783938 3000597 8733774
6171H733774N20481o541648n625899K734092Q043637N343889J286840K332458
$$ 8733774 9254255 2712607 -2913292 -179200 7864437 13208326 14495166 16827624
6163A6827624N027103K690328l972251q292876o568620j281017K888217L288547
$$ 16827624 21854727 24545055 20572804 12279928 5711308 4430291 7318508 10607055
6155A0607055O51013k091065l118278l725523n196844n140154j008255L752714
$$ 10607055 11258068 9167003 6048725 2323202 -2873642 -8013796 -9022051 -5269337
6147e269337L047654j801808k291374M211744Q526139J979159j0437837j5675366
$$ -5269337 -2221683 -4023491 -6314865 -2103121 6423018 8402177 -2035660 -17711026
6139a7711026q692357K971579R299302P310482J135479k843731q39566M908787
$$ -17711026 -26403383 -23431804 -14132502 -6822020 -5686541 -8530272 -9369838 -4461051
6131d461051P618450L528800k933698m530248n02821L243940K485123r66284l325520
$$ -4461051 3157399 6686199 3752501 -777747 -1280568 1963372 4448495 3482211 156691
6122A56691l262989j579212k9738j226793o012486r868571o167043M650692J2999916
$$ 156691 -3106298 -4685510 -4715248 -5942041 -11954527 -21823098 -27990141 -23339449 -10339533
6113a0339533J0825998J548840m761486l996468o80804J048005K763551O093957
$$ -10339533 486465 2035305 -2726181 -6722649 -7403453 -6355448 -3591897 2502060
6105B502060P456020L075910l915601o561703l059287J900876M171917L831802
$$ 2502060 9958080 13033990 9118389 2556686 -502601 1398275 5570192 9401994
6097I401994J820703j780180m662563k737047L393488O813188K878532m140330
$$ 9401994 11222697 9442517 4779954 2042907 5436395 12249583 15128115 10987785
6089A0987785p006727m889637k301057j550628j448147j346722r66131K009357
$$ 10987785 3981058 -908579 -3209636 -4760264 -6208411 -7555133 -8521264 -6511907
6081f511907Q082354J1193394N150845n304141p976524K74725Q333935N947918
$$ -6511907 1570447 12763841 17914686 12610545 4634021 4908746 13242681 19190599
6073A9190599k886759p053321l354313K124386M218992L364497J289378j803784
$$ 19190599 16303840 9250519 5896206 8020592 12239584 15604081 16893459 15089675
6065A5089675n060209o279334m675022j938269l1727M21237k31600r81645l84135
$$ 15089675 10029466 3750132 -924890 -2863159 -2894886 -2473649 -2705249 -3686894 -4071029
6056d071029K074552M991038O218935M594876M29876m403401o913135n593962
$$ -4071029 -1996477 2994561 9213496 13808372 14238248 9834847 2921712 -2672250
6048b672250k736449j640029j577401R12350N393931O963006L920720R03673J474610
$$ -2672250 -5408699 -7048728 -8626129 -7713779 -2319848 4643158 8563878 9467551 10942161
6039A0942161K649461P92064j927259k164851k096354m972365p340120l419537
$$ 10942161 13591622 14383686 12456427 10291576 8195222 3222857 -4117263 -7536800
6031g536800M213402O309022o3079p260727p656311k555122J904226K763348J210473
$$ -7536800 -3323398 2985624 2922545 -4338182 -11994493 -14549615 -12645389 -9882041 -8671568
6022h671568o25268q31279J678588N234039O062177K709602j833060l662551k032838
$$ -8671568 -9296836 -10128115 -8449527 -3215488 2846689 5556291 3723231 60680 -1972158
6013a972158Q97924K740406K658085J781857J860993K476802R62664l000316n058985
$$ -1972158 -1074234 1666172 4324257 6106114 7967107 10443909 11406573 8406257 3347272
6004C347272k053291K063371J360501k511000k401440K885336O576197M804930
$$ 3347272 1293981 3357352 4717853 2206853 -194587 2690749 9266946 14071876
5996A4071876J825589J204631m82222n843745r366481n236872K282558M421682
$$ 14071876 15897465 17102096 16619874 10776129 1409648 -3827224 -1544666 2877016
5988B877016R76994o12677J924156K609184j827723n967615m179941J017595L570445
$$ 2877016 3854010 3241333 5165489 7774673 5946950 -20665 -4200606 -3183011 387434
5979C87434K615293J723387K009556J099369j529188k532696O13986N325965O080659
$$ 387434 3002727 4726114 6735670 7835039 6305851 3773155 4387141 9713106 15793765
5970A5793765M12838q024262j2485619r388039j789297L605084L157564l31145
$$ 15793765 16206603 8182341 -4303278 -13691317 -15480614 -11875530 -8717966 -9049111
5962i049111j253112K443584P394118R028269O333412J901546j483526k828412
$$ -9049111 -10302223 -7858639 -464521 8563748 14897160 16798706 15315180 12486768
5954A2486768k190973j75446J410406O37183j537421j504237J673690L299042
$$ 12486768 10295795 10120349 11530755 12167938 10630517 9126280 10799970 14099012
5946A4099012j130759q202664r125541r17258Q693797R689641P96191r744829
$$ 14099012 12968253 4765589 -4359952 -5277210 3416587 13106228 13902419 4157590
5938D157590j2726695n924468M744466J0587749Q027836J947461k54213K344438
$$ 4157590 -8569105 -14493573 -9749107 838642 8866478 10813939 10559726 12904164
5930A2904164M078412J459821k591593m704222n930296p411887o269373p80567
$$ 12904164 16982576 18442397 15850804 11146582 5216286 -2195601 -8464974 -9245541
5922i245541M390589M013464L01491j093642l27171j317050k567695J025846P304351
$$ -9245541 -4854952 -841488 -539997 -1633639 -1960810 -3277860 -5845555 -4819709 2484642
5913B484642P499798J75676m888236j338805L881191K044993l332287k940353
$$ 2484642 9984440 10160116 5271880 3933075 7814266 9859259 6526972 3586619
5905C586619K684473M183935j544121p148821o775268l529197k024774q60977
$$ 3586619 6271092 10455027 8910906 1762085 -5013183 -8542380 -10567154 -11428131
5897a1428131K651271N621102L503705j721111l247830Q57821M633605K613024
$$ -11428131 -8776860 -3155758 347947 -1373164 -4620994 -3763173 870432 3483456
5889C483456k250444k356389L913530R034524N469794m462557j1160421r502454
$$ 3483456 1233012 -1123377 2790153 11824677 17294471 12831914 1671493 -7830961
5881g830961m010001j196634j126166J15141K940797M213467L149948K055817
$$ -7830961 -11840962 -13037596 -14163762 -14048621 -11107824 -6894357 -3744409 -1688592
5873a688592J288175j337469n045513n036995N50146O636723P467119M030165
$$ -1688592 -400417 -1737886 -6783399 -11820394 -11270248 -4633525 2833594 6863759
5865F863759J711280K479030L130340O39286l963133p335586p318710m263347
$$ 6863759 8575039 11054069 14184409 14823695 10860562 3524976 -3793734 -8057081
5857h057081j92989K979544M803776N654814N027019J943220k728116o355234
$$ -8057081 -8250070 -5270526 -466750 5188064 10215083 12158303 9430187 3074953
5849C074953p544235o801143l686444L082906J0801880J2306506M575240n106721
$$ 3074953 -4469282 -11270425 -14956869 -11873963 -1072083 11234423 15809663 10702942
5841A0702942o829382m59549N022694L956030j48537j871374r25729M25693J695320
$$ 10702942 3873560 3414011 8436705 12392735 12244198 10372824 9447095 9872788 11568108
5832A1568108K482890P69876l165652m672238q47831M192257M745759J678943
$$ 11568108 14050998 14820874 11655222 6982984 6135153 10327410 15073169 16752112
5824A6752112M1310O56493J47925j762613j817727l74950j761148n630834n400113
$$ 16752112 16793422 17449915 17597840 15835227 14017500 13642550 11881402 6250568 850455
5815H50455R45183N603369K269874l537743l110594J446667J471980k869722k884935
$$ 850455 1795638 7399007 9668881 6131138 3020544 4467211 5939191 3069469 184534
5806A84534K584385L446640n023878j2672163q933071J606879P111422N666215
$$ 184534 2768919 6215559 1191681 -11480482 -20413553 -18806674 -11695252 -6029037
5798f029037M404959N662738N089250K011292P53301J148695j921459p707176
$$ -6029037 -1624078 4038660 9127910 11139202 11892503 13041198 11119739 3412563
5790C412563q424954k205233K525772L77837k541787J42382L970530K117866j977181
$$ 3412563 -5012391 -7217624 -4691852 -4314015 -6855802 -6713420 -2742890 -625024 -2602205
5781b602205l10172N894179Q265809M845627J827460K367693K602356l37916l848695
$$ -2602205 -2912377 2981802 11247611 16093238 17920698 20288391 22890747 22552831 18704136
5772A8704136m720700k618702J642125N671305M145603n236029j4906277j4353939
$$ 18704136 13983436 11364734 13006859 18678164 22823767 17587738 2681461 -11672478
5764a1672478m295494M214753N574020N136262O759125N476535j921904q345490
$$ -11672478 -15967972 -11753219 -6179199 -1042937 5716188 11192723 9270819 925329
5756I25329o204646J058086N264059N867255P512086R307246N839355k547905
$$ 925329 -5279317 -4221231 1042828 6910083 14422169 23729415 29568770 27020865
5748B7020865q752641q505585m642941j362445M79801J721197K799816L859151
$$ 27020865 18268224 9762639 5119698 3757253 4237054 5958251 8758067 12617218
5740A2617218M082797J688817k717287m793448j936111K282090L143527J385602
$$ 12617218 16700015 18388832 15671545 10878097 8941986 11224076 14367603 15753205
5732A5753205j938k045378o239874p864035j572037P533375Q158553p60859p646287
$$ 15753205 15751267 13705889 7466015 -398020 -1970057 5563318 13721871 12961012 5314725
5723E314725n338780r53351l179673q333273p184228K36384N817726O116996M836268
$$ 5314725 -24055 -977406 -4157079 -12490352 -19674580 -19438196 -13620470 -7503474 -2667206
5714b667206L777543M35166m221373m072940K344424P088908L209057m744912
$$ -2667206 1110337 1545503 -2675870 -6748810 -4404386 2684522 5893579 1148667
5706A148667o836099j703511K469402N32218l062110k265479K166570O153561
$$ 1148667 -5687432 -7390943 -4921541 -4389323 -7451433 -9716912 -7550342 -1396781
5698a396781Q986071J1009435Q624476r54534j1614858j3213111n288184J896693
$$ -1396781 7589290 18598725 27223201 26268667 14653809 1440698 -3847486 -1950793
5690a950793K115641Q65575M190492P929276N227255j213561l084855O09905L126106
$$ -1950793 164848 1030423 5220915 13150191 18377446 17163885 14079030 14688935 17815041
5681A7815041R93279k449253m115674m459215l451166r5237L328737K829164o90484
$$ 17815041 18808320 16359067 12243393 7784178 4333012 4237775 7566512 10395676 9705192
5672I705192k346120j240042j070924k254802q23840L197578M012185m26795m357663
$$ 9705192 7359072 6119030 5048106 2793304 1969464 5167042 9179227 8752432 4394769
5663D394769l429593j171384j771714k774865l83159L286354L965519K056331
$$ 4394769 965176 -206208 -1977922 -4752787 -5135946 -1849592 2115927 4172258
5655D172258M95564l39460r01989J69582K308489J374939l082406m324370J330148
$$ 4172258 4667822 4328362 3426373 3595955 5904444 7279383 4196977 -127393 1202755
5646A202755O287387K142691o146113o647773J552986P677181O149993L047626
$$ 1202755 7490142 9632833 3486720 -3161053 -1608067 6069114 12219107 15266733
5638A5266733L682090M261677L36333m983125o696433n321788l479683p35625
$$ 15266733 18948823 23210500 23546833 18563708 11867275 6545487 3065804 2330179
5630B330179K921922L627553m99915m191020j822602L692274M829948q173n783007
$$ 2330179 5252101 8879654 8379739 4188719 2366117 6058391 10888339 10880166 5097159
5621E097159q823341r285281o604384O32739R309328J2352508P116489j018482
$$ 5097159 -3726182 -13011463 -19615847 -18983108 -9673780 2678728 9795217 8776735
5613H776735n385692m624081j088538K770812M023390j8079o833555q466832j123742
$$ 8776735 3391043 -1233038 -2321576 449236 4472626 4454547 -2379008 -10845840 -11969582
5604a1969582Q109776R658670M002519q11799k361434n794773j1788718j2480588
$$ -11969582 -3859806 5798864 9801383 8989584 6628150 833377 -10955341 -23435929
5596b3435929m264647L985441L374910p42561K894868J2430595J4173409L567734
$$ -23435929 -27700576 -23715135 -20340225 -21082786 -18187918 -5757323 8416086 11983820
5588A1983820o837095n220831L131519M916126j976547p438301m860112R15042
$$ 11983820 5146725 -74106 3057413 7973539 5996992 -1441309 -6301421 -5386379
5580e386379K326453r89737l954855l423706k81849L577174O724851O986658K183552
$$ -5386379 -3059926 -4049663 -8004518 -11428224 -11710073 -8132899 -1408048 5578610 7762162
5571G762162o040255j1183281q046894J66265M650670K171043q59315J519119
$$ 7762162 1721907 -9461374 -17508268 -17342003 -12691333 -10520290 -11379605 -9860486
5563i860486N430984L697884j977795l615029l30847L92163l966785o072656q89751
$$ -9860486 -4429502 -731618 -2709413 -6324442 -6655289 -6263126 -10229911 -16302567 -17192318
5554a7192318O139959Q403981P586265P373479N293680j040448o037375l998263
$$ -17192318 -11052359 -2648378 4937887 12311366 17605046 16564598 10527223 6528960
5546F528960Q4896k011185p018894m284064O772010J4723630J2410668M585080
$$ 6528960 6613856 4602671 -2416223 -6700287 71723 14795353 27206021 31791101
5538C1791101k425776q260408j2466038j0902867l568772J939661O22658k629794
$$ 31791101 29365325 21104917 8638879 -2263988 -5832760 -3893099 -3270441 -5900235
5530e900235j435163K324846L136026J131457K04307O23556P500r55602J01674
$$ -5900235 -7335398 -5010552 -1874526 -743069 -538762 84794 92294 -863308 -761634
5521g61634J781730M90114l382546n644390m238995j054013J664629L158785L021587
$$ -761634 1020096 1510210 -1872336 -7516726 -11755721 -12809734 -11145105 -7986320 -4964733
5512d964733J541486O61807J660028K624768J093622j818796l015166k071162
$$ -4964733 -3423247 -2761440 -1101412 1523356 2616978 798182 -2216984 -4288146
5504d288146q78419L95245K988743N571785N007969J724356o194J327875J756501
$$ -4288146 -5166565 -4771320 -1782577 3789208 8797177 10521533 10515339 11843214 13599715
5495A3599715j642899n217426l844696Q24823K391988n75174k569466n42014N65058
$$ 13599715 11956816 6739390 2894694 3719517 6111505 5536331 2966865 2424851 2989909
5486B989909l707153p895934l213190P869316J2558389N470327l261362l047204
$$ 2989909 -717244 -8613178 -11826368 -3957052 8601337 14071664 10810302 7763098
5478G763098J658370l49878q425388j1012340l987758L428201L397495k43179
$$ 7763098 9421468 9071590 646202 -10366138 -14353896 -10925695 -7528200 -7771379
5470g771379j087747n42566k320789l584204J78936N878472O827980L666129L230986
$$ -7771379 -8859126 -9401692 -11722481 -15306685 -15127749 -9249277 -2421297 1244832 4475818
5461D475818P165758R108095M356559l651042q434319p643677l403467R27918
$$ 4475818 11641576 20749671 25106230 21455188 13020869 5377192 1973725 2901643
5453B901643K656575J202641r56929q72915Q41313R13125j512573l720097l893069
$$ 2901643 5558218 6760859 5803930 4931015 5772328 6685453 5172880 1452783 -2440286
5444b440286l347816k966101q13660M133479Q376544P315933J391939m038543
$$ -2440286 -5788102 -8754203 -9567863 -5434384 2942160 10258093 11650032 7611489
5436G611489m926105k326577L97431J945314L218496M401303L989584J054345
$$ 7611489 2685384 358807 756238 2701552 5920048 10321351 14310935 15365280
5428A5365280k743408m207623j568419L497269O475946L557993l846269q802951
$$ 15365280 12621872 8414249 6845830 10343099 16819045 20377038 16530769 7727818
5420G727818n866468J404235L741070j498919o029888k498813M076333L511832
$$ 7727818 1861350 3265585 7006655 5507736 -522152 -3020965 1055368 4567200
5412D567200l813386p388032k852963J751746n64645m821099k826548L789049
$$ 4567200 753814 -6634218 -9487181 -7735435 -8300080 -13121179 -15947727 -12158678
5404a2158678P054522M859854J557260j058784m877004q183368n694285K362252
$$ -12158678 -5104156 -244302 1312958 254174 -4622830 -12806198 -18500483 -16138231
5396a6138231Q217424O610676J370954j320708j288869j695522k033496M50327
$$ -16138231 -7920807 -1310131 60823 -1259885 -2548754 -4244276 -6277772 -5827445
5388e827445L994829L062407l074371p365226l702437M299499P339585K401944
$$ -5827445 -1832616 1229791 -1844580 -9209806 -12912243 -8612744 -1273159 1128785
5380A128785l668183l717557O03588K375007p30594m393292m336196p66459L780162
$$ 1128785 -2539398 -6256955 -5653367 -3278360 -4008954 -8402246 -12738442 -13504901 -9724739
5371i724739P031455P114733L956366Q70366P94231J105592k604988p554629n753489
$$ -9724739 -2693284 4421449 8377815 9248181 10042412 11148004 8543016 988387 -4765102
5362d765102L046200Q481680M135163k856031l341429j10494j337025n650628
$$ -4765102 -1718902 6762778 10897941 8041910 4700481 4589987 3252962 -2397666
5354b397666m768976J710700N637677M112881K749320L639092J280399n650035
$$ -2397666 -7166642 -5455942 181735 4294616 7043936 10683028 11963427 6313392
5346F313392q965962l628492L029077K485502j519543K08529O838452Q940920
$$ 6313392 -2652570 -6281062 -3251985 -766483 -2286026 -2077497 4760955 13701875
5338A3701875L609745j728643j652100j61505k417263n993522n542307j760649
$$ 13701875 17311620 15582977 13930877 13769372 11352109 5358587 -183720 -1944369
5330a944369J70406q68753p35838K388866M333343J120257m727869p339542m974548
$$ -1944369 -1773963 -2642716 -3378554 -989688 3343655 4463912 -263957 -7603499 -12578047
5321a2578047r73792J586984K442423J706589r03282l615956l427897q12738M86851
$$ -12578047 -13551839 -11964855 -9522432 -7815843 -8719125 -12335081 -15762978 -16575716 -16088865
5312a6088865J69259K811411R205794J1803600M869914n032174o670366j27598
$$ -16088865 -15919606 -13108195 -3902401 7901199 12771113 7738939 1068573 940975
5304I40975L818537M34930k505350J700066P440239N506575k976748q905364q181176
$$ 940975 4759512 5194442 2689092 4389158 11829397 17335972 14359224 5453860 -2727316
5295b727316m760940j884027K257978Q593626J2869052J0640328L337276l610911
$$ -2727316 -7488256 -9372283 -7114305 1479321 14348373 24988701 28325977 24715066
5287B4715066o712531o085014l065450Q26378L372264L244032K294043L373067
$$ 24715066 18002535 11917521 8852071 9678449 13050713 16294745 18588788 21961855
5279B1961855N183505K644998n506305j2546320j0893771j795276O122286P161471
$$ 21961855 27145360 29790358 24284053 11737733 843962 -951314 5170972 12332443
5271A2332443L162992j757445n854626q121321p244233m501849l304993l539639
$$ 12332443 15495435 13737990 7883364 -237957 -7482190 -11984039 -15289032 -18828671
5263a8828671r79147N019766Q499042N463775L70082q19167P17993O60421l94162
$$ -18828671 -19807818 -14788052 -6289010 -825235 -455153 -1274320 -556327 104094 -290068
5254b90068K65638N17622k772537n796271k383022M892368P101175K315774k132308
$$ -290068 -24430 493192 -2279345 -8075616 -10458638 -5566270 1534905 3850679 1718371
5245A718371j494903Q87893J594204K202974L595089K972290J71493k0864M032252
$$ 1718371 223468 1111361 2705565 4908539 8503628 11475918 11647411 11626547 15658799
5236A5658799O578747K835332l537903n775124k739033J528697L490849K222887
$$ 15658799 22237546 25072878 21534975 15759851 13020818 14549515 18040364 20263251
5228B0263251r63479k750179q55681K103642J840322l98538L36898L355164K446120
$$ 20263251 19299772 16549593 15693912 17797554 19637876 19239338 19576236 22931400 25377520
5219B5377520k982984n498130j749233J703690n50069m375801m652710l892372
$$ 25377520 22394536 16896406 15147173 16850863 16300794 11924993 7272283 3379911
5211C379911n157998m439779J177554M918665M0777p550382p338652n48994L031997
$$ 3379911 -1778087 -6217866 -5040312 -121647 -80870 -7631252 -14969904 -15518898 -12486901
5202a2486901J548866J985016N552783N041798j300830n034960r62257M441763
$$ -12486901 -10938035 -8953019 -3400236 1641562 340732 -4694228 -5656485 -1214722
5194a214722L584145r02920j626577K163940M925765L496665Q8807k044634k108146
$$ -1214722 2369423 1466503 -160074 2003866 6929631 10426296 10515103 8470469 6362323
5185F362323j304196j024729j378617j038014O82624K064248J000817j782167
$$ 6362323 5058127 4033398 2654781 1616767 2299391 4363639 5364456 3582289
5177C582289l629587l455459k076526M7995K700679M347676L607894J650675M82395
$$ 3582289 -47298 -3502757 -5579283 -5531288 -2830609 1517067 5124961 6775636 7258031
5168G258031p6135q78484n80972K055906M519617L454219K7886k161511l372868
$$ 7258031 7181896 6303412 5722440 7778346 12297963 15752182 15780068 13618557 10245689
5159A0245689o488752j0014938q647696k050030K913564J403841k722682k914885
$$ 10245689 3756937 -6258001 -14905697 -16955727 -14042163 -12638322 -15361004 -18275889
5151a8275889Q68824K881294o7199m426825m476255M66389M642843K637370k890338
$$ -18275889 -17407065 -14525771 -14592970 -19019795 -23496050 -23029661 -18386818 -15749448 -18639786
5142a8639786l180710N306853J4838698J5192780O044563l799056p749497o867660
$$ -18639786 -21820496 -16513643 -1674945 13517835 19562398 15763342 8013845 1146185
5134A146185m711410k393614J36839K202861L338972L469992J908046j201831
$$ 1146185 -3565225 -5958839 -5822000 -3619139 -280167 3189825 5097871 3896040
5126C896040l187305j985754K9008n77838k220467o68024L087787L323391j377006
$$ 3896040 708735 -1277019 -1248011 -1825849 -4046316 -4714340 -1626553 1696838 319832
5117C19832n575716n240142k911045k004912j167392J961330N342747N177083
$$ 319832 -5255884 -10496026 -13407071 -15411983 -16579375 -14618045 -9275298 -4098215
5109d098215J629002j791760l248855l916792m909927n341596l747555k01880
$$ -4098215 -2469213 -4260973 -7509828 -11426620 -16336547 -21678143 -25425698 -25627578
5101b5627578L566050O072475P538041Q588199Q265074N794081L977819O416921
$$ -25627578 -22061528 -15989053 -8451012 137187 8402261 14196342 18174161 24591082
5093B4591082J0066978O316229o622634j7897207j6632022o142107J413313J120209
$$ 24591082 34658060 40974289 34351655 16454448 -177574 -6319681 -4906368 -3786159
5085c786159j875307l037841k857029j416859K450563O076382N180376J732554
$$ -3786159 -5661466 -8699307 -11556336 -12973195 -10522632 -4446250 734126 2466680
5077B466680J580259M093422L219354o65158m93362L961270L872227l083099o685069
$$ 2466680 4046939 8140361 11359715 10694557 10201195 14162465 18034692 14951593 8266524
5068H266524n96001N961859K397028o078675o741310R32023N785666K746866j243335
$$ 8266524 7670523 13632382 16029410 9950735 3209425 4141448 9927114 12673980 11430645
5059A1430645L24642M485518N066562J700530j014757k57991J901393J551083
$$ 11430645 11755287 16240805 21307367 23007897 21993140 21735149 23636542 25187625
5051B5187625j882892m470301l132859p66149k301224o360359o426534j190115
$$ 25187625 23304733 18834432 15701573 14935424 12634200 6273841 -152693 -1342808
5043a342808K720053Q92070k393190j746232J130522J673387o2645j324156k018004
$$ -1342808 1377245 2269315 -123875 -1870107 -739585 933802 871157 -452999 -2471003
5034b471003l276101m142326l775256l265135k033269K460055P864358O592578
$$ -2471003 -5747104 -9889430 -13664686 -16929821 -18963090 -16503035 -8638677 -2046099
5026b046099k186448p360522m38527J0839956J2737091M566625k885416m737123
$$ -2046099 -4232547 -11593069 -12031596 -1191640 11545451 16112076 13226660 8489537
5018H489537o212814j0010747j0982945o000754K25021L052315M337758O724834
$$ 8489537 2276723 -7734024 -18716969 -24717723 -24492702 -21440387 -17102629 -10377795
5010a0377795P404365K640483n012766q818565o016539n65528K373935K625840
$$ -10377795 -2973430 -332947 -5345713 -14164278 -20180817 -20746345 -18372410 -15746570
5002a5746570M138518Q089286R570484M266883l501126n228296q00113P74109
$$ -15746570 -11608052 -3518766 6051718 10318601 6817475 1589179 789066 1563175
4994A563175m381256q311076m103437K424521J943752l662688n474995k358464
$$ 1563175 -2818081 -11129157 -15232594 -12808073 -10864321 -14527009 -20002004 -22360468
4986b2360468j150291l824593m702653o74009M809659Q851195J1956392J2511534
$$ -22360468 -23510759 -27335352 -32038005 -32712014 -27902355 -19051160 -7094768 5416766
4978E416766O640458l792769j0092037p087320N98779N359372N034200K089446
$$ 5416766 12057224 8264455 -1827582 -8914902 -8316123 -2956751 2077449 4166895
4970D166895j183933l549671l864924k028471L83582J629616J218192J12758K52533
$$ 4166895 2982962 -566709 -4431633 -6460104 -6076522 -4446906 -3228714 -3115956 -2863423
4961b863423K349857L486463Q3405n482198o197327j113646J522333l177349p740978
$$ -2863423 -513566 2972897 3056302 -2425896 -8623223 -9736869 -8214536 -11391885 -19132863
4952a9132863l525180M911714O576455J427731j78125N698947J1258836R614629
$$ -19132863 -22658043 -17746329 -11169874 -9742143 -9920268 -4221321 7037515 16652144
4944A6652144L328286j965496m767706o132863o861312p873725q757269o305236
$$ 16652144 19980430 18014934 13247228 7114365 253053 -7620672 -16377941 -22683177
4936b2683177O16551O710581O735040L516273K349470J217632m027313q390253
$$ -22683177 -22066626 -15356045 -8621005 -5104732 -2755262 -1537630 -5564943 -13955196
4928a3955196l622112O321001Q813432J955042k769341P98303N269818L828786
$$ -13955196 -17577308 -11256307 -2442875 -487833 -3257174 -2458871 2810947 6639733
4920F639733K2240j589347l188775o334574o869560k924480R12691K249772M685797
$$ 6639733 6661973 5072626 1883851 -4450723 -11320283 -14244763 -13332072 -11082300 -6396503
4911f396503Q645745Q248527K226694j994048n67892K96767m036292q377263p497058
$$ -6396503 2249242 10497769 12724463 10730415 10162523 10459290 6422998 -1954265 -9451323
4902i451323m724632m034611k508188K450225O640118O171029L326918M87770
$$ -9451323 -14175955 -18210566 -20718754 -18268529 -11628411 -5457382 -2130464 -1642694
4894a642694l176666n249808j027782N218629K671050p596799j1092141k891374
$$ -1642694 -4819360 -10069168 -11096950 -5878321 -3207271 -10804070 -21896211 -24787585
4886b4787585L936215O64224l902739k375414j923182o323704n398550K678944
$$ -24787585 -20851370 -20187146 -24089885 -26465299 -28388481 -34712185 -40110735 -37431791
4878c7431791J116087j4696648k1825675j0995310j4423762n2995746p9670149
$$ -37431791 -36315704 -51012352 -72838027 -83833337 -98257099 -151252845 -230922994
4871b30922994l0977255P1293097J29393597R3058971K0206923r767120M875452
$$ -230922994 -261900249 -190607152 -61213555 31845416 52052339 42285219 47160671
4864D7160671J2926475l450205j6111355p868408M759777N739642J004152l87532
$$ 47160671 60087146 56636941 40525586 32657178 37416955 43156597 44160749 43773217
4856D3773217q04926k736238k184491N59496j254911p759200j0422875o361687
$$ 43773217 42968291 40232053 38047562 38607058 37352147 29592947 19170072 12808385
4848A2808385k218303j048091J914619O848974N603158l887520j0768951o260532
$$ 12808385 10590082 9541991 11456610 18305584 23908742 20021222 9252271 2991739
4840B991739L479944P346662M872005L216285L936185K429358j576083k407393
$$ 2991739 6471683 13818345 18690350 21906635 25842820 28272178 26696095 24288702
4832B4288702J536508L932263K48429m394928k493309L972793N713331n7680n216652
$$ 24288702 25825210 29757473 30005902 25610974 23117665 27090458 32803789 32746109 27529457
4823B7529457l227193N38090k529268r568888r253940Q88119R269131N570829
$$ 27529457 24302264 24840354 22311086 12742198 3488258 4376377 13645508 19216337
4815A9216337n720810j1930291p686890J101518N830066L373871k706052n983219
$$ 19216337 13495527 1565236 -6121654 -5020136 809930 4183801 1477749 -4505470
4807d505470l256863J758527K879526R7012k62624M432818Q068201M450611l251806
$$ -4505470 -7762333 -6003806 -3124280 -3027268 -3289892 1142926 9211127 13661738 10409932
4798A0409932o675505l172470K376791N042008M343870J802587j587491m508647
$$ 10409932 3734427 561957 2938748 7980756 12324626 14127213 12539722 8031075
4790H031075m903902k025849K006860L642454J328918k287155k647668J076807
$$ 8031075 3127173 1101324 3108184 6750638 8079556 5792401 3144733 4221540
4782D221540M153589K298451k250906m047271k162252j56038L66602P98393R93489
$$ 4221540 8375129 10673580 8422674 4375403 2213151 2057113 2423715 3222108 4215597
4773D215597j49227j24731L866635P033880J324407j0602274j5497410p605778
$$ 4215597 4066370 3941639 7808274 14842154 16166561 5564287 -9933123 -17538901
4765a7538901K954807N595679L587710N081873Q317906O162641l31274l736918
$$ -17538901 -14584094 -8988415 -5400705 -318832 7999074 14161715 13830441 10093523
4757A0093523k301111k60571J425797M931807P727578M630607k506509o050680
$$ 10093523 7792412 7531841 8957638 13889445 21617023 26247630 23741121 17690441
4749A7690441l911951j453288j755985k306155k209625m033203o474451l763207
$$ 17690441 13778490 12325202 10569217 8263062 6053437 2020234 -4454217 -8217424
4741h217424M175556Q693637M291967k712036k835168L717980Q354653N554160
$$ -8217424 -4041868 4651769 8943736 6231700 3396532 7114512 15469165 21023325
4733B1023325j862891p638437q272130m431025J019209N271292O431532L328632
$$ 21023325 19160434 11521997 3249867 -1181158 -161949 5109343 11540875 14869507
4725A4869507l393565r229443q045457N13689Q258063P158486r07749p406138
$$ 14869507 11475942 2246499 -5798958 -5285269 2972794 10131280 9223531 1817393
4717A817393q226121o171437l897200r68080K037337L089788L357500O049650
$$ 1817393 -6408728 -12580165 -16477365 -17445445 -15408108 -12318320 -8960820 -2911170
4709b911170R376314P286373n89966o313664m147751K232458O488500P584261
$$ -2911170 6465144 13751517 13161551 6847887 2700136 4932594 11421094 19005355
4701A9005355O780539K747941m403499q971275o343958q62963m31027n199412
$$ 19005355 25785894 28533835 24130336 15159061 8815103 7952140 7521113 2321701
4693B321701q089434n614227j684887j95440K19038K097487M390401M510604K437721
$$ 2321701 -5767733 -11381960 -13066847 -13262287 -13043249 -10945762 -6555361 -2044757 392964
4684C92964L56809l94917l43899n64219j322555j740186o03208K147863M909667
$$ 392964 749773 354856 10957 -553262 -1875817 -3616003 -4219211 -2071348 2838319
4675B838319N749135L964174M29218k654940k643780R73332M710301M403901J104740
$$ 2838319 8587454 12551628 12980846 10325906 7682126 8655458 13365759 17769660 18874400
4666A8874400L05616L567425M890955q74818r220231j0807750l715995M565378
$$ 18874400 19180016 22747441 27638396 26763578 17543347 6735597 3019602 7584980
4658G584980P287705N226812K256737n52803l635910n688524n180808k749384
$$ 7584980 14872685 20099497 22356234 21803431 18167521 12478997 7298189 4548805
4650D548805N74480N099475R748488J0415918M895606k560452n910008n138374
$$ 4548805 5123285 10222760 19971248 30387166 35282772 32722320 26812312 21673938
4642B1673938m682617n200787l102486J273464K226935j556835k812057L193724
$$ 21673938 16991321 11790534 8688048 9961512 12188447 10631612 7819555 11013279
4634A1013279R211504N670851l892064o811564m403N677724K335795l713045l374401
$$ 11013279 20224783 25895634 22003570 15192006 15187603 20865327 23201122 19488077 16113676
4625A6113676P76211Q2999n280208o804678j490108L961064L903143J128185P80594
$$ 16113676 16889887 16972886 11692678 4888000 3397892 7358956 11262099 12390284 13170878
4616A3170878K659377L156920J145384j454312k921890l187393l231119m090844
$$ 13170878 15830255 18987175 20132559 18678247 15756357 12568964 9337845 5247001
4608E247001n271636m311145p1271M059016L540194o62094k620336M46519M393662
$$ 5247001 -24635 -4335780 -4407051 -348035 3192159 2530065 -90271 356248 4749910
4599D749910M017971p98015o664009j0965768j2108891q539088p83085P138292
$$ 4749910 8767881 7969866 1305857 -9659911 -21768802 -30307890 -31090975 -23952683
4591b3952683J0969535J0074623O742714L192951M97534j262187k964323n045077
$$ -23952683 -12983148 -2908525 3834189 7027140 7524674 6262487 3298164 -1746913
4583a746913n893767m121498k224866l853697o899512m867855K679263P315237
$$ -1746913 -7640680 -11762178 -13987044 -17840741 -24740253 -29608108 -26928845 -19613608
4575a9613608L724093j465281P04662P798565J0059500N356382Q39711K55981
$$ -19613608 -15889515 -17354796 -16650134 -8851569 1207931 6564313 7404024 7660005
4567G660005p70334m783142o817114l092390J816144K201048J95073J182501M162265
$$ 7660005 6889671 2106529 -4710585 -7802975 -5986831 -3785783 -3590710 -2408209 1754056
4558A754056L771120R6083o18196M436008J0116420J0266119N028918r31949m489620
$$ 1754056 5525176 5621259 5003063 9439071 19555491 29821610 34850528 33918579 29428959
4549B9428959n880374o282824n924185m268897j113544K259605L251473O66916
$$ 29428959 23548585 17265761 11341576 7072679 5959135 8218740 11470213 12137129
4541A2137129k749254k682360R57323K912263p86334o838282q230496l136097
$$ 12137129 9387875 6705515 7662838 10575101 9788767 2950485 -5280011 -8416108
4533h416108K982654M729097K906731J256437k250l304508p320260o389336J521467
$$ -8416108 -5433454 -704357 2202374 3458811 3456561 152053 -7168207 -13557543 -12036076
4524a2036076R926804J0686931M188583j411673j087154J030125j657970q528943
$$ -12036076 -2109272 8577659 12766242 11354569 10267415 11297540 9639570 1110627
4516A110627j1883771o004265O193868J5687349J5549114P011425j923282m509115
$$ 1110627 -10773144 -16777409 -10583541 5103808 20652922 27664347 25741065 21231950
4508B1231950k173906j946133o570888j0180979o339527K167347N956935R05677
$$ 21231950 19058044 17111911 10541023 360044 -5979483 -3812136 2144799 3050476
4500C050476p047468r833113o090401l21633L370603L916260J842861j616755
$$ 3050476 -3996992 -13830105 -19920506 -20242139 -16871536 -12955276 -11112415 -12729170
4492a2729170m374577m344203o75136N844784J2473227J5026919J1391639N011522
$$ -12729170 -17103747 -21447950 -22123086 -16278302 -3805075 11221844 22613483 27625005
4484B7625005J832048K772113K659345j923396p818544j0642149j0477342q813125
$$ 27625005 29457053 32229166 34888511 32965115 25146571 14504422 4027080 -4786045
4476d786045m583599J698346M276416n93173o791116n406551K117449O103156
$$ -4786045 -9369644 -7671298 -3394882 -3988055 -10779171 -16185722 -14068273 -7965117
4468g965117L226218P6507J225423L021997K243338K053372M389902M048459l140084
$$ -7965117 -4738899 -4662392 -3436969 -414972 1828366 3881738 8271640 12320099 9180015
4459I180015j1778276j3312845p348441o60528K198691J994262R74281Q30924
$$ 9180015 -2598261 -15911106 -23259547 -23920075 -21721384 -19727122 -18752841 -17921917
4451a7921917K615605M929630M529470J673487J086303M105748M813720q77907
$$ -17921917 -15306312 -10376682 -5847212 -4173725 -3087422 1018326 5832046 4954139
4443D954139p195863o263556O3382L704385K765655K158599L407737K547129j426669
$$ 4954139 -2241724 -8505280 -8441898 -4737513 -1971858 186741 3594478 6141607 4714938
4434D714938l832401j776230J770932L142343K389974J309393J077379K280966
$$ 4714938 882537 -893693 877239 4019582 6409556 7718949 8796328 11077294
4426A1077294L808780K610727j651852m001580j275890J217873k647207q178453
$$ 11077294 14886074 17496801 15844949 11843369 10567479 11785352 9138145 959692
4418I59692n254381N282946J0863582M644835n721058r994087p570468l761950
$$ 959692 -4294689 988257 11851839 16496674 10775616 781529 -6788939 -10550889
4410a0550889j279929q2370N0380O38207L287311N256397K257652k898671k435802
$$ -10550889 -11830818 -11913188 -11862808 -11224601 -7937290 -2680893 -423241 -3321912 -5757714
4401e757714L279919M265292l054316q347767k922042O238791P145926O22058
$$ -5757714 -2477795 1787497 -1266819 -9614586 -12536628 -6297837 848089 1470147
4393A470147k771686P60558M859060M065260l15525m562654o103845l801013K7487
$$ 1470147 -1301539 -540981 4318079 8383339 8067814 3505160 -2598685 -6399698 -6372211
4384f372211N1877m504210o068805J403669J2066828J4665623O905749l425986
$$ -6372211 -6320334 -10824544 -16893349 -15489680 -3422852 11242771 18148520 14722534
4376A4722534r172624q581228k090549P339825J2111453O653419l900964r139393
$$ 14722534 5549910 -3031318 -5121867 2217958 14329411 20982830 17081866 7942473
4368G942473p003108m194359l504534k73778O577567R408424K764570p081845
$$ 7942473 939365 -3254994 -6759528 -7033306 -455739 8952685 11717255 4635410
4360D635410r287532j809177O830382P629699L37979o739163n537191K538639
$$ 4635410 -4652122 -6461299 369083 7998782 8336761 1597598 -3939593 -1400954
4352a400954P662941L581068m466196p429057m505564j666473j035766M52120
$$ -1400954 6261987 9843055 5376859 -2052198 -6557762 -8224235 -9260001 -8807881
4344h807881K856946K256690j052232j467992K520691N234286L205483Q72786
$$ -8807881 -5950935 -3694245 -4746477 -6214469 -3693778 1540508 4745991 5618777
4336E618777K827204O194138N535970J050473k812094l964189l869632m012261
$$ 5618777 8445981 14640119 20176089 21226562 18414468 14450279 10580647 6568386
4328F568386m165002l103966J01793M034665M701164M60145l836162k344635K896242
$$ 6568386 2403384 -700582 -598789 3435876 8137040 8597185 4761023 2416388 5312630
4319E312630M685683J991750Q69634K915252J785820n146140j0519572q177030
$$ 5312630 9998313 11990063 12859697 15774949 17560769 12414629 1895057 -6281973
4311f281973k847163j406477j229553L977077J1746733J3950471R475364M430573
$$ -6281973 -9129136 -10535613 -11765166 -7788089 3958644 17909115 27384479 31815052
4303C1815052J319459k596586o580310n829997j151726p3238n056978q678909
$$ 31815052 33134511 30537925 23957615 18127618 16975892 16902654 11845676 3166767
4295C166767n023391J157757K295974p36928j821657J36600J355542J090262J882319
$$ 3166767 -1856624 -698867 1597107 860179 -961478 -824878 530664 1620926 3503245
4286C503245K755598j75324n337082n431593J467243P193274M617762j897728
$$ 3503245 6258843 6083519 746437 -4685156 -3217913 3975361 8593123 6695395
4278F695395l397090K16120J241268k900817n978767l252614J836512M142550
$$ 6695395 3298305 3514425 4755693 1854876 -4123891 -7376505 -5539993 -1397443
4270a397443M007337M194091M377023K926115O62554j103019l218338n721122
$$ -1397443 2609894 6803985 11181008 14107123 14769677 13666658 10448320 4727198
4262D727198n433820o23312M762182N760428K851718k20214k202094l390869j993390
$$ 4727198 -706622 -1329934 3432248 9192676 12044394 11824180 9622086 6231217 4237827
4253D237827K908780O862739M554344k150436o157585m493058o39953J770149
$$ 4237827 7146607 14009346 18563690 16413254 10255669 5762611 5122658 6892807
4245F892807K546170K585221K430715K664615K115323k281467r604300j2327318
$$ 6892807 9438977 12024198 14454913 17119528 19234851 16953384 7349084 -4978234
4237d978234n727601L360178M912084K21299j003731L580843O447770L763355
$$ -4978234 -10705835 -7345657 -2433573 -2212274 -3216005 364838 6812608 10575963
4229A0575963P76165J347443K004081n1259j876774j666635k491062n055446m562352
$$ 10575963 11352128 12699571 14703652 14652393 12775619 11108984 8617922 3562476 -999876
4220i99876P62014N315156M644017J279796j824806n815409r480366o985106J882877
$$ -999876 -237862 5077294 9721311 11001107 9176301 3360892 -6119474 -13104580 -11221703
4211a1221703P513829L839310j654656L95968O286343N689588j764094o646828
$$ -11221703 -3707874 131436 -1523220 -1127252 5159091 10848679 9084585 2437757
4203B437757m203273O76685K480085J309008m02040j363746p60098J594057L772083
$$ 2437757 -1765516 -1088831 1391254 2700262 2298222 934476 174378 1768435 5540518
4194E540518L171679m81988m787088o203079j944603O576301J2275196R091034
$$ 5540518 8712197 8230209 3443121 -2759958 -4704561 1871740 14146936 23237970
4186B3237970O25536l602020j202191Q30158j685059m041690j896669J772135
$$ 23237970 23863506 20261486 19059295 19889453 18204394 14162704 12266035 14038170
4178A4038170L174144L336115K946017l84305n191484m870565J859071P687156
$$ 14038170 17212314 20548429 23494446 23110141 17918657 13048092 14907163 22594319
4170B2594319Q320690P621843O655659k89856j1915210j5120017l837219Q928189
$$ 22594319 30915009 38536852 45192511 44902655 32987445 17867428 14030209 22958398
4162B2958398Q943276M09221l358771O53651O071830Q492144O129120j374212
$$ 22958398 31901674 32310895 28952124 29605775 35677605 44169749 50298869 48924657
4154D8924657o902337r56004J0490814J0414393K90602J116604J3973918J2326233
$$ 48924657 42022320 41066316 51557130 61971523 62262125 63378729 77352647 89678880
4146H9678880o076003o16450M0387758N0387702l0201218j43560654j66064839
$$ 89678880 83602877 82986427 123374185 173761887 143560669 15 -166064824
4139a66064824p0882848L6522831O2761054L2790733J7502611K4372529J7533925
$$ -166064824 -236947672 -200424841 -137663787 -104873054 -87370443 -62997914 -45463989
4132d5463989k029730l668537J0080692R090308o741099q656272O574665J1485174
$$ -45463989 -47493719 -51162256 -41081564 -31991256 -38732355 -47388627 -40813962 -29328788
4124b9328788k117240j1366364n068493R06410j806631J45819J1559294J6251633
$$ -29328788 -31446028 -42812392 -47880885 -46974475 -48781106 -48635287 -37075993 -20824360
4116b0824360O901848p19444M087081R559808M997706j207380l93981L02589n305073
$$ -20824360 -13922512 -14641956 -10554875 -995067 4002639 2795259 2401278 2703867 -2601206
4107b601206q202670j188917N826168J903722p007483r486185n934679k241129
$$ -2601206 -10803876 -11992793 -6166625 -4262903 -11270386 -20756571 -26691250 -28932379
4099b8932379K433990R508949J2935971Q784899L548192K622027L70944p812433
$$ -28932379 -26498389 -16989440 -4053469 4731430 8279622 10901649 11272593 3460160
4091C460160j3744746q703710J396799N462941M314184N746446Q823913O271525
$$ 3460160 -10284586 -18988296 -17591497 -12128556 -7814372 -2067926 6755987 13027512
4083A3027512j236576n349111k943709J000013K154725O58230k137299m262716
$$ 13027512 11790936 6441825 3498116 4498129 6652854 7311084 5173785 911069
4075I11069k801191J728992M080392J876458o11633q06108k661147p056341o053792
$$ 911069 -1890122 -161130 3919262 5795720 5184087 4377979 1716832 -5339509 -11393301
4066a1393301M285593J3515617J0467853O65702k386278J992667L311801j168032
$$ -11393301 -7107708 6407909 16875762 17541464 15155186 17147853 20459654 19291622
4058A9291622l972441k839742l735307p142767n719413R97658L192541k612812
$$ 19291622 15319181 12479439 8744132 1601365 -4118048 -3120390 72151 -2540661
4050b540661o219408l54132O695543M531151k365857k457605L833745N137593
$$ -2540661 -8760069 -9114201 -2418658 2112493 -253364 -2710969 1122776 6260369
4042F260369k551289r709873p386433P38137M176210j151618q959856r729106
$$ 6260369 3709080 -6000793 -13387226 -12649089 -8472879 -9624497 -18584353 -28313459
4034b8313459p0248J3475490J9458213J2354306j144812q778499n963648L23973
$$ -28313459 -28383707 -14908217 4549996 16904302 15759490 6980991 1017343 1341316
4026A341316J663926j619717l405261j830033j076777l496194n609090m084070
$$ 1341316 3005242 1385525 -2019736 -3849769 -4926546 -8422740 -14031830 -18115900
4018a8115900r38438P71700K391106N872155P773888L580736l505350n439984
$$ -18115900 -19054338 -18282638 -15891532 -10019377 -2245489 1335247 -2170103 -7610087
4010g610087j206503J887481M43585J18679M539896P400620K583185m434583m321963
$$ -7610087 -8816590 -6929109 -6485524 -6366845 -1826949 5573671 8156856 3722273 -599690
4001e99690J066495J412803n716933j1287944q749136k490381P83074J410645
$$ -599690 466805 1879608 -3837325 -15125269 -23874405 -26364786 -25581712 -24171067
3993b4171067K924518M823797M586088K865093J528608n71784m869125q287374
$$ -24171067 -21246549 -16422752 -11836664 -8971571 -7442963 -8014747 -12883872 -21171246
3985b1171246o527951j389153L96700l527962p330147m569330L382969R335117
$$ -21171246 -27699197 -29088350 -28691650 -32219612 -39549759 -44119089 -40736120 -31401003
3977c1401003R276526O310605N234358N886207M274811n49289m050276k239158
$$ -31401003 -22124477 -15813872 -10579514 -4693307 -418496 -967785 -5018061 -7257219
3969g257219K253600L318688k09032k972041p65578L710363N059984K444108p75781
$$ -7257219 -5003619 -1684931 -1893963 -4866004 -5631582 -1921219 3138765 5582873 4807092
3960D807092l068022n981020q936503p371728P51262R281552R317352L54663q098184
$$ 4807092 1739070 -4241950 -13178453 -20550181 -19798919 -10517367 -1200015 -845352 -8943536
3951h943536p837293j558625K041300K74996j408765R47528L831097K698154k69814
$$ -8943536 -16780829 -18339454 -16298154 -16023158 -17431923 -16484395 -12653298 -9955144 -10224958
3942a0224958J26224L219519L436914k11341k140406L46399J985335j496105m647610
$$ -10224958 -10098734 -6879215 -3442301 -3653642 -5794048 -5447649 -3462314 -4958419 -9606029
3933i606029K12304R396098J0624063M91612r309024p444189K217009P377740
$$ -9606029 -9393725 2373 10626436 11118048 1809024 -5635165 -3418156 3959584
3925C959584L832508k391369o142368p588296o491440j276905M701227M655208
$$ 3959584 7792092 5400723 -741645 -8329941 -14821381 -16098286 -11397059 -6741851
3917f741851p99113k492507L366880Q424062N461957K71168J372098M628331k55902
$$ -6741851 -7540964 -10033471 -6666591 1757471 7219428 7490596 8862694 13491025 13235123
3908A3235123j1422913j5750842q125029J959951N368385M161229L541862K823609
$$ 13235123 1812210 -13938632 -22063661 -20103710 -14735325 -10574096 -7032234 -4208625
3900d208625K91754q42906J934298M689280L158474j79277r16234j76500j579293
$$ -4208625 -3916871 -4759777 -2825479 1863801 5022275 4842998 3926764 3750264 2170971
3891B170971m727347p112131q501380q193075k666674P706537J4378093J0703378
$$ 2170971 -2556376 -9668507 -18169887 -26362962 -29029636 -21323099 -6945006 3758372
3883C758372K341149q45375L15750k436832q887328r578975j938621M544407L169791
$$ 3758372 6099521 5254146 5569896 3133064 -5754264 -15333239 -17271860 -12727453 -9557662
3874i557662k13499J839111O272783N885848J435695q12423L70742J072256L53205
$$ -9557662 -9771161 -7932050 -1659267 4226581 5662276 4849853 5220595 6292851 6646056
3865F646056P88932J685667r65483o845160r784251n985081Q40699M769219M335640
$$ 6646056 7434988 9120655 8155172 1310012 -8474239 -14459320 -13618621 -8849402 -4513762
3856d513762J683552j369925l385666k235667K225583N883937M518602k81151
$$ -4513762 -2830210 -4200135 -7585801 -9821468 -7595885 -1711948 2806654 2525503
3848B525503k980307j928460j251748l646052n622008l246299P80874Q57644k165476
$$ 2525503 -454804 -2383264 -3635012 -7281064 -12903072 -16149371 -15368497 -14510853 -16676329
3839a6676329j291772N886778J2152551R663007N24519n659141l324682L437142
$$ -16676329 -17968101 -12081323 71228 9734235 10258754 4599613 1274931 4712073
3831D712073O452453K052993o055786j0793350q264685j087740M772146O113101
$$ 4712073 11164526 13217519 7161733 -3631617 -11896302 -12984042 -8211896 -2098795
3823b098795M274373J576427j083356k772949k299220q83037j447943l354244
$$ -2098795 2175578 3752005 2668649 -104300 -2403520 -3286557 -4734500 -8088744
3815h088744k051871L132745N672337J060481n013949m334131J070302J898660
$$ -8088744 -10140615 -7007870 -1335533 -275052 -5289001 -9623132 -8552830 -6654170
3807f654170l740335p511243m201819P21721R57438m83895K811157R303207J1179991
$$ -6654170 -10394505 -17905748 -22107567 -21385846 -20428408 -20912303 -18101146 -8797939 2382052
3798B382052N747113j077744l087521j004788J04544k199427n099434l933053
$$ 2382052 8129165 7051421 3963900 2959112 3063656 864229 -4235205 -8168258
3790h168258K380108R050343R308870J653959p617002j0675228o366968k95030
$$ -8168258 -5788150 3262193 12571063 14225022 6608020 -4067208 -10434176 -10729206
3782a0729206K823765L958520N791566O893122L377944m251842r806152q512778
$$ -10729206 -7905441 -3946921 1844645 8737767 12115711 7863869 -1942283 -10455061
3774a0455061k632699K228726L907582L663032J670371k752448p144539p227494
$$ -10455061 -13087760 -10859034 -6951452 -3288420 -1618049 -4370497 -11515036 -18742530
3766a8742530k871657J803173M830975P641994R051048M871002l493037p122622
$$ -18742530 -21614187 -19811014 -14980039 -7338045 1713003 6584005 3090968 -4031654
3758d031654j400854O319731P088799K880179J242122K294496M01169m085806
$$ -4031654 -5432508 887223 7976022 10856201 12098323 14392819 14793988 10708182
3750A0708182m989107j717961p14902m222482o530902l958881o95953j225934
$$ 10708182 5719075 4001114 3286212 -936270 -7467172 -11426053 -12122006 -13347940
3742a3347940l399080k857255N07135L710682M617313K899551M73488J225921
$$ -13347940 -16747020 -19604275 -19097140 -15386458 -10769145 -7869594 -7396106 -6170185
3734f170185O129053R503051N772246j352738l670874j108581k82138j185841
$$ -6170185 -41132 9461919 15234165 13881427 10210553 9101972 8819834 7633993
3726G633993K769290R701279P874473n125550j4948230j0752192j255710K25113
$$ 7633993 10403283 20104562 27979035 22853485 7905255 -2846937 -4102647 -3877534
3718c877534l406196m17835Q827401J2972125Q246193K262776J69734q74859k960585
$$ -3877534 -7283730 -7701565 1125836 14097961 22344154 24606930 24776664 23901805 20941220
3709B0941220l859236l458371m558052o017027l533755J642476L098331j24465
$$ 20941220 17081984 13623613 9065561 3048534 -485221 1157255 4255586 4131121
3701D131121j341229L047099P839893O906533R75687m936223p209585n256008
$$ 4131121 2789892 5836991 13676884 20583417 21559104 16622881 9413296 4157288
3693D157288j731435j429495n469630p512194j632076P143575P704233j546430
$$ 4157288 2425853 996358 -4473272 -11985466 -13617542 -6473967 1230266 -316164
3685c16164r925930q840902j438362M323077N292712L087713M78175L75326L318503
$$ -316164 -10242094 -19082996 -20521358 -16198281 -10905569 -7817856 -7339681 -6964355 -3645852
3676c645852M738915L27608n734147n210095J161209L990701J29172k753964L66287
$$ -3645852 1093063 1420671 -4313476 -9523571 -8362362 -4371661 -4242489 -6996453 -6630166
3667f630166M301666M455200M687198P584331O888411j568627r933016r188124
$$ -6630166 -2328500 2126700 6813898 14398229 21286640 19718013 9784997 596873
3659E96873k837002M19999J045596M351613P492640L744312l579922m806444r7889
$$ 596873 -2240129 -1820130 -774534 3577079 11069719 14814031 11234109 6427665 6329776
3650F329776J272432k097774j283048N924150R154444K272814n786007m804652
$$ 6329776 7602208 5504434 4221386 10145536 19299980 21572794 15786787 10982135
3642A0982135J443536K653217k115478n341434l487231L28477L572406O037969
$$ 10982135 12425671 15078888 12963410 7621976 4134745 4463222 8035628 14073597
3634A4073597N565562k55487p761986r323216l326681L283828M337677J647749
$$ 14073597 19639159 19383672 11621686 2298470 -1028211 2255617 6593294 8241043
3626H241043M11924J474182J812299K25482j556557k654684m162517n964092n640057
$$ 8241043 8652967 10127149 11939448 12164930 10608373 7953689 3791172 -2172920 -7812977
3617g812977k146640J818515L295171L029740L277240L336104J187973j256240
$$ -7812977 -9959617 -8141102 -4845931 -1816191 1461049 4797153 5985126 4728886
3609D728886K46345M572171N010913k84232l523826J640071R214977Q777898J340058
$$ 4728886 4975231 9547402 14558315 14274083 10750257 12390328 21605305 30383203 31723261
3600C1723261k126076K089014M827488r80736q996299r446704l419356Q82116
$$ 31723261 29597185 31686199 36513687 35532951 26536652 17089948 13670592 14552708
3592A4552708J506790L133108N988107M146619l505120q941372n771918J416460
$$ 14552708 16059498 19192606 25180713 29327332 25822212 16880840 11108922 12525382
3584A2525382L420764j524711p012771p683786m320945l37940K420326L600812
$$ 12525382 15946146 14421435 7408664 -275122 -4596067 -4934007 -2513681 1087131
3576A087131L390581L008307L873586N067781L724105n30084l596267j863790
$$ 1087131 4477712 7486019 11359605 16427386 20151491 19621407 16025140 14161350
3568A4161350K090259J983348l787190r391112q709097k666395K974660N053842
$$ 14161350 16251609 18234957 14447767 5056655 -3652442 -6318837 -3344177 1709665
3560A709665M609370K118563l673476j0508289j1210529k243885Q877643J0577329
$$ 1709665 6319035 8437598 4764122 -5744167 -16954696 -19198581 -10320938 256391
3552B56391J737706o247991l900623M834035R273830O220588J734022M01752l51527
$$ 256391 1994097 -4253894 -8154517 -3320482 5953348 12173936 13907958 14309710 13958183
3543A3958183l723306p157493o543931l340747k681492n524259p162711m160500
$$ 13958183 10234877 3077384 -3466547 -6807294 -9488786 -15013045 -22175756 -26336256
3535b6336256P59266K563666N65628j035615J172035N377291O628022K869257
$$ -26336256 -25576990 -23013324 -22447696 -23483311 -22311276 -16933985 -10305963 -7436706
3527g436706k237237l313451N44667N006411N825015K995441r31258m278988o197485
$$ -7436706 -9673943 -12987394 -12442727 -7436316 -1611301 1384140 452882 -3826106 -10023591
3518a0023591n164318m46637N362401P673127M227635k811576q524638q249753
$$ -10023591 -15187909 -15634546 -10272145 -2599018 1628617 -1182959 -9707597 -17957350
3510a7957350q44722Q953048J3132014Q305594q5673m345104l704623k935670
$$ -17957350 -18802072 -9849024 3282990 11588584 11502911 7157807 3453184 517514
3502E17514l282566q28676N305120R392677O843891P00792l432080n007619o588693
$$ 517514 -2765052 -3593728 1711392 11104069 17947960 18648752 15216672 10209053 3620360
3493C620360p410409m428875J324793M589761K526601k214820n582744o068483
$$ 3620360 -3790049 -8218924 -6894131 -2304370 222231 -1992589 -7575333 -13643816
3485a3643816m079666p08384J629304L27616l441791l978956K712058J2333646
$$ -13643816 -17723482 -18431866 -16802562 -16474946 -19916737 -23895693 -21183635 -8849989
3477h849989J4945577N788232q184938j4961696j0145509j75149P169233J0943209
$$ -8849989 6095588 11883820 3698882 -11262814 -21408323 -21583472 -14414239 -3471030
3469c471030J3024850J0903558J284128j0841813j4771397p519947J982233N037823
$$ -3471030 9553820 20457378 21741506 10899693 -3871704 -11391651 -9409418 -4371595
3461d371595L363302L029123M055996K179672k652363n901751m898980p41985
$$ -4371595 -1008293 2020830 6076826 8256498 5604135 -297616 -5196596 -5938581
3453e938581M612209Q792750Q728356M626711J967841M385103O992867K952537
$$ -5938581 -1326372 7466378 16194734 20821445 22789286 27174389 34167256 37119793
3445C7119793n319376q785640m926095n76686r58159l456765m391232m861885
$$ 37119793 31800417 23014777 18088682 17511996 16553837 13097072 8705840 3843955
3437C843955o437451o888082m281309r33159M55018R80571K580898M235648M287867
$$ 3843955 -2593496 -9481578 -13762887 -14696046 -14241028 -13260457 -10679559 -6443911 -2156044
3428b156044L625744L660456L782968L290303L058783L021699J120704k612570
$$ -2156044 1469700 5130156 8913124 12203427 15262210 18283909 19404613 16792043
3420A6792043m152158r61544L170600K392868l521868q781562q260490k683290
$$ 16792043 12639885 11678341 14848941 17241809 13719941 4938379 -3322111 -6005401
3412f005401K425979K289926j871934l791102j55120M123371K465529l349149
$$ -6005401 -3579422 -1289496 -3161430 -6952532 -7107652 -2984281 -518752 -3867901
3404c867901n595241k163025J722847L657668O871571J0478952P061588m439991
$$ -3867901 -9463142 -11626167 -9903320 -6245652 625919 11104871 18166459 13726468
3396A3726468j2822927r565857j815767j144619o037693o469052r89491K883067
$$ 13726468 903541 -8662316 -10478083 -11622702 -17660395 -24129447 -25118938 -22235871
3388b2235871K837046M062849P611578Q016171L939911P11697P9054k608935q041288
$$ -22235871 -19398825 -15335976 -7724398 291773 4231684 4943381 5022435 2413500 -5627788
3379e627788r403484l400685L654208N498022M272884M591977O163939O974456
$$ -5627788 -15031272 -18431957 -14777749 -9279727 -5006843 -414866 5749073 12723529
3371A2723529P179403N343736k035335j2143212j4780358o451209J955662P2785
$$ 12723529 19902932 25246668 23211333 11068121 -3712237 -10163446 -8207784 -8134999
3363h134999o049074l574429O302326R736508J481071p565214o730985P28863
$$ -8134999 -14184073 -17758502 -11456176 -1719668 -238597 -7803811 -14534796 -13805933
3355a3805933N127873L758805P45384j347395l135457l781207n87039O099622
$$ -13805933 -8678060 -4919255 -4173871 -5521266 -8656723 -12437930 -13024969 -6925347
3347f925347J1005247Q707850n05655j0498007j5071920j3187617p782227r60256
$$ -6925347 4079900 12787750 12282095 1784088 -13287832 -26475449 -34257676 -35217932
3339c5217932O543427J1597433R723264K517726j141947L630593R234495N143165
$$ -35217932 -28674505 -17077072 -7353808 -4836082 -5978029 -2347436 6887059 12030224
3331A2030224o343063j1972020n373077M955253P934496L258138j532656j853614
$$ 12030224 5687161 -6284859 -11657936 -6702683 1231813 4489951 2957295 1103681
3323A103681R60812L814354M118760L02777n613631p813903l289574K672525K058967
$$ 1103681 2064493 5878847 9997607 10300384 4686753 -3127150 -6416724 -3744199 -1685232
3314a685232n033655r393232l800295P829071J4449742R820305j297708q906868
$$ -1685232 -6718887 -16112119 -19912414 -12083343 2366399 12186704 10888996 1982128
3306A982128q493484m497474k934031l174498j60117O377419R728366M957207
$$ 1982128 -6511356 -11008830 -13942861 -17117359 -17277476 -10900057 -1171691 3785516
3298C785516l906201q385102n058106K059356O820306O196737J859146j221980
$$ 3785516 -120685 -8505787 -13563893 -11504537 -4684231 1512506 3371652 2149672
3290B149672O69122N016297N046992j117978o640858n007432L83543J106167l849984
$$ 2149672 2818794 7835091 12882083 11764105 5123247 115815 499358 1605525 -2244459
3281b244459o967711l341913L325248P040809O341997L079244o50050k307885
$$ -2244459 -9212170 -12554083 -9228835 -2188026 4153971 7233215 6583165 4275280
3273D275280j89867L084438K799877m27509q11691K767498L684096j517596n957677
$$ 4275280 4085413 7169851 9969728 9542219 8730528 11498026 15182122 13664526 7706849
3264G706849k727115L434572L244987k456929n068464l219284m363725j0408929
$$ 7706849 4979734 8414306 11659293 9202364 4133900 914616 -3449109 -13858038
3256a3858038j2632701n062663N992864J1286690J0307429P632133M091437j081494
$$ -13858038 -26490739 -31553402 -25560538 -14273848 -3966419 3665714 7757151 6675657
3248F675657m206439j604383K641635J515572l627715m618664N40883M214303
$$ 6675657 2469218 864835 3506470 5022042 1394327 -3224337 -2683454 1530849
3240A530849P46854n374423o647418k716735Q41777N20410k407784n110203n563642
$$ 1530849 2277703 -3096720 -9744138 -12460873 -11619096 -11098686 -13506470 -18616673 -24180315
3231b4180315k833434K093444O151666O798136M501868J724620L66949R44718
$$ -24180315 -27013749 -24920305 -18768639 -11970503 -7468635 -5744015 -5377066 -4432348
3223d432348K719769L536736J248646l196501n679801l670478L12036J891700
$$ -4432348 -1712579 1824157 3072803 -123698 -5803499 -9473977 -9161941 -7270241
3215g270241K93820j503644j171796P62700K759956M008992M092558K875579J371579
$$ -7270241 -6976421 -8480065 -9651861 -8889161 -6129205 -2120213 1972345 4847924 6219503
3206F219503J240470K598935L358107J666767j508408l149333j616982J266034
$$ 6219503 7459973 10058908 13417015 15083782 13575374 10426041 8809059 10075093
3198A0075093K110966j36142l004160l715112k644324k263954l285427l879875
$$ 10075093 12186059 12049917 9045757 5330645 2686321 422367 -2863060 -6742935
3190f742935k886645j616602j547938k093142j902060p62376J180119M403899
$$ -6742935 -9629580 -11246182 -12794120 -14887262 -16789322 -17551698 -16371579 -11967680
3182a1967680Q253104R510895N306011k632965q563504q070114k073472M264642
$$ -11967680 -3714576 5796319 11102330 8469365 -94139 -8164253 -10237725 -5973083
3174e973083N985623K320699k932026n462212m916472l860752k503341K006953
$$ -5973083 12540 2333239 -598787 -6060999 -10977471 -14838223 -17341564 -15334611
3166a5334611R260578J2668695P198491k608657p742801o450632m643786m799952
$$ -15334611 -6074033 6594662 13793153 11184496 3441695 -3008937 -7652723 -12452675
3158a2452675k105543N521507J0822541O547380l290820q495615o459718l420288
$$ -12452675 -14558218 -9036711 1785830 8333210 5042390 -3453225 -9912943 -13333231
3150a3333231k744743l13070N945652R437598L651764o742282j0320560l388522
$$ -13333231 -16077974 -16391044 -10445392 -1007794 2643970 -4098312 -14418872 -17807394
3142a7807394N803907Q032017L384482j335941j563592J633103M592663M386298
$$ -17807394 -12003487 -3971470 -586988 -1922929 -3486521 -1853418 2739245 7125543
3134G125543N25401l965915m390424P9693M063046K421767k211349k788013J557933
$$ 7125543 7650944 3685029 -705395 -625702 3437344 5859111 3647762 859749 2417682
3125B417682L739141p49885o833017p001942j413971L617123M354504K179662
$$ 2417682 6156823 5406938 -1426079 -8428021 -9841992 -6224869 -1870365 309297
3117C09297m27137j530562R63018O385193Q948254M189749k943921l279808K910190
$$ 309297 -117840 -1648402 -685384 5699809 14648063 18837812 15893891 12614083 15524273
3108A5524273N135741k110423j1218289j2856933q215848l737602j85927M714056
$$ 15524273 20660014 18549591 7331302 -5525631 -13741479 -17479081 -17665008 -12950952
3100a2950952P525755L182072m013020l962878L738237P810598J832359o364628
$$ -12950952 -5425197 -2243125 -6256145 -10219023 -6480786 1329812 3162171 -3202457
3092c202457p033205k366145p18749k708813j925026L131972O679800N413270
$$ -3202457 -10235662 -12601807 -13320556 -16029369 -17954395 -14822423 -8142623 -2729353
3084b729353L041133L206627M169861L532699L101665M943802O234109K867269
$$ -2729353 311780 3518407 7688268 11220967 14322632 19266434 25500543 28367812
3076B8367812l504178o736540m462582j135656j690940n258620p244481n699227
$$ 28367812 24863634 18127094 13664512 12528856 10837916 5579296 -1665185 -7364412
3068g364412k968387j573272j104025n9857J200598J255691N85646J455712M248929
$$ -7364412 -10332799 -11906071 -13010096 -13069953 -11869355 -10613664 -10028018 -8572306 -4323377
3059d323377N773078K871159k990176o450563l840263K944637Q426810Q731516
$$ -4323377 1449701 4320860 1330684 -5119879 -8960142 -6015505 2411305 11142821
3051A1142821M619891o817k249794k889426m625248p600558q051794k947215M898916
$$ 11142821 15762712 15755895 13506101 10616675 5991427 -1609131 -9660925 -12608140 -7709224
3042g709224Q888471O288916J441159k3599J887605K640929M4870k810710j917891
$$ -7709224 1179247 7468163 8909322 8885723 10773328 13414257 13459127 10648417 8730526
3033H730526K246302M785791J440787o595678j2757393j0889206k045709N352259
$$ 8730526 10976828 15762619 17203406 10607728 -2149665 -13038871 -15084580 -9732321
3025i732321M048452l579480p780371k708304O773366J1111650P261541J359136
$$ -9732321 -5683869 -9263349 -17043720 -19752024 -12978658 -1867008 5394533 6753669
3017F753669L23596L444497M365073L65746l688741k462795J459171O59903n863036
$$ 6753669 7077265 10521762 14886835 15252581 11563840 9101045 10560216 11220119 5357083
3008E357083r904908n151293L686803P617577N674012M020792M769637L602026
$$ 5357083 -4547825 -9699118 -6012315 1605262 7279274 11300066 16069703 19671729
3000A9671729r51932l956732k582004q76571j839069j377034M190327J0216370
$$ 19671729 18719797 14763065 12181061 11304490 9465421 8088387 12278714 22495084
2992B2495084R959207M397376r88307n230225j0015484j2379115q401617k246849
$$ 22495084 32454291 36851667 35863360 30633135 20617651 8238536 -163081 -2409930
2984b409930j753176n514970m531414K417486N880266J168484l992628k337738
$$ -2409930 -4163106 -9678076 -14209490 -11792004 -5911738 -4743254 -8735882 -11073620
2976a1073620K160649L048230K155846L472011L766712j171234o706598n934906
$$ -11073620 -8912971 -5864741 -3708895 -236884 3529828 2358594 -4348004 -10282910
2968a0282910j828863k132246n050735j726442P576603J1642764M967805m134256
$$ -10282910 -12111773 -14244019 -19294754 -21021196 -13444593 -1801829 3165976 -968280
2960i68280o046856j775262K272396L732551K975854j120157p583531j0311761
$$ -968280 -7015136 -8790398 -6518002 -2785451 190403 -929754 -8513285 -18825046
2952a8825046n383959J696495K543259k239484m059290J323797Q444790J0279119
$$ -18825046 -24209005 -22512510 -19969251 -22208735 -26268025 -24944228 -16499438 -6220319
2944f220319O953741L862619L968547M832918K595132k945546p654766p070334
$$ -6220319 733422 4596041 8564588 13397506 15992638 13047092 5392326 -1678008
2936a678008r01687O441491R619724O618378m1594n502796o407058l647109j285918
$$ -1678008 -2579695 3861796 13481520 20099898 20058304 14555508 8148450 4501341 3215423
2927C215423k059373m396282m707494j852225J833876L206445R28199l383977
$$ 3215423 1156050 -3240232 -7947726 -9799951 -7966075 -4759630 -3831431 -7215408
2919g215408n357941j086970P655429J3224549R981679R66817o051481p255590
$$ -7215408 -12573349 -13660319 -6004890 7219659 17201338 18168155 12116674 4861084
2911D861084m179086Q50929N443000N330220j392908q554106p580983O6561L392764
$$ 4861084 681998 1532927 6975927 12306147 10913239 2359133 -5221850 -5155289 -1762525
2902a762525k850779j0517434r612528j278252N688202O375413K637314j695722
$$ -1762525 -4613304 -15130738 -24743266 -26021518 -20333316 -13957903 -11320589 -13016311
2894a3016311l363614l36690N485561Q514511N916682J079670k187406m745900
$$ -13016311 -16379925 -16716615 -11231054 -2716543 3200139 4279809 2092403 -2653497
2886b653497p702080p793006k634338L496424N255359M300401N347357P109325
$$ -2653497 -10355577 -18148583 -20782921 -17286497 -12031138 -7730737 -2383380 4725945
2878D725945M440193k135466o268533m692563k1530M725769Q112713P424370P96030
$$ 4725945 9166138 7030672 762139 -3930424 -3951954 773815 8886528 16310898 17106928
2869A7106928p231181q865313l214193K360114K506342K05317Q85796M640280
$$ 17106928 9875747 1010434 -2203759 156355 2662697 2868014 3753810 8394090
2861H394090O582551K501631o420058j2802704r069774K541576R608447M610515
$$ 8394090 14976641 17478272 11058214 -1744490 -10814264 -8272688 1335759 5946274
2853E946274l828123k957177M634453N093119m275493j0239971m276435N146322
$$ 5946274 2118151 -839026 3795427 8888546 4613053 -5626918 -9903353 -4757031
2845d757031P118873L651433K160867K196591l95114l170214j360622K320789
$$ -4757031 2361842 6013275 8174142 10370733 9975619 6805405 5444783 7765572
2837G765572J883191j434805j977732j61581j180577n150662p049865n187675
$$ 7765572 9648763 8213958 6236226 6074645 4894068 -256594 -7306459 -12494134
2829a2494134j888337K674905R059032J2456598P380759j648542l679278L053010
$$ -12494134 -14382471 -11707566 -2648534 9808064 17188823 15540281 11861003 14914013
2821A4914013Q305144N000348j910043n469920o648591q536401q406916l247098
$$ 14914013 23219157 28219505 26309462 20839542 14190951 5654550 -2752366 -5999464
2813e999464K180657J221146l605916l557107L191491Q955298Q088353M346350
$$ -5999464 -3818807 -2597661 -6203577 -9760684 -6569193 2386105 10474458 14820808
2805A4820808L792591N643042M839589Q63493j464769L8122J021697k853364q689994
$$ 14820808 18613399 24256441 29096030 29959523 28494754 28532876 29554573 26701209 18011215
2796A8011215r675916m584839L86260R7676l243917m544108l124969j918565j543133
$$ 18011215 8335299 3750460 4136720 4234396 990479 -3553629 -6678598 -8597163 -10140296
2787a0140296K85050L673605N033988K072200k262136k777647J634829N813929
$$ -10140296 -9855246 -6181641 -1147653 924547 -1337589 -4115236 -2480407 3333522
2779C333522L271771n883958j2899223r112892K876809J0765817P312892q47133
$$ 3333522 6605293 721335 -12177888 -21290780 -18413971 -7648154 -335262 -1182395
2771a182395l055103R84045K888446r78349n517257o269291n120825m484384k488855
$$ -1182395 -4237498 -3253453 -365007 -1343356 -6860613 -13129904 -18250729 -22735113 -25223968
2762b5223968K115495N231886K407049m175589p912208n713769n99237K974300
$$ -25223968 -23108473 -17876587 -15469538 -19645127 -27557335 -33271104 -33870341 -30896041
2754c0896041M059916N413636R459102J3999081J3151149M535514n843775r507233
$$ -30896041 -26836125 -21422489 -11963387 2035694 15186843 19722357 13878582 4371349
2746D371349n661966j044634J92795O62180K483740K383020k165101p189348p524142
$$ 4371349 -1290617 -2335251 -2142456 -1480276 1003464 3386484 1221383 -5967965 -13492107
2737a3492107l979660l57947L064638P418329R523551N035482l600329q518722
$$ -13492107 -17471767 -17829714 -14765076 -7346747 2176804 7212286 3611957 -4906765
2729d906765o076855j17211M480587O327161N177411P38850m333324n210605j282958
$$ -4906765 -10983620 -11100831 -6620244 -293083 4884328 5623178 1289854 -3920751 -5203709
2720e203709K183354J320200j209134j229431N60481J007300J93807K09817M16625
$$ -5203709 -3020355 -1700155 -2909289 -4138720 -3578239 -2570939 -2377132 -2167315 -1750690
2711a750690j147358k886062j422548J977825K281696j020225k126334K051316
$$ -1750690 -2898048 -5784110 -7206658 -5228833 -2947137 -3967362 -6093696 -4042380
2703d042380O407853N406052J850333J970004M544698K276566o057389j2100319
$$ -4042380 2365473 7771525 9621858 11591862 16136560 18413126 12355737 255418
2695B55418r155003j233608L053467J596049p45476k14781K041905L475486L502226
$$ 255418 -8899585 -10133193 -7079726 -5483677 -6229153 -6443934 -4402029 -926543 2575683
2686B575683K938912K425004J870868N95979j443148k429433p87527J074749j323824
$$ 2575683 5514595 7939599 9810467 10406446 8963298 6533865 5746338 6821087 5497263
2677E497263p273800r793344m863214K574248N982201O031646O391130N384487
$$ 5497263 -1776537 -11569881 -16433095 -13858847 -7876646 -1845000 4546130 9930617
2669I930617J9320m802781j279821P458105R153072L85448p366441m261000M211918
$$ 9930617 9949937 5147156 3867335 11325440 20478512 20863960 13497519 9236519 13448437
2660A3448437O564950J286464m102566n030900l136392n01079K183028L155129
$$ 13448437 20013387 21299851 17197285 12166385 9029993 8528914 10711942 13867071
2652A3867071J276725q07395j79772R75727j492350o265964p412177k561308M062879
$$ 13867071 15143796 14336401 14156629 15132356 13640006 7374042 -38135 -2599443 1463436
2643A463436O903815M073143k289983p336865o140450J307230Q379371Q541924
$$ 1463436 8367251 12440394 10150411 2813546 -3326904 -2019674 6359697 14901621
2635A4901621L006411j699586k460441j584499r97170M09801K855985L538161
$$ 14901621 17908032 16208446 13748005 12163506 11166336 11576137 14432122 17970283
2627A7970283L24708n024028q641265p995936l534079J340447K594462J00702
$$ 17970283 18294991 13270963 4629698 -3366238 -6900317 -5559870 -2965408 -2864706
2619b864706j192244K572299P998337Q132049J803783m733856n838460k393811
$$ -2864706 -4056950 -1484651 6513686 14645735 16449518 11715662 5877202 3483391
2611C483391J192536K518889K217581J896441K509614L310393J852207l374098
$$ 3483391 4675927 7194816 9412397 11308838 13818452 17128845 18981052 15606954
2603A5606954r870807j2249982p229085K751929J0616668R758873L53761q811912
$$ 15606954 5736147 -6513835 -13742920 -10990991 -374323 9384550 9738311 926399
2595I26399q072006J723099R108146N996572k363467n566145j882626K262140
$$ 926399 -7145607 -5422508 3685638 9682210 7318743 1752598 -130028 2132112
2587B132112L432103L982527M738973K948237j216043k972738j00653L485905
$$ 2132112 5564215 9546742 14285715 17233952 16017909 13045171 12944518 16430423
2579A6430423L484320J89038l733054o202149n468804j481157J612996o33723
$$ 16430423 19914743 20103781 16370727 10168578 4699774 3218617 4831613 4197890
2571D197890n540324n393861J348551O918106N048561o56245k768325K83192M418228
$$ 4197890 -1342434 -6736295 -5387744 1530362 6578923 5922678 3154353 3437545 7855773
2562G855773N848743L164722k972316q699302q722575k541298L965059N840038
$$ 7855773 13704516 16869238 13896922 5197620 -3524955 -6066253 -2101194 3738844
2554C738844M542185L466518K204589p49483l186227j917383J805413L938088
$$ 3738844 8281029 11747547 13952136 13202653 10016426 8099043 9904456 13842544
2546A3842544L352275K268832J989464J256282j558397o321180j0410547r845950
$$ 13842544 17194819 19463651 21453115 22709397 21151000 14829820 4419273 -5426677
2538e426677l569393L174292L553677j842020n295987k788288R65826J066964
$$ -5426677 -8996070 -5821778 -2268101 -4110121 -9406108 -12194396 -11228570 -10161606
2530a0161606L8547K218650N664575N566341K198371m74056j665909l644598o419427
$$ -10161606 -10123059 -7904409 -2239834 3326507 5524878 5050822 3384913 -259685 -6679112
2521f679112p551015o046759k523194K610115P407675P691162K747254j113877
$$ -6679112 -14230127 -20276886 -22800080 -20189965 -12782290 -5091128 -2343874 -3457751
2513c457751J802119P687237Q081988K063880l001683k590128l31834r33320l378264
$$ -3457751 -1655632 6031605 14113593 16177473 13175790 10585662 10253828 9320508 5942244
2504E942244l766837j323876J146292J280372j04733l13468J323865J859960r28791
$$ 5942244 2175407 851531 1997823 3278195 3173462 2859994 4183859 6043819 5115028
2495E115028l739103j715697K898895K571567l331934o040580j280126K728579
$$ 5115028 1375925 -339772 2559123 5130690 1798756 -4241824 -5521950 -2793371
2487b793371j666423q124817n824364L112577P058835K814941j401275j31326
$$ -2793371 -4459794 -12584611 -18408975 -15296398 -8237563 -5422622 -6823897 -6955223
2479f955223K952425L547449J991444j091859n691858q044311l934009K888855
$$ -6955223 -4002798 -455349 1536095 444236 -5247622 -13291933 -17225942 -14337087
2471a4337087M395342R91849Q80215N562832O729989M95590n837144n524857j219271
$$ -14337087 -9941745 -8949896 -8069681 -2506849 4223140 4718730 -1118414 -6643271 -7862542
2462g862542K589539O423885R750414P480134r07469p157961o034138l493443
$$ -7862542 -5273003 1150882 10901296 18381430 17473961 10316000 4281862 788419
2454G88419o089933j0056040q789629l816086L13907N114563J2565185J6523908
$$ 788419 -5301514 -15357554 -24147183 -27963269 -27649362 -22534799 -9969614 6554294
2446F554294J0487361k28286m620898j498210J058197o94948l136496m355370
$$ 6554294 17041655 16813369 12192471 10694261 11752458 11057510 7921014 3565644
2438C565644o222949p659566n057789J91691K797125K229356K359471L053560
$$ 3565644 -2657305 -10316871 -15374660 -15182969 -12385844 -10156488 -7797017 -4743457
2430d743457J054191j024802L138682J0983383J1316764Q31195r386705r065500
$$ -4743457 -3689266 -4714068 -1575386 9407997 20724761 21555956 12169251 3103751
2422C103751k012112J905067N89252j587964k858515l779498k022646M214511
$$ 3103751 1091639 2996706 3585958 1997994 -860521 -4640019 -6662665 -2448154
2414b448154R691206P058905j850042o849893k938028L106800K590968l275531
$$ -2448154 7243052 14301957 12451915 5602022 2663994 5770794 8361762 5086231
2406E086231n878966j400569M429397M677645M31385j636331Q52902L248369J841747
$$ 5086231 -792735 -2193304 2236093 6913738 7345123 5708792 6561694 9810063 11651810
2397A1651810m23188K58745J170556k606497q515581q398913p65211N805392M431047
$$ 11651810 11228622 11487367 12657923 10051426 1535845 -6863068 -7628279 -1822887 2608160
2388B608160q72383k170041J034965L199771K401578J919689K878790J772600
$$ 2608160 1735777 -434264 600701 3800472 6202050 8121739 11000529 12773129
$$ [...]
##END NTUPLES=NMR SPECTRUM
##END=
