##TITLE=31Pdec_DE-59_EA
 
 24 sc
 5.6.2024
##JCAMPDX= 6.0         $$ Bruker NMR JCAMP-DX V2.0
##DATA TYPE= NMR SPECTRUM
##DATA CLASS= NTUPLES
##ORIGIN= UXNMR, Bruker Analytische Messtechnik GmbH
##OWNER= root
$$ XWIN-NMR		Version 3.5
$$ Wed Jun  5 14:13:30 2024 Russian Standard Time (UT+4h)  she@DPX200
##.OBSERVE FREQUENCY= 81.013821
##.OBSERVE NUCLEUS= ^31P
##.ACQUISITION MODE= SIMULTANEOUS
##.ACQUISITION SCHEME= undefined
##.AVERAGES= 24
##.DIGITISER RES= 16
##SPECTROMETER/DATA SYSTEM= spect
##.PULSE SEQUENCE= zgpg30
##.SOLVENT NAME= CDCl3
##.SHIFT REFERENCE= (INTERNAL, CDCl3, 0, 248.564)
##AUDIT TRAIL= $$ (NUMBER, WHEN, WHO, WHERE, WHAT)
$$ ##TITLE= Audit trail, XWIN-NMR		Version 3.5
$$ ##JCAMPDX= 5.01
$$ ##ORIGIN= Bruker BioSpin GmbH
$$ ##OWNER= she
$$ F:/spectra/data/she/nmr/P31/1/pdata/1/auditp.txt
$$ ##AUDIT TRAIL=  $$ (NUMBER, WHEN, WHO, WHERE, WHAT)
(   1,<2024-06-05 14:12:27.18 +0400>,<she>,<DPX200>,
      <created by zg, POWCHK disabled, PULCHK disabled
       configuration hash MD5:
       00 E9 B6 7A A2 85 ED C7 34 08 36 98 17 FE 4E 26
       data hash MD5: 32K
       68 29 70 35 AC 41 B8 6B 6F 68 86 42 F1 5F F3 62>)
(   2,<2024-06-05 14:12:42.07 +0400>,<she>,<DPX200>,
      <Start of raw data processing
       efp BC_mod = 2 LB = 10 FT_mod = 6 PKNL = 1 PHC0 = -192.0891 PHC1 = 0 SI = 64K 
       data hash MD5: 64K
       3E CB 59 AD 52 48 E5 AF 87 BF 32 57 7C CF 75 76>)
(   3,<2024-06-05 14:12:55.64 +0400>,<she>,<DPX200>,
      <pk PHC0 = 7.558727 PHC1 = 0 
       data hash MD5: 64K
       8E 8A 6D B3 9F F6 E4 43 DA AE EF 60 CC 0D 99 B0>)
(   4,<2024-06-05 14:12:58.56 +0400>,<she>,<DPX200>,
      <abs ABSG = 5 
       data hash MD5: 64K
       7F 21 0E 9A DD 12 0E 89 3D 46 D2 BD C8 BE 25 25>)
$$ ##END=
$$ 
$$ hash MD5
$$ CB 58 B9 82 F3 A9 99 19 16 15 42 78 95 E7 1C 59
##$RELAX= 
##$RELAX= 
##$RELAX= 
##$RELAX= 
##$RELAX= 
##$RELAX= 
##$RELAX= 
##$RELAX= 
##$RELAX= 
$$ Bruker specific parameters
$$ --------------------------
##$DU= <F:/spectra>
##$EXPNO= 1
##$NAME= <P31>
##$PROCNO= 1
##$TYPE= <nmr>
##$USER= <she>
##$AMP= (0..31)
100 100 100 100 100 100 100 100 100 100 100 100 100 100 100 100 100 100 
100 100 100 100 100 100 100 100 100 100 100 100 100 100 
##$AQSEQ= 0
##$AQ_mod= 1
##$AUNM= <au_zg>
##$AUTOPOS= <>
##$BF1= 81.014009
##$BF2= 200.13
##$BF3= 200.13
##$BF4= 200.13
##$BF5= 200.13
##$BF6= 200.13
##$BF7= 200.13
##$BF8= 200.13
##$BYTORDA= 1
##$CFDGTYP= 0
##$CFRGTYP= 5
##$CHEMSTR= <none>
##$CNST= (0..31)
1 1 145 1 1 1 1 1 1 1 1 1 1 1 1 1 1 1 1 1 1 1 1 1 1 1 1 1 1 1 1 1 
##$CPDPRG= <waltz16>
##$CPDPRG1= <>
##$CPDPRG2= <waltz16>
##$CPDPRG3= <>
##$CPDPRG4= <mlev>
##$CPDPRG5= <mlev>
##$CPDPRG6= <mlev>
##$CPDPRG7= <mlev>
##$CPDPRG8= <mlev>
##$CPDPRGB= <>
##$CPDPRGT= <>
##$D= (0..31)
0 1 0 0 0 0 0 0 0 0 0 0.03 2e-05 3e-06 0 0 0 0 0 0 0 0 0 0 0 0 0 0 0 0 
0 0 
##$DATE= 1717582346
##$DBL= (0..7)
120 120 120 11 120 120 24 19 
##$DBP= (0..7)
150 150 150 150 150 150 150 150 
##$DBP07= 0
##$DBPNAM0= <>
##$DBPNAM1= <>
##$DBPNAM2= <>
$$ [...]
##$SUBNAM3= <"">
##$SUBNAM4= <"">
##$SUBNAM5= <"">
##$SUBNAM6= <"">
##$SUBNAM7= <"">
##$SUBNAM8= <"">
##$SUBNAM9= <"">
##$SW= 501.771253377433
##$SWIBOX= (0..15)
0 1 3 0 0 0 0 0 0 0 0 0 0 0 0 0 
##$SW_h= 40650.406504065
##$TD= 32768
##$TD0= 1
##$TE= 0
##$TE2= 300
##$TE3= 300
##$TEG= 300
##$TL= (0..7)
0 120 53 12 22 120 120 120 
##$TP= (0..7)
150 150 150 150 150 150 150 150 
##$TP07= 0
##$TPNAME0= <>
##$TPNAME1= <>
##$TPNAME2= <>
##$TPNAME3= <>
##$TPNAME4= <>
##$TPNAME5= <>
##$TPNAME6= <>
##$TPNAME7= <>
##$TPOAL= (0..7)
0.5 0.5 0.5 0.5 0.5 0.5 0.5 0.5 
##$TPOFFS= (0..7)
0 0 0 0 0 0 0 0 
##$TUNHIN= 0
##$TUNHOUT= 0
##$TUNXOUT= 0
##$USERA1= <user>
##$USERA2= <user>
##$USERA3= <user>
##$USERA4= <user>
##$USERA5= <user>
##$V9= 5
##$VALIST= <valist>
##$VCLIST= <CCCCCCCCCCCCCCC>
##$VD= 0
##$VDLIST= <DDDDDDDDDDDDDDD>
##$VPLIST= <PPPPPPPPPPPPPPP>
##$VTLIST= <TTTTTTTTTTTTTTT>
##$WBST= 1024
##$WBSW= 4
##$XGAIN= (0..3)
0 0 0 0 
##$XL= 0
##$YL= 0
##$YMAX_a= 15279
##$YMIN_a= -17326
##$ZGOPTNS= <>
##$ZL1= 120
##$ZL2= 120
##$ZL3= 120
##$ZL4= 120
##$ABSF1= 248.5645
##$ABSF2= -253.2056
##$ABSG= 5
##$ABSL= 3
##$ALPHA= 0
##$AQORDER= 0
##$ASSFAC= 0
##$ASSFACI= 0
##$ASSFACX= 0
##$ASSWID= 0
##$AUNMP= <proc_1d>
##$AZFE= 0.1
##$AZFW= 0.5
##$BCFW= 0
##$BC_mod= 2
##$BYTORDP= 0
##$COROFFS= 0
##$CY= -3
##$DATMOD= 1
##$DC= 0
##$DFILT= <>
##$DTYPP= 0
##$F1P= 0
##$F2P= 0
##$FCOR= 1
##$FTSIZE= 65536
##$FT_mod= 6
##$GAMMA= 0
##$GB= 0
##$INTBC= 1
##$INTSCL= 6.047779e-11
##$ISEN= 30
##$LB= 10
##$LEV0= 0
##$LPBIN= 0
##$MAXI= 10000
##$MC2= 0
##$MEAN= 0
##$ME_mod= 0
##$MI= 50
##$NCOEF= 0
##$NC_proc= -8
##$NLEV= 6
##$NOISF1= 182.463
##$NOISF2= 159.3651
##$NSP= 0
##$NTH_PI= 0
##$NZP= 0
##$OFFSET= 248.5645
##$PC= 4
##$PHC0= -184.5304
##$PHC1= 0
##$PH_mod= 1
##$PKNL= yes
##$PPARMOD= 0
##$PSCAL= 0
##$PSIGN= 0
##$REVERSE= no
##$SF= 81.0140089999694
##$SI= 65536
##$SIGF1= 159.3651
##$SIGF2= -187.1042
##$SINO= 113.3802
##$SIOLD= 16384
##$SREGLST= <1H.CDCl3>
##$SSB= 0
##$STSI= 65536
##$STSR= 0
##$SW_p= 40650.406504065
##$SYMM= 0
##$S_DEV= 0
##$TDeff= 32768
##$TDoff= 0
##$TI= <>
##$TILT= no
##$TM1= 0
##$TM2= 0
##$TOPLEV= 0
##$USERP1= <user>
##$USERP2= <user>
##$USERP3= <user>
##$USERP4= <user>
##$USERP5= <user>
##$WDW= 1
##$XDIM= 65536
##$YMAX_p= 409359457
##$YMIN_p= -10704445
$$ End of Bruker specific parameters
$$ ---------------------------------
##NTUPLES= NMR SPECTRUM
##VAR_NAME=  FREQUENCY,     SPECTRUM/REAL,   SPECTRUM/IMAG
##SYMBOL=    X,             R,               I
##VAR_TYPE=  INDEPENDENT,   DEPENDENT,       DEPENDENT
##VAR_FORM=  AFFN,          ASDF,            ASDF
##VAR_DIM=   65536,         65536,           65536
##UNITS=     HZ,            ARBITRARY UNITS, ARBITRARY UNITS
##FACTOR=    0.620285442955139, 1,           1
##FIRST=     20137.2065510682, 0,            0
##LAST=      -20513.1999529968, 0,           0
##MIN=       -20513.1999529968, -10704445,   0
##MAX=       20137.2065510682, 409359457,    0
$$ Real data points
##PAGE= N=1
##DATA TABLE= (X++(R..R)), XYDATA
$$ [...]
41156b329335l7870k6627j2664M674K7440N7506R4294J33254J66383J84943J82860
$$ -2329335 -2367205 -2393832 -2406496 -2401822 -2374382 -2316876 -2222582 -2089328 -1922945 -1738002 -1555142
41145a555142J59090J18077O8779K2432j0627k4010j6624Q159M4326Q4832J22968
$$ -1555142 -1396052 -1277975 -1209196 -1186764 -1197391 -1221401 -1238025 -1229866 -1185540 -1100708 -977740
41134i77740J53816J75069J86299J87204J76589J52903J15557O5926P854n2336
$$ -977740 -823924 -648855 -462556 -275352 -98763 54140 169697 235623 243477 191141
41124A91141j06810j48447j73250j81402j76396j63174j46478j29794j14750j00759
$$ 191141 84331 -64116 -237366 -418768 -595164 -758338 -904816 -1034610 -1149360 -1250119
41114a250119q5065o3301l0776J5529P4831J41436K05736K57143K87513K93303
$$ -1250119 -1335184 -1398485 -1429261 -1413732 -1338901 -1197465 -991729 -734586 -447073 -153770
41104a53770K75758K39760J92235J40727R1967N0561J8086p147k9600n5457r0993
$$ -153770 121988 361748 553983 694710 786677 837238 855324 848177 818577 763120 672127
41093F72127j40526k04408k77863l51265m11900m46823m46284m06851l33273k38124
$$ 672127 531601 327193 49330 -301935 -713835 -1160658 -1606942 -2013793 -2347066 -2585190
41083b585190j38970n3600N206L3611L7616L0226K5834L4366N7877R0837J23322
$$ -2585190 -2724160 -2777760 -2772554 -2738943 -2701327 -2671101 -2645267 -2610901 -2553024 -2462187 -2338865
41072b338865J45132J49143J32941R8880N3105M239l8117o5216p1314n5430k1777
$$ -2338865 -2193733 -2044590 -1911649 -1812769 -1759664 -1755425 -1793542 -1858758 -1930072 -1985502 -2007279
41061b007279K1608O5698J03559J32389J53430J69953J84528J97221K05559K06104
$$ -2007279 -1985671 -1919973 -1816414 -1684025 -1530595 -1360642 -1176114 -978893 -773334 -567230
41051e67230J96679J78033J53904J29255J07766R0187P4599N8068L8562J6204
$$ -567230 -370551 -192518 -38614 90641 198407 288594 363193 421261 459823 476027
41041D76027o680k6789m1912n2667o2697p6995r9178j29109j62047j89997k04913
$$ 476027 469347 442558 400646 347979 285282 208287 109109 -20000 -182047 -372044 -576957
41030e76957k02141j82091j49401j10508p1474l6976j0147P311J4973J3384L732
$$ -576957 -779098 -961189 -1110590 -1221098 -1292572 -1329548 -1339695 -1332384 -1317411 -1304027 -1300295
41019a300295j2260l2256n3547p3799r2004j08820j25963j45077j66756j89945
$$ -1300295 -1312555 -1344811 -1398358 -1472157 -1564161 -1672981 -1798944 -1944021 -2110777 -2300722
41009b300722k11650k27096k30658k17485j84983j33447o5941J1982R2719J67643
$$ -2300722 -2512372 -2739468 -2970126 -3187611 -3372594 -3506041 -3571982 -3560000 -3467281 -3299638
40999c299638K28742K70281K89826K88431K70135K40765K06202J70679J35834
$$ -3299638 -3070896 -2800615 -2510789 -2222358 -1952223 -1711458 -1505256 -1334577 -1198743
40990a198743J00948O4280K4791j6628n7133r3057j21356j40411j49927j50264
$$ -1198743 -1097795 -1033515 -1008724 -1025352 -1082485 -1175542 -1296898 -1437309 -1587236 -1737500
40980a737500j41818j24935j00494p0672l9112j0091J2611K6327K9353K0700L76
$$ -1737500 -1879318 -2004253 -2104747 -2175419 -2214531 -2224622 -2212011 -2185684 -2156331 -2135631 -2135255
40969b135255k9730o5136r9172j24918j38026j38417j29555j15738r9703q2222
$$ -2135255 -2164985 -2230121 -2329293 -2454211 -2592237 -2730654 -2860209 -2975947 -3075650 -3157872
40959c157872o3312m3234k2348m18K3296M8938P4978R8295J15512J24614J25740
$$ -3157872 -3221184 -3264418 -3286766 -3287184 -3263888 -3214950 -3139972 -3041677 -2926165 -2801551 -2675811
40948b675811J20709J11730J00154Q6042O8877M8785K7214O402j1741k6179l6258
$$ -2675811 -2555102 -2443372 -2343218 -2257176 -2188299 -2139514 -2112300 -2105898 -2117639 -2143818 -2180076
40937b180076m0838l8130k6578o091K1227N1434P9803J01857J14002J14066J02107
$$ -2180076 -2220914 -2259044 -2285622 -2291713 -2270486 -2219052 -2139249 -2037392 -1923390 -1809324 -1707217
40926a707217Q1271N7832L9840L4594M5762P1394J04056J33548J51105J52659
$$ -1707217 -1625946 -1568114 -1528274 -1493680 -1447918 -1376524 -1272468 -1138920 -987815 -835156
40916h35156J39454J16163Q8237O0027L4017J0832j0542l2310n6999q6004j18147
$$ -835156 -695702 -579539 -491302 -431275 -397258 -386426 -396968 -429278 -486277 -572281 -690428
40905f90428j49263j73380j84794j79831j57613j20075p1670j8765L1641P3708
$$ -690428 -839691 -1013071 -1197865 -1377696 -1535309 -1655384 -1727054 -1745819 -1714178 -1640470
40895a640470J04303J23358J32913J35686J34493J32619J33970J41768J56368
$$ -1640470 -1536167 -1412809 -1279896 -1144210 -1009717 -877098 -743128 -601360 -444992
40886d44992J74121J88593J93519J85441J64603J34003R7646N9173K1470j2976
$$ -444992 -270871 -82278 111241 296682 461285 595288 692934 752107 773577 760601
40876G60601m1594o1637p0573o6859n1164k7526l311J3126J6436P442o927j6927
$$ 760601 719007 657370 586797 519938 468774 441248 437937 451063 467499 474941 468014 451087
40864D51087j4432L889L5368P2028J03210J19885J19149J06068R1109Q4335R0004
$$ 451087 436655 440544 475912 547940 651150 771035 890184 996252 1087361 1171696 1261700
40853A261700J04842J20609J28806J24498J07328P9839M4906M475l9277q1645
$$ 1261700 1366542 1487151 1615957 1740455 1847783 1927622 1972528 1977003 1937726 1856081
40843A856081j14515j28661j17886q1941k6264M0364J07882J65964K05121K18711
$$ 1856081 1741566 1612905 1495019 1413078 1386814 1427178 1535060 1701024 1906145 2124856
40833B124856K04938J67442J14202N5644K472l6708n7421n9997m8400k8155m810
$$ 2124856 2329794 2497236 2611438 2667082 2669554 2632846 2575425 2515428 2467028 2438873 2434063
40822B434063J6548L1587L7617L4949K7490K1779K4612M0455O9719J08590J50272
$$ 2434063 2450611 2482198 2519815 2554764 2582254 2604033 2628645 2669100 2738819 2847409 2997681
40811B997681J87264K13648K26541K26063K14092J92471J61698J20897O9270P977
$$ 2997681 3184945 3398593 3625134 3851197 4065289 4257760 4419458 4540355 4609625 4617602
40801D617602n8862j24928j83654k30304k63195k83703k95164l01335l05122l08054
$$ 4617602 4558740 4433812 4250158 4019854 3756659 3472956 3177792 2876457 2571335 2263281
40791B263281l10298l11151l09759l05767k99370k90997k81240k71051k61335
$$ 2263281 1952983 1641832 1332073 1026306 726936 435939 154699 -116352 -377687
40782c77687k51605k39024k19263j88880j47232r6713m1694J3029O3884J09920
$$ -377687 -629292 -868316 -1087579 -1276459 -1423691 -1520404 -1562098 -1549069 -1485185 -1375265
40772a375265J52879J95552K39263K82050L18533L41491L44776L26375K89835
$$ -1375265 -1222386 -1026834 -787571 -505521 -186988 154503 499279 825654 1115489
40763A115489K42840J93473J46608J02631N9065J3789l2440p5856j11845j37545
$$ 1115489 1358329 1551802 1698410 1801041 1860106 1873895 1841455 1765599 1653754 1516209
40753A516209j52792j59103j57986j50083j35369j13840q6242n4627k2418O317
$$ 1516209 1363417 1204314 1046328 896245 760876 647036 560794 506167 483749 490066
40743D90066K8266M1989M7949M7606M2311L2882J9914M360j2220k8025m1842n3601
$$ 490066 518332 560321 608270 655876 698187 731069 750983 755343 743123 715098 673256 619655
40731F19655o4163p4470q4986r6128j09175j26418j50026j80285k14516k47417
$$ 619655 555492 481022 396036 299908 190733 64315 -85711 -265996 -480512 -727929
40721g27929k72565k84243k78709k54457k11727j52051p8403M150Q7996J63515
$$ -727929 -1000494 -1284737 -1563446 -1817903 -2029630 -2181681 -2260084 -2255934 -2167938 -2004423
40711b004423K20871K52782K57074K37814K04185J67328J36507J16315J06204
$$ -2004423 -1783552 -1530770 -1273696 -1035882 -831697 -664369 -527862 -411547 -305343
40702c05343J02185R9345R3564Q2090O3702L8892R554k2390n6638r4770j38380
$$ -305343 -203158 -103813 -10249 71841 135543 174435 183989 161599 104961 10191 -128189
40691a28189j86301k33081k69951k87645k79463k43311j82207j03312j5871P0934
$$ -128189 -314490 -547571 -817522 -1105167 -1384630 -1627941 -1810148 -1913460 -1929331 -1858397
40681a858397J49238K12673K56505K78529K79999K65184K39363K06905J70798
$$ -1858397 -1709159 -1496486 -1239981 -961452 -681453 -416269 -176906 29999 200797
40672B00797J33231R6150O1349L0436M635j5953l3140n0194o9774r1812j13337
$$ 200797 334028 430178 491527 521963 526598 510645 477505 427311 357537 265725 152388
40661A52388j30499j40874j43979j39747j26906j03454o9413k9363Q180L5142
$$ 152388 21889 -118985 -262964 -402711 -529617 -633071 -702484 -731847 -723667 -688525
40651f88525M8868N3583N6933O4395P5858Q6405Q9703Q1220N9970K8982n372l5468
$$ -688525 -639657 -586074 -529141 -464746 -388888 -302483 -212780 -131560 -71590 -42608 -47980 -83448
40639h3448n5534o3895o2873n6636m8634l9972k9033j2317J3631M9867R3477J37898
$$ -83448 -138982 -202877 -265750 -322386 -371020 -410992 -440025 -452342 -438711 -388844 -295367 -157469
40627a57469J75225J99488K09117K06989J97873J85109J69044J48038J20738Q7720
$$ -157469 17756 217244 426361 633350 831223 1016332 1185376 1333414 1454152 1541872
40617A541872N1765J7012j2409l3706m6007n0228m8853m5900m6257n3624o8093
$$ 1541872 1593637 1610649 1598240 1564534 1518527 1468299 1419446 1373546 1327289 1273665 1205572
40606A205572q5633j00456j08533j09532j06038j01269r7161r3853r0244q4816
$$ 1205572 1119939 1019483 910950 801418 695380 594111 496950 403097 312853 228037
40596B28037p6132o2915m4163j9425J0811M5023Q1038J16785J51126J84270K17365
$$ 228037 151905 88990 44827 25402 36213 81236 162274 279059 430185 614455 831820
40585H31820K51086K83997L11919L29290L32056L20193K97799K70355K41032K08993
$$ 831820 1082906 1366903 1678822 2008112 2340168 2660361 2958160 3228515 3469547 3678540
40575C678540J71015J24919P1971J6623l5426p8963j09947j25802j25885j12004
$$ 3678540 3849555 3974474 4046445 4063068 4027642 3948679 3838732 3712930 3587045 3475041
40565C475041q8206n9645l1027n342J6494L4998N0771O3284P0383O8973N6817
$$ 3475041 3386835 3327190 3296163 3290821 3307315 3342313 3393084 3456368 3526751 3595724 3652541
40554C652541L4719P705j5913k7471k1334L060M1138Q4621J23700J49282J54843
$$ 3652541 3687260 3694965 3679052 3651581 3630247 3633307 3674445 3759066 3882766 4032048 4186891
40543D186891J37696R9462M5768j4965p3286j20381j49237j55590j38895j02969
$$ 4186891 4324587 4424049 4469817 4454852 4381566 4261185 4111948 3956358 3817463 3714494
40533C714494n5446o053L5685O2595P1399O3150M2191J4289j4837m0066n7215
$$ 3714494 3659048 3652995 3688680 3751275 3822674 3885824 3928015 3942304 3927467 3887401 3830186
40522C830186o3734n9320m5663k5554k102K1635M3116O0872P4525Q3898Q7844
$$ 3830186 3766452 3707132 3661469 3635915 3633813 3655448 3698564 3759436 3833961 3917859 4005703
40511D005703Q4099P0674M8046K0413n274k2222k6772j9496l940J5719L6378N6306
$$ 4005703 4089802 4160476 4208522 4228935 4223661 4201439 4174667 4155171 4151231 4166950 4203328 4259634
40499D259634P4454Q9813J01523J09420J14030J15657J13494J06011R2675P5574
$$ 4259634 4334088 4423901 4525424 4634844 4748874 4864531 4978025 5084036 5176711 5252285
40489E252285N9454N0138N2413O8656R8418J38397J82328K21221K45178K46758
$$ 5252285 5311739 5361877 5414290 5482946 5581364 5719761 5902089 6123310 6368488 6615246
40479F615246K24134J81425J25867O4057n6o4794j29424j93263k55427l14819
$$ 6615246 6839380 7020805 7146672 7210729 7210673 7145879 7016455 6823192 6567765 6252946
40469F252946l69918m18331m56266m78483m79226m54091m01838l25355k31529
$$ 6252946 5883028 5464697 5008431 4529948 4050722 3596631 3194793 2869438 2637909
40460B637909j30577l4960M2492R1558J07724R3440N6447O206m8764j01301j44728
$$ 2637909 2507332 2472372 2514864 2606422 2714146 2807586 2864033 2870239 2821475 2720174 2575446
40449B575446j72917j82040j72667j50448j24411j03496r2984r3037j00349j11360
$$ 2575446 2402529 2220489 2047822 1897374 1772963 1669467 1576483 1483446 1383097 1271737
40439A271737j24095j37253j48427j54189j52237j43216j30216j16388j02897
$$ 1271737 1147642 1010389 861962 707773 555536 412320 282104 165716 62819
40430F2819q8562p1128m9000k2402O616L4968N9472P7491Q7467Q9263Q3918P2740
$$ 62819 -25743 -96871 -145871 -168273 -161657 -126689 -67217 10274 97741 187004 270922 343662
40418C43662N6787L7688J8907N194l63Q44L531K427m143j4178k4759l4358m2945
$$ 343662 400449 438137 457044 462238 461875 462719 466250 468677 464534 450356 425597 391239 348294
40405C48294n1048n9691p1148q8744j14659j47003j78630j99229j99703j76074
$$ 348294 297246 237555 166407 77663 -36996 -183999 -362629 -561858 -761561 -937635
40395i37635j30660p0454m727N6619J04359J31983J38256J28222J11198R6542
$$ -937635 -1068295 -1138749 -1143476 -1086857 -982498 -850515 -712259 -584037 -472839 -376297
40385c76297Q9746R0848R5360R6699Q8791O8008L4259q827n4601r5006j22764
$$ -376297 -286551 -195703 -100343 -3644 85147 153155 187414 178587 123986 28980 -93784
40374i3784j33370j26089j03711p1363l4865O27L1194N3916O6597O8192N9877
$$ -93784 -227154 -353243 -456954 -528317 -563182 -562555 -531361 -477445 -410848 -342656 -282779
40363b82779M5649L1572K3643K5192L5271M8950N9720O2714N7132M6418L6196
$$ -282779 -237130 -205558 -181915 -156723 -121452 -72502 -12782 49932 107064 153482 189678
40352A89678L0931L1070L2368K8146J3304j2223m2717o8982q2473p9397o2908
$$ 189678 220609 251679 284047 312193 325497 313274 270557 201575 119102 39705 -23203
40341b3203m2101k7823k7343m0986o2703q3994r8487j04609j05301j05450j08815
$$ -23203 -65304 -93127 -120470 -161456 -224159 -308153 -406640 -511249 -616550 -722000 -830815
40330h30815j16063j24779j30915j30554j21197j02452p6314m6716j8264N518
$$ -830815 -946878 -1071657 -1202572 -1333126 -1454323 -1556775 -1633089 -1679805 -1698069 -1692551
40320a692551K3447L6864M8613O1204P4798Q6272R0622Q4306O8390M8830L3438
$$ -1692551 -1669104 -1632240 -1583627 -1522423 -1447625 -1361353 -1270731 -1186425 -1118035 -1069205 -1035767
40309a035767K7512L1180M0082M8732N3914N5752N5995N5565N3787M9733M4048
$$ -1035767 -1008255 -977075 -936993 -888261 -834347 -778595 -722600 -667035 -613248 -563515 -519467
40298e19467L9456L9629M7408O3497Q6456J13736J42867J71552J96817K14359
$$ -519467 -480011 -440382 -392974 -329477 -243021 -129285 13582 185134 381951 596310
40288E96310K19191K07221J76799J29423O9555L389o2913j24359j76738k15404
$$ 596310 815501 1022722 1199521 1328944 1398499 1401888 1338975 1214616 1037878 822474
40278H22474k35282k32967k09517j71451j28826r1420o5411n2189m9396n2782
$$ 822474 587192 354225 144708 -26743 -155569 -246989 -312400 -364589 -413985 -466767
40268d66767n7469n8468n1169l2409j700L8131Q1258J19992J46497J54714J41896
$$ -466767 -524236 -582704 -633873 -666282 -667982 -629851 -548593 -428601 -282104 -127390 14506
40257A4506J09386O2312Q437m3555q5944j13464j24112j19081j02029p8000n2345
$$ 14506 123892 186204 194641 151086 65142 -48322 -172434 -291515 -393544 -471544 -523889
40246e23889k9637j2340L80J2632K9830N5702R0362J30537J71092K06640K32936
$$ -523889 -553526 -565866 -565486 -552854 -523024 -467322 -376960 -246423 -75331 131309 364245
40235C64245K48355K54844K56888K58526K60148K57471K43505K12268J62221R7733
$$ 364245 612600 867444 1124332 1382858 1643006 1900477 2143982 2356250 2518471 2616204
40225B616204K8041l5522q2833j07580j08517q9262n6953k0403J1759L2885L9933
$$ 2616204 2644245 2608723 2525890 2418310 2309793 2220531 2163578 2143175 2154934 2187819 2227752
40214B227752L4323K1373Q321J892O391K2603M7512P4997R7550J08461J03550
$$ 2227752 2262075 2283448 2291769 2293661 2300052 2322655 2370167 2445164 2542714 2651175 2754725
40203B754725Q1993M6201J004m7807r5016j36877j70884j94822k06118k02153
$$ 2754725 2836718 2882919 2883923 2836116 2741100 2604223 2433339 2238517 2032399 1830246
40193A830246j81653j46550j03000o0379k8021j1437j0443k0403l5417n0907o4205
$$ 1830246 1648593 1502043 1399043 1338664 1310643 1299206 1288763 1268360 1232943 1182036 1117831
40182A117831p3685p7993p6142o8069n4894l8533k1086m341J0343K1947K9461
$$ 1117831 1044146 966153 890011 821942 767048 728515 707429 703088 713431 735378 764839
40171G64839L1462K5963J1116j3148m3624p3976r7063j08066j06255r4325p6011
$$ 764839 796301 822264 833380 820232 776608 702632 605569 497503 391248 296923 220912
40160B20912n3948k9120k116K4917M7051N7293M9259K0787k3503p2448j11744
$$ 220912 166964 137844 135728 160645 207696 264989 314248 335035 311532 239084 127340
40149A27340j29001j17798p8860j8593N3578J27592J94388K46769K79457K88667
$$ 127340 -1661 -119459 -198319 -216912 -163334 -35742 158646 405415 684872 973539
40139I73539K72084K29962J66803R1977J7962m3385q4387j02745r9846p7901l8416
$$ 973539 1245623 1475585 1642388 1734365 1752327 1708942 1624555 1521810 1421964 1344063 1305647
40128A305647J6997Q4656J57848K27827K86102L26771L48198L53545L49663L44463
$$ 1305647 1322644 1407300 1565148 1792975 2079077 2405848 2754046 3107591 3457254 3801717
40118C801717L43977L50821L64508L82595M01437M16447M22599M15572L93082
$$ 3801717 4145694 4496515 4861023 5243618 5645055 6061502 6484101 6899673 7292755
40109G292755L55576L06078K49412J91384J38134R5485O7913N7319O2306P8571
$$ 7292755 7648331 7954409 8203821 8395205 8533339 8628824 8696737 8754056 8816362 8894933
40099H894933J00252J21552J38328J49462J57189J65616J77937J94489K13200
$$ 8894933 8995185 9116737 9255065 9404527 9561716 9727332 9905269 10099758 10312958
40090A0312958K31542K47847K61188K70990K77281K80970K83053K83023K77906
$$ 10312958 10544500 10792347 11053535 11324525 11601806 11882776 12165829 12448852 12726758
40081A2726758K62855K33012J85733J22076M6927l2406j08377j75215k30020k73006
$$ 12726758 12989613 13222625 13408358 13530434 13577361 13544955 13436578 13261363 13031343 12758337
40071A2758337l06758l34616l58786l79342l94822m03764m05820m01575l91382
$$ 12758337 12451579 12116963 11758177 11378835 10984013 10580249 10174429 9772854 9381472
40062I381472l74209l47585l09014k58363j99555j40087q8266n0078k7687k0011
$$ 9381472 9007263 8659678 8350664 8092301 7892746 7752659 7664393 7614315 7586628 7566617
40052G566617k3979l5385m9595o2799p3257q1244q7510r1797r2794q9216q0557
$$ 7566617 7542638 7507253 7457658 7394859 7321602 7240358 7152848 7061051 6968257 6879041 6798484
40041F798484o6904m8434k5291K160L3118O6264R9740J31099J57475J76014J84478
$$ 6798484 6731580 6683146 6657855 6660015 6693133 6759397 6859137 6990236 7147711 7323725 7508203
40030G508203J81571J66743J39768J00753N0836p194o9187j30657j87391k34973
$$ 7508203 7689774 7856517 7996285 8097038 8147874 8140680 8071493 7940836 7753445 7518472
40020G518472k67975k80293k67273k28442j68709r6656k0979N2282J19934J80125
$$ 7518472 7250497 6970204 6702931 6474489 6305780 6209124 6188145 6240427 6360361 6540486
40010F540486K31298K72479L03961L27468L45764L61908L78050L94279M08860
$$ 6540486 6771784 7044263 7348224 7675692 8021456 8383364 8761414 9155693 9564553
40001I564553M20261M29211M38791M52688M73478N01925N36688N73870O07300
$$ 9564553 9984814 10414025 10852816 11305504 11778982 12280907 12817595 13391465 13998765
39992A3998765O30388O38964O33257O17628N98126N79393N62773N46636N28183
$$ 13998765 14629153 15268117 15901374 16519002 17117128 17696521 18259294 18805930 19334113
39983A9334113N05108M76140M41076M01061L59029L19665K88575K70753K68638
$$ 19334113 19839221 20315361 20756437 21157498 21516527 21836192 22124767 22395520 22664158
39974B2664158K80403K99841L18615L29918L31127L23650L10511K93987K75007
$$ 22664158 22944561 23244402 23563017 23892935 24224062 24547712 24858223 25152210 25427217
39965B5427217K54151K32578K11617J91410J69954J43446J07753O0314J674o4018
$$ 25427217 25681368 25913946 26125563 26316973 26486927 26630373 26738126 26798440 26800114 26736096
39955B6736096j29966j88567k32931k57584k59035k36901j94790j39645p9672
$$ 26736096 26606130 26417563 26184632 25927048 25668013 25431112 25236322 25096677 25017005
39946B5017005k2280K6917O4505Q9684J04289J11638J14415J12990J05418Q9097
$$ 25017005 24994725 25021642 25086147 25175831 25280120 25391758 25506173 25619163 25724581 25813678
39936B5813678O3000K9083p712m0660o2933o9283n7355k8157J4489O4972J16395
$$ 25813678 25876678 25905761 25898049 25857389 25794456 25725173 25667818 25639661 25654150 25719122 25835517
39925B5835517J60670J89412J96388J80140J44501R6166M1246j6526p4870j30592
$$ 25835517 25996187 26185599 26381987 26562127 26706628 26802794 26844040 26827514 26752644 26622052
39915B6622052j78163k10551k21838k09727j76367j27211o8886p322N2867J07673
$$ 26622052 26443889 26233338 26011500 25801773 25625406 25498195 25429309 25421987 25474854 25582527
39905B5582527J52396J81270J88820J72331J33683P9441J9251l6634q0155j07610
$$ 25582527 25734923 25916193 26105013 26277344 26411027 26490468 26509719 26473085 26392930 26285320
39895B6285320j20094j21561j15758j04283q7071o4359l8063j1331J3190L4727
$$ 26285320 26165226 26043665 25927907 25823624 25736553 25672194 25634131 25622800 25635990 25670717
39885B5670717N4270P3036R0657J04500J10646J06028R0234O5775L6639O328k3213
$$ 25670717 25724987 25798023 25888680 25993180 26103826 26209854 26300088 26365863 26402502 26408830 26385617
39874B6385617n1090p6046r5501j06079j05343r3521p3885n1652l2164j9474j5691
$$ 26385617 26334527 26258481 26162980 26056901 25951558 25858037 25784152 25732500 25700336 25680862 25665171
39863B5665171k0961l4075n3751p9803j13073j53702j99201k44453k84046l14981
$$ 25665171 25644210 25610135 25556384 25476581 25363508 25209806 25010605 24766152 24482106 24167125
39853B4167125l37288l52101l59075l55368l36888l00673k46931j79885j07041
$$ 24167125 23829837 23477736 23118661 22763293 22426405 22125732 21878801 21698916 21591875
39844B1591875l7071K2893O9191J01683J22550J35222J44298J55519J74334K03146
$$ 21591875 21554804 21577697 21646888 21748571 21871121 22006343 22150641 22306160 22480494 22683640
39834B2683640K38974K73532K96130K97833K74348K26182J56604O9557l0916j40104
$$ 22683640 22922614 23196146 23492276 23790109 24064457 24290639 24447243 24516800 24485884 24345780
39824B4345780k52268l61127m60631n45456o11496o56655o81643o90065o87381
$$ 24345780 24093512 23732385 23271754 22726298 22114802 21458147 20776504 20086439 19399058
39815A9399058o79061o68622o56564o40919o19003n89002n50368n03504m49662
$$ 19399058 18719997 18051375 17394811 16753892 16134889 15545887 14995519 14492015 14042353
39806A4042353l91245l31861k75787k27209j89469j64217j50548j44793j41469
$$ 14042353 13651108 13319247 13043460 12816251 12626782 12462565 12312017 12167224 12025755
39797A2025755j35107j22091j01722p6106m8767k2605J692K5515N0560P6498R9793
$$ 12025755 11890648 11768557 11666835 11590729 11541962 11519357 11521049 11546564 11597124 11673622 11773415
39786A1773415J14457J14211R4683N4669l590p4759j51274k25008k89187l39609
$$ 11773415 11887872 12002083 12096766 12151435 12147845 12073086 11921812 11696804 11407617 11068008
39776A1068008l74449l93167l95582l82043l54533l17920k79796k48331k29042
$$ 11068008 10693559 10300392 9904810 9522767 9168234 8850314 8570518 8322187 8093145
39767H093145k22746k26120k34084k41963k46260k44599k36026k21936k06612
$$ 8093145 7870399 7644279 7410195 7168232 6921972 6677373 6441347 6219411 6012799
39758F012799j96067j95035k03712k16787k25719k22971k05292j74292j34446
$$ 6012799 5816732 5621697 5417985 5201198 4975479 4752508 4547216 4372924 4238478
39749D238478r0433m5607k365L6488O7373Q7274R5680R5008Q9150Q1483P3868
$$ 4238478 4148045 4102438 4100073 4136561 4203934 4291208 4386888 4481896 4571046 4652529 4726397
39738D726397O6712N9345N0452L8631K3118M305j6108l5626n2135o5522p8612
$$ 4726397 4793109 4852454 4902906 4941537 4964655 4968960 4952852 4917226 4865091 4799569 4720957
39727D720957r6406j23766j62653k10325k59311k99538l22181l23438l05808k75787
$$ 4720957 4624551 4500785 4338132 4127807 3868496 3568958 3246777 2923339 2617531 2341744
39717B341744k39551j99799j55702j05489m9364R168O4253J10203J43963J65858
$$ 2341744 2102193 1902394 1746692 1641203 1591839 1601007 1665260 1775463 1919426 2085284
39707B085284J78067J82200J78168J65250J43932J16550Q6215N5412K5581k187
$$ 2085284 2263351 2445551 2623719 2788969 2932901 3049451 3135666 3191078 3216659 3214472
39697C214472k6081m2850m7984l7318r732L0885P6406J18224J51582J77485K00945
$$ 3214472 3188391 3145541 3097557 3060239 3050507 3081392 3157798 3276022 3427604 3605089 3806034
39686C806034K27011K57034K87129L09286L14330K95380K50500J83587J03407
$$ 3806034 4033045 4290079 4577208 4886494 5200824 5496204 5746704 5930291 6033698
39677F033698K1334n1282j05463j36358j44343j34949j17181j00429r1341r2305
$$ 6033698 6055032 6003750 5898287 5761929 5617586 5482637 5365456 5265027 5173686 5081381
39667E081381j02149j17778j35110j49035j53616j43706j17409p7635l1572J1719
$$ 5081381 4979232 4861454 4726344 4577309 4423693 4279987 4162578 4084943 4053371 4065090
39657D065090M4461O2940O8772O7865O7478P3037Q6475J06378J29209J50656J66766
$$ 4065090 4109551 4172491 4241263 4309128 4376606 4449643 4536118 4642496 4771705 4922361 5089127
39646E089127J74755J73458J63660J48354J32531J21713J19507J25587J35771
$$ 5089127 5263882 5437340 5601000 5749354 5881885 6003598 6123105 6248692 6384463
39637F384463J44247J46512J41173J29831J15698J02045R1253Q4242Q0117P6293
$$ 6384463 6528710 6675222 6816395 6946226 7061924 7163969 7255222 7339464 7419581 7495874
39627G495874O9670N8557M4157L0423K2050K1550K6913L1478K6484N327l2909
$$ 7495874 7565544 7624101 7668258 7698681 7720731 7742281 7769194 7800672 7827156 7832483 7799574
39616G799574q2500j33035j73199j95046j97110j84816j67531j53755j47270j46309
$$ 7799574 7717074 7584039 7410840 7215794 7018684 6833868 6666337 6512582 6365312 6219003
39606F219003j45377j38170j20213r0686n2909j3023K2755N0875P1540Q7599J02195
$$ 6219003 6073626 5935456 5815243 5724557 5671648 5658625 5681380 5732255 5803795 5891394 5993589
39595E993589J16602J29382J37154J36603J26949J11441R6595Q9077R2035J03449
$$ 5993589 6110191 6239573 6376727 6513330 6640279 6751720 6848315 6937392 7029427 7132876
39585G132876J17542J27830J29361J19166R5792N9544J3654l4951p6916j03872
$$ 7132876 7250418 7378248 7507609 7626775 7722567 7782111 7795765 7760814 7683898 7580026
39575G580026j12057j03429q3447n7279k7430N837M2558Q1701J21305J59488J95129
$$ 7580026 7467969 7364540 7281093 7223814 7196384 7202221 7244779 7326480 7447785 7607273 7802402
39564G802402K27724K56591K80190K96177L02390K98024K84187K63372K38324
$$ 7802402 8030126 8286717 8566907 8863084 9165474 9463498 9747685 10011057 10249381
39555A0249381K11104J82792J53792J24239R4255O4203L5354J0677n342q595J943
$$ 10249381 10460485 10643277 10797069 10921308 11015563 11079766 11115120 11125797 11120455 11111860 11113803
39544A1113803K2866M7775P0548Q7874R9348J05721J07258J03784R5939Q6030
$$ 11113803 11136669 11184444 11254992 11342866 11442214 11547935 11655193 11758977 11854916 11940946
39534A1940946P7419P2990P4325Q2205R7468J20670J50556J82904K11150K28532
$$ 11940946 12018365 12091355 12165680 12247885 12345353 12466023 12616579 12799483 13010633 13239165
39524A3239165K30137K13601J78669J26605O0241j5598r4146j67752k29553k74686
$$ 13239165 13469302 13682903 13861572 13988177 14048418 14032820 13938674 13770922 13541369 13266683
39514A3266683l00524l06376k93411k64673k24575j77695j27825p7771k9524J5853
$$ 13266683 12966159 12659783 12366372 12101699 11877124 11699429 11571604 11493833 11464309 11480162
39504A1480162N8269R7878J34071J65624J92251K16009K40787K70320L06451L48749
$$ 11480162 11538431 11636309 11770380 11936004 12128255 12344264 12585051 12855371 13161822 13510571
39494A3510571L95092M42407M87221N25937N54991N71269N73010N60504N35694
$$ 13510571 13905663 14348070 14835291 15361228 15916219 16487488 17060498 17621002 18156696
39485A8156696N01153M60163M18282L84308L68236L76899M10773M64191N28058
$$ 18156696 18657849 19118012 19536294 19920602 20288838 20665737 21076510 21540701 22068759
39476B2068759N92459O48153O87466P05274O99578O71285O23537N61277M90959
$$ 22068759 22661218 23309371 23996837 24702111 25401689 26072974 26696511 27257788 27748747
39467B7748747M19604L53081K94654K45282K05741J79024J70857J87667K32960
$$ 27748747 28168351 28521432 28816086 29061368 29267109 29446133 29616990 29804657 30037617
39458C0037617L04262L92368M83629N64478O25846O65028O84366O88420O81867
$$ 30037617 30341879 30734247 31217876 31782354 32408200 33073228 33757594 34446014 35127881
39449C5127881O68575O50777O27777N95355N47411M79512L92173K91851J89300
$$ 35127881 35796456 36447233 37075010 37670365 38217776 38697288 39089461 39381312 39570612
39440C9570612R6373K2712k6375n0022n0121k9299R911O4545J30604K03427K78879
$$ 39570612 39666985 39689697 39663322 39613300 39563179 39533880 39543791 39608336 39738940 39942367 40221246
39429D0221246L54243M28118M99542N66998O28038O79943P21045P51810P74547
$$ 40221246 40575489 41003607 41503149 42070147 42698185 43378128 44099173 44850983 45625530
39420D5625530P91470Q02020Q01049P79381P26997O37454N11273L56620J87266
$$ 45625530 46417000 47219020 48020069 48799450 49526447 50163901 50675174 51031794 51219060
39411E1219060J9006j34094k63008l66061m49656n26379o10273p10611q27214
$$ 51219060 51238066 51103972 50840964 50474903 50025247 49498868 48888595 48177984 47350770
39402D7350770r50193j064447j155990j216356j243307j238940j207491j154354
$$ 47350770 46400577 45336130 44180140 42963784 41720477 40481537 39274046 38119692
39394C8119692j086222j011433r39275q77954q32062q01048p79462p58662p29134
$$ 38119692 37033470 36022037 35082762 34204808 33372746 32571698 31792236 31033574 30304440
39385C0304440o82926o15672n27873m25053l16886k15288j31531p3159m2190l5614
$$ 30304440 29621514 29005842 28477969 28052916 27736030 27520742 27389211 27316052 27273862 27238248
39375B7238248m7538p1250j00261j28651j51396j64750j66588j56698j37000j11265
$$ 27238248 27190710 27119460 27019199 26890548 26739152 26574402 26407814 26251116 26114116 26002851
39365B6002851q4062n9574m1140l1619l3524m8159p4358j08139j43752j75294
$$ 26002851 25918789 25859215 25818075 25786456 25752932 25704773 25630415 25522276 25378524 25203230
39355B5203230j97864k08111k04671j88689j63777j34867j06343q0380n6555l2817
$$ 25203230 25005366 24797255 24592584 24403895 24240118 24105251 23998908 23918528 23861973 23829156
39345B3829156p311K0158M7927P3733R6376J16407J35152J52827J67391J75249
$$ 23829156 23821845 23842003 23889930 23963663 24060039 24176446 24311598 24464425 24631816 24807065
39335B4807065J73413J61270J40576J13898Q3095M9088J2754k4046n8360q7050
$$ 24807065 24980478 25141748 25282324 25396222 25479317 25528405 25541159 25517113 25458753 25371703
39325B5371703j07915j20039j23123j16897j01772q0369n8190m2414l9554n3557
$$ 25371703 25263788 25143749 25020626 24903729 24801957 24721588 24663398 24620984 24581430 24527873
39315B4527873q4801j29802j81748k32363k74810l06174l28185l45793l64310
$$ 24527873 24443072 24313270 24131522 23899159 23624349 23318175 22989990 22644197 22279887
39306B2279887l86197m09267m27571m34726m27505m07226l78310l45392l11053
$$ 22279887 21893690 21484423 21056852 20622126 20194621 19787395 19409085 19063693 18752640
39297A8752640k75575k38516k00688j64889j34695j12375r7637q8239q1883p7945
$$ 18752640 18477065 18238549 18037861 17872972 17738277 17625902 17528265 17440026 17358143 17280198
39287A7280198p7761q3469r6314j15564j38447j60799j77993j85992j82188j65709
$$ 17280198 17202437 17118968 17022654 16907090 16768643 16607844 16429851 16243859 16061671 15895962
39277A5895962j37100r7886n0640Q52N2042R9130J40815J79122K18877K66127
$$ 15895962 15758862 15660976 15610336 15611188 15663230 15762360 15903175 16082297 16301174 16567301
39267A6567301L26252M02209M93283N94938P00178Q02094Q96247R81507J058791
$$ 16567301 16893553 17295762 17789045 18383983 19084161 19886255 20782502 21764009 22822800
39258B2822800J128472J187740J228953J239688J204519J108458R41513P03542
$$ 22822800 23951272 25139012 26367965 27607653 28812172 29920630 30862143 31565685
39250C1565685M07845Q1104k41735n26501p48604q97528r75826r94955r70840
$$ 31565685 31973530 32054634 31812899 31286398 30537794 29640266 28664440 27669485 26698645
39241B6698645r20320q57898p92569p26041o53930n70301m73241l68201k66733
$$ 26698645 25778325 24920427 24127858 23401817 22747887 22177586 21704345 21336144 21069411
39232B1069411j81575j21332q8162p8917q7571j06484j26704j39066j37005j19183
$$ 21069411 20887836 20766504 20678342 20599425 20511854 20405370 20278666 20139600 20002595 19883412
39222A9883412q9681n5372k2697M280K4188L7883M7755N6922O8318Q3743J02885
$$ 19883412 19793731 19738359 19715662 19719942 19744130 19782013 19829768 19886690 19955008 20038751 20141636
39211B0141636J22923J39568J49614J53305J54561J58898J70895J92827K24557
$$ 20141636 20264559 20404127 20553741 20707046 20861607 21020505 21191400 21384227 21608784
39202B1608784K63661L05721L45485L79362M07941M36309M71134N16229N70070
$$ 21608784 21872445 22178166 22523651 22903013 23310954 23747263 24218397 24734626 25304696
39193B5304696O27404O83598P37988P93842Q55451R24770R99426J072351J132437
$$ 25304696 25932100 26615698 27353686 28147528 29002979 29927749 30927175 31999526 33131963
39184C3131963J165560J155872J087829R49615P37666M60549J39727j94171n08540
$$ 33131963 34297523 35453395 36541224 37490839 38228505 38689054 38828781 38634610 38126070
39175C8126070p76526r81890j119580j192795j208907j176375j103388r98176
$$ 38126070 37349544 36367654 35248074 34055279 32846372 31669997 30566609 29568433
39167B9568433q70162p30777n92737m67488l62121k77585k09372j50371r4352
$$ 29568433 28698271 27967494 27374757 26907269 26545148 26267563 26058191 25907820 25813468
39158B5813468l8377J6994O9243J15693J54486J84888K07592K24988K40823K59414
$$ 25813468 25775091 25792085 25861328 25977021 26131507 26316395 26523987 26748975 26989798 27249212
39148B7249212K85060L21900L73420M41438N25494O23659P33950Q54719R83595
$$ 27249212 27534272 27856172 28229592 28671030 29196524 29820183 30554133 31408852 32392447
39139C2392447J116601J249219J378993J507349J638739J777388J923525K071174
$$ 32392447 33509048 34758267 36137260 37644609 39283348 41060736 42984261 45055435
39131D5055435K208687K321968K399226K434840K430069K390190K320172K221788
$$ 45055435 47264122 49586090 51985316 54420156 56850225 59240415 61560587 63782375
39123F3782375K093538J932570J736926J507184J247151R63442O63819L54996
$$ 63782375 65875913 67808483 69545409 71052593 72299744 73263186 73927005 74282001
39115G4282001M1163k75573n92820r05051j202183j470890j698139j874992j998584
$$ 74282001 74323164 74047591 73454771 72549720 71347537 69876647 68178508 66303516 64304932
39106F4304932k071738k101166k095531k064005k015153j955731j889288j814899
$$ 64304932 62233194 60132028 58036497 55972492 53957339 52001608 50112320 48297421
39098D8297421j726886j616333j474472j296635j084924q48410o00784l56446
$$ 48297421 46570535 44954202 43479730 42183095 41098171 40249761 39648977 39292531
39090C9292531j26124Q6349K84606M76947O71663Q73148J080681J289562J492927
$$ 39292531 39166407 39252756 39537362 40014309 40685972 41559120 42639801 43929363 45422290
39081D5422290J683101J852571J994808K104664K177848K209804K195086K128258
$$ 45422290 47105391 48957962 50952770 53057434 55235282 57445086 59640172 61768430
39073F1768430K006384J832014J614828J370427J116243Q66365O28139M02288
$$ 61768430 63774814 65606828 67221656 68592083 69708326 70574691 71202830 71605118
39065G1605118J85936k3592k26119m17495n89641p31884q33856q89078q96953
$$ 71605118 71791054 71767462 71541343 71123848 70534207 69802323 68968467 68079389 67182436
39056F7182436q61552p88091o79867n37560l60663j49527R2983L60787O45178
$$ 67182436 66320884 65532793 64852926 64315366 63954703 63805176 63898159 64258946 64904124
39047F4904124R36597J226462J507927J775592K025318K254574K462528K648771
$$ 64904124 65840721 67067183 68575110 70350702 72376020 74630594 77093122 79741893
39039G9741893K811079K943683L037446L082089L069507K996539K865565K682380
$$ 79741893 82552972 85496655 88534101 91616190 94685697 97682236 100547801 103230181
39031A03230181K452315K176843J852629J473665J035843N42239O761n46422j088571
$$ 103230181 105682496 107859339 109711968 111185633 112221476 112763715 112770476 112224054 111135483
39022A11135483j594956k051678k456672k814709l130099l401890l623929l788916
$$ 111135483 109540527 107488849 105032177 102217468 99087369 95685479 92061550 88272634
39014H8272634l893395l940590l939376l900201l830635l733467l608090l453792
$$ 88272634 84379239 80438649 76499273 72599072 68768437 65034970 61426880 57973088
39006E7973088l272782l071620k860615k651410k453554k271843k105830j951584
$$ 57973088 54700306 51628686 48768071 46116661 43663107 41391264 39285434 37333850
38998C7333850j804187j659457j514577j368209j220608j073822r31690p99479
$$ 37333850 35529663 33870206 32355629 30987420 29766812 28692990 27761300 26961821
38990B6961821o83065n87666n16427m69343m42975m31298m27604m26862m27236
$$ 26961821 26278756 25691090 25174663 24705320 24262345 23831047 23403443 22976581 22549345
38981B2549345m29684m35726m45023m54670m60605m59805m51651m38083m23064
$$ 22549345 22119661 21683935 21238912 20784242 20323637 19863832 19412181 18974098 18551034
38972A8551034m11594m07899m13120m23968m33857m36147m27503m09418l87337
$$ 18551034 18139440 17731541 17318421 16894453 16460596 16024449 15596946 15187528 14800191
38963A4800191l68146l57215l56248l62966l72701l80750l84104l81919l75295
$$ 14800191 14432045 14074830 13718582 13355616 12982915 12602165 12218061 11836142 11460847
38954A1460847l66768l59509l56043l56979l60614l63857l63927l59768l52221
$$ 11460847 11094079 10734570 10378527 10021548 9660934 9297077 8933150 8573382 8221161
38945H221161l42813l31992l18182k98533k70893k35472j95049j53717j15322
$$ 8221161 7878348 7546356 7228174 6929641 6658748 6423276 6228227 6074510 5959188
38936E959188q2498n6477l7147k3152j2218j973R137K1494L4891M9401O5576Q3669
$$ 5959188 5876690 5820213 5783066 5759914 5747696 5745723 5754860 5776354 5811245 5860646 5926222 6009891
38924F009891J02751J20639J34519J41491J38754J23993R6450N7998J3205l1801
$$ 6009891 6112642 6233281 6367800 6509291 6648045 6772038 6868488 6926486 6939691 6907890
38914F907890p0820r8546j11042j06090q3490m5000O077O5230J26716J83541K28270
$$ 6907890 6837070 6738524 6627482 6521392 6437902 6392902 6398979 6464209 6590925 6774466 7002736
38903G002736K55086K62293K53439K35677K16053J98329J82599J67457J52354
$$ 7002736 7257822 7520115 7773554 8009231 8225284 8423613 8606212 8773669 8926023
38894H926023J38096J25612J14647J03542Q9788P0584M3167N316m3663j01895
$$ 8926023 9064119 9189731 9304378 9407920 9497708 9568292 9611459 9616775 9573112 9471217
38884I471217j64500k24386k74147l08390l25408l27342l18768l04518k87850
$$ 9471217 9306717 9082331 8808184 8499794 8174386 7847044 7528276 7223758 6935908
38875F935908k69838k49855k26577j98769j65838j28520q9837n5389l1707k2861
$$ 6935908 6666070 6416215 6189638 5990869 5825031 5696511 5606674 5551285 5519578 5496717
38865E496717k7756m0774n5608o8793p9617q6936q6746p3427m3699J56N0234R5824
$$ 5496717 5468961 5428187 5372579 5303786 5224169 5137233 5050487 4977060 4933361 4933517 4983751 5079575
38853E079575J27308J39262J31702J09072P7981M5257J7142j066n782M049K7302
$$ 5079575 5206883 5346145 5477847 5586919 5664900 5710157 5727299 5726233 5720451 5724500 5751802
38842E751802O2039J06208J56641K07785K52362K84156L00500L02387K92570K73668
$$ 5751802 5813841 5920049 6076690 6284475 6536837 6820993 7121493 7423880 7716450 7990118
38832G990118K47398K14623J75524J30054P8780K3725l1529q2620j25658j58265
$$ 7990118 8237516 8452139 8627663 8757717 8836497 8860222 8828693 8746073 8620415 8462150
38822H462150j80044j92341j97539j98391j97744j98495k03257k13533k28505
$$ 8462150 8282106 8089765 7892226 7693835 7496091 7297596 7094339 6880806 6652301
38813F652301k44195k53842k49954k27324j85233j27516o0940O689O7872J16662
$$ 6652301 6408106 6154264 5904310 5676986 5491753 5364237 5303297 5309986 5377858 5494520
38803E494520J50044J68536J75114J73122J65050J53238J41498J35658J41878
$$ 5494520 5644564 5813100 5988214 6161336 6326386 6479624 6621122 6756780 6898658
38794F898658J63530J98630K39692K76287K98896L01906K84574K50216K04805
$$ 6898658 7062188 7260818 7500510 7776797 8075693 8377599 8662173 8912389 9117194
38785I117194J55773J10856P6429N5325M5335M0026L2065J7123m229k7617m7664
$$ 9117194 9272967 9383823 9460252 9515577 9560912 9600938 9633003 9650126 9645897 9618280 9570616
38774I570616o0289o3569n7421m2931k1723M468L3884O4420R3129J16058J28929
$$ 9570616 9510327 9446758 9389337 9346406 9324683 9329151 9363035 9427455 9520584 9636642 9765571
38763I765571J28617J14446Q8205N2849J1069l4881q2205j26717j63303j87468
$$ 9765571 9894188 10008634 10096839 10149688 10160757 10125876 10043671 9916954 9753651 9566183
38753I566183j96630j90301j69498j36430r4987n1074j1654J7656L5031M3237
$$ 9566183 9369553 9179252 9009754 8873324 8778337 8727263 8715609 8733265 8768296 8811533
38743H811533M8235N6395P1896R5571J25718J59796J95419K29826K58619K75658
$$ 8811533 8859768 8916163 8988059 9083630 9209348 9369144 9564563 9794389 10053008 10328666
38733A0328666K74965K53594K13403J60288J01302M1654j6571p3581j30077j85783
$$ 10328666 10603631 10857225 11070628 11230916 11332218 11373872 11357301 11283720 11153643 10967860
38723A0967860k38667k84759l18607l34312l26990k94301k38047j65220q7154
$$ 10967860 10729193 10444434 10125827 9791515 9464525 9170224 8932177 8766957 8679803
38714H679803j6163L8933P5503R6534J07633J13484J15416J11265R8093P6304
$$ 8679803 8663640 8702573 8778076 8874610 8982243 9095727 9211143 9322408 9420501 9496805
38704I496805N1882L4467L2097M6321P0668R3309J02324R1033O0892K0859j5978
$$ 9496805 9548687 9583154 9615251 9661572 9732240 9825549 9927873 10018906 10079798 10100657 10084679
38693A0084679l6701l2327j98N5651J26407K01607K71964L31055L76234M08809
$$ 10084679 10047978 10015651 10015453 10071104 10197511 10399118 10671082 11002137 11378371 11787180
38683A1787180M33093M54078M74791M94685N09781N14418N03694M75397M30270
$$ 11787180 12220273 12674351 13149142 13643827 14153608 14668026 15171720 15647117 16077387
38674A6077387L70949L00839K23972J45150O9299O5o1066j14298j60332j99818
$$ 16077387 16448336 16749175 16973147 17118297 17187596 17187661 17126595 17012297 16851965 16652147
38664A6652147k33717k63772k91854l18320l40810l54995l56993l45662l23129
$$ 16652147 16418430 16154658 15862804 15544484 15203674 14848679 14491686 14146024 13822895
38655A3822895k93863k63317k36803k18263k09143k07963k11023k13545k10693
$$ 13822895 13529032 13265715 13028912 12810649 12601506 12393543 12182520 11968975 11758282
38646A1758282j98320j73852j36984q9792l6149J9087P0892J15165J50042J76578
$$ 11758282 11559962 11386110 11249126 11159334 11123185 11142272 11213164 11328329 11478371 11654949
38636A1654949J97850K16817K34580K50658K65199K81219L04719L42166L97091
$$ 11654949 11852799 12069616 12304196 12554854 12820053 13101272 13405991 13748157 14145248
38627A4145248M68140N49663O33823P12766P80376Q34009Q75722R11574R48553
$$ 14145248 14613388 15163051 15796874 16509640 17290016 18124025 18999747 19911321 20859874
38618B0859874R90850J037871J084457J121973J139455J125406J071021R73782
$$ 20859874 21850724 22888595 23973052 25095025 26234480 27359886 28430907 29404689
38610B9404689Q39628O82622N21968L77165K62694J84639J40832J23843J24416
$$ 29404689 30244317 30926939 31448907 31826072 32088766 32273405 32414237 32538080 32662496
38601C2662496J33620J43999J50421J50563J44439J33072J17313R7497P3767M6589
$$ 32662496 32796116 32940115 33090536 33241099 33385538 33518610 33635923 33733420 33807187 33853776
38591C3853776J7117j2623l9836o1450p4828p8434p2189n7452l6619j2266J4118
$$ 33853776 33870893 33858270 33818434 33756984 33682156 33603722 33531533 33474081 33437462 33425196 33439314
38580C3439314M3074P6853J17645J65446K17112K67360L11114L45981L73599L99018
$$ 33439314 33482388 33559241 33676886 33842332 34059444 34326804 34637918 34983899 35357498 35756516
38570C5756516M28517M67155N17388N79061O50042P27062Q06881Q87483R68452
$$ 35756516 36185033 36652188 37169576 37748637 38398679 39125741 39932622 40820105 41788557
38561D1788557J050102J132165J213209J291057J363709J430537J493761J559578
$$ 41788557 42838659 43970824 45184033 46475090 47838799 49269336 50763097 52322675
38553E2322675J637687J738663J870298K035100K230288K449929K687538K937513
$$ 52322675 53960362 55699025 57569323 59604423 61834711 64284640 66972178 69909691
38545F9909691L195076L455701L715265L970962M221792M467712M707597M937539
$$ 69909691 73104767 76560468 80275733 84246695 88468487 92936199 97643796 102581335
38537A02581335N150575N337964N491151N603392N670576N691307N666734N600224
$$ 102581335 107731910 113069874 118561025 124164417 129834993 135526300 141193034 146793258
38529A46793258N496681N361234N197725N007875M791812M549602M282386L991963
$$ 146793258 152289939 157651173 162848898 167856773 172648585 177198187 181480573 185472536
38521A85472536L678992L341619K976122K579662K153466J704859J247789Q02523
$$ 185472536 189151528 192493147 195469269 198048931 200202397 201907256 203155045 203957568
38513B03957568L94561N1942j99466l41436l66883k79591r0421J87605N42888
$$ 203957568 204352129 204404071 204204605 203863169 203496286 203216695 203126274 203313879 203856767
38504B03856767R66022J448213J978991K545183L131954L724961M311980M883100
$$ 203856767 204822789 206271002 208249993 210795176 213927130 217652091 221964071 226847171
38496B26847171N430116N946407O427854O874094P288806P678241Q048270Q401019
$$ 226847171 232277287 238223694 244651548 251525642 258814448 266492689 274540959 282941978
38488B82941978Q732030R028481R269025R425968R470075R376230R126436Q707753
$$ 282941978 291674008 300702489 309971514 319397482 328867557 338243787 347370223 356077976
38480C56077976Q107320P310325O305572N096017L705746K176714N58197j100873
$$ 356077976 364185296 371495621 377801193 382897210 386602956 388779670 389337867 388236994
38472C88236994k749729m328360n766549o995502p965268q655060r069810r228104
$$ 388236994 385487265 381158905 375392356 368396854 360431586 351776526 342706716 333478612
38464C33478612r151640q861517q379237p727803o931007o011987m992315l891512
$$ 333478612 324326972 315465455 307086218 299358415 292427408 286415421 281423106 277531594
38456B77531594k726558j511834k60191J014873K296937L565252M794366N954367
$$ 277531594 274805036 273293202 273033011 274047884 276344821 279910073 284704439 290658806
38448B90658806P011656P930602Q676543R219746R538798R621243R460496R050904
$$ 290658806 297670462 305601064 314277607 323497353 333036151 342657394 352117890 361168794
38440C61168794Q385879P463783O300675M940899L454361J918141L94435j077935
$$ 361168794 369554673 377018456 383319131 388260030 391714391 393632532 394026967 392949032
38432C92949032k472514l756810m884860n807240o487793o911766p080504p000503
$$ 392949032 390476518 386719708 381834848 376027608 369539815 362628049 355547545 348547042
38424C48547042o677499o119040n340939m371143l248283k017193p25195N79489
$$ 348547042 341869543 335750503 330409564 326038421 322790138 320772945 320047750 320627239
38416C20627239J848884L037543M104577N012998N727513O216392O461253O470261
$$ 320627239 322476123 325513666 329618243 334631241 340358754 346575146 353036399 359506660
38408C59506660O283000N959026N555363N109235M638712M157808L689067L259665
$$ 359506660 365789660 371748686 377304049 382413284 387051996 391209804 394898871 398158536
38400C98158536K883536K545229K199090J784062J244191N44813l20355j332237
$$ 398158536 401042072 403587301 405786391 407570453 408814644 409359457 409039102 407706865
38392D07706865k458131l666375m934034o240903p554593q820982r971017j0940759
$$ 407706865 405248734 401582359 396648325 390407422 382852829 374031847 364060830 353120071
38384C53120071j1690140j2208123j2504299j2596648j2504887j2251421j1865475
$$ 353120071 341429931 329221808 316717509 304120861 291615974 279364553 267499078
38377B67499078j1384683j0851326j0304664r773575r273633q809496q380126
$$ 267499078 256114395 245263069 234958405 225184830 215911197 207101701 198721575
38370A98721575p983392p618375p285671o986655o722216o491254o289400o108523
$$ 198721575 190738183 183119808 175834137 168847482 162125266 155634012 149344612 143236089
38362A43236089n937395n763621n576383n369161n141344m898056m648145m401001
$$ 143236089 137298694 131535073 125958690 120589529 115448185 110550129 105901984 101500983
38354A01500983m163321l937216l720573l509366l300552l093762k891103k695668
$$ 101500983 97337662 93400446 89679873 86170507 82869955 79776193 76885090 74189422
38346G4189422k510058k335681k172738k020288j876174j737058j599106j459365
$$ 74189422 71679364 69343683 67170945 65150657 63274483 61537425 59938319 58478954
38338E8478954j317214j174897j036740r07677p92212o94254o17181n63401n33591
$$ 58478954 57161740 55986843 54950103 54042426 53250214 52555960 51938779 51375378 50841787
38329E0841787n26314n38256n64547n99027o35026o66876o91289p07306p15201
$$ 50841787 50315473 49777217 49212670 48613643 47978617 47311741 46620452 45913146 45197945
38320D5197945p15964p12273p09460p14262p31298p60101p95640q32180q67262
$$ 45197945 44481981 43769708 43060248 42345986 41614688 40854587 40058947 39226767 38359505
38311C8359505r02570r41244r83938j026644j061675j081047j079987j058550
$$ 38359505 37456935 36515691 35531753 34505109 33443434 32362387 31282400 30223850
38303C0223850j020882r73050r20879q68451q17650p68884p22608o80529o45279
$$ 30223850 29202968 28229918 27309039 26440588 25622938 24854054 24131446 23450917 22805638
38294B2805638o18752o00362n86413n70812n46865n09738m58661l97536l33244
$$ 22805638 22186886 21586524 21000111 20429299 19882434 19372696 18914035 18516499 18183255
38285A8183255k72696k20819j80582j53885j41377j40919j46666j50790j47295
$$ 18183255 17910559 17689740 17509158 17355273 17213896 17072977 16926311 16775521 16628226
38276A6628226j35129j18237j02820r3949r3543j00282j11195j23959j38405j56148
$$ 16628226 16493097 16374860 16272040 16178091 16084548 15984266 15873071 15749112 15610707 15454559
38266A5454559j78685k05909k36283k68093l00070l30580l56499l73383l77322
$$ 15454559 15275874 15069965 14833682 14565589 14265519 13934939 13578440 13205057 12827735
38257A2827735l67158l45023l14812k79986k42832k05472j71049j43409j25366
$$ 12827735 12460577 12115554 11800742 11520756 11277924 11072452 10901403 10757994 10632628
38248A0632628j16891j14531j12652j06067r2921p5989o1246n4459n8089p0607
$$ 10632628 10515737 10401206 10288554 10182487 10089566 10013577 9952331 9897872 9839783 9769176
38238I769176q8350j08201j28951j50597j72566j92749k08244k16867k17903k11467
$$ 9769176 9680826 9572625 9443674 9293077 9120511 8927762 8719518 8502651 8284748 8073281
38228H073281j97419j75173j44637j07436o7268k9191J680K1372K8171K3551J2562
$$ 8073281 7875862 7700689 7556052 7448616 7381348 7352157 7353837 7375209 7403380 7426931 7439493
38217G439493K888K508J6768M6168Q5934J27696J62668J84755J91981J85956J70419
$$ 7439493 7442381 7444889 7461657 7507825 7593759 7721455 7884123 8068878 8260859 8446815 8617234
38206H617234J49966J29048J11025R7666Q9460Q6249Q7253R0270R0895Q2794N9460
$$ 8617234 8767200 8896248 9007273 9104939 9194399 9280648 9367901 9458171 9549066 9631860 9691320
38195I691320J7107m2685j12544j82026k42032k88097l20928l44738l64660l84154
$$ 9691320 9708427 9665742 9553198 9371172 9129140 8841043 8520115 8175377 7810717 7426563
38185G426563m03019m17139m20414m07874l78134l33911k80750k24875j71197
$$ 7426563 7023544 6606405 6185991 5778117 5399983 5066072 4785322 4560447 4389250
38176D389250j22189p8034l7788j044L0672N3609O3182N6647L5530O168k2083
$$ 4389250 4267061 4189027 4151239 4150195 4180867 4234476 4297658 4354305 4389835 4396003 4373920
38165D373920l9933m0962k3318R887N1202R0753J19370J31877J28602J13803R2252
$$ 4373920 4333987 4293025 4269707 4279594 4330796 4421549 4540919 4672796 4801398 4915201 5007453
38154E007453O6771L8402Q307k1021m6367o5568p8956q9457j01328j18120j40947
$$ 5007453 5074224 5112626 5120933 5099912 5053545 4987977 4909021 4819564 4718236 4600116 4459169
38143D459169j67879j94470k14802k22236k09866j71404j03173o891J08686K29197
$$ 4459169 4291290 4096820 3882018 3659782 3449916 3278512 3175339 3168448 3277134 3506331
38133C506331L39239M27428M88928N24354N36719N28897N02980M61125M06553
$$ 3506331 3845570 4272998 4761926 5286280 5822999 6351896 6854876 7316001 7722554
38124G722554L43507K76067K06953J37648O9815O744m6836q6498j09907j17143
$$ 7722554 8066061 8342128 8549081 8686729 8756544 8763288 8716452 8629954 8520047 8402904
38114H402904j09743q9984o1365k9240P6K1905L5566M4552N4453P0248R4271J25295
$$ 8402904 8293161 8203177 8141812 8112572 8112648 8134553 8170119 8214671 8269124 8339372 8433643 8558938
38102H558938J58735J87997K06468K09199J93723J60089J10647M9645j7290q3781
$$ 8558938 8717673 8905670 9112138 9321337 9515060 9675149 9785796 9835441 9818151 9734370
38092I734370j43450j90999k23173k38716k37185k18027j81466j30843p3912k1067
$$ 9734370 9590920 9399921 9176748 8938032 8700847 8482820 8301354 8170511 8096599 8075532
38082H075532J8856M2409N2559N6440O1385P1685Q7659J07052J26956J44680J57375
$$ 8075532 8094388 8136797 8189356 8245796 8307181 8378866 8466525 8573577 8700533 8845213 9002588
38071I002588J61813J55165J36083J04763O1800P239n9049j35774k18837l01226
$$ 9002588 9164401 9319566 9455649 9560412 9622212 9629451 9570402 9434628 9215791 8914565
38061H914565l74215m29408m60750m66145m48211m13939l73040l35090l06340
$$ 8914565 8540350 8110942 7650192 7184047 6735836 6321897 5948857 5613767 5307427
38052E307427k87689k75267k63387k48068k28829k08218j90374j79755j79939
$$ 5307427 5019738 4744471 4481084 4233016 4004187 3795969 3605595 3425840 3245901
38043C245901j91643k10667k27930k32789k18093j83590j35573q3422l5604K700
$$ 3245901 3054258 2843591 2615661 2382872 2164779 1981189 1845616 1762194 1726590 1729290
38033A729290K9624M5269N0428M6477L6205K4682J9106K7071N3304R6313J47258
$$ 1729290 1758914 1804183 1854611 1901088 1937293 1961975 1981081 2008152 2061456 2157769 2305027
38022B305027J92731K20332K23710K04571J71574J37665J16721J19833J52070
$$ 2305027 2497758 2718090 2941800 3146371 3317945 3455610 3572331 3692164 3844234
38013C844234K10957K87259L67586M37986M87539N10704N07320M80503M34292
$$ 3844234 4055191 4342450 4710036 5148022 5635561 6146265 6653585 7134088 7568380
38004G568380L72424K98345K15598J27941L9272m6492j25525j93871k46977k79424
$$ 7568380 7940804 8239149 8454747 8582688 8621960 8575468 8449943 8256072 8009095 7729671
37994G729671k85593k61220k05176j20707j5519R9579K13340L16879M05175M76479
$$ 7729671 7444078 7182858 6977682 6856975 6841456 6941035 7154375 7471254 7876429 8352908
37984H352908N30474N66790N84924N85424N71057N46766N17884M87655M55864
$$ 8352908 8883382 9450172 10035096 10620520 11191577 11738343 12256227 12743882 13199746
37975A3199746M19622L75558L21593K57439J84409J05465K5109n1707j21527j83564
$$ 13199746 13619368 13994926 14316519 14573958 14758367 14863832 14888941 14837234 14715707 14532143
37965A4532143k38933k88635l32121l67389l92138m04823m05135l94133l74164
$$ 14532143 14293210 14004575 13672454 13305065 12912927 12508104 12102969 11708836 11334672
37956A1334672l48407l19893k90510k60729k30278j98983j67048j34973j03826
$$ 11334672 10986265 10666372 10375862 10115133 9884855 9685872 9518824 9383851 9280025
37947I280025p5553n2294l4404j9052j218K3237N5118R1812J28981J62080J87011
$$ 9280025 9204472 9152178 9117774 9098722 9097504 9120741 9175859 9267671 9396652 9558732 9745743
37936I745743K00496K00537J86468J58333J16290O0943n453p7969j49063k09941
$$ 9745743 9946239 10146776 10333244 10491577 10607867 10668810 10663357 10585388 10436325 10226384
37926A0226384k52727k72809k70308k49776k17962j80868j41852j01658n9928
$$ 10226384 9973657 9700848 9430540 9180764 8962802 8781934 8640082 8538424 8478496
37917H478496j7019K4969O2486R2210J13110J27403J39461J53198J69459J84914
$$ 8478496 8461477 8486446 8548932 8641142 8754252 8881655 9021116 9174314 9343773 9528687
37907I528687J93147J87648J65352J28648Q4515M1545O922j4884k1718j2787J1488
$$ 9528687 9721834 9909482 10074834 10203482 10287997 10329542 10336464 10321580 10299862 10287075 10298563
37896A0298563M8468R2206J34201J66627J86004J94095J95151J92080J84693J70518
$$ 10298563 10347031 10439237 10573438 10740065 10926069 11120164 11315315 11507395 11692088 11862606
37886A1862606J46460J10036O0523L70o3850j22180j63756j79807j65689j21320
$$ 11862606 12009066 12119102 12179625 12179995 12116145 11993965 11830209 11650402 11484713 11363393
37876A1363393n0552L9503J38810K35046L15326L68933L90222L80694L49476L11374
$$ 11363393 11312841 11352344 11491154 11726200 12041526 12410459 12800681 13181375 13530851 13842225
37866A3842225K82203K72807K84999L12151L44214L73775L99112M22848M48044
$$ 13842225 14124428 14397235 14682234 14994385 15338599 15712374 16111486 16534334 16982378
37857A6982378M75050N01003N21504N32783N33283N24426N10453M97154M89655
$$ 16982378 17457428 17958431 18479935 19012718 19546001 20070427 20580880 21078034 21567689
37848B1567689M90172M96814N04291N06588N00358M86824M70458M55512M43451
$$ 21567689 22057861 22554675 23058966 23565554 24065912 24552736 25023194 25478706 25922157
37839B5922157M33441M24672M17574M12497M07389L96845L73576L31438K68351
$$ 25922157 26355598 26780270 27197844 27610341 28017730 28414575 28788151 29119589 29387940
37830B9387940J87638R6762M088q4413j66205k40354l04616l54249l83681l89694
$$ 29387940 29575578 29672340 29676428 29592015 29425810 29185456 28880840 28526591 28142910 27753216
37820B7753216l73487l40388k98079k54894k18583j95090j87376j95158k15868
$$ 27753216 27379729 27039341 26741262 26486368 26267785 26072695 25885319 25690161 25474293
37811B5474293k45782k80231l13212l37880l48335l41444l17154k77184k23485
$$ 25474293 25228511 24948280 24635068 24297188 23948853 23607409 23290255 23013071 22789586
37802B2789586j57750q2163n82Q0939J55001K15057K57918K85022L01632L14451
$$ 22789586 22631836 22549673 22549091 22630030 22785031 23000088 23258006 23543028 23844660 24159111
37792B4159111L29011L48017L70906L94519M14602M27597M31831M27424M15154
$$ 24159111 24488122 24836139 25207045 25601564 26016166 26443763 26875594 27303018 27718172
37783B7718172L95132L66127L25981K73270K09611J41011P6452K3902j3794m0257
$$ 27718172 28113304 28479431 28805412 29078682 29288293 29429304 29505756 29529658 29515864 29475607
37773B9475607o3497r1954j30810j80006k34613k87432l32350l66314l88900m00599
$$ 29475607 29412110 29320156 29189346 29009340 28774727 28487295 28154945 27788631 27399731 26999132
37763B6999132m01853l93514l77571l56704l32609l04549k69544k24299j67297
$$ 26999132 26597279 26203765 25826194 25469490 25136881 24832332 24562788 24338489 24171192
37754B4171192r9490k3306N8608J43719K29156L11377L86484M50652N00209N31388
$$ 24171192 24071702 24048396 24107004 24250723 24479879 24791256 25177740 25628392 26128601 26659989
37744B6659989N40035N21530M70896L83778K58878J01410p4673k48389l97599
$$ 26659989 27200024 27721554 28192450 28576228 28835106 28936516 28861843 28613454 28215855
37735B8215855n06001n67312n85303n71437n41904n14279n03450n17687n56551
$$ 28215855 27709854 27142542 26557239 25985802 25443898 24929619 24426169 23908482 23351931
37726B3351931o11301o67606p10111p27869p18471o88468o49774o14323n89694
$$ 23351931 22740630 22073024 21362913 20635044 19916573 19228105 18578331 17964008 17374314
37717A7374314n77200n72716n69864n63873n53655n40599n25307n05279m75707
$$ 17374314 16797114 16224398 15654534 15090661 14537006 13996407 13471100 12965821 12490114
37708A2490114m32727l76543l11732k44500j79255j17300n8269k370M8657R2056
$$ 12490114 12057387 11680844 11369112 11124612 10945357 10828057 10769788 10767418 10816075 10908131
37698A0908131J25135J46212J55211J53845J45241J33376J22322J15117J12315
$$ 10908131 11033266 11179478 11334689 11488534 11633775 11767151 11889473 12004590 12116905
37689A2116905J11575J09329J03549R5361Q8332Q6747R4589J15641J53683K11800
$$ 12116905 12228480 12337809 12441358 12536719 12625051 12711798 12806387 12922028 13075711 13287511
37679A3287511K90881L88115M96439O05442P03256P78785Q23678Q33743Q09282
$$ 13287511 13578392 13966507 14462946 15068388 15771644 16550429 17374107 18207850 19017132
37670A9017132P54094O73693N74236M62749L47797K38873J44097O7598Q660l6572
$$ 19017132 19771226 20444919 21019155 21481904 21829701 22068574 22212671 22280269 22288929 22252357
37660B2252357p2370j02038j28819j57391j93472k41156l00128l65123m27870
$$ 22252357 22179987 22077949 21949130 21791739 21598267 21357111 21056983 20691860 20263990
37651B0263990m80154n16654n36560n43281n41991n36360n26947n12658m93999
$$ 20263990 19783836 19267182 18730622 18187341 17645350 17108990 16582043 16069385 15575386
37642A5575386m74974m61503m57656m62868m72291m79493m78982m67370m43785
$$ 15575386 15100412 14638909 14181253 13718385 13246094 12766601 12287619 11820249 11376464
37633A1376464m10195l71018l31331k94687k62421k34792k12263j95317j83140
$$ 11376464 10966269 10595251 10263920 9969233 9706812 9472020 9259757 9064440 8881300
37624H881300j72994j61280j45472j25411j03029q0895o0825m3580k9764k0758
$$ 8881300 8708306 8547026 8401554 8276143 8173114 8092219 8031394 7987814 7958050 7937292
37614G937292j8527k4215l6730n2446o6207p3008o9616n5559l3043n662K3122
$$ 7937292 7918765 7894550 7857820 7805374 7739167 7666159 7596543 7540984 7507941 7502279 7525401
37603G525401N0472P3294Q7179Q6786O8003L0763j9215p1010j11495j29690j20523
$$ 7525401 7575873 7649167 7736346 7823132 7891135 7921898 7902683 7831673 7720178 7590488 7469965
37592G469965q6318l5644J9575O7480R9253J11051J04403Q5031O0447L7112J8201
$$ 7469965 7383647 7348003 7367578 7435058 7534311 7645362 7749765 7834796 7895243 7932355 7950556
37581G950556L126j0824k5959m2789o0634p9227r9409j22394j48355j75584k00759
$$ 7950556 7953682 7942858 7916899 7874110 7813476 7734249 7634840 7512446 7364091 7188507 6987748
37570F987748k20103k30928k32663k26834k15984k02253j86397j67745j45331
$$ 6987748 6767645 6536717 6304054 6077220 5861236 5658983 5472586 5304841 5159510
37561E159510j19634r3640p1907n7884n1429m8658m4387l5333k1826o970N891
$$ 5159510 5039876 4946236 4874329 4816445 4765016 4716358 4671971 4636638 4614812 4607842 4613733
37550D613733J5601K3744L3066M5181N9556P4341Q7834R8966J06933J11064J11483
$$ 4613733 4629334 4653078 4686144 4731325 4790881 4865222 4953056 5052022 5158955 5270019 5381502
37539E381502J09581J07320J05800J04441J01516R5402Q5405P1695N4813L5831
$$ 5381502 5491083 5598403 5704203 5808644 5910160 6005562 6090967 6162662 6217475 6253306
37529F253306J7444M910M973K2461N6535R9601J39859J65920J70803J53563J18212
$$ 6253306 6270750 6275660 6280633 6303094 6359629 6459230 6599089 6765009 6935812 7089375 7207587
37518G207587P0962J7483l8179r2972j43827j87423k20521k39951k42219k23712
$$ 7207587 7278549 7296032 7257853 7164881 7021054 6833631 6613110 6373159 6130940 5907228
37508E907228j82224j19212m1336M0237J13014J67500K00183K13533K13295K05100
$$ 5907228 5725004 5605792 5564456 5604693 5717707 5885207 6085390 6298923 6512218 6717318
37498F717318J92221J75209J53034J24819R1365N5656K2136m954k3222l2371l2660
$$ 6717318 6909539 7084748 7237782 7362601 7453966 7509622 7531758 7526804 7503582 7471211 7438551
37487G438551k2779K92L8614Q9923J46778J99252K38926K61630K68023K62526
$$ 7438551 7415772 7416064 7454678 7544601 7691379 7890631 8129557 8391187 8659210 8921736
37477H921736K51070K38252K25300K10433J91264J67321J40767J15324R4582Q0777
$$ 8921736 9172806 9411058 9636358 9846791 10038055 10205376 10346143 10461467 10556049 10636826
37467A0636826P4295P3914P7550Q3103Q8698R2337R1517Q3637O7194M2887J3681
$$ 10636826 10711121 10785035 10862585 10945688 11034386 11126723 11218240 11301877 11369071 11411958 11425639
37456A1425639j6246m3006o4108p8881q8231r3647r5577r1988p8318m9270j745
$$ 11425639 11409393 11366387 11302279 11223398 11135167 11041520 10945943 10853955 10775637 10726367 10724622
37445A0724622O2733J37253K10859K71601L10109L22120L08774K74976K27379
$$ 10724622 10787355 10924608 11135467 11407068 11717177 12039297 12348071 12623047 12850426
37436A2850426J73309J20497P6586M7839L7530M5119O6875R7779J33667J72299
$$ 12850426 13023735 13144232 13220818 13268657 13306187 13351306 13418181 13515960 13649627 13821926
37426A3821926K12792K54085K93954L29422L57908L77880L88638L89863L81840
$$ 13821926 14034718 14288803 14582757 14912179 15270087 15647967 16036605 16426468 16808308
37417A6808308L66128L45856L25086L07797K97220K95518L03359L19386L40586
$$ 16808308 17174436 17520292 17845378 18153175 18450395 18745913 19049272 19368658 19709244
37408A9709244L64056L89198M18387M55011N00104N50060N97393O34390O57385
$$ 19709244 20073300 20462498 20880885 21335896 21836000 22386060 22983453 23617843 24275228
37399B4275228O68843O76067O87782P11018P49628Q04288Q73311R54198J045573
$$ 24275228 24944071 25620138 26307920 27018938 27768566 28572854 29446165 30400363 31445936
37390C1445936J148423J265405J398379J545849J702217J859403K009779K148645
$$ 31445936 32594359 33859764 35258143 36803992 38506209 40365612 42375391 44524036
37382D4524036K274992K390639K498670K601866K701298K795230K878639K943538
$$ 44524036 46799028 49189667 51688337 54290203 56991501 59786731 62665370 65608908
37374F5608908K979890K977157K926854K825843K678635K497154K298266K101086
$$ 65608908 68588798 71565955 74492809 77318652 79997287 82494441 84792707 86893793
37366H6893793J925214J789160J707883J690013J736268J839499J985413K153220
$$ 86893793 88819007 90608167 92316050 94006063 95742331 97581830 99567243 101720463
37358A01720463K316982K448616K522165K517435K421558K229089J942312J572427
$$ 101720463 104037445 106486061 109008226 111525661 113947219 116176308 118118620 119691047
37350A19691047J140282O74802K08962k24903n98583q89864j083715j173470j161606
$$ 119691047 120831329 121506131 121715093 121490190 120891607 120001743 118918028 117744558 116582952
37341A16582952j059183q83631o55457l95159j21328J49756M03655O27527Q10963
$$ 116582952 115523769 114640138 113984681 113589522 113468194 113617950 114021605 114649132 115460095
37332A15460095R48133J040198J096217J131203J161558J199832J251078J311950
$$ 115460095 116408228 117448426 118544643 119675846 120837404 122037236 123288314 124600264
37324A24600264J372304J418428J437153J420313J368722J294308J218960J169685
$$ 124600264 125972568 127390996 128828149 130248462 131617184 132911492 134130452 135300137
37316A35300137J171570J241337J384198J594459J858232K155685K461731K746098
$$ 135300137 136471707 137713044 139097242 140691701 142549933 144705618 147167349 149913447
37308A49913447K974855L114400L137077L026280K779226K406910J931937J385361
$$ 149913447 152888302 156002702 159139779 162166059 164945285 167352195 169284132 170669493
37300A70669493Q03427K24309l15343p84067j158776j426623j585252j641797
$$ 170669493 171472920 171697229 171381886 170597819 169439043 168012420 166427168 164785371
37292A64785371j611187j513973j373529j212604j049738q96380p55686o23542
$$ 164785371 163174184 161660211 160286682 159074078 158024340 157127960 156372274 155748732
37284A55748732m91598l51270j97186k8470J52867L45663N53170P84027J049853
$$ 155748732 155257134 154905864 154708678 154680208 154833075 155178738 155731908 156515935 157565788
37275A57565788J360903J721901K129275K569915L021669L456290L844817M163793
$$ 157565788 158926691 160648592 162777867 165347782 168369451 171825741 175670558 179834351
37267A79834351M399825M551325M627841M647880M635141M612902M597747M595251
$$ 179834351 184234176 188785501 193413342 198061222 202696363 207309265 211907012 216502263
37259B16502263M599534M596274M566728M490513M346631M113934L772580L307234
$$ 216502263 221101797 225698071 230264799 234755312 239101943 243215877 246988457 250295691
37251B50295691K711368J991352J169011K81506o22557j491123k279154k958151
$$ 250295691 253007059 254998411 256167422 256448928 255826371 254335248 252056094 249097943
37243B49097943l521233l982315m370236m719937n063180n421057n799807o190438
$$ 249097943 245576710 241594395 237224159 232504222 227441042 222019985 216220178 210029740
37235B10029740o571788o916430p198071p398258p510083p538053p494892p396570
$$ 210029740 203457952 196541522 189343451 181945193 174435110 166897057 159402165 152005595
37227A52005595p256860p083437o877630o638285o366790o069262n754733n431657
$$ 152005595 144748735 137665298 130787668 124149383 117782593 111713331 105958598 100526941
37219A00526941n106130m782540m465007m157954l865622l591332l336736l101288
$$ 100526941 95420811 90638271 86173264 82015310 78149688 74558356 71221620 68120332
37211F8120332k882109k674655k474017k276449k080910j890365j711636j552787
$$ 68120332 65238223 62563568 60089551 57813102 55732192 53841827 52130191 50577404
37203E0577404j418689j307872j213377j127216j045212r69108r05249q61168
$$ 50577404 49158715 47850843 46637466 45510250 44465038 43495930 42590681 41729513
37195D1729513q41952q47814q73577r09816r44893r67454r69307r48042r07976
$$ 41729513 40887561 40039747 39166170 38256354 37311461 36344007 35374700 34426658 33518682
37186C3518682q58277q09057p67427p35357p09894o85242o55748o18627n75295
$$ 33518682 32660405 31851348 31083921 30348564 29638670 28953428 28297680 27679053 27103758
37177B7103758n30913m92501m66386m55813m59623m72695m88128n00005n05374
$$ 27103758 26572845 26080344 25613958 25158145 24698522 24225827 23737699 23237694 22732320
37168B2732320n04492m99538m92599m84125m72698m56384m34668m09312l83205
$$ 22732320 22227828 21728290 21235691 20751566 20278868 19822484 19387816 18978504 18595299
37159A8595299l57984l32415l02950k66200k21830j74021j30564r9789q7201r3960
$$ 18595299 18237315 17904900 17601950 17335750 17113920 16939899 16809335 16709546 16622345 16528385
37149A6528385j17909j55784k04454k60585l19647l75506m21078m50033m58841
$$ 16528385 16410476 16254692 16050238 15789653 15470006 15094500 14673422 14223389 13764548
37140A3764548m48142m22308l87537l49803l13655k81686k54107k28900k03061
$$ 13764548 13316406 12894098 12506561 12156758 11843103 11561417 11307310 11078410 10875349
37131A0875349j74326j41868j05475o4460j7959L3266Q5326J31786J66373J85813
$$ 10875349 10701023 10559155 10453680 10389220 10371261 10404527 10489853 10621639 10788012 10973825
37121A0973825J90789J84851J72792J59773J50834J50069J59390J77944K02835
$$ 10973825 11164614 11349465 11522257 11682030 11832864 11982933 12142323 12320267 12523102
37112A2523102K30576K58143K82968L02248L12608L10733K94486K63657K19947
$$ 12523102 12753678 13011821 13294789 13597037 13909645 14220378 14514864 14778521 14998468
37103A4998468J66681J08500N0718k077m7574q6119j19344j47804j69590j81046
$$ 14998468 15165149 15273649 15324367 15322290 15274716 15188597 15069253 14921449 14751859 14570813
37093A4570813j79100j63095j34726r6789n2468n753L8310P4511R8707J07970
$$ 14570813 14391713 14228618 14093892 13997103 13944635 13938882 13977192 14051703 14150410 14258380
37083A4258380R9939P2994K7957l0086r1851j46421j85056k04030k04789j91596
$$ 14258380 14358319 14431313 14459270 14429184 14337333 14190912 14005856 13801826 13597037 13405441
37073A3405441j68640j38812j04587o9320l7117j1059Q727K5294M2846O3807Q7270
$$ 13405441 13236801 13097989 12993402 12924082 12886965 12875906 12884633 12909927 12952773 13016580 13103850
37062A3103850J10001J29111J44226J57656J72711J91302K12148K30606K40261
$$ 13103850 13213851 13342962 13487188 13644844 13817555 14008857 14221005 14451611 14691872
37053A4691872K35455K13499J75751J27409P6023K8946r118l7000n5983o7855
$$ 14691872 14927327 15140826 15316577 15443986 15520009 15548955 15539837 15502837 15446854 15378999
37043A5378999p3242p0537n5546k2888L0252R9877J74061K37055K76277K87093
$$ 15378999 15305757 15235220 15179674 15156786 15187038 15286915 15460976 15698031 15974308 16261401
37033A6261401K72298K37824J88960J29700O4184k201o3165j12619j45686j59330
$$ 16261401 16533699 16771523 16960483 17090183 17154367 17152166 17089001 16976382 16830696 16671366
37023A6671366j52268j24114p4347k485R0331J99691L17769M34976N42325O33398
$$ 16671366 16519098 16394984 16320637 16318152 16408483 16608174 16925943 17360919 17903244 18536642
37013A8536642P05256P58158P94460Q17277Q29538Q33568Q31168Q23920Q13522
$$ 18536642 19241898 20000056 20794516 21611793 22441331 23274899 24106067 24929987 25743509
37004B5743509Q02003P91948P86675P89734Q03431Q27365Q58742Q94619R34398
$$ 25743509 26545512 27337460 28124135 28913869 29717300 30544665 31403407 32298026 33232424
36995C3232424R80711J038771J115135J216246J346616J507295J695702J907028
$$ 33232424 34213135 35251906 36367041 37583287 38929903 40437198 42132900 44039928
36987D4039928K136339K380431K639033K914950L212820L536968L889697M270865
$$ 44039928 46176267 48556698 51195731 54110681 57323501 60860469 64750166 69021031
36979F9021031M678466N109227N558688O020710O486779O945343P381265P774592
$$ 69021031 73699497 78808724 84367412 90388122 96874901 103820244 111201509 118976101
36971A18976101Q098057Q313651Q370542Q207226P759694O975118N828116M334708
$$ 118976101 127074158 135387809 143758351 151965577 159725271 166700389 172528505 176863213
36963A76863213K559021O09019j378937l263334m921848o269409p265161p908376
$$ 176863213 179422234 180031253 178652316 175388982 170467134 164197725 156932564 149024188
36955A49024188q227897q270675q092836p753300p308610o808206o291127n785080
$$ 149024188 140796291 132525616 124432780 116679480 109370870 102562664 96271537 90486457
36947I0486457n307623m867822m467350m101729l762706l441603l132074k831292
$$ 90486457 85178834 80311012 75843662 71741933 67979227 64537624 61405550 58574258
36939E8574258k539615k259597j994835j748964j524791j323474j143876r82656
$$ 58574258 56034643 53775046 51780211 50031247 48506456 47182982 46039106 45056450
36931D5056450q35651o99816n74381m60426l59550k72637j99122j36600q0857
$$ 45056450 44220799 43520983 42946602 42486176 42126626 41853989 41654867 41518267 41437410
36922D1437410k6328L3237J04155J92068L00879M31819N83003P49512R23615J095309
$$ 41437410 41411082 41444319 41548474 41740542 42041421 42473240 43056243 43805755 44729370 45824679
36912D5824679J253703J389230J495755J571716J620057J647650J664598J683282
$$ 45824679 47078382 48467612 49963367 51535083 53155140 54802790 56467388 58150670
36904E8150670J716444J774158J860872J974555K108634K255450K408814K564693
$$ 58150670 59867114 61641272 63502144 65476699 67585333 69840783 72249597 74814290
36896G4814290K720854K876672L033095L192390L357262L529742L710211L897046
$$ 74814290 77535144 80411816 83444911 86637301 89994563 93524305 97234516 101131562
36888A01131562M087322M278414M469373M660814M852947N042619N220865N372259
$$ 101131562 105218884 109497298 113966671 118627485 123480432 128523051 133743916 139116175
36880A39116175N476621N512655N461850N310987N052762M685436M212400L641561
$$ 139116175 144592796 150105451 155567301 160878288 165931050 170616486 174828886 178470447
36872A78470447K984366K255041J470772O52458j75649r88456j763815k485569
$$ 178470447 181454813 183709854 185180626 185833084 185657435 184668979 182905164 180419595
36864A80419595l144361l735988m258231m707698n078487n363606n558485n664407
$$ 180419595 177275234 173539246 169281015 164573317 159494830 154131224 148572739 142908332
36856A42908332n689746n648205n555189n424221n265162n084544m887065m676773
$$ 142908332 137218586 131570381 126015192 120590971 115325809 110241265 105354200 100677427
36848A00677427m457406m232205m003828l774415l545623l318638l094500k874864
$$ 100677427 96220021 91987816 87983988 84209573 80663950 77345312 74250812 71375948
36840G1375948k662579k461370k274481k103334j947318j804827j674423j555050
$$ 71375948 68713369 66251999 63977518 61874184 59926866 58122039 56447616 54892566
36832E4892566j445368j343043j244910j148194j052337r60119q76840q07513
$$ 54892566 53447198 52104155 50859245 49711051 48658714 47698595 46821755 46014242
36824D6014242p53979p14246o84490o61768o45174o34815o29668o25986o17561
$$ 46014242 45260263 44546017 43861527 43199759 42554585 41919770 41290102 40664116 40046555
36815D0046555n98215n65372n22299m77196m39533m16163m09522m18120m37904
$$ 40046555 39448340 38882968 38360669 37883473 37443940 37027777 36618255 36200135 35762231
36806C5762231m63245m87822n06185n15639n16891n12430n03724m89841m68808
$$ 35762231 35298986 34811164 34304979 33789340 33272449 32760019 32256295 31766454 31297646
36797C1297646m40625m09296l82338l68289l73834m01795m50206n12294n77556
$$ 31297646 30857021 30447725 30065387 29697098 29323264 28921469 28471263 27958969 27381413
36788B7381413o34153o72045o85308o72560o36088n81044n14910m46355l83029
$$ 27381413 26747260 26075215 25389907 24717347 24081259 23500215 22985305 22538950 22155921
36779B2155921l29705k88286k59253k42893k39313k47843k66960k94926l30557
$$ 22155921 21826216 21537930 21278677 21035784 20796471 20548628 20281668 19986742 19656185
36770A9656185l73453m23399m79233n37833n93815o40075o69080o74804o55074
$$ 19656185 19282732 18859333 18380100 17842267 17248452 16608377 15939297 15264493 14609419
36761A4609419o13234n57907n00513m51738m18567m02893m01784m09020m17394
$$ 14609419 13996185 13438278 12937765 12486027 12067460 11664567 11262783 10853763 10436369
36752A0436369m20798m15305l98972l71006l31204k80257k20519j56571r4943
$$ 10436369 10015571 9600266 9201294 8830288 8499084 8218827 7998308 7841737 7746794
36743G746794m3037p643O351l386l6624r0782j60742k38425l13148l73440m09779
$$ 7746794 7703757 7696114 7702465 7699079 7662455 7571673 7410931 7172506 6859358 6485918 6076139
36732F076139m16817l94319l46733k81751k08136j33721o4556n535L8778O4414
$$ 6076139 5659322 5265003 4918270 4636519 4428383 4294662 4230106 4224571 4263349 4327763
36722D327763O9535N6121L0515K215j8868k5780j7193K116K3450L8237M1866L5311
$$ 4327763 4397298 4453419 4483934 4486149 4467281 4441501 4424308 4426424 4449874 4488111 4529977 4565288
36710D565288K3978J4784J3311K2057M0098O3981Q9606J14119J36586J56993J74477
$$ 4565288 4589266 4604050 4617361 4639418 4679516 4743497 4833103 4947222 5083808 5240801 5415278
36699E415278J86181J87446J73433J41410R2416L0903l7606j08824j80135k49465
$$ 5415278 5601459 5788905 5962338 6103748 6196164 6227067 6189461 6080637 5900502 5651037
36689E651037l14549l73376m24727m67635n00279n19752n23056n08575m77071
$$ 5651037 5336488 4963112 4538385 4070750 3570471 3050719 2527663 2019088 1542017
36680A542017m31914l78502l22872k69894k21724j77257j33069q5729l4481J7524
$$ 1542017 1110103 731601 408729 138835 -82889 -260146 -393215 -478944 -513425 -495901
36670d95901O4713J02579J30536J52021J71804J92687K13744K30974K39602K36600
$$ -495901 -431188 -328609 -198073 -46052 125752 318439 532183 763157 1002759 1239359
36660A239359K22191J99653J73719J48569J26722J09329R7290R1853R3892J02481
$$ 1239359 1461550 1661203 1834922 1983491 2110213 2219542 2316832 2408685 2502577 2605058
36650B605058J14128J23631J26025J18279R9684P1022L3318j2789o6605j26227
$$ 2605058 2719186 2842817 2968842 3087121 3186805 3257827 3291145 3278356 3211751 3085524
36640C085524j87773k46014k96205l35579l63245l78984l82633l74960l58766
$$ 3085524 2897751 2651737 2355532 2019953 1656708 1277724 895091 520131 161365
36631A61365l38310l16753k93367k62716k16561j47778n4650N6412J71619K74383
$$ 161365 -176945 -493698 -787065 -1049781 -1266342 -1414120 -1468770 -1412358 -1240739 -966356
36621i66356L51535L97597M14787M09712L89595L60259L25926K89585K53014K16566
$$ -966356 -614821 -217224 197563 607275 996870 1357129 1683055 1972640 2225654 2442220
36611B442220J79297J39887R8106N5750J6236j6993m2025n8847o8591p2527p1557
$$ 2442220 2621517 2761404 2859510 2915260 2931496 2914503 2872478 2813631 2745040 2672513 2600956
36600B600956o6075n5837l9814j6462J5143N3565R3828J28203J49243J53194J41394
$$ 2600956 2534881 2479044 2439230 2422768 2437911 2491476 2585304 2713507 2862750 3015944 3157338
36589C157338J18830R1449O4353M1173K3631J0647j773j8599m2127o9218r1979
$$ 3157338 3276168 3367617 3431970 3473143 3496774 3507421 3505648 3487049 3444922 3375704 3283725
36578C283725j01988r5220p4101m5403j5894J0965L5610O0550Q7725J16279J41887
$$ 3283725 3181737 3086517 3012416 2967013 2951119 2962084 2997694 3058244 3145969 3262248 3404135
36567C404135J57989J58405J39915J03614N4884K230m4887p9181r8513j06984
$$ 3404135 3562124 3720529 3860444 3964058 4018942 4021172 3976285 3897104 3798591 3691607
36557C691607j13141j25913j50458j86082k27202k66398k97535l17442l26026
$$ 3691607 3578466 3452553 3302095 3116013 2888811 2622413 2324878 2007436 1681410
36548A681410l25454l18813l08371k94014k72730k39615j89964j21582l6570N8094
$$ 1681410 1355956 1037143 728772 434758 162028 -77587 -267551 -389133 -425703 -367609
36538c67609J51577K31559K87173L11613L03808K68489K14133J49466Q0694J1183
$$ -367609 -216032 15527 302700 614313 918121 1186610 1400743 1550209 1630903 1642086
36528A642086n6765j19986j73977k13817k35675k38285k23664j96541j62586j26698
$$ 1642086 1585321 1465335 1291358 1077541 841866 603581 379917 183376 20790 -105908
36518a05908r2378o1975l7012j8191n485J408K756r58q501j7866k6919l4148l8792
$$ -105908 -198286 -260261 -297273 -315464 -320949 -319541 -316785 -317743 -326244 -344110 -371029 -405177 -443969
36505d43969m0380l8483l3180k5676j8254j3346j2528j6135k3418l2764m1724
$$ -443969 -484349 -522832 -556012 -581688 -599942 -613288 -625816 -641951 -665369 -698133 -739857
36494g39857m6951m4297k9473L11M4513R8727J56357K11324K59611K99107L28709
$$ -739857 -786808 -831105 -860578 -860267 -815754 -717027 -560670 -349346 -89735 209372 538081
36483E38081L47558L54266L46035L18854K69711J99731J15872K9695m5954j00577
$$ 538081 885639 1239905 1585940 1904794 2174505 2374236 2490108 2519803 2473849 2373272
36473B373272j28651j30911j14301r0130p0405o3155o9171q2496r4740j00372
$$ 2373272 2244621 2113710 1999409 1909279 1838874 1775719 1706548 1624052 1529312 1428940
36463A428940r9232r5102r2234r2890r7330j05173j16230j29764j42944j50319
$$ 1428940 1329708 1234606 1142372 1049482 952152 846979 730749 600985 458041 307722
36453C07722j45603j25072r0436m8967j0470J7062L0436L1238K3551J1501j744
$$ 307722 162119 37047 -53389 -102356 -112826 -95764 -65328 -34090 -10539 962 -782
36442g82j3680k1711k2782j3628Q221M3209Q9106J41459J94663K42898K80718
$$ -782 -14462 -36173 -58955 -72583 -64362 -21153 67953 209412 404075 646973 927691
36431I27691L03612L08519K94253K61842K14880J59057J00479M3719q671n5002
$$ 927691 1231303 1539822 1834075 2095917 2310797 2469854 2570333 2614052 2605381 2550379
36421B550379r3319j21622j38760j44992j42034j33191j22988j15547j12247j10641
$$ 2550379 2457060 2335438 2196678 2051686 1909652 1776461 1653473 1537926 1425679 1315038
36411A315038j05784r3020p0208l8162K45M1001P9116J08996J26323J31053J28631
$$ 1315038 1209254 1116234 1046026 1007864 1008109 1049110 1128226 1237222 1363545 1494598 1623229
36400A623229J27216J32343J43402J54811J60503J58284J51565J48243J57491
$$ 1623229 1750445 1882788 2026190 2181001 2341504 2499788 2651353 2799596 2957087
36391B957087J85562K32444K91173L50423L98725M27845M33824M16128L76465
$$ 2957087 3142649 3375093 3666266 4016689 4415414 4843259 5277083 5693211 6069676
36382F069676L18099K45538J64007P8941m019p8819j39497j81918k05642k14468
$$ 6069676 6387775 6633313 6797320 6876261 6872242 6793423 6653926 6472008 6266366 6051898
36372F051898k15022k14099k16047k21290k26758k28087k22406k09970j93599
$$ 6051898 5836876 5622777 5406730 5185440 4958682 4730595 4508189 4298219 4104620
36363D104620j76313j58715j37885j08745o7509j5218M1054R0533J23530J35629
$$ 4104620 3928307 3769592 3631707 3522962 3455453 3440235 3481289 3571822 3695352 3830981
36353C830981J28800J09047Q2609N3464K3233p271l6474o1669p9968q9859r2271
$$ 3830981 3959781 4068828 4151437 4204901 4228134 4220863 4184389 4122720 4042752 3952893 3860622
36342C860622r0245q7284q5554q5149q4605q1711p4028n9350l6725p777K2879
$$ 3860622 3770377 3683093 3597539 3512390 3427785 3346074 3272046 3212696 3175971 3168194 3191073
36331C191073M8755O3504O2569M3940Q559l9371r2801j43616j84864k12085k23294
$$ 3191073 3239828 3303332 3365901 3409841 3418400 3379029 3286228 3142612 2957748 2745663 2522369
36320B522369k18863k02003j78879j57080j42769j38567j43378j53518j63927
$$ 2522369 2303506 2101503 1922624 1765544 1622775 1484208 1340830 1187312 1023385
36311A023385j69419j66614j56065j42906j34692j37352j51655j72449j90861
$$ 1023385 853966 687352 531287 388381 253689 116337 -35318 -207767 -398628
36302c98628j97898j87371j56886j07391m2354L2431J08771J76701K26684K52849
$$ -398628 -596526 -783897 -940783 -1048174 -1090528 -1058097 -949326 -772625 -545941 -293092
36292b93092K55740K42708K25381K15078K18415K34924K57533K75384K77925K58860
$$ -293092 -37352 205356 430737 645815 864230 1099154 1356687 1632071 1909996 2168856
36282B168856K18374J62588J00702M1932o016l7048m7002l5131n701L2024O6245
$$ 2168856 2387230 2549818 2650520 2692452 2686436 2649388 2602386 2567255 2561554 2593578 2659823
36271B659823Q6678Q8344P3268M9171K5847J1163Q605J7066L2335M9385O4566
$$ 2659823 2746501 2834845 2908113 2957284 2983131 2994294 3002899 3019965 3052300 3101685 3166251
36260C166251P6763Q6870R5824J02685J04304R7081P9640N4487K7438M994q676
$$ 3166251 3243014 3329884 3425708 3528393 3632697 3729778 3809418 3863905 3891343 3896337 3887661
36249C887661j3548j3357j3274j7176k6359m0602o0231q6938j22486j66890k17910
$$ 3887661 3874113 3860756 3847482 3830306 3803947 3763345 3703114 3616176 3493690 3326800 3108890
36238C108890k71870l24340l69989m02408m14914m02200l61967k95743k08770
$$ 3108890 2837020 2512680 2142691 1740283 1325369 923169 561202 265459 56689
36229E6689j09055o156Q9937J69886K26379K55605K57922K37298K00044J53608
$$ 56689 -52366 -58522 31415 201301 427680 683285 941207 1178505 1378549 1532157
36219A532157J05538O2219K7543K135j6204l0884m4388n6601o4453o3209m8675
$$ 1532157 1637695 1699914 1727457 1729592 1713388 1682504 1638116 1581515 1517062 1453853 1405178
36208A405178j9330K2607P1514J19812J60021J86635J97313J92917J76149J49290
$$ 1405178 1385848 1408455 1479969 1599781 1759802 1946437 2143750 2336667 2512816 2662106
36198B662106J12572O4700N372o2330j31754j94788k44691k78138k95961l02568
$$ 2662106 2774678 2839378 2844750 2782420 2650666 2455878 2211187 1933049 1637088 1334520
36188A334520l04142l06109l10742l15852l15056k99844k63006k02259j22251
$$ 1334520 1030378 724269 413527 97675 -217381 -517225 -780231 -982490 -1104741
36179a104741l3775M9526J15401J56450J71713J66248J49163J30844J20000J21079
$$ -1104741 -1138516 -1088990 -973589 -817139 -645426 -479178 -330015 -199171 -79171 41908
36169D1908J32715J47993J56941J50603J24993Q2890L2605j5406n1974p1174p0714
$$ 41908 174623 322616 479557 630160 755153 838043 870648 855242 803268 732094 661380
36158F61380n1500j7056K7165P4485J17614J49401J63976J58192J32531R0893
$$ 661380 609880 592824 619989 694474 812088 961489 1125465 1283657 1416188 1507081
36148A507081L9604j3526n9764r0175r7255p7259l2047L1016J01388J68676K24965
$$ 1507081 1546685 1533159 1473395 1383220 1285965 1208706 1176659 1207675 1309063 1477739 1702704
36137A702704K65051K85151K82009K53668K01509J31606N3649k2269q8743j41963
$$ 1702704 1967755 2252906 2534915 2788583 2990092 3121698 3175347 3153078 3064335 2922372
36127B922372j80387k03103k09498k00180j77752j46692j12597q1335n8051m5966
$$ 2922372 2741985 2538882 2329384 2129204 1951452 1804760 1692163 1610828 1552777 1506811
36117A506811m5505n4590o9820q7214j01953j08283j01257p9760m8124j4386J3680
$$ 1506811 1461306 1406716 1336896 1249682 1147729 1039446 938189 858429 810305 795919 809599
36106H09599L1684L9077L7740L0257J8683L699j5621m1074p3758j12691j54699
$$ 809599 841283 880360 918100 948357 967040 970739 955118 914044 840286 727595 572896
36095E72896j95531k31121k57917k72330k70563k49781k10088j55643r3842l3066
$$ 572896 377365 146244 -111673 -384003 -654566 -904347 -1114435 -1270078 -1363920 -1396986
36085a396986J9896O1751R3395J18876J42812J67675J92880K16326K36990K56317
$$ -1396986 -1377090 -1315339 -1221944 -1103068 -960256 -792581 -599701 -383375 -146385 109932
36075A09932K77343L02358L30934L59671L83519L97730L99424L88359L66856L38765
$$ 109932 387275 689633 1020567 1380238 1763757 2161487 2560911 2949270 3316126 3654891
36065C654891L07741K75870K43765K11731J80398J49961J19299Q6819N2694J9972
$$ 3654891 3962632 4238502 4482267 4693998 4874396 5024357 5143656 5230475 5283169 5303141
36055E303141p196k6799m0894n4800p4568j04328j44530j91524k38592k77943
$$ 5303141 5295945 5269146 5228252 5173452 5098884 4994556 4850026 4658502 4419910 4141967
36045D141967l02471l06953k89382k52638k05155j59125j26634j15823j28620
$$ 4141967 3839496 3532543 3243161 2990523 2785368 2626243 2499609 2383786 2255166
36036B255166j60344k01142k39334k65691k76434k73327k61348k45816k30258
$$ 2255166 2094822 1893680 1654346 1388655 1112221 838894 577546 331730 101472
36027A01472k15330j98861j77165j47171j08424o4054k0331J5144L6314M1555
$$ 101472 -113858 -312719 -489884 -637055 -745479 -809533 -829864 -814720 -778406 -736851
36017g36851L5253K6826K7153M3637P6482J18343J57688J83729J90261J77211
$$ -736851 -701598 -674772 -647619 -603982 -527500 -409157 -251469 -67740 122521 299732
36007B99732J50258J19193R5046Q6416R6309J20876J50793J75026J85599J80890
$$ 299732 449990 569183 664229 750645 846954 967830 1118623 1293649 1479248 1660138
35997A660138J65142J44375J21766R6088O3943K3588k2735o9250j09423j39137
$$ 1660138 1825280 1969655 2091421 2187509 2251452 2275040 2252305 2183055 2073632 1934495
35987A934495j58181j69223j75327j78051j77170j71328j58788j38303j10420
$$ 1934495 1776314 1607091 1431764 1253713 1076543 905215 746427 608124 497704
35978D97704p8299m6902k0807k527P324Q766K045j1461k8264m3181n1171m9158
$$ 497704 419405 372503 351696 349169 356493 365259 367304 355843 327579 284398 233227 184069
35966A84069l6734j5690J0725L8107O0909P2948O8870M6078O082m5422r9477j45568
$$ 184069 147335 131645 142370 180477 241386 314334 383204 429282 435364 389942 290465 144897
35954A44897j73966j78415j58059j17343o4018o659M6831Q9778J17145J26336
$$ 144897 -29069 -207484 -365543 -482886 -546904 -553563 -506732 -416954 -299809 -173473
35944a73473J18237R8007P4779N9495O0861Q1443J16551J56754J92056K14914
$$ -173473 -55236 42771 117550 177045 237906 319349 435900 592654 784710 999624
35934I99624K21205K09917J82611J42820R5394M5907J69l6462o0157o9590o6471
$$ 999624 1220829 1430746 1613357 1756177 1851571 1897478 1897647 1861185 1801028 1731438 1664967
35923A664967n5320m2433l3872l3201m0166n1266o1715o7391o5965n7004m1524
$$ 1664967 1609647 1567214 1533342 1500141 1459975 1408709 1346994 1279603 1213638 1156634 1115110
35912A115110k1456L30J9661L1335L0922J7119p369l7373o7705r4341j13860j22592
$$ 1115110 1093654 1093984 1113645 1144980 1175902 1193021 1185652 1148279 1080574 986233 872373 749781
35900G49781j16986r5275n9067j3615L3763P6019J08007J26496J29435J15838
$$ 749781 632795 537520 478453 464838 498601 574620 682627 809123 938558 1054396
35890A054396Q6856M6736K264l9588p4171j00201j18848j32003j41044j46680
$$ 1054396 1141252 1187988 1190252 1150664 1076493 976292 857444 725441 584397 437717
35880D37717j49282j48949j45056j35734j17993q8904m7439M105O0072J12924
$$ 437717 288435 139486 -5570 -141304 -259297 -348201 -395640 -391535 -331463 -218539
35870b18539J55202J80960J86467J70513J34730Q3783K5247l1210p5632j00446
$$ -218539 -63337 117623 304090 474603 609333 693116 718363 687153 611521 511075
35860E11075j02952q6137n7363k5699N35J5400J6228M026j6813l9859n8798o9709
$$ 511075 408123 321986 264623 238924 239459 254859 271087 275113 258300 218441 159643 89934
35848H9934p2548p1120p1475p9208r7118j24471j57930j92853k23820k44810k50390
$$ 89934 17386 -53734 -125209 -204417 -301535 -426006 -583936 -776789 -1000609 -1245419 -1495809
35837a495809k37998k09699j71662j31495r5042o4176l6465o957K8573P0903J17288
$$ -1495809 -1733807 -1943506 -2115168 -2246663 -2341705 -2405881 -2442346 -2449303 -2420730 -2349827 -2232539
35826b232539J63959K08655K50827K89670L22121L42670L45085L25049K82543
$$ -2232539 -2068580 -1859925 -1609098 -1319428 -997307 -654637 -309552 15497 298040
35817B98040K22886J55785R2671M3460J4115N656J4592L4498N8317Q0660R9084
$$ 298040 520926 676711 769382 812842 826957 832613 847205 881703 940020 1020680 1119764
35806A119764J13659J25212J33682J37872J36476J28833J14443R1868N8623J2859
$$ 1119764 1233423 1358635 1492317 1630189 1766665 1895498 2009941 2101809 2160432 2173291
35796B173291m3917j04722j57106j86203j80422j37373o6489J3913Q3789J28693
$$ 2173291 2129374 2024652 1867546 1681343 1500921 1363548 1297059 1310972 1394761 1523454
35786A523454J43599J32235J03613O8043L4192P846p829j1443l048J5225L8363
$$ 1523454 1667053 1799288 1902901 1970944 2005136 2012982 2005153 1993710 1990662 2005887 2044250
35775B044250N8587O6849N5358K0291l6324j06688j79644k44258k92336l18773
$$ 2044250 2102837 2169686 2225044 2245335 2209011 2102323 1922679 1678421 1386085 1067312
35765A067312l20689k97098k49608j83176j06033k8525L9032Q9279J20342J36097
$$ 1067312 746623 449525 199917 16741 -89292 -117817 -78785 10494 130836 266933
35755B66933J43466J48375J53163J56842J57367J54091J49094J46717J51586J66136
$$ 266933 410399 558774 711937 868779 1026146 1180237 1329331 1476048 1627634 1793770
35745A793770J88970K14779K35645K43331K32270K02262J59288J13317P4255M8447
$$ 1793770 1982740 2197519 2433164 2676495 2908765 3111027 3270315 3383632 3457887 3506334
35735C506334L7578L9717N0907O6157P9800Q5951P9676N8683K4527j7516o0046
$$ 3506334 3543912 3583629 3634536 3700693 3780493 3866444 3946120 4004803 4029330 4011814 3951768
35724C951768r5965j20673j33032j34622j27667j13206r0976o0923k4862J3267
$$ 3951768 3855803 3735130 3602098 3467476 3339809 3226603 3135627 3074704 3049842 3063109
35714C063109M8679P7539R8169J11006J17494J18795J15369J07359R4860P7685
$$ 3063109 3111788 3189327 3287496 3398502 3515996 3634791 3750160 3857519 3952379 4030064
35704D030064N5413K8605J61k5048m2810n2345n6836o1430p0464q5945j07825
$$ 4030064 4085477 4114082 4114243 4089195 4046385 3994040 3937204 3875774 3805310 3719365 3611540
35693C611540j35228j67217k02292k37304k67323k87268k94191k88218k71418
$$ 3611540 3476312 3309095 3106803 2869499 2602176 2314908 2020717 1732499 1461081
35684A461081k45879k12764j72692j26300p4098j6015M8430J19202J94765K71605
$$ 1461081 1215202 1002438 829746 703446 629348 613333 661763 780965 975730 1247335
35674A247335L44088M04643M44875M57792M40288L94346L26456K45801J62132
$$ 1247335 1591423 1996066 2440941 2898733 3339021 3733367 4059823 4305624 4467756
35665D467756Q3932J7409l3515o6782q2253q2141p0681n2601l1537r773J0870
$$ 4467756 4551688 4569097 4535582 4468800 4386547 4304406 4233725 4181124 4149587 4139814 4150684
$$ [...]
##END NTUPLES=NMR SPECTRUM
##END=
