##TITLE=31Pdec_DE-59_D2O
 D2O, 64 sc
 22.7.2024
##JCAMPDX= 6.0         $$ Bruker NMR JCAMP-DX V2.0
##DATA TYPE= NMR SPECTRUM
##DATA CLASS= NTUPLES
##ORIGIN= UXNMR, Bruker Analytische Messtechnik GmbH
##OWNER= root
$$ XWIN-NMR		Version 3.5
$$ Mon Jul 22 14:13:53 2024 Russian Standard Time (UT+4h)  she@DPX200
##.OBSERVE FREQUENCY= 81.013821
##.OBSERVE NUCLEUS= ^31P
##.ACQUISITION MODE= SIMULTANEOUS
##.ACQUISITION SCHEME= undefined
##.AVERAGES= 64
##.DIGITISER RES= 17
##SPECTROMETER/DATA SYSTEM= spect
##.PULSE SEQUENCE= zgpg30
##.SOLVENT NAME= D2O
##.SHIFT REFERENCE= (INTERNAL, D2O, 0, 198.062)
##AUDIT TRAIL= $$ (NUMBER, WHEN, WHO, WHERE, WHAT)
$$ ##TITLE= Audit trail, XWIN-NMR		Version 3.5
$$ ##JCAMPDX= 5.01
$$ ##ORIGIN= Bruker BioSpin GmbH
$$ ##OWNER= she
$$ F:/spectra/data/she/nmr/P31/2/pdata/1/auditp.txt
$$ ##AUDIT TRAIL=  $$ (NUMBER, WHEN, WHO, WHERE, WHAT)
(   1,<2024-07-22 14:12:47.71 +0400>,<she>,<DPX200>,
      <created by zg, POWCHK disabled, PULCHK disabled
       configuration hash MD5:
       00 E9 B6 7A A2 85 ED C7 34 08 36 98 17 FE 4E 26
       data hash MD5: 32K
       E5 F9 39 43 1F 09 E6 74 88 F0 28 90 21 EF C5 FF>)
(   2,<2024-07-22 14:12:52.31 +0400>,<she>,<DPX200>,
      <Start of raw data processing
       efp BC_mod = 2 LB = 1.5 FT_mod = 6 PKNL = 1 PHC0 = 2712.854 PHC1 = -83.31303 SI = 64K 
       data hash MD5: 64K
       54 04 5C 86 C7 70 96 48 48 31 1A A4 F9 E3 39 D9>)
(   3,<2024-07-22 14:12:58.17 +0400>,<she>,<DPX200>,
      <abs ABSG = 5 
       data hash MD5: 64K
       05 FD 92 6D 50 DE EF 7D C3 ED 4D DD 95 3E 8C 45>)
(   4,<2024-07-22 14:13:19.84 +0400>,<she>,<DPX200>,
      <pk PHC0 = 22.1496 PHC1 = 21.8 
       data hash MD5: 64K
       34 9A B3 56 FB 71 75 E3 85 EE CC 71 CE D1 9D 64>)
(   5,<2024-07-22 14:13:23.67 +0400>,<she>,<DPX200>,
      <abs ABSG = 5 
       data hash MD5: 64K
       8D 0F 3F D9 70 7A 78 42 D6 F6 C9 BF FB BC 81 83>)
$$ ##END=
$$ 
$$ hash MD5
$$ A4 AF 35 69 E9 09 12 3D 77 CB E1 43 F6 09 CF 51
##$RELAX= 
##$RELAX= 
##$RELAX= 
##$RELAX= 
##$RELAX= 
##$RELAX= 
##$RELAX= 
##$RELAX= 
$$ Bruker specific parameters
$$ --------------------------
##$DU= <F:/spectra>
##$EXPNO= 2
##$NAME= <P31>
##$PROCNO= 1
##$TYPE= <nmr>
##$USER= <she>
##$AMP= (0..31)
100 100 100 100 100 100 100 100 100 100 100 100 100 100 100 100 100 100 
100 100 100 100 100 100 100 100 100 100 100 100 100 100 
##$AQSEQ= 0
##$AQ_mod= 1
##$AUNM= <au_zg>
##$AUTOPOS= <>
##$BF1= 81.014009
##$BF2= 200.13
##$BF3= 200.13
##$BF4= 200.13
##$BF5= 200.13
##$BF6= 200.13
##$BF7= 200.13
##$BF8= 200.13
##$BYTORDA= 1
##$CFDGTYP= 0
##$CFRGTYP= 5
##$CHEMSTR= <none>
##$CNST= (0..31)
1 1 145 1 1 1 1 1 1 1 1 1 1 1 1 1 1 1 1 1 1 1 1 1 1 1 1 1 1 1 1 1 
##$CPDPRG= <waltz16>
##$CPDPRG1= <>
##$CPDPRG2= <waltz16>
##$CPDPRG3= <>
##$CPDPRG4= <mlev>
##$CPDPRG5= <mlev>
##$CPDPRG6= <mlev>
##$CPDPRG7= <mlev>
##$CPDPRG8= <mlev>
##$CPDPRGB= <>
##$CPDPRGT= <>
##$D= (0..31)
0 1 0 0 0 0 0 0 0 0.06 0 0.03 2e-05 3e-06 0 0 0.0002 0 0 0 0 0 0 0 0 0 
0 0 0 0 0 0 
$$ [...]
##$SUBNAM3= <"">
##$SUBNAM4= <"">
##$SUBNAM5= <"">
##$SUBNAM6= <"">
##$SUBNAM7= <"">
##$SUBNAM8= <"">
##$SUBNAM9= <"">
##$SW= 400.765351723535
##$SWIBOX= (0..15)
0 1 3 0 0 0 0 0 0 0 0 0 0 0 0 0 
##$SW_h= 32467.5324675325
##$TD= 32768
##$TD0= 1
##$TE= 0
##$TE2= 300
##$TE3= 300
##$TEG= 300
##$TL= (0..7)
0 120 53 12 22 120 120 120 
##$TP= (0..7)
150 150 150 150 150 150 150 150 
##$TP07= 0
##$TPNAME0= <>
##$TPNAME1= <>
##$TPNAME2= <>
##$TPNAME3= <>
##$TPNAME4= <>
##$TPNAME5= <>
##$TPNAME6= <>
##$TPNAME7= <>
##$TPOAL= (0..7)
0.5 0.5 0.5 0.5 0.5 0.5 0.5 0.5 
##$TPOFFS= (0..7)
0 0 0 0 0 0 0 0 
##$TUNHIN= 0
##$TUNHOUT= 0
##$TUNXOUT= 0
##$USERA1= <user>
##$USERA2= <user>
##$USERA3= <user>
##$USERA4= <user>
##$USERA5= <user>
##$V9= 5
##$VALIST= <valist>
##$VCLIST= <CCCCCCCCCCCCCCC>
##$VD= 0
##$VDLIST= <DDDDDDDDDDDDDDD>
##$VPLIST= <PPPPPPPPPPPPPPP>
##$VTLIST= <TTTTTTTTTTTTTTT>
##$WBST= 1024
##$WBSW= 4
##$XGAIN= (0..3)
0 0 0 0 
##$XL= 0
##$YL= 0
##$YMAX_a= 5874
##$YMIN_a= -2801
##$ZGOPTNS= <>
##$ZL1= 120
##$ZL2= 120
##$ZL3= 120
##$ZL4= 120
##$ABSF1= 198.0616
##$ABSF2= -202.7028
##$ABSG= 5
##$ABSL= 3
##$ALPHA= 0
##$AQORDER= 0
##$ASSFAC= 0
##$ASSFACI= 0
##$ASSFACX= 0
##$ASSWID= 0
##$AUNMP= <proc_1d>
##$AZFE= 0.1
##$AZFW= 0.5
##$BCFW= 0
##$BC_mod= 2
##$BYTORDP= 0
##$COROFFS= 0
##$CY= -3
##$DATMOD= 1
##$DC= 0
##$DFILT= <>
##$DTYPP= 0
##$F1P= 0
##$F2P= 0
##$FCOR= 1
##$FTSIZE= 65536
##$FT_mod= 6
##$GAMMA= 0
##$GB= 0
##$INTBC= 1
##$INTSCL= 9.790993e-09
##$ISEN= 30
##$LB= 1.5
##$LEV0= 0
##$LPBIN= 0
##$MAXI= 10000
##$MC2= 0
##$MEAN= 0
##$ME_mod= 0
##$MI= 50
##$NCOEF= 0
##$NC_proc= -10
##$NLEV= 6
##$NOISF1= 182.463
##$NOISF2= 159.3651
##$NSP= 0
##$NTH_PI= 0
##$NZP= 0
##$OFFSET= 198.0616
##$PC= 4
##$PHC0= 2735.004
##$PHC1= -61.51303
##$PH_mod= 1
##$PKNL= yes
##$PPARMOD= 0
##$PSCAL= 0
##$PSIGN= 0
##$REVERSE= no
##$SF= 81.0140089999434
##$SI= 65536
##$SIGF1= 159.3651
##$SIGF2= -187.1042
##$SINO= 113.3802
##$SIOLD= 16384
##$SREGLST= <1H.CDCl3>
##$SSB= 0
##$STSI= 65536
##$STSR= 0
##$SW_p= 32467.5324675325
##$SYMM= 0
##$S_DEV= 0
##$TDeff= 32768
##$TDoff= 0
##$TI= <>
##$TILT= no
##$TM1= 0
##$TM2= 0
##$TOPLEV= 0
##$USERP1= <user>
##$USERP2= <user>
##$USERP3= <user>
##$USERP4= <user>
##$USERP5= <user>
##$WDW= 1
##$XDIM= 65536
##$YMAX_p= 117617600
##$YMIN_p= -280699531
$$ End of Bruker specific parameters
$$ ---------------------------------
##NTUPLES= NMR SPECTRUM
##VAR_NAME=  FREQUENCY,     SPECTRUM/REAL,   SPECTRUM/IMAG
##SYMBOL=    X,             R,               I
##VAR_TYPE=  INDEPENDENT,   DEPENDENT,       DEPENDENT
##VAR_FORM=  AFFN,          ASDF,            ASDF
##VAR_DIM=   65536,         65536,           65536
##UNITS=     HZ,            ARBITRARY UNITS, ARBITRARY UNITS
##FACTOR=    0.49542278885378, 1,            1
##FIRST=     16045.7642231865, 0,            0
##LAST=      -16421.768244346, 0,            0
##MIN=       -16421.768244346, -280699531,   0
##MAX=       16045.7642231865, 117617600,    0
$$ Real data points
##PAGE= N=1
##DATA TABLE= (X++(R..R)), XYDATA
$$ [...]
##PAGE= N=2
##DATA TABLE= (X++(I..I)), XYDATA
7267i128662J1449189R109945N445399M342032j158980j0936309j2882301k764226
$$ -9128662 2320527 11430472 16875871 21217903 20058923 9122614 -3759687 -6523913
7259f523913P022139O393169J320932Q43986L372437M248166N118608P255754
$$ -6523913 498226 6891395 8212327 9056313 12428750 16676916 21795524 29051278
7251B9051278O049077P8847m231947l982322n237356j0264542j1024792l461799
$$ 29051278 35100355 35179202 30947255 26964933 21727577 11463035 438243 -3023556
7243c023556L621525L015584K12817J578m503233j5987926j9193107r80700K4872556
$$ -3023556 597969 3613553 3826370 3827948 -675285 -16663211 -35856318 -36837018 -11964462
7234a1964462L2476552J8534409L145264j535304l369790r344471j2240870n459814
$$ -11964462 20512090 39046499 42191763 40656459 37286669 27942198 15701328 10241514
7226A0241514L847910N996908L132667L473758P920789J0376900P502207J906408
$$ 10241514 14089424 20086332 23218999 26692757 34613546 44990446 52492653 54399061
7218E4399061k403297l656535k391920n2989K498458M295552J827156q314273
$$ 54399061 51995764 48339229 45947309 45894320 48392778 52688330 54515486 46201213
7210D6201213k1045645k3132687r435914O090660O111252o180117j1408200k088080
$$ 46201213 25155568 2022881 -7413033 -1322373 4788879 -1391238 -12799438 -14887518
7202a4887518Q078512O997832J668099L755482R737211Q745501K982616M996673
$$ -14887518 -6809006 188826 1856925 5612407 15349618 24095119 27077735 32074408
7194C2074408J5876614K0426143Q040699j2045832k2518134j8057851p098064
$$ 32074408 47951022 68377165 76417864 64372032 41853898 23796047 16697983
7187A6697983J471529N262412L918708l386212j3136914j6563784q891895L448021
$$ 16697983 18169512 23431924 27350632 23964420 10827506 -5736278 -14628173 -11180152
7179a1180152R827784P919132M075332K321714n04672p107061j3174986j2136966
$$ -11180152 -1352368 6566764 10642096 12963810 12459138 5352077 -7822909 -19959875
7171a9959875l013332R137287J7477390J6628160O592753m001923m396625M547700
$$ -19959875 -22973207 -13835920 3641470 20269630 26862383 22860460 18463835 23011535
7163B3011535R304602J967293p299115m757752N755176Q204839j424183r723528
$$ 23011535 32316137 34283430 26984315 22226563 27981739 36186578 34762395 25038867
7155B5038867o680549P09012J332009l712339n701296k310273J623735L550257
$$ 25038867 18358318 19067330 20399339 16687000 10985704 8675431 10299166 13849423
7147A3849423N431664P984601R074558P428763L130368m806133j6291857k5483730
$$ 13849423 19281087 27265688 36340246 43769009 46899377 42093244 25801387 317657
7139C17657k3474685q257109J0573183J9732215J4617158K809398m476039l462774
$$ 317657 -23157028 -31414137 -20840954 -1108739 13508419 16317817 11841778 8379004
7131H379004K15175j52308m262944o448310l566082J655328M637011L231281k194368
$$ 8379004 8594179 8441871 4178927 -2269383 -5835465 -4180137 456874 3688155 1493787
7122A493787r551220j4591880j2822755m519571L803987N685924K070889O5166
$$ 1493787 -8057433 -22649313 -35472068 -39991639 -36187652 -30501728 -28430839 -28365673
7114b8365673L966835R699768R974790L825979k049836k094690J597058M240909
$$ -28365673 -24398838 -14699070 -4724280 -898301 -2948137 -5042827 -3445769 795140
7106G95140O012292R250443J0665475M479796o490153j1834145q040254k830443
$$ 795140 6807432 16057875 26723350 31203146 24712993 12878848 4838594 2008151
7098B008151j241549J956926R102887J0327788j189404j4069796j3369486l589110
$$ 2008151 766602 2723528 11826415 22154203 20964799 6895003 -6474483 -10063593
7090a0063593m63700m361290j469670Q925478J0029631l857103j4684693p620009
$$ -10063593 -10527293 -14888583 -16358253 -7432775 2596856 -1260247 -15944940 -23564949
7082b3564949O224152Q293714O91464r10815N925841Q245770k72835j0120297
$$ -23564949 -17340797 -9047083 -8355619 -9266434 -3340593 4905177 4632342 -5487955
7074e487955r973794N36095J3227507J8751741J1598633m893407j8093531j6904393
$$ -5487955 -15461749 -14925654 -1698147 17053594 28652227 23758820 5665289 -11239104
7066a1239104m011637O753019N230664n624735j3719023r257819N128564J4767722
$$ -11239104 -15250741 -8497722 -3267058 -8891793 -22610816 -31868635 -26740071 -11972349
7058a1972349Q426067n933376r153623L062898J3478429Q760596j162804l66408
$$ -11972349 -3546282 -9479658 -18633281 -15570383 -2091954 6668642 5505838 5139430
7050E139430P602270O971865m547677j4131584j4773123j1492716p169420J927783
$$ 5139430 12741700 19713565 15165888 1034304 -13738819 -25231535 -32400955 -30473172
7042c0473172J4034775J9225728J3170829K986690l883351p206152q268580o251340
$$ -30473172 -16438397 2787331 15958160 18944850 15061499 7855347 -413233 -6664573
7034f664573k579439k76373K080778P021396R478709K434531r030450j2144655
$$ -6664573 -9244012 -9520385 -7439607 -418211 9060498 11495029 2464579 -9680076
7026i680076n876111k040842m740175l991323N303543J3400855J2100941P061616
$$ -9680076 -15556187 -17597029 -22337204 -26328527 -21024984 -7624129 4476812 11538428
7018A1538428N266453L507423j107491k121131L644313O336980j586271j0832317
$$ 11538428 16804881 20312304 19204813 17083682 20727995 27064975 25478704 14646387
7010A4646387r372319j635322N07799k510802k635334j747138p735137j6898632
$$ 14646387 5274068 3638746 4146545 1635743 -999591 -2746729 -10481866 -27380498
7002b7380498j6871467o104486M147072O962256N603003K906567j576167l832276
$$ -27380498 -44251965 -50356451 -46209379 -39247123 -33644120 -30737553 -32313720 -36145996
6994c6145996J375497Q380296N464382n918660j0473430j384604R786522J0772495
$$ -36145996 -34770499 -26390203 -20925821 -26844481 -37317911 -38702515 -28915993 -18143498
6986a8143498M236991m40896l10009K910436Q018427J0781277M373272q897718
$$ -18143498 -13906507 -14347403 -14657412 -11746976 -3728549 7052728 11426000 2528282
6978B528282j4681368m161668J2264415J7810373J0101156Q217n332848p782957
$$ 2528282 -12153086 -16314754 -4050339 13760034 23861190 23869407 18536559 10753602
6970A0753602q833310n762937J372166O787208N941928J045736k264423r43560
$$ 10753602 1920292 -3842645 -2470479 4316729 10258657 11304393 9039970 8096410
6962H096410L395121O213290L961449k065942o805421p673990p296451p983602
$$ 8096410 11491531 17704821 21666270 19600328 12794907 5120917 -2175534 -10159136
6954a0159136p164914k342051K668459K231123j940483k471139K685313P354748
$$ -10159136 -17324050 -19666101 -16997642 -14766519 -16707002 -19178141 -16492828 -9138080
6946i138080P135773O092881R166997J2618136Q684565j708300q221138n274479
$$ -9138080 -2002307 4090574 13257571 25875707 34560272 32851972 24630834 19356355
6938A9356355o84018m656881j3939996j4873990k545698J1093332J2232618K216822
$$ 19356355 18672337 14015456 75460 -14798530 -17344228 -6250896 5981722 8198544
6930H198544o396233o568767k311817M24943N37509q87889k979577l129591J440220
$$ 8198544 1802311 -4766456 -7078273 -6653330 -6115821 -7003710 -9983287 -13112878 -11672658
6921a1672658Q075551R943260N078921q26040k778068k278686k394472k957324
$$ -11672658 -3597107 6346153 11425074 10599034 7820966 5542280 3147808 190484
6913A90484l785741o111871o616889K105659J7987759K4219212R085416j3455376
$$ 190484 -3595257 -9707128 -16324017 -14218358 3769401 27988613 37074029 23618653
6905B3618653j7353871R66932J6387042Q786317j0711410j7722847q383784K0192
$$ 23618653 6264782 7231714 23618756 32405073 21693663 3970816 -4412968 -4392776
6897d392776k235757n062982J949883J2395184J3704880N257843l749808q169104
$$ -4392776 -6628533 -11691515 -9741632 2653552 16358432 21616275 17866467 9697363
6889I697363q961244o025367O73344N489758L107026j334047R60228O461553L154921
$$ 9697363 736119 -5289248 -4615904 873854 3980880 2646833 3607061 10068614 13223535
6880A3223535q417706j2919256m156273M015701o1791p039828l210305O172638
$$ 13223535 4805829 -8113427 -12269700 -8253999 -8315790 -15355618 -18565923 -12393285
6872a2393285O893350L49074q25106L244323L85016r535858j1651204r87970Q464261
$$ -12393285 -5499935 -5150861 -5975967 -2731644 -2346628 -11882486 -23533690 -24521660 -16057399
6863a6057399O585200K327079O420171J2821016R135487m289510j6765965k1635018
$$ -16057399 -9472199 -7145120 -724949 12096067 21231554 16942044 176079 -21458939
6855b1458939j8912583r881938K295061J1460194J4694402J4925717J3226611
$$ -21458939 -40371522 -50253460 -47958399 -36498205 -21803803 -6878086 6348525
6848F348525O324271l363780n322711L683621J1432572O925944l324567o178537
$$ 6348525 12672796 9309016 3986305 7669926 19102498 26028442 22703875 16525338
6840A6525338j333744J666965k21026k070224j532194l8141K819803O495913N492519
$$ 16525338 15191594 16858559 16637533 14567309 13035115 12996974 15816777 22312690 27805209
6831B7805209k455157r324195p492542j529895O54524J033862M189718N261076
$$ 27805209 25350052 16025857 8533315 7003420 7657944 8691806 12881524 18142600
6823A8142600m98302m535173J342898N915876n684528k2384700j8148661P585506
$$ 18142600 17644298 13109125 14452023 20367899 14683371 -7701329 -25849990 -18264484
6815a8264484K6191104K1343204R038297O986112Q148651n08949j2782383j4917023
$$ -18264484 7926620 29269824 38308121 45294233 53442884 52933935 40151552 25234529
6807B5234529r010095p442208j2971700j8724133k0431533j6735678n262952J0534369
$$ 25234529 16224434 8782226 -4189474 -22913607 -43345140 -60080818 -65343770 -54809401
6799e4809401J9023573J5494342J0332251J1353793R303171n046908k0101164
$$ -54809401 -35785828 -20291486 -9959235 1394558 10697729 5650821 -14450343
6792a4450343j7385687O45972J4687880J6242281J3619692J2558676Q630369J21387
$$ -14450343 -31836030 -31190058 -16502178 -259897 13359795 25918471 34548840 34670227
6784C4670227o948895r352863r819455q419573k880211K025348j257814p864691
$$ 34670227 27721332 18368469 8549014 129441 -2750770 -725422 -1983236 -9847927
6776i847927l746598J2019288K1891856J3450426l133995r351955j605182Q081109
$$ -9847927 -13594525 -1575237 20316619 33767045 30633050 21281095 19675913 27757022
6768B7757022Q979613J842330n056959n066587M73418L653464r8239m976622k613722
$$ 27757022 36736635 38578965 33522006 28455419 28928837 32582301 32484062 27507440 24893718
6759B4893718M925946P454505J382282o378783r765987r796620q015557l340514
$$ 24893718 29819664 37274169 38656451 32277668 22511681 12715061 4699504 1358990
6751A358990J699584J115980m078603m609558L005716R879700P937676J273702
$$ 1358990 3058574 4174554 95951 -4513607 -1507891 8371809 16309485 17583187
6743A7583187k418716l840055p275087j0311773p767468j813251P97725o66572
$$ 17583187 15164471 11324416 4049329 -6262444 -14029912 -15843163 -15045438 -15712010
6735a5712010r79549J748329L847840K632881n30146l230822l597003j78666N353731
$$ -15712010 -16691559 -14943230 -11095390 -8462509 -8992655 -12223477 -15820480 -15999146 -10645415
6726a0645415P351146L028434j914123n42578L981656J947357p183530j0715923
$$ -10645415 -3294269 -265835 -2179958 -2722536 1259120 3206477 -3977053 -14692976
6718a4692976P98579J8438585K3516540J0194467p662650j4739029j2764015j3711660
$$ -14692976 -13894397 4544188 28060728 38255195 30592545 15853516 3089501 -10622159
6710a0622159j8501965j4577577K082681J5105027Q623906q254088j2658906k03312
$$ -10622159 -29124124 -43701701 -41619020 -26513993 -17890087 -26144175 -38803081 -39006393
6702c9006393J0732668Q309440K857092N797077R586108K295006r582433r844827
$$ -39006393 -28273725 -19964285 -17107193 -11310116 -1724008 570998 -9011435 -18856262
6694a8856262J464415P611292K45569r657468q876420J472589J0786883J1812023
$$ -18856262 -17391847 -9780555 -9534986 -19192454 -28068874 -26596285 -15809402 -3997379
6686c997379M343794o693204j2211302m066504J4940531K9499543K5803783O702838
$$ -3997379 346415 -6346789 -18558091 -22624595 -7684064 21815479 47619262 54322100
6678E4322100j0470432j1700503l80542P172813K0205j5135820k2100654j4485420
$$ 54322100 43851668 32151165 31770623 38943436 38963641 23827821 1727167 -12758253
6670a2758253k071590L259371J663727Q18223K929295M058509L548484M968377
$$ -12758253 -14829843 -11570472 -9906745 -9088522 -6159227 -2100718 1447766 6416143
6662F416143P170114L173300q286767j6691595j1185041M756675J5784717J1990848
$$ 6416143 13586257 16759557 8472790 -8218805 -19403846 -14647171 1137546 13128394
6654A3128394l60810p424705m396835O56085k75654l997148k576398L025368M018298
$$ 13128394 12767584 5342879 946044 1602129 1326475 -2670673 -5247071 -2221703 1796595
6645A796595j711068n209578K1783P935775Q885822K723399l240327n027680m699124
$$ 1796595 85527 -5124051 -5102268 2833507 11719329 14442728 11202401 6174721 1475597
6636A475597n201521p262484q844407n184381N702460J5392526J1135206n686790
$$ 1475597 -3725924 -10988408 -19832815 -25017196 -19314736 -3922210 7212996 1526206
6628A526206j6617449r333146N319718R260926J354662o543491r983899j3442512
$$ 1526206 -15091243 -24424389 -19104671 -9843745 -8489083 -15032574 -25016473 -38458985
6620c8458985j6015864j1014774J307719J3250893K0300867K1430573J3508572
$$ -38458985 -54474849 -65489623 -64181904 -50931011 -30630144 -9199571 4309001
6613D309001j534362r874988k191172Q765513N492376n402733m610204M358753
$$ 4309001 2774639 -7100349 -9291521 -526008 4966368 -436365 -5046569 -687816
6605f87816j2253j6350641j7227258M789607K1018108J1974077k458054O01495
$$ -687816 -700069 -17050710 -34277968 -29488361 -8470253 3503824 1045770 1647265
6597A647265R229545K458046j0428360q226216K757288J611638p705719n124816
$$ 1647265 10876810 13334856 2906496 -5319720 -2562432 -950794 -8656513 -13781329
6589a3781329N165394k90975k0425277k6689939q353911J2132445J7219625J7028039
$$ -13781329 -8615935 -8906910 -29332187 -56022126 -64376037 -52243592 -35023967 -17995928
6581a7995928K2176806K2254830Q182948o883488p716086q33291n54937n423030
$$ -17995928 4180878 26435708 34618656 27735168 20019082 19185791 18630854 13207824
6573A3207824n662582k591700l471153n218578N76835J1044818J3964021M239140
$$ 13207824 7545242 4953542 1482389 -3736189 -3159354 7885464 21849485 26088625
6565B6088625j0777304k0059835j6984264k998671J1473832J4631086N662588
$$ 26088625 15311321 -4748514 -21732778 -24731449 -13257617 1373469 7036057
6558G036057n888570j4041614k0079693k1210566r823016J0140301K0480170J1692161
$$ 7036057 1147487 -12894127 -32973820 -54184386 -64007402 -53867101 -33386931 -21694770
6550b1694770l510148q994519n307367o41867N290575J4752014K0055092J3317274
$$ -21694770 -25204918 -34199437 -39506804 -40148671 -34858096 -20106082 -50990 13266284
6542A3266284Q43434n849835o829196q899001j0885745p119063P1467L927712
$$ 13266284 14109718 8259883 1430687 -7468314 -18354059 -25473122 -25401655 -21473943
6534b1473943M195829L762071J441586j247963M014988J6695329J9177220J034678
$$ -21473943 -17278114 -13516043 -12074457 -13322420 -9307432 7387897 26565117 27599795
6526B7599795j9547597j8960970l223817L580814j789755j801704O325445N391892
$$ 27599795 8052198 -10908772 -14132589 -10551775 -12341530 -14143234 -7817789 -2425897
6518b425897q348694j5808789p344298K264044K207340L982235J6757810K6722683
$$ -2425897 -10774591 -26583380 -33927678 -31663634 -29456294 -25474059 -8716249 18006434
6510A8006434J8803624J423885q238074r162009r497634p870914L56384Q594385
$$ 18006434 36810058 38233943 29995869 20833860 11336226 3465312 3821696 12416081
6502A2416081Q088923L171170K103778J413882n187888j1161151p228205M95127
$$ 12416081 20505004 23676174 25779952 27193834 22005946 10844795 3616590 4111717
6494D111717j47423o252992o001876o45723j524119q328533r376729k462456K974535
$$ 4111717 3964294 -2288698 -8290574 -8936297 -10460416 -18788949 -28165678 -30628134 -27653599
6485b7653599M388355Q204814J2249906N867263q174654j1462361K429865J5511353
$$ -27653599 -23265244 -15060430 -2810524 3056739 -5117915 -16580276 -14150411 1360942
6477A360942J1114943k674756p640223j606852L703025K712473q5482j794938
$$ 1360942 12475885 9801129 2160906 554054 4257079 6969552 6884070 5089132
6469E089132l984369n292246j774021M753238O938054K198816l090594j976985
$$ 5089132 1104763 -4187483 -5961504 -1208266 5729788 7928604 4838010 2861025
6461B861025M103804O994478J328325q749727j3028926o245957N262521J0128389
$$ 2861025 6964829 13959307 15287632 6537905 -6491021 -12736978 -7474457 2653932
6453B653932M657795l664569n001345L064244J3652992J5888591M427209j2380325
$$ 2653932 7311727 3647158 -1354187 1710057 15363049 31251640 35678849 23298524
6445B3298524j7282468l497507J3784614J4101232j786050j3138450p970879J736645
$$ 23298524 6016056 2518549 16303163 30404395 28618345 15479895 7509016 9245661
6437I245661j406459j7006898k9724754k7735291j1278029J0697164K5460844
$$ 9245661 7839202 -9167696 -38892450 -66627741 -77905770 -67208606 -41747762
6430d1747762K4093352J1231024J901120K515757K269709q448164j9540227j4036825
$$ -41747762 -17654410 -6423386 -4522266 -2006509 263200 -8184964 -27725191 -41762016
6422d1762016N541924J8962523J6239287Q776478Q543673R990585J816667j2517989
$$ -41762016 -36220092 -17257569 -1018282 7758196 16301869 26292454 28109121 15591132
6414A5591132j7768587p562846P716325J4676177J1415567N185165M75769m835839
$$ 15591132 -2177455 -9740301 -2023976 12652201 24067768 29252933 29728702 24892863
6406B4892863j2002035j6135784j2773190o432261n593054r037693n702566P619766
$$ 24892863 12890828 -3244956 -16018146 -22450407 -28043461 -37081154 -42783720 -35163954
6398c5163954J6867809Q171554j0293534j5904584r83669J7086129J9012775O943931
$$ -35163954 -18296145 -10124591 -20418125 -36322709 -37306378 -20220249 -1207474 5736457
6390E736457k081066J245872J0924531J6749934J4456538N819581m084241r056065
$$ 5736457 3655391 4901263 15825794 32575728 47032266 52851847 48767606 39711541
6382C9711541o900354l522774p286332j8109495k6371675k3945657j2450030M34966
$$ 39711541 32811187 29288413 22002081 3892586 -22479089 -46424746 -58874776 -58439810
6374e8439810Q303081Q362096K271736k214959L389752J5951600J9600849N108082
$$ -58439810 -50136729 -41774633 -39502897 -41717856 -38328104 -22376504 -2775655 2332427
6366B332427j4039351j5928459O76192J4188596R791846k083158m208249K522354
$$ 2332427 -11706924 -27635383 -26959191 -12770595 -2978749 -5061907 -9270156 -6747802
6358f747802M902564K48275j647312L017933O282832L040829j018713m13925J266181
$$ -6747802 -1845238 -1596963 -3244275 -226342 6056490 9097319 8078606 7664681 8930862
6349H930862r35324m505119m065687P70206O693022J0923255J0921692N562285
$$ 8930862 7995538 3490419 -575268 194938 6887960 17811215 28732907 34295192
6341C4295192m71481k60161L936989R98200j2000916k1723434j5816805j051401
$$ 34295192 33823711 33563550 37500539 38498739 26497823 4774389 -11042416 -12093817
6333a2093817O112716K418217j74437N996170J3757157J2401047J715934q969051
$$ -12093817 -5981101 -3562884 -3737321 2258849 16016006 28417053 30132987 21163936
6325B1163936j1811048p904923m738650o419360p586435j288139P633013N960801
$$ 21163936 9352888 1447965 -3290685 -9710045 -17296480 -18584619 -10951606 -4990805
6317d990805p499798j5744858o431587Q872542J0881000M24008n693894k268145
$$ -4990805 -12490603 -28235461 -34667048 -25794506 -14913506 -14489498 -20183392 -22451537
6309b2451537p20879n985577p125456K817409J3395554J2487792L661720j908686
$$ -22451537 -23172416 -29157993 -36283449 -33466040 -20070486 -7582694 -3920974 -5829660
6301e829660j616691K20862K756855P309986J0407398O910597k636746j3550661
$$ -5829660 -7446351 -7225489 -4468634 2841352 13248750 20159347 17522601 3971940
6293C971940k2040463k4282643j6788826l773265K699938k048886o025944M021799
$$ 3971940 -18068523 -42351166 -59139992 -62913257 -60213319 -62262205 -68288149 -64266350
6285f4266350K2700234L2068366K4767136J0269319n77669n963053p170564l265570
$$ -64266350 -41566116 -9497750 15269386 25538705 24961036 18997983 11827419 8561849
6277H561849M203584R194946Q267792M102482p02143o875313j2324463j0131026
$$ 8561849 12765433 21960379 30228171 34330653 33628510 26753197 14428734 4297708
6269D297708J294793J1628570R908653l62473n275061P20999P849307N093216
$$ 4297708 5592501 17221071 27129724 26767251 21492190 22213189 30062496 35155712
6261C5155712n356762j2379575j0137117k197662N758179J0358691Q432373j447040
$$ 35155712 29798950 17419375 7282258 5084596 10842775 21201466 29633839 28186799
6253B8186799j3066946j5801863q125090j121016k796653n998940n42378Q968953
$$ 28186799 15119853 -682010 -8807100 -9928116 -12724769 -18723709 -19266087 -10297134
6245a0297134R630267J353613k657292K751772P300066L455764j783746q02721
$$ -10297134 -666867 686746 -1970546 781226 8081292 11537056 9753310 8950589
6237H950589J146735l330076r251027p606103j550557j393569p069518q273553
$$ 8950589 10097324 6767248 -2483779 -10089882 -11640439 -13034008 -20103526 -28377079
6229b8377079j322344N541300N207490P64657j188996P42440L801636O082474
$$ -28377079 -29699423 -24158123 -18950633 -18185976 -19374972 -18632532 -14830896 -8748422
6221h748422P756238R545514J0885895R058094K365691m867678n357221L44632
$$ -8748422 -992184 8553330 19439225 28497319 30863010 25995332 20638111 20982743
6213B0982743K536422l216515p712801k001709P359844P835748P22451j504796
$$ 20982743 23519165 20302650 12589849 10588140 17947984 25783732 26506183 25001387
6205B5001387M360087Q012541K957171m577061p467106p408429p955823p171036
$$ 25001387 29361474 37374015 40331186 35754125 28287019 20878590 12922767 5751731
6197E751731l105817M32464n12307l535151l726670m46231L173896M475037K777287
$$ 5751731 2645914 3078378 2566071 -969080 -4695750 -5141981 -1968085 2506952 5284239
6188E284239o82248l200089l333702k725707k699211j339635K361677M919172
$$ 5284239 4601991 1401902 -1931800 -4657507 -7356718 -8696353 -6334676 -1415504
6180a415504L737981J714879R30873j754361n249263L93640J6614972K4041229
$$ -1415504 2322477 4037356 4968229 3213868 -2035395 -1641755 14973217 39014446
6172C9014446O508505j8976270k0169797L414263J7901603M653932j4798484j5356177
$$ 39014446 45522951 26546681 6376884 9791147 27692750 32346682 17548198 2192021
6164B192021m139807j140253n353558l370975L068906K342735l361114k304344
$$ 2192021 -1947786 -3088039 -8441597 -11812572 -8743666 -6400931 -9762045 -12066389
6156a2066389M458232N728974J295208Q45220M203494J434909q006400j3493231
$$ -12066389 -7608157 -1879183 -583975 261245 4464739 5899648 -2106752 -15599983
6148a5599983j0786617n865719j480373M987933J0682961R570969N439034P507271
$$ -15599983 -26386600 -32252319 -33732692 -28744759 -18061798 -8490829 -3051795 4455476
6140D455476J3449650J2493674N034976K054183M427938J313501q332925j1813299
$$ 4455476 17905126 30398800 35433776 37487959 41915897 43229398 34896473 23083174
6132B3083174n234735j266627p174335j2552732p606602K138377Q109014J0497528
$$ 23083174 17848439 16581812 9407477 -3145255 -10751857 -8613480 -504466 9993062
6124I993062R360204J273j2938974j3315507K691056J6433724J3599496M983230
$$ 9993062 19353266 19354539 6415565 -6899942 -4208886 12224838 25824334 30807564
6116C0807564N151017P144524j358085j1016144m789300R814744Q987577r264503
$$ 30807564 35958581 43103105 41745020 30728876 25939576 35754320 44741897 35477394
6108C5477394k0566408j0663197N777265R422002J021565o656477p470806l414009
$$ 35477394 14910986 4247789 10025054 19447056 20468621 13812144 6341338 2927329
6100B927329K423342O458928M992228o66322m535389l568487M41899N914200J1059807
$$ 2927329 5350671 11809599 16801827 16135505 11600116 8031629 8473528 14387728 25447535
6091B5447535J0298908R88317p866743n563903K431253O24688j1607292j7397712
$$ 25447535 35746443 36734760 28868017 23304114 25735367 26360055 14752763 -2644949
6083b644949q843625O68568j436722q180293p667849k976382l454789o382316
$$ -2644949 -11488574 -10820006 -12256728 -20437021 -28104870 -31081252 -34536041 -40918357
6075d0918357k706131N240930O700242j269o042338o512290m512550j852281L309709
$$ -40918357 -43624488 -38383558 -31683316 -31684585 -37726923 -44239213 -48751763 -50604044 -47294335
6066d7294335R288613J0990755Q040745N000683L686855K724655L537774Q308011
$$ -47294335 -38005722 -27014967 -18974222 -13973539 -10286684 -7562029 -4024255 4283756
6058D283756J2749105R798613M81730p272111j0075014j0471781q277577j660200
$$ 4283756 17032861 26831474 27313204 20041093 9966079 -505702 -8783279 -10443479
6050a0443479L504041j314104j0861134r430327M212472J0777303j019640j4350961
$$ -10443479 -6939438 -8253542 -19114676 -28545003 -24332531 -13555228 -14574868 -28925829
6042b8925829p329371J4333513K5370411J6385531K898494p59133J052590j192719
$$ -28925829 -36255200 -21921687 3448724 19834255 22732749 21973616 23026206 21833487
6034B1833487n666403n002980L83771L684086J734997k880499o699775p554402
$$ 21833487 16167084 11164104 11547875 15231961 16966958 14086459 7386684 -167718
6026a67718m457997Q17091L928650K395533j560449l526600l56378Q145085J7470392
$$ -167718 -4625715 -3808624 120026 2515559 955110 -2571490 -2927868 5217217 22687609
6017B2687609J9712598J1805507R59896m714055q424792j7136769k3524166j1554758
$$ 22687609 42400207 54205714 55165610 50451555 42026763 24889994 1365828 -10188930
6009a0188930J5275678K8730307J0915378j9177592k9794885j6489468P0407Q101031
$$ -10188930 5086748 33817055 44732433 25554841 -4240044 -20729512 -20659105 -12558074
6001a2558074J3841462J8790125J2472885n611614j7711935j2644434k769740
$$ -12558074 1283388 20073513 32546398 26934784 9222849 -3421585 -6191325
5994f191325l466563r069624m614432P665416J0814426o89602j2352267r481599
$$ -6191325 -9657888 -18727512 -23341944 -15676528 -4862102 -5551704 -17903971 -27385570
5986b7385570M464078J3145080O155496r636905j6483676m894661J3649656J8320089
$$ -27385570 -22921492 -9776412 -3620916 -13257821 -29741497 -34636158 -20986502 -2666413
5978b666413M314237j1372866j2658583k719837O671957J2853063J8278619J8398229
$$ -2666413 1647824 -9725042 -22383625 -25103462 -18431505 -5578442 12700177 31098406
5970C1098406Q391482l427468m562677J684188O55665r609324j4813114p614504
$$ 31098406 39489888 36062420 31499743 33183931 33839596 24230272 9417158 1802654
5962A802654J135106M89068m680418m515095o42908j716743q454540j2211306
$$ 1802654 2937760 3426828 -1253590 -5768685 -6411593 -8128336 -16582876 -28794182
5954b8794182o350569O320238J6144394J4882149M148878m753754l994318J07537
$$ -28794182 -35144751 -28824513 -12680119 2202030 6350908 1597154 -2397164 -2289627
5946b289627k590187q168413m153594P306899Q775072m462622j3296976l106889
$$ -2289627 -4879814 -13048227 -17201821 -9894922 -1119850 -5582472 -18879448 -21986337
5938b1986337J2195181J0484341n470601j3918176o564447M277356Q467586Q687804
$$ -21986337 -9791156 693185 -4777416 -18695592 -25260039 -20982683 -12515097 -3827293
5930c827293O978904p79545j1455213j1968933J410735J3962434J2472771L788827
$$ -3827293 3151611 2372066 -9083147 -21052080 -19641345 -5678911 6793860 10582687
5922A0582687K461527Q260861Q972491J047178o093134o233390m750458p513358
$$ 10582687 13044214 21305075 30277566 31324744 25231610 18998220 14247762 6734404
5914F734404j1092847r724303n044512j804592J435481Q648118J5101160J0055044
$$ 6734404 -4358443 -14082746 -19127258 -20931850 -19496369 -10848251 4252909 14307953
5906A4307953n927768j5370658l772873J9404075K9103186J3540613j3562308
$$ 14307953 8380185 -6990473 -10763346 8640729 37743915 51284528 37722220
5899C7722220l0451618k8570627j3814629M009251J6142001J5789592L167392
$$ 37722220 7270602 -21300025 -35114654 -31105403 -14963402 826190 3993582
5892C993582j1646408j6836405r580735L803383J5017466J7628365Q898144n712869
$$ 3993582 -7652826 -24489231 -34069966 -30266583 -15249117 2379248 11277392 5564523
5884E564523j3235428n751640R046196J6142628J0846802J965710j597412m98233
$$ 5564523 -7670905 -13422545 -4376349 11766279 22613081 24578791 22981379 22483146
5876B2483146m84123m041129q409639q940022m037370J669843J303028n063715
$$ 22483146 21999023 17957894 9548255 608233 -3429137 -1759294 -456266 -5519981
5868e519981r321032o591735j711149L58990K888299Q152742Q153943l215065
$$ -5519981 -14841013 -21432748 -23143897 -22784907 -19896608 -11743866 -3589923 -6804988
5860f804988j5157224j2397750R26340O746708J477049J78029R479933J5849957
$$ -6804988 -21962212 -34359962 -33433622 -26686914 -25209865 -25031836 -15551903 298054
5852B98054Q550111l299633p339319o378738p525463o212003M052224J6021615
$$ 298054 8848165 5548532 -1790787 -8169525 -15694988 -21906991 -17854767 -1833152
5844a833152J8144683J2426258Q405990N646902k713074j3681764j7337940j3754664
$$ -1833152 16311531 28737789 37143779 42790681 40077607 26395843 9057903 -4696761
5836d696761j2166424j4071037j1537657l071719K680632J690651P09842M884135
$$ -4696761 -16863185 -30934222 -42471879 -45543598 -42862966 -41172315 -40462473 -35578338
5828c5578338R650329R329944N421243K323517J195923N59021k180129r624713
$$ -35578338 -25928009 -16598065 -11176822 -8853305 -7657382 -7098361 -9278490 -18903203
5820a8903203j8796463j9181607n319249J1182344J3826299M266696k37781P104501
$$ -18903203 -37699666 -56881273 -62200522 -51018178 -37191879 -32925183 -33162964 -26058463
5812b6058463J4355322J2061474O724400O023041N491859o9776m550012j411395
$$ -26058463 -11703141 358333 7082733 13105774 18597633 18527857 13977845 12566450
5804A2566450L633722K516109j498169j605089l84572k541252l031014L520219
$$ 12566450 16200172 18716281 17218112 15613023 15228451 12687199 9656185 13176404
5796A3176404Q826603K297452q995059r116181R38369M782264k211570o742908
$$ 13176404 22003007 24300459 15305400 6189219 7127588 11909852 9698282 2955374
5788B955374k072672P39218n887170j0840258k296905J2213003J6895071R534661
$$ 2955374 882702 1621920 -4265250 -15105508 -17402413 -5189410 11705661 21240322
5780B1240322k28499o929603j1042628j0544787l504516M358284O180580N101955
$$ 21240322 21011823 14082220 3039592 -7505195 -11009711 -6651427 -470847 4631108
5772D631108P917438J0904623M748773p786630j2664981m352674P621427J4012032
$$ 4631108 12548546 23453169 28201942 20415312 7750331 3397657 11019084 25031116
5764B5031116J5323132J2775511L256018j0509270j7104017j2051782n576388
$$ 25031116 40354248 53129759 56385777 45876507 28772490 16720708 11144320
5757A1144320n846293n523910L475540J2339623P904038m347173p389178N58095
$$ 11144320 5298027 -225883 3249657 15589280 23493318 19146145 11756967 12315062
5749A2315062M670445q94267m929463j032120Q24133o461931j2071353m075908
$$ 12315062 16985507 16091240 11161777 10129657 10953790 4491859 -7579494 -11655402
5741a1655402J0239847J4639551O794742k248895n735996n409832k164596M437668
$$ -11655402 -1415555 13223996 20018738 17769843 12033847 6624015 4459419 8897087
5733H897087R232659O200350n50147j697489K129141J902231l000551k705594
$$ 8897087 18129746 24330096 23779949 22082460 24211601 26113832 23113281 20407687
5725B0407687N541292J0567782M062487o746716j1032447j0189685j2244311j6315333
$$ 20407687 25948979 36516761 40579248 33832532 22800085 12610400 366089 -15949244
5717a5949244j3322813j086901J0037837R294276j007477p507246j153556J1497372
$$ -15949244 -29272057 -30358958 -20321121 -11026845 -12034322 -19541568 -20695124 -9197752
5709i197752J5322756N221387p584039j1149533p922359o634300n754947K083094
$$ -9197752 6125004 11346391 3762352 -7387181 -15309540 -21943840 -27698787 -25615693
5701b5615693J2305781J1149326j835266j0087251m511288L645346K866571m87496
$$ -25615693 -13309912 -2160586 -3995852 -14083103 -18594391 -14949045 -12082474 -12569970
5693a2569970L773602J0168298P193443k524977p371049n614846l766689j451256
$$ -12569970 -8796368 1371930 8565373 6040396 -1330653 -6945499 -10712188 -12163444
5685a2163444N559364J0741746L139285j1877917j5626342k714537J1085499J1878187
$$ -12163444 -6604080 4137666 7276951 -4600966 -20227308 -22941845 -11856346 21841
5677B1841M155766j056675j104270J737942O444125Q949138K832441q630377j2159287
$$ 21841 4177607 3120932 2016662 3754604 10198729 19147867 21980308 13349931 1190644
5668A190644l794581L063325j820273q874357m960121M380198M801411j729687
$$ 1190644 -2603937 459388 -1360885 -10235242 -15195363 -10815165 -6013754 -7743441
5660g743441J46159J2767627J9556311R057558r324743j9561058j8034409j1566697
$$ -7743441 -7597282 5170345 24726656 33784214 24459471 4898413 -13135996 -24702693
5652b4702693n096787P04921N053195P897459J1980626J7596031J7907607O844491
$$ -24702693 -29799480 -29094559 -24041364 -16143905 -4163279 13432752 31340359 38184850
5644C8184850q673525j2232223K515309K0880255K2000318L400242j5894308j8657646
$$ 38184850 29511325 17279102 19794411 40674666 62674984 66075226 50180918 31523272
5636C1523272r263101m338081q542462j0051709j034336Q437735M493043r002512
$$ 31523272 22260171 17922090 9379628 -672081 -1706417 6731318 11224361 2221849
5628B221849j3465592N2571J8229747K1178285O060071j0337629j1898979j099696
$$ 2221849 -11243743 -11191172 7038575 28216860 34276931 23939302 12040323 10940627
5620A0940627O570696L381828k199461j07355N703651M301336l872477p314489
$$ 10940627 17511323 20893151 18693690 18586335 24289986 28591322 24718845 17404356
5612A7404356k398381O65455m569160r471025n232963J605436P64771k631931
$$ 17404356 15005975 15671430 11102270 1631245 -3601718 -1996282 -1231511 -3863442
5604c863442M137513J8152725K2183976J0600843j941272l132959j80304n156691
$$ -3863442 274071 18426796 40610772 51211615 49270343 46137384 45957080 40800389
5596D0800389j4377300j4951534n873693O29238k133862o680846m242331K458752
$$ 40800389 26423089 11471555 5597862 6227100 4093238 -2587608 -6829939 -4371187
5588d371187M673725Q07447k137174R28674O470967P671936L337316j141916m99853
$$ -4371187 302538 1109985 -1027189 -98515 6372452 14044388 17381704 16239788 15739935
5579A5739935N046848J0396503R243706j436255j6497778k2970714j1664938R619289
$$ 15739935 20786783 31183286 40426992 38990737 22492959 -477755 -12142693 -2523404
5571b523404K1195500J3966629K63397l631435J377507K888620k142074n469604
$$ -2523404 18672096 32638725 32902122 29270687 30648194 33536814 31394740 25925136
5563B5925136m419663n809980j0650062r436880J066856R304032O213040M5141
$$ 25925136 21505473 15695493 5045431 -4391449 -3324593 5979439 12192479 12237620
5555A2237620K593560R570316Q458239J23442k834789K473594N139844J24137
$$ 12237620 14831180 24401496 32859735 32983177 30148388 32621982 37761826 37885963
5547C7885963k876533L182974Q982212K950639r340259j2678641n650454k886882
$$ 37885963 35009430 38192404 47174616 50125255 40784996 28106355 22455901 19569019
5539A9569019j1354945j6800620l279654K0319269K6546896M351436k3554080
$$ 19569019 8214074 -8586546 -11866200 8453069 34999965 39351401 15797321
5532A5797321k6935440n182416J3714365J0014490n553904j1328076m005429K630599
$$ 15797321 -11138119 -16320535 -2606170 7408320 1854416 -9473660 -13479089 -10848490
5524a0848490Q54146k769427r01447M802002R301451J0239927O147138l012368
$$ -10848490 -9994344 -12763771 -13665218 -8863216 438235 10678162 16825300 13812932
5516A3812932j0990407r437730m21031L657772k701143r371994n540989M510435
$$ 13812932 2822525 -6615205 -7036236 -3378464 -6079607 -15451601 -20992590 -16482155
5508a6482155R179304O995202O085340R619288J2208060R858724M072781m071688
$$ -16482155 -7302851 -307649 5777691 15396979 27605039 37463763 41536544 37464856
5500C7464856j4770952k3171882k1195810q859286L503100P713543O142603M675371
$$ 37464856 22693904 -477978 -21673788 -30533074 -27029974 -19316431 -13173828 -8498457
5492h498457M125821K772819J211368j09170k769295n325030k410847N699729
$$ -8498457 -4372636 -1599817 -388449 -497619 -3266914 -8591944 -11002791 -5303062
5484e303062R127398J371749r279864j0042353r49817P625704J0857425J1496845
$$ -5303062 3824336 5196085 -4083779 -14126132 -15075949 -7450245 3407180 14904025
5476A4904025Q637944j623875j3394066j3656039k728521J931851r148712k0997390
$$ 14904025 23541969 21918094 8524028 -5132011 -7860532 -5928681 -15077393 -36074783
5468c6074783j4829649M361025J5377586J0387247J369644j163691K1883Q07451
$$ -36074783 -50904432 -46543407 -31165821 -20778574 -19408930 -20572621 -20550738 -19743287
5460a9743287M635904J2731538J6713180R717620k569495j0040445j1143553r668458
$$ -19743287 -15107383 -2375845 14337335 24054955 21485460 11445015 301462 -9366996
5452i366996m611796O119804J5100560J0722049n288655j6217122j0835795K543167
$$ -9366996 -13978792 -7858988 7241572 17963621 12674966 -3542156 -14377951 -11834784
5444a1834784Q589666N022709J762961L735627M999221J305774j188487M322448
$$ -11834784 -3245118 1777591 3540552 7276179 12275400 13581174 12392687 16715135
5436A6715135J3102294J4542234P493009J450187J916960K841723k798294j1735517
$$ 16715135 29817429 44359663 51852672 53302859 55219819 58061542 55263248 43527731
5428D3527731j5560056j2490153p241510k050001M498614J0392903R944918K607736
$$ 43527731 27967675 15477522 8236012 6186011 10684625 21077528 31022446 33630182
5420C3630182m563849o500601o528415q860603r698658k561802R472000J4260612
$$ 33630182 29066333 22565732 16037317 7176714 -2521944 -5083746 4388254 18648866
5412A8648866N426247q250853j2190949k714122R615644J3229044Q012733K285369
$$ 18648866 24075113 15824260 3633311 919189 10534833 23763877 31776610 34061979
5404C4061979P81886O59858j306732l502172l504104k250295o73672L425885J0580377
$$ 34061979 34843865 35503723 34196991 30694819 27190715 24940420 24266748 27692633 38273010
5395C8273010J5478518J3062463N876907l54585n379158j1777373j6681640j4969824
$$ 38273010 53751528 66813991 72690898 72336313 66957155 55179782 38498142 23528318
5387B3528318r307356p249960q399821n039199L164733O886601L050842N70578
$$ 23528318 14220962 6971002 -1428819 -6468018 -3303285 3583316 6634158 7204736
5379G204736L965327L715873p303998j8534927j5447460j043234R454028J0002270
$$ 7204736 11170063 14885936 7581938 -10952989 -26400449 -27443683 -17989655 -7987385
5371g987385O548827K698975k787648n957825k02567J0107604J2605799O063146
$$ -7987385 -1438558 1260417 -1527231 -7485056 -7687623 2419981 15025780 21088926
5363B1088926K815930Q088895J0932109K768230p786334q476497j982989O8348
$$ 21088926 23904856 31993751 42925860 45694090 37907756 29431259 27448270 27516618
5355B7516618n004819r799165r407841n656390j601883K24555k983569r445233
$$ 27516618 22511799 12712634 3304793 -2351597 -3953480 -3728925 -6712494 -16157727
5347a6157727j0649469k134387P250736O326829j145494j536935P200886J2103565
$$ -16157727 -26807196 -28941583 -21690847 -15364018 -16509512 -18046447 -10845561 1258004
5339A258004O092583m55409L666647J2352750J1220077p34330r904403p514999
$$ 1258004 7350587 6895178 10561825 22914575 34134652 33400322 23495919 15980920
5331A5980920q915K613643N55425N41444L249908K201881m731066r580134m318106
$$ 15980920 15972005 18585648 19141073 19682517 22932425 25134306 20403240 10823106 6505000
5322F505000O874606J1354410M022340o181059q397617l458487l21939k216416
$$ 6505000 13379606 24734016 28756356 22575297 14177680 10719193 10397254 8180838
5314H180838l449788M5968M168853L618862l8248j849304j502104k538190n050761
$$ 8180838 4731050 4777018 8945871 12564733 12526485 10677181 9175077 6636887 1586126
5305A586126m690016K38525N157970N143331J672174K11969K132546K830921p41370
$$ 1586126 -3103890 -2865365 2292605 7435936 9108110 9320079 11452625 14283546 13542176
5296A3542176m088897r74125N820665N767262m441372j3141291p766596O918875
$$ 13542176 9453279 8479154 14299819 20067081 15625709 2484418 -5282178 1636697
5288A636697J4107786P997138M57527J382388M243328n61270q245265q007822
$$ 1636697 15744483 23741621 24199148 25581536 29824864 29263594 21018329 13010507
5280A3010507k114683j773387o939165o259321K150146O326590J202686k323667
$$ 13010507 10895824 9122437 2183272 -4076049 -1925903 4400687 5603373 3279706
5272C279706L056525P413379R26724p791634m997531N764735R622354K385772
$$ 3279706 6336231 13749610 14676334 6884700 1887169 7651904 17274258 19660030
5264A9660030p881915j5610186j8881399j1313017R399715K7634137K3758394
$$ 19660030 11778115 -3832071 -22713470 -34026487 -24626772 3007365 26765759
5257B6765759K419566j1816602q962483l808322p367808r896826k066079O983960
$$ 26765759 29185325 17368723 8406240 4597918 -2769890 -12666716 -14732795 -7748835
5249g748835O547438K870989N566267R292025M903390k877159n096272n232239
$$ -7748835 -1201397 1669592 7235859 16527884 21431274 18554115 13457843 8225604
5241H225604r524655j0845777q29294J0504064P718720l410979l613098Q737257
$$ 8225604 -1299051 -12144828 -12974122 -2470058 5248662 1837683 -1775415 6961842
5233F961842J5711231Q567666k460939q534658j2091592j3388288p103925K736903
$$ 6961842 22673073 31240739 28779800 20245142 8153550 -5234738 -12338663 -9601760
5225i601760L509863m264614m583086P217721J4105212M026202j0355079j1174901
$$ -9601760 -6091897 -10356511 -14939597 -7721876 6383336 10409538 54459 -11120442
5217a1120442k09965Q919970J1209224R784988N234668j740141n164401k375488
$$ -11120442 -11330407 -2410437 8798787 18583775 23818443 22078302 16913901 14538413
5209A4538413j62147l217269n482262j838608K092179J361323J075931L575251
$$ 14538413 14376266 11158997 5676735 3838127 5930306 7291629 8367560 11942811
5201A1942811l90963j3961704k1312690r848762O807733Q065393j505686j940820
$$ 11942811 11551848 -2409856 -23722546 -33571308 -26763575 -18698182 -20203868 -22144688
5193b2144688P797686J0795425M195479L014666R730777O990595j1087027k4175065
$$ -22144688 -14347002 -3551577 643902 3658568 13389345 20379940 9292913 -14882152
5185a4882152j4936333N863914J7229793J5764080J1444605P973507K474873l287164
$$ -14882152 -29818485 -23954571 -6724778 9039302 20483907 28457414 30932287 27645123
5177B7645123m860465l088516k77548N284022J1853536R328137o699536k2785070
$$ 27645123 22784658 19696142 19418594 24702616 36556152 45884289 39184753 16399683
5169A6399683k2512712q888614J307636J951148J578819M091213K046786o636063
$$ 16399683 -6113029 -15001643 -13694007 -11742859 -10164040 -6072827 -4026041 -10662104
5161a0662104j0555073k314840P449214N118959m660348o185255K671636P768728
$$ -10662104 -21217177 -23532017 -16082803 -10963844 -15624192 -21809447 -19137811 -11369083
5153a1369083J821987m278797J68612Q043004N919271m825340j1368984r668815
$$ -11369083 -9547096 -13825893 -13657281 -5614277 304994 -4520346 -15889330 -25558145
5145b5558145p411977p696430m353474L807182Q387284O845118R041794J9489229
$$ -25558145 -32970122 -40666552 -45020026 -41212844 -32825560 -25980442 -16938648 2550581
5137B550581K5229471J3639686o517668j5279219p190017N747331J2466799J1466414
$$ 2550581 27780052 41419738 34902070 19622851 12432834 18180165 30646964 42113378
5129D2113378M127974p368512j5948227j4887094p434873k086435l8115K838142
$$ 42113378 46241352 38872840 22924613 8037519 602646 -1483789 -1521904 1316238
5121A316238M618308K58313n848451l607226O467284J3520502J3111240J0480927
$$ 1316238 5934546 6192859 344408 -3262818 3204466 16724968 29836208 40317135
5113D0317135P056813j249452j0701272j1027175l908959l540269j2684446j5105770
$$ 40317135 47373948 46124496 35423224 24396049 20487090 16946821 4262375 -10843395
5105a0843395j053997J5453074J6780987N925708k594629n061016p384274r937298
$$ -10843395 -11897392 3555682 20336669 26262377 23667748 18606732 11222458 1285160
5097A285160q463524n216359n578460o273955R27897J4572634K2653141J7090731
$$ 1285160 -7178364 -12394723 -17973183 -24247138 -23319241 -8746607 13906534 30997265
5089C0997265K356052j0483008j3885367q999104l546109k904142l400448P73743
$$ 30997265 33353317 22870309 8984942 -14162 -3560271 -6464413 -9864861 -9091118
5081i091118N763750K804251n412310o251730K224193P151361K966418R56683
$$ -9091118 -3327368 -523117 -5935427 -12187157 -9962964 -2811603 154815 1111498
5073A111498P451201R875390j422251j3300772r645337J850232K836701n615254
$$ 1111498 8562699 18438089 17015838 3715066 -5930271 -4080039 -1243338 -6858592
5065f858592p633437n43383L897636K784211M894187J1080133J2286889P859895
$$ -6858592 -14492029 -15035412 -11137776 -8353565 -3459378 7620755 19907644 27767539
5057B7767539O533469P985912K812968p016770p795984J736869O011873j113023
$$ 27767539 34301008 42286920 45099888 38083118 30287134 32024003 38035876 36922853
5049C6922853n475393K613527J0913844M973717r312955j6121933j1684121l794836
$$ 36922853 31447460 34060987 44974831 49948548 40635593 24513660 12829539 9034703
5041I034703J519144J941855m300737j3325805j4640581m581481O404240Q343326
$$ 9034703 10553847 12495702 8194965 -5130840 -19771421 -24352902 -17948662 -9605336
5033i605336N532238O439382Q281641L472439m745432o070047K33498M379721
$$ -9605336 -4073098 2366284 10647925 14120364 9374932 3304885 3538383 7918104
5025G918104J588178j476843K139893R169482J0129550J032759j1023707j4495525
$$ 7918104 9506282 8029439 10169332 19338814 29468364 30501123 19477416 4981891
5017D981891o347217L613835M618929j930103p360481r759290j2446168j1082408
$$ 4981891 -1365326 2248509 6867438 4937335 -2423146 -12182436 -24628604 -35711012
5009c5711012K243756K0024013K1766542K873099j4908626j2475031J957892J0129248
$$ -35711012 -33467256 -13443243 8323299 11196398 -3712228 -16187259 -14229367 -4100119
5001d100119J1197397J4588438J7009449P811658q418165j5460658j0053646m123553
$$ -4100119 7097278 21685716 38695165 46506823 38088658 22628000 12574354 8450801
4993H450801k816703R85868Q528385J0203659L191281l064613m818485j0756212
$$ 8450801 5634098 6619966 15148351 25352010 28543291 25478678 20660193 9903981
4985I903981k2992705k7690636j5674098J549766R027379R481696J2868414J5505341
$$ 9903981 -13088724 -40779360 -56453458 -54903692 -45876313 -36394617 -23526203 -8020862
4977h020862P404993n790215p470775M000053J1689307N485466m674986o871670
$$ -8020862 -615869 -6406084 -13876859 -9876806 1812501 7297967 2622981 -4248689
4969d248689m528172o613411j1357041j0943773n548686j226138K262894J0102388
$$ -4248689 -8776861 -15390272 -26747313 -37691086 -43239772 -44465910 -42203016 -32100628
4961c2100628K0091445K2601211J4569607M446371J20367l64035k194287m939109
$$ -32100628 -12009183 10592028 25161635 29608006 29728373 29364338 27170051 22230942
4953B2230942n569431m840514m766627l733713j9229L013347J363036k402684
$$ 22230942 16661511 11820997 7054370 3320657 3301428 6314775 7677811 5275127
4945E275127k843667r32185k625355q304726j0697284n073810M284937J0327580
$$ 5275127 2431460 1499275 -1126080 -9430806 -20128090 -25201900 -20916963 -10589383
4937a0589383J1263881R545611O781341L282032L07875r48957k108819o301700
$$ -10589383 674498 10220109 17001450 20283482 20591357 19642400 17533581 11231881
4929A1231881j2764041j4280087l489677J6016697K7995123J9020465m261583
$$ 11231881 -1532160 -15812247 -19301924 -3285227 24709896 43730361 39468778
4922C9468778k0432365j8121751p721254m111273p100375p570842m660935m048646
$$ 39468778 19036413 914662 -6806592 -10917865 -18018240 -25589082 -30250017 -34298663
4914c4298663l779849L703132J5739036J9224735Q896254n254020j2009937j0648890
$$ -34298663 -38078512 -34375380 -18636344 588391 9484645 4230625 -7779312 -18428202
4906a8428202n612006R02457O858965Q967969P500629O433696O797597O191398
$$ -18428202 -24040208 -23137751 -16278786 -7310817 189812 6623508 13421105 19612503
4898A9612503N152373O141927O366725P21881q303690j3494686j4824939j7378096
$$ 19612503 24764876 30906803 37273528 37995409 29691719 16197033 1372094 -16006002
4890a6006002j9030020j3683889n198795k300187j209486P670089J6909924R504657
$$ -16006002 -35036022 -48719911 -53918706 -56218893 -57428379 -49758290 -32848366 -23343709
4882b3343709r305573j5137414m341999N55799n996509j320560J7406427J7684541
$$ -23343709 -32649282 -47786696 -52128695 -51572896 -57569405 -58889965 -41483538 -23798997
4874b3798997n235951M230608P9812968J53163843J24758680L793585r3190961
$$ -23798997 -29034948 -24804340 55008628 208172471 332931151 336724736 243533775
4867B43533775r0971162l6626107j0601822k0381826k4146731j1763120o999108
$$ 243533775 152562613 115936506 105334684 84952858 60806127 49043007 42043899
4860D2043899j3277466r535553O379728J2001687r09997j4330583j4695179r529190
$$ 42043899 28766433 19230880 25610608 37612295 36702298 22371715 7676536 -1852654
4852a852654q148421p337209l017704M64350m05371j711090J36717K996125M252862
$$ -1852654 -10001075 -17338284 -20355988 -19891638 -20297009 -22008099 -21871382 -18875257 -14622395
4843a4622395M113843K723108O04386R61206M628742N245278k229860j0759197
$$ -14622395 -10508552 -7785444 -7181058 -6219852 -1591110 3654168 1424308 -9334889
4835i334889q719581K990584J1158512P943560n48706m621113k082866K908825
$$ -9334889 -18054470 -15063886 -3905374 4038186 3489480 -1131633 -3214499 -305674
4827c05674N738164M010900j018765m466691k752894J515479K818191q7622l580172
$$ -305674 5432490 9443390 8424625 3957934 1205040 2720519 5538710 5451088 1870916
4818A870916m375152k090685J592755L388777M54854n214761p615917m656404
$$ 1870916 -2504236 -4594921 -3002166 386611 841465 -4373296 -11989213 -16645617
4810a6645617j034654k54086O24836M022310N918300K802953j271638j317877
$$ -16645617 -17680271 -17934357 -17309521 -13287211 -7368911 -4565958 -5837596 -7155473
4802g155473L84780j31821n17834K073293L012754k093583p021471l844546J907488
$$ -7155473 -6770693 -6902514 -7420348 -5347055 -2334301 -4427884 -11449355 -15293901 -13386413
4793a3386413j524217j1655154j3402019k677894O595312M325306l68527N380504
$$ -13386413 -14910630 -26565784 -39967803 -42645697 -36050385 -31725079 -32093606 -26713102
4785b6713102J7246119J9552256P374261p526337j1981969m790817N930367J2481913
$$ -26713102 -9466983 10085273 17459534 9933197 -2048772 -6839589 -909222 11572691
4777A1572691J2127630O178827j229178m480092p61782N326627M604717n847076
$$ 11572691 23700321 29879148 28649970 24169878 23408096 28734723 33339440 27492364
4769B7492364j6873189j7159890p801707o87552k312898o953692p775550n657496
$$ 27492364 10619175 -6540715 -14342422 -15029974 -17342872 -24296564 -32072114 -37729610
4761c7729610k457277N004681J6393796K1403918J2262058k614638q326699l419517
$$ -37729610 -40186887 -35182206 -18788410 2615508 14877566 12262928 3936229 516712
4753E16712Q04553j341808l840981j343207L265392N783003O358662N902018M063756
$$ 516712 1321265 -20543 -3861524 -5204731 -1939339 3843664 10202326 16104344 20168100
4744B0168100K375099K751294K270396l345318j0618895j0738655k442206N267931
$$ 20168100 22543199 25294493 27564889 24219571 13600676 2862021 419815 5687746
4736E687746N083959j035880p515537j0912173q884685j630185L934955M279r805192
$$ 5687746 10771705 9735825 2220288 -8691885 -17576570 -19206755 -15271800 -15267521 -25072713
4727b5072713j2843457n036059L348272L659815Q04855L061456Q748910J0791691
$$ -25072713 -37916170 -42952229 -39603957 -35944142 -35139287 -32077831 -23328921 -12537230
4719a2537230P814343K978517k623636p933396q393509k191167M168525M049004
$$ -12537230 -4722887 -1744370 -4368006 -12301402 -20694911 -22886078 -18717553 -14668549
4711a4668549N82801P40609L293149J554725m173366o289277j776383M169508
$$ -14668549 -14085748 -13345139 -10051990 -8497265 -12670631 -18959908 -20736291 -16566783
4703a6566783P309208R212806J0926326R158852K524824l825031l994391J594998
$$ -16566783 -9257575 -44769 10881557 20040409 22565233 18740202 14745811 16340809
4695A6340809P978697J1311523R956725L495297n232872r576368n582951J475107
$$ 16340809 24319506 35631029 45587754 49083051 43850179 34273811 28690860 30165967
4687C0165967J813898o749447j5652173j6594583j1696361q778295r391760p584428
$$ 30165967 31979865 25230418 9578245 -7016338 -18712699 -27490994 -36882754 -44467182
4679d4467182q64676L769039j356861j2972818j8808538j1019232N423724J8544682
$$ -44467182 -45331858 -41562819 -42919680 -55892498 -74701036 -85720268 -80296544 -61751862
4671f1751862K1671823J8419395J5687570J3971514P995999k653751q955442l520238
$$ -61751862 -40080039 -21660644 -5973074 7998440 15994439 13340688 4385246 865008
4663H65008P347083J0122872J486475q760503j2279460j0580758p224074j924827
$$ 865008 8212091 18334963 19821438 11060935 -1218525 -11799283 -19023357 -20948184
4655b0948184L500421L477455j181887j131296O881210J3369423J1813205R467930
$$ -20948184 -17447763 -13970308 -15152195 -16283491 -9402281 3967142 15780347 25248277
4647B5248277J2059999J0147011m349347j8891174j6410852l176889J42862r112776
$$ 25248277 37308276 47455287 43105940 24214766 7803914 4627025 4769887 -4342889
4639d342889j4244890q877492m439609n254247P5919J5070541K4990128K0348512
$$ -4342889 -18587779 -27465271 -31904880 -37159127 -37083208 -22012667 2977461 23325973
4631B3325973J1370816P366059M86912j5279095k5782183j5623730O230156J7710936
$$ 23325973 34696789 42062848 42549760 27270665 1488482 -14135248 -7905092 9805844
4623I805844J2835135L744997k15278m61973m39713j994129p387372j4751533
$$ 9805844 22640979 26385976 26170698 25708725 25269012 23274883 15887511 1135978
4615A135978j5878360p388273K174333N231610O673016J1890373J3170013K149309
$$ 1135978 -14742382 -22130655 -19956322 -14724712 -8051696 3838677 17008690 19157999
4607A9157999j2285752j4563589n376163J622459J621561J357310L458257M073956
$$ 19157999 6872247 -7691342 -13067505 -11445046 -9823485 -8466175 -5007918 -933962
4599i33962M008424O875899Q037421O89661q938982q511171j00637L223058K10447
$$ -933962 3074462 9950361 17987782 18677443 9738461 1227290 1126653 4349711 4560158
4590D560158J915934Q578111O672750o386351j4790464r428785k030539m111389
$$ 4560158 6476092 15054203 21726953 15340602 550138 -8878647 -10909186 -15020575
4582a5020575q214937k375114J0015397J7498917J7431706J4057824Q576407J686092
$$ -15020575 -23235512 -25610626 -15595229 1903688 19335394 33393218 41969625 43655717
4574D3655717j966987j505704m222019j3437777k0244388j6322938o464399R16069
$$ 43655717 41688730 40183026 35961007 22523230 2278842 -14044096 -20508495 -19592426
4566a9592426O523378J3049149J4899200P715525K8282J623849O964962M510569
$$ -19592426 -13069048 -19899 14879301 22594826 22623108 24246957 31211919 35722488
4558C5722488l441772n967615l793421o576539j1893769o249640J0481700K0184802
$$ 35722488 32280716 26313101 22519680 15943141 4049372 -2200268 8281432 28466234
4550B8466234J2570283J12734j891403L435327L910347k249305q463573j3012432
$$ 28466234 41036517 41149251 39257848 42693175 46603522 44354217 35890644 22878212
4542B2878212j7373165j6902432o437569P375577J1989763O718825K596976L720222
$$ 22878212 5505047 -11397385 -17834954 -10459377 1530386 8249211 10846187 14566409
4534A4566409J783548o649124j0577109j321992J1127752J0690710j643015j0292252
$$ 14566409 16349957 9700833 -876276 -2198268 8929484 19620194 17977179 7684927
4526G684927q176009l352329j723559J971513J0030653J2308808J550264j1726217
$$ 7684927 -491082 -3843411 -5566970 -3595457 6435196 18744004 20294268 8568051
4518H568051j2814537m897012k822282p924356n812464Q284285J8354428J0401347
$$ 8568051 -4246486 -9143498 -11965780 -19890136 -25702600 -17418315 936113 11337460
4510A1337460n784454r736127J702570J2434110J1040110M102565K709221N828187
$$ 11337460 5553006 -4183121 -2480551 9953559 20993669 25096234 27805455 33633642
4502C3633642M590630j986112m884424N83937O442577L447597m396222n392949
$$ 33633642 38224272 36238160 31353736 31937673 38380250 41827847 37431625 32038676
4494C2038676J075104J850852j0383407k4641746k6157009j5526829l771782N375649
$$ 32038676 33113780 34964632 24581225 -60521 -26217530 -41744359 -45516141 -40140492
4486d0140492J5960240K5940077K6555424J6301608L648331n851980j3833824
$$ -40140492 -24180252 1759825 28315249 44616857 48265188 42413208 28579384
4479B8579384j8677669j3685940n61180P130246J075075j0326962j4025644p420179
$$ 28579384 9901715 -3784225 -4345405 2784841 3859916 -6467046 -20492690 -27912869
4471b7912869M132755J5348465K0031597J2184734l560089j1839577n711262L290869
$$ -27912869 -23780114 -8431649 11599948 23784682 20224593 8385016 2673754 5964623
4463E964623L490114N85452M317308Q485257J720840q991241o138203Q659783
$$ 5964623 9454737 10040189 14357497 22842754 24563594 15572353 9434150 18093933
4455A8093933J3764497J04253j4549308j2328917k72194L521629k964870p073368
$$ 18093933 31858430 31962683 17413375 5084458 4812264 8333893 5369023 -1704345
4447a704345m073776l064527r451052j3958450n486624J1529495K0564723J2989996
$$ -1704345 -5778121 -8842648 -18293700 -32252150 -37738774 -26209279 -5644556 7345440
4439G345440k142307j0877199j0956569r345322p511993l4409J1350881J4584210
$$ 7345440 5203133 -5674066 -16630635 -25975957 -33487950 -33522359 -22171478 -7587268
4431g587268M643988n971248l741473O278049Q674825O61997n529717j522295
$$ -7587268 -2943280 -8914528 -12656001 -6377952 2296873 2958870 -2570847 -4093142
4423d093142P667526J3423766J2514222M720268r100734k3320004k8527342j9420931
$$ -4093142 3574384 16998150 29512372 34232640 25131906 1811902 -26715440 -46136371
4415d6136371R53839K3325604L5049147K6306517J566479j9559512k2584033j5217829
$$ -46136371 -45182532 -21856928 13192219 39498736 41065215 21505703 -1078330 -16296159
4407a6296159j3589737j7105872j2337079J583389J0544151R536109R352672J4221130
$$ -16296159 -29885896 -46991768 -59328847 -57745458 -47201307 -37665198 -28312526 -14091396
4399a4091396J2466070j410140j3422243j1041882j912588J750965L053629R244901
$$ -14091396 -1625326 -3035466 -16457709 -27499591 -29412179 -27661214 -24607585 -15362684
4391a5362684J3603386O766648l404228k671458N236607M734084m863079q515770
$$ -15362684 -1759298 5007350 1603122 -1068336 4168271 8902355 4039276 -4476494
4383d476494p29183P633131R780873J1681381J5575322J2295651j809529j4716395
$$ -4476494 -5205677 2427454 12208327 23889708 39465030 51760681 49951152 35234757
4375C5234757j5321368r084443p264586r805418r507863o274477n860402p824182
$$ 35234757 19913389 10828946 3564360 -6241058 -15748921 -22023398 -27883800 -35707982
4367c5707982m943776N496141J6931494K0813756J4593062K695135p422905j0911224
$$ -35707982 -40651758 -35155617 -18224123 2589633 17182695 19877830 12454925 1543701
4359A543701r322195p579783o462065j641179P823124J4573108J1100058L11272
$$ 1543701 -7778494 -15358277 -21820342 -23461521 -15638397 -1065289 10034769 10346041
4351A0346041p035390n188192K12712r1339o821424j0193032j635306J3387664
$$ 10346041 3310651 -1877541 -1664829 -1756168 -8577592 -18770624 -20405930 -7018266
4343g018266J8633794O230984j1508471j5584980l265397J0387864J3209290Q254558
$$ -7018266 11615528 17846512 6338041 -9246939 -12512336 -2124472 11084818 19339376
4335A9339376L222916j433721p074003q562210j320877Q513443J1044869O807311
$$ 19339376 22562292 21128571 14054568 5492358 4171481 12684924 23729793 30537104
4327C0537104M164236M262285m12508j1185900j7811024j3005267m107947l008150
$$ 30537104 34701340 38963625 38551117 27365217 9554193 -3451074 -7559021 -10567171
4319a0567171r361025j1735749m045837O341520Q733800K670904k228386J490940
$$ -10567171 -19928196 -31663945 -35709782 -29368262 -20634462 -17963558 -20191944 -18701004
4311a8701004J0467400J5179352J1009936K135005m578429n890622k156980M262450
$$ -18701004 -8233604 6945748 17955684 20090689 15512260 9621638 7464658 11727108
4303A1727108Q295454M910024l141517n330426K366378Q010326j309361j7548874
$$ 11727108 20022562 24932586 21791069 16460643 18827021 26837347 25527986 7979112
4295G979112j8644815k71030J4211284N118090j4487722j6274905L486774J9733229
$$ 7979112 -10665703 -10936733 3274551 8392641 -6095081 -22369986 -18883212 850017
4287H50017J4675215J99244l026333N523360J0475358N209813j773169k678101
$$ 850017 15525232 15724476 12698143 18221503 28696861 33906674 32133505 29455404
4279B9455404j2998J266815J238393Q62915k117534q259607j2731258j1732110
$$ 29455404 29442406 30709221 31947614 32810529 30692995 22433388 9702130 -2029980
4271b029980q831711r466205j1590749p894289K894399J2443065J2466963M473704
$$ -2029980 -10861691 -20327896 -31918645 -39812934 -36918535 -24475470 -12008507 -7534803
4263g534803k426600j719679L995955N725023k759951j6623981k1525453p756901
$$ -7534803 -9961403 -11681082 -7685127 -1960104 -4720055 -21344036 -42869489 -50626390
4255e0626390J5896299K7798319J7310670j415179o267922N019869J3350479N237017
$$ -50626390 -34730091 -6931772 10378898 8963719 2695797 7715666 21066145 26303162
4247B6303162r550531j3208545l874753N308368N950395K094891l18740o91415
$$ 26303162 16752631 3544086 -330667 4977701 10928096 13022987 12704247 12012832
4239A2012832P37535M578416O795906J181355q725522j0035275J240506J2010955
$$ 12012832 12750367 17328783 24124689 25306044 16580522 6545247 7785753 19796708
4231A9796708J0312987K322504Q9071O87304p054436j9510451k0022351n162761
$$ 19796708 30109695 32432199 32521270 33208574 26154138 6643687 -13378664 -18541425
4223a8541425P937834O322355j978740m598349m379034r502474j4602821p800849
$$ -18541425 -10603591 -4281236 -6259976 -10858325 -15237359 -24739833 -39342654 -47143503
4215d7143503Q038145J6643961J0903164J167058r14480L994235Q442937Q180658
$$ -47143503 -39105358 -22461397 -11558233 -10391175 -11305655 -7311420 1131517 9312175
4207I312175L135463l988088p053298j578521O894253P183010j784705q077526
$$ 9312175 12447638 8459550 1406252 -172269 6721984 13904994 12120289 4042763
4199D042763l897492L304583L012336l695331r633353j3407995j5537046r977688
$$ 4042763 145271 3449854 6462190 2766859 -6866494 -20274489 -35811535 -45789223
4191d5789223O969940K3309248K1954097M727540q474938o652071M06958J601014
$$ -45789223 -38819283 -15510035 6444062 11171602 2696664 -3955407 -3548449 -1947435
4183a947435J014327O100361J2051855J0068659K366301l583076q821351j7434439
$$ -1947435 -933108 5167253 17219108 27287767 29654068 26070992 17249641 -184798
4175a84798k2522131j2963699P102909K0154612J7944071R274015L219775j921575
$$ -184798 -22706929 -35670628 -28567719 -8413107 9530964 18804979 22024754 20103179
4167B0103179q766940j2870412j1140006p516766l860418M155662J4992275J6705932
$$ 20103179 11336239 -1534173 -12674179 -20190945 -24051363 -19895701 -4903426 11802506
4159A1802506M392283q250692o775030L465885P950685N964375O603011P706560
$$ 11802506 16194789 7944097 1169067 4634952 12585637 18550012 25153023 32859583
4151C2859583j437777j6888408j9910901n189977Q866400O759204k836515m167706
$$ 32859583 31421806 14533398 -5377503 -10567480 -1701080 5058124 2221609 -1946097
4143a946097N24822j439249r078621q939491J715053R525295O016638P4083K223774
$$ -1946097 -1421275 -2860524 -11939145 -20878636 -19163583 -9638288 -3621650 -3547567 -1323793
4134a323793O823610R07337j3789165j9868435p550784J0774044J6212643P771399
$$ -1323793 5499817 6407154 -7382011 -27250446 -34801230 -24027186 -7814543 -43144
4126d3144J134909M404445P174359j026589j2017773r565742O802930K0961785
$$ -43144 1091765 5496210 12670569 11643980 -373793 -9939535 -3136605 17825180
4118A7825180K1853075J3963915M883750n180269j6098799k0371698j1700918
$$ 17825180 39678255 53642170 58525920 53345651 37246852 16875154 5174236
4111E174236M201613J4679292J3499285M912218k340936j615350P015046J5069355
$$ 5174236 9375849 24055141 37554426 42466644 40125708 38510358 45525404 60594759
4103F0594759J2402697j251735j5422215k1459462k0105608j4516302m496082
$$ 60594759 72997456 71745721 56323506 34864044 14758436 242134 -4253948
4096d253948O979826J0407291J693509q826055q646625L30034O690503O484276
$$ -4253948 2725878 13133169 14826678 6000623 -2646002 -2315968 4374535 10858811
4088A0858811M789245L573212n7181m002091j316064P654864J3221088R591869
$$ 10858811 15648056 19221268 19164087 15161996 13845932 21500796 34721884 44313753
4080D4313753J832187l518511o661636r313568q839549l388954K395745K728781
$$ 44313753 46145940 42627429 35965793 26652225 17812676 14423722 16819467 19548248
4072A9548248j355820m063669k385566K391777Q202742J2623486J1209923P50514
$$ 19548248 18192428 14128759 11743193 14134970 22337712 34961198 46171121 46921635
4064D6921635j4439947k3264718j8167111l689161Q257120J1586991J0734738
$$ 46921635 32481688 9216970 -8950141 -12639302 -4382182 7204809 17939547
4057A7939547J0981612R953748M213812r71198J593891O606358J278087j3368233
$$ 17939547 28921159 38874907 43088719 42117521 43711412 50317770 51595857 38227624
4049C8227624k0151188j0786344O08425p55172q096455o920475k65465j670665
$$ 38227624 18076436 7290092 7898517 7143345 -953110 -7873585 -8139050 -9809715
4041i809715r638475r897744j271373J957097m014582m963146O208583J5764705
$$ -9809715 -19448190 -29345934 -30617307 -28660210 -32674792 -37637938 -31429355 -15664650
4033a5664650J1089990M96747j621583L140013L721068j427954o030355r674745
$$ -15664650 -4574660 -4077913 -5699496 -2559483 1161585 -266369 -6296724 -15971469
4025a5971469j5576039j8949097j1609674K998271J1593957Q635421K092302L84900
$$ -15971469 -31547508 -50496605 -62106279 -59108008 -47514051 -38878630 -36786328 -36401428
4017c6401428K600113M222817M819284N764000N400919J315668m421752o149571
$$ -36401428 -33801315 -29578498 -24759214 -18995214 -13594295 -12278627 -16700379 -22849950
4009b2849950j498019M597453N174246N35770j500114K909127O666231K211829
$$ -22849950 -24347969 -19750516 -14576270 -14040500 -15540614 -12631487 -5965256 -3753427
4001c753427n120341l532393P025814J3933566J0097023J889336l405170o026452
$$ -3753427 -8873768 -12406161 -5380347 8553219 18650242 20539578 17134408 11107956
3993A1107956n675596J678497J2092325J2078473j499481j2290149p146381L512624
$$ 11107956 5432360 7110857 19203182 31281655 29782174 17492025 10345644 13858268
3985A3858268K515202o868915q012883J359828P340877L103218l833141p223814
$$ 13858268 16373470 9504555 1491672 2851500 10192377 13295595 9462454 2238640
3977B238640q206713n171376N630546J7237621J6627654N907148J854445R012098
$$ 2238640 -5968073 -11139449 -5508903 11728718 28356372 34263520 36117965 45130063
3969D5130063J1259611j038615j3417699j0147857P38312K223092l672180k510119
$$ 45130063 56389674 55351059 41933360 31785503 32523815 34746907 31074727 28564608
3961B8564608M984545L862440p312760j1110271Q17966J2865402Q889799l822188
$$ 28564608 33549153 37411593 30098833 18988562 19806528 32671930 41561729 37739541
3953C7739541p745482k455655k191277r978275j1991195j120495R357371M859167
$$ 37739541 29994059 27538404 25347127 15368852 3377657 2257162 11614533 16473700
3945A6473700q684739j4273149q550523l199894m022525l686700K056592N371906
$$ 16473700 7788961 -6484188 -15034711 -18234605 -22257130 -25943830 -23887238 -18515332
3937a8515332Q86684k648999M059968J3929413J2482720q02183j2324552j3602451
$$ -18515332 -17628648 -20277647 -16217679 -2288266 10194454 9392271 -2932281 -16534732
3929a6534732q955263l841571K880104J1793960J7495144J5586579R161004L736633
$$ -16534732 -25489995 -29331566 -26451462 -14657502 2837642 18424221 27585225 31321858
3921C1321858n2183m599816q805355p288429L289115J7584693K2751044J0314289
$$ 31321858 31269675 26669859 17864504 10576075 13865190 31449883 54200927 64515216
3913F4515216j1768296k4425727j8527049m710309K695524L685119O010892Q645818
$$ 64515216 52746920 28321193 9794144 5083835 7779359 11464478 17475370 26121188
3905B6121188M929836k576495n240393m233917p655720j2244975n583384J0372127
$$ 26121188 31051024 28474529 23234136 19000219 11344499 -900476 -6483860 3888267
3897C888267J6377058M123174r430460o930366M478391O529385l097780j1797447
$$ 3888267 20265325 24388499 14958039 8027673 12506064 19035449 15937669 4140222
3889D140222j2346441p644458k82268Q690371J3389842Q212415j702883n774760
$$ 4140222 -8206219 -15850677 -16132945 -7442574 5947268 14159683 12456800 6682040
3881F682040k722732k69456j486738j762503P42615J750837m65746j748292K43862
$$ 6682040 3959308 3689852 2203114 440611 1183226 2934063 2468317 720025 963887
3872I63887J952690k1512m109455o754201o016840j736201L774260N465272M42556
$$ 963887 2916577 2895065 -1214390 -7968591 -13985431 -15721632 -11947372 -6482100 -6039544
3863f039544p160710j0296562p187809j510908L691896P318048P339478K659050
$$ -6039544 -13200254 -23496816 -30684625 -32195533 -28503637 -21185589 -13846111 -11187061
3855a1187061k924382m198288j520322O80713J300934K957349N995801Q027371
$$ -11187061 -14111443 -18309731 -19830053 -19149340 -17848406 -14891057 -8895256 -867885
3847h67885Q850973R791564Q494377R77945j0305500j6604660j2979160l862306
$$ -867885 7983088 17774652 26269029 27246974 16941474 336814 -12642346 -16504652
3839a6504652K722711K840589j703476n514118l452868L884936R055976N897634
$$ -16504652 -13781941 -10941352 -12644828 -18158946 -21611814 -17726878 -8670902 -2773268
3831b773268k504608q212784q721424p241615m614272J835349J1328255J8248811
$$ -2773268 -5277876 -13490660 -22212084 -29453699 -34067971 -32232622 -20904367 -2655556
3823b655556J8922948J4708600Q134354J012448m063886n836705p273003j0686062
$$ -2655556 16267392 30975992 39110346 40122794 36058908 30222203 22949200 12263138
3815A2263138j1720314n384926L746461O482339L395937L658452Q648751Q793512
$$ 12263138 542824 -4842102 -1095641 5386698 8782635 12441087 21089838 29883350
3807B9883350O21379n159529p1508P631006M795183o749721j2650441n701560
$$ 29883350 30504729 25345200 25273692 32904698 37699881 30950160 18299719 12598159
3799A2598159N852220R508947J728809j0579289j7729458j5767561r043130m076674
$$ 12598159 18450379 27959326 29688135 19108846 1379388 -14388173 -23431303 -27507977
3791b7507977j509756K701492Q722459J1318802Q400154M833358M537625M454357
$$ -27507977 -29017733 -26316241 -17593782 -6274980 2125174 6958532 11496157 15950514
3783A5950514N58893m876798o636533l838696j33342Q16893j939438n301684l216850
$$ 15950514 16509407 11632609 4996076 1157380 1024038 1840931 -98507 -5400191 -8617041
3774h617041N729961J2293397O338902o701694j0062910M19627R262381M915803
$$ -8617041 -2887080 9406317 15745219 9043525 -1019385 -599758 8662623 13578426
3766A3578426k977421r79301N676527L523424m810535m908633M519929R320839
$$ 13578426 10601005 9621704 15298231 18821655 14011120 9102487 13622416 22943255
3758B2943255K890590n347109p468257p595597r722886q970019k474799K424739
$$ 22943255 25833845 20486736 13018479 5422882 -4300004 -13270023 -15744822 -13320083
3750a3320083m79783n448588l852329K452031M673014p54921r936571j6993007
$$ -13320083 -13799866 -19248454 -23100783 -20648752 -15975738 -16730659 -26667230 -43660237
3742d3660237j6420665n118113J1867299K1973609J7631226M970421m603474p356200
$$ -43660237 -60080902 -65199015 -53331716 -31358107 -13726881 -8756460 -13359934 -20716134
3734b0716134o843974n441777k675786J264445N954204J1438968J3988545O695522
$$ -20716134 -27560108 -33001885 -35677671 -34413226 -28459022 -17020054 -3031509 3664013
3726C664013q965417j8200004r390081Q391517J5663611Q459262J424708M226504
$$ 3664013 -5301404 -23501408 -32891489 -24499972 -8836361 -377099 1047609 5274113
3718E274113Q518423L903353m869713n932996J786161Q398952P088232j22034
$$ 5274113 13792536 17695889 12826176 6893180 8679341 17078293 24166525 24044491
3710B4044491q580743j5214772j6763957j0489948J618377J3034265J8156679
$$ 24044491 15463748 248976 -16514981 -27004929 -25386552 -12352287 5804392
3703E804392J5893116Q974869K068513j145849j694181m106853r124942j1238746
$$ 5804392 21697508 30672377 32740890 31595041 29900860 25794007 16669065 5430319
3695E430319p210448k349954k292606l224978J141132O668381M180998l880266
$$ 5430319 -1780129 -4130083 -6422689 -9647667 -8506535 -1838154 2342844 -1537422
3687a537422n705730m00417p24848j0066896j3009134k65840J1655168L070838
$$ -1537422 -7243152 -7643569 -8368417 -18435313 -31444447 -31710287 -20055119 -16984281
3679a6984281j6376972j8851754J342598K0182403J9337744Q721708N594029Q790102
$$ -16984281 -33361253 -52213007 -50870409 -30688006 -11350262 -2628554 2965475 11755577
3671A1755577O700679j228296n447249k227845L695558Q316482R914676N132342
$$ 11755577 18456256 17227960 11780711 9552866 13248424 21564906 31479582 36611924
3663C6611924o552197j7011922j7238980q973880p99053M105314P509119P229599
$$ 36611924 30059727 13047805 -4191175 -13165055 -13964108 -9858794 -2349675 4879924
3655D879924J788q387205p961010j67613L240023j107221l012002L514134R693818
$$ 4879924 4881712 -3505493 -11466503 -11634116 -8394093 -9501314 -12513316 -8999182 694636
3646F94636O737172N06197J218283O154153M367133n305411j2426544j0464635
$$ 694636 7431808 7938005 9156288 15310441 19677574 14372163 1945619 -8519016
3638h519016m325206j244551k206419m550248o529778o530539k906998K631098
$$ -8519016 -12844222 -14088773 -16295192 -20845440 -27375218 -33905757 -36812755 -34181657
3630c4181657N566193M776128M095757N251448L801581l819843j2808896j4926186
$$ -34181657 -28615464 -23839336 -19743579 -14492131 -10690550 -14510393 -27319289 -42245475
3622d2245475r337346l135016j198003q98503J749021N855974Q720157J0832993
$$ -42245475 -51582821 -54717837 -55915840 -56814343 -55065322 -49209348 -40489191 -29656198
3614b9656198J3093363J1923572L462577p724841j0717983j589480J0170826J2382405
$$ -29656198 -16562835 -4639263 -1176686 -8901527 -19619510 -21208990 -11038164 1344241
3606A344241M216604m465485n800591j692657O34629k689789q579202j0120655
$$ 1344241 5560845 1095360 -4705231 -6397888 -5763259 -8453048 -17032250 -27152905
3598b7152905l184770Q844713J7429965J6902789R113584k54524p207645r861675
$$ -27152905 -30337675 -21492962 -4062997 12839792 21953376 21698852 14491207 4629532
3590D629532p229982j230433K853552J976298p76988j670188k517297o083711
$$ 4629532 -2600450 -3830883 -977331 998967 221979 -1448209 -3965506 -10049217
3582a0049217q457169l592740N740261R869336N846871J241312K443134O833269
$$ -10049217 -18506386 -22099126 -16358865 -6489529 -642658 598654 3041788 9875057
3574I875057R217605Q295839L304341p282891j8366004j8283267m582428P553164
$$ 9875057 19092662 27388501 30692842 23409951 5043947 -13239320 -17821748 -10268584
3566a0268584L570745q490259p463179J0087997K2419574J1155531j3772122k6779320
$$ -10268584 -6697839 -15188098 -22651277 -12563280 9856294 21011825 7239703 -19539617
3558a9539617j7914555j189612O550961M632524K893426M931960N282694J459645
$$ -19539617 -37454172 -38643784 -32092823 -27460299 -24566873 -19634913 -14352219 -12892574
3550a2892574j49121N422118J1561726P888814l717168r790079m080352K935399
$$ -12892574 -13041695 -7619577 3942149 11830963 8113795 -1676284 -5756636 -2821237
3542b821237n89308r627402q782609N536787J9680786K0914760J1833453K404892
$$ -2821237 -3410545 -13037947 -21820556 -16283769 3397017 24311777 36145230 38550122
3534C8550122m376775j1357810j6729071j4529234n695553J40062k602191p440601
$$ 38550122 34173347 22815537 6086466 -8442768 -14138321 -13998259 -16600450 -24041051
3526b4041051n819888q5649J035307k607086j762734O327092J0916057L208002
$$ -24041051 -29860939 -29946588 -28911281 -31518367 -33281101 -26954009 -16037952 -12829950
3518a2829950q251234p632219N410483J3945105O563962p531359j1377796j441921
$$ -12829950 -21081184 -28713403 -23302920 -9357815 -2793853 -10325212 -21703008 -23144929
3510b3144929J0756857J4474700J0164778M736839K320716J898932J354638J041142
$$ -23144929 -12388072 2086628 12251406 16988245 19308961 21207893 22562531 23603673
3502B3603673K512405M690316M084589M08661j414841J119629J937017n139598
$$ 23603673 26116078 30806394 34890983 35299644 33884803 35004432 36941449 31801851
3494C1801851j3996254j2383334j279868L691658m941728j4128330r835366J070912
$$ 31801851 17805597 5422263 4142395 7834053 2892325 -11236005 -21071371 -20000459
3486b0000459J552025q947972j3507992k762165J2447857J6570430P689968l501148
$$ -20000459 -18448434 -27396406 -40904398 -43666563 -31218706 -14648276 -6958308 -10459456
3478a0459456o239007J687862J2625566J5053928N621628n348280n832108K643864
$$ -10459456 -16698463 -15010601 -2385035 12668893 18290521 12942241 7110133 9753997
3470I753997R288057J0472979J0643532Q311106l974195k2268955k8874869j5365446
$$ 9753997 19042054 29515033 40158565 48469671 44495476 22226521 -6648348 -22013794
3462b2013794M249747J2895541J1902827J1532467J0106014j526400j9280779
$$ -22013794 -17764047 -4868506 7034321 18566788 28672802 27146402 7865623
3455G865623k6078412j4367804L833535J2616108R011734J315986k045857J098990
$$ 7865623 -18212789 -32580593 -28747058 -16130950 -7119216 -5803230 -7849087 -6750097
3447f750097O127907N411561l356241j2470644j2349165l499383N055347P871796
$$ -6750097 -622190 4789371 1433130 -11037514 -23386679 -26886062 -21830715 -13958919
3439a3958919O628952K795312l982625q910653l389582J2028842K3756656K0034112
$$ -13958919 -7329967 -4534655 -8517280 -17427933 -20817515 -8788673 14967983 35002095
3431C5002095M308979j1046722j8864905j9531375j4576598n443839L745567Q807287
$$ 35002095 39311074 28264352 9399447 -10131928 -24708526 -30152365 -26406798 -17599511
3423a7599511J0170370J0550012R823496O852711L999634L944056L699291j344315
$$ -17599511 -7429141 3120871 12944367 19797078 23796712 27740768 31440059 30095744
3415C0095744p870685o895949K659930J0293918P994263J439921P08895M526333
$$ 30095744 22225059 15329110 17989040 28282958 36277221 37717142 38426037 42952370
3407D2952370K560197p580548j4940248j0174760J083533N550893j272740j2311226
$$ 42952370 45512567 37932019 22991771 12817011 13900544 19451437 18178697 5867471
3399E867471j9669680k0515475j3312681K042351J7277714J8631745M224595q597369
$$ 5867471 -13802209 -34317684 -47630365 -45588014 -28310300 -9678555 -5453960 -14051329
3391a4051329l594235J1069856J2609493l987245j8090380j2900746J444238N219725
$$ -14051329 -17645564 -6575708 6033785 2046540 -16043840 -28944586 -27500348 -22280623
3383b2280623j220880j053648J0211988J7200664Q782324n439975j0387425o006422
$$ -22280623 -23501503 -24555151 -14343163 2857501 11639825 6199850 -4187575 -10193997
3375a0193997k519854k910294j767410J965211K673319j203740l758823j294305
$$ -10193997 -12713851 -15624145 -17391555 -15426344 -12753025 -13956765 -17715588 -19009893
3367a9009893K118752J871215m80584j204642o9623J548750L974614P081246Q591673
$$ -19009893 -16891141 -15019926 -15500510 -16705152 -16774775 -15226025 -11251411 -4170165 4421508
3358D421508P789890O943168N846863K38494r549005j4292895p840341J517154
$$ 4421508 12211398 19154566 25001429 25239923 15690918 1398023 -6442318 -4925164
3350d925164J646516m578791l630773N439602O949785o617284j9686005j4397178
$$ -4925164 -3278648 -7857439 -11488212 -6048610 901175 -5716109 -25402114 -39799292
3342c9799292L757773J4648019J1399310M563871J613260r98145l851771L29920
$$ -39799292 -36041519 -21393500 -9994190 -5430319 -3817059 -4815204 -8666975 -8337055
3334h337055J0742799J2386189k953333k0300587j9398350k465449R776954O653128
$$ -8337055 2405744 14791933 11838600 -8461987 -27860337 -30325786 -20548832 -13895704
3326a3895704j815488l073872K282782O808945P768589O773656M840612K616314
$$ -13895704 -15711192 -18785064 -16502282 -9693337 -1924748 4848908 9689520 12305834
3318A2305834N53766l598980j1461721j6765751j0353246M054798R621257q91804
$$ 12305834 12859600 9260620 -2201101 -18966852 -29320098 -25265300 -15644043 -16535847
3310a6535847j2157569o776237R156484J4786582M736905m596507L79397J3517569
$$ -16535847 -28693416 -35469653 -26313169 -11526587 -6789682 -11386189 -11006792 2510777
3302B510777K0640189J6908350P032184k836635p435724l718748M284543P165111
$$ 2510777 23150966 40059316 47091500 44254865 36819141 33100393 37384936 44550047
3294D4550047J018606q264574j3985276j5008191j0828630N7899J1896728J2381028
$$ 44550047 45568653 37304079 23318803 8310612 -2518018 -2460119 9436609 21817637
3286B1817637r6303r357385k037796J2783230J6497576O552263m681717j1000837
$$ 21817637 21721334 12363949 10326153 23109383 39606959 46159222 41477505 30476668
3278C0476668j5846468j7184727p414557Q949992J4949765N276482m112039N56964
$$ 30476668 14630200 -2554527 -9969084 -1019092 13930673 19207155 15095116 15652080
3270A5652080J0494139Q853416l791017j1586814o421554L227475N857141M27193
$$ 15652080 26146219 34999635 31208618 19621804 13200250 16427725 22284866 22712059
3262B2712059n254021m832753q32809k528128j4287626k6345855k3049616k158228
$$ 22712059 17458038 12625285 11792476 9264348 -5023278 -31369133 -54418749 -56576977
3254e6576977K0624896K9257791K2548612Q830801n237137j4623555j4008840
$$ -56576977 -35952081 -6694290 15854322 24685123 19447986 4824431 -9184409
3247i184409n053838J019711k799157q565189n187431N001381J1360465J0910563
$$ -9184409 -14238247 -13218536 -16017693 -24582882 -29770313 -24768932 -13408467 -2497904
3239b497904Q040585L304760m890630j1050489q459405k026353j561984m163421
$$ -2497904 5542681 8847441 3956811 -7093678 -15553083 -17579436 -19141420 -23304841
3231b3304841J086273J1265063J0763651j969884p939883L094308J4183045O094115
$$ -23304841 -22218568 -10953505 -189854 -2159738 -10099621 -7005313 7177732 13271847
3223A3271847j2477788j6998233k360451J1574784Q574282n009039j2891576r019262
$$ 13271847 794059 -16204174 -18564625 -6989841 1584441 -3424598 -16316174 -25335436
3215b5335436L05255P192422Q901019O580440K156887k490210m716212j973670
$$ -25335436 -25030181 -17837759 -8936740 -2356300 -199413 -2689623 -7405835 -9379505
3207i379505M249767P049342J559766o004589l181405J1935650K4847883K0922556
$$ -9379505 -5129738 1919604 3479370 -2525219 -5706624 6229026 31076909 51999465
3199E1999465L285362j1657471j4201122j0494027j1536254j8035214j9204848
$$ 51999465 55284827 43627356 29426234 18932207 7395953 -10639261 -29844109
3192b9844109o468991J3251073K1913752J1470271l504155k539899J2863461J9766560
$$ -29844109 -36313100 -23062027 -1148275 10321996 6817841 4277942 17141403 36907963
3184C6907963N262272j5361858k0523356j1517621o428893j1183425j2792424
$$ 36907963 42170235 26808377 6285021 -5232600 -11661493 -22844918 -35637342
3177c5637342k142133J0748292J0613284k457855j3759760j1828315L18736J1337342
$$ -35637342 -37779475 -27031183 -16417899 -18875754 -32635514 -44463829 -44145093 -32807751
3169c2807751J4753192J3474865J2142422R505221K458838n511564p682219n629767
$$ -32807751 -18054559 -4579694 7562728 17067949 19526787 14015223 6333004 703237
3161G03237p831823j4179878j2896288P99450J3842625J3132663N007774M240922
$$ 703237 -7128586 -21308464 -34204752 -33405302 -19562677 -6430014 -1422240 2818682
3153B818682J0495342J0639392J071779p515021p400017k139143L188540P225047
$$ 2818682 13314024 23953416 25025195 17510174 10110157 7971014 11159554 18384601
3145A8384601O760211j201515j0153803r821139k843142j474343n399288j81451
$$ 18384601 25144812 23943297 13789494 3968355 1125213 -349130 -5748418 -5929869
3137e929869J5927132K2185146M710931j9649841k4856380j0496137K034838J540106
$$ -5929869 9997263 32182409 36893340 17243499 -7612881 -18109018 -16074180 -14534074
3129a4534074k458166N70818P877330J1443365Q971359L364328j738020l907580
$$ -14534074 -16992240 -16421422 -8544092 2899273 11870632 15234960 13496940 9589360
3121I589360l734981m148755n038945k698070J632956J41542p788988r324781
$$ 9589360 5854379 1705624 -3333321 -6031391 -4398435 -4256893 -12045881 -21370662
3113b1370662L149451J5624634J0088468p271822j3750245l748493N370409K873054
$$ -21370662 -18221211 -2596577 7491891 220069 -13530176 -17278669 -11908260 -9035206
3105i035206j114193J999143L152956n337943j1647275k274393J3534355J5443971
$$ -9035206 -10149399 -8150256 -4997300 -10335243 -21982518 -24256911 -10722556 4721415
3097D721415J748976r868823q507788r85035L440571M847542O297031P099586
$$ 4721415 6470391 -3398432 -11906220 -12891255 -9450684 -4603142 1693889 8793475
3089H793475O321535M966282K265002l245689q130243p157432k498620j449523
$$ 8793475 15115010 20081292 22346294 19100605 10970362 3812930 1314310 -135213
3081a35213m277137l792905J208085K434375m204584j1320083j1777960q571469
$$ -135213 -4412350 -8205255 -6997170 -4562795 -8767379 -20087462 -31865422 -40436891
3073d0436891o646527l597416L601398J0135075J0570338Q416877R244621R797346
$$ -40436891 -47083418 -50680834 -47079436 -36944361 -26374023 -17957146 -8712525 1084821
3065A084821M228437l389895m349439k54411l67903m964316m333753L915017R325284
$$ 1084821 5313258 1923363 -2426076 -2680487 -3048390 -8012706 -12346459 -8431442 893842
3056H93842M854480k429894l054038J754892N593950P504428R220505Q299196
$$ 893842 5748322 3318428 264390 2019282 7613232 15117660 24338165 32637361
3048C2637361K569015l170044l400211j615995n328792j3181448j5590433q540263
$$ 32637361 35206376 32036332 28636121 27020126 21691334 8509886 -7080547 -15620810
3040a5620810O98923L605923O64040j156496K042729O585607N610276k455330
$$ -15620810 -14921887 -11315964 -10651924 -11808420 -9765691 -3180084 2430192 -25138
3032b5138j0054178p443267N354420J6748755J6293592O097599l650322p109739
$$ -25138 -10079316 -17522583 -12168163 4580592 20874184 26971783 23321461 16211722
3024A6211722o136551l981479j625003P4229k82308k196002l258224j954340J439182
$$ 16211722 10075171 6093692 4468689 4542918 4260610 2064608 -1193616 -3147956 -1708774
3015a708774N852743R284470R164155N063824o03042o212140j2317264j7332138
$$ -1708774 4143969 13428439 22592594 27656418 27053376 20841236 8523972 -8808166
3007h808166j6076536o694350M267335Q173072L587500l805846p539308m065847
$$ -8808166 -24884702 -31579052 -27311717 -19138645 -15551145 -19356991 -26896299 -30962146
2999c0962146N302128J3012571J1343571L335689O29139O100604Q034879j346500
$$ -30962146 -25660018 -12647447 -1303876 2031813 2660952 8761556 16796435 15449935
2991A5449935j2132021j2164230o094191n002711n780415J916488J4161509J7208102
$$ 15449935 3317914 -8846316 -14940507 -19943218 -25723633 -23807145 -9645636 7562466
2983G562466J0288440M647522J724747o602775j5794262j0143772Q784274J8402093
$$ 7562466 17850906 22498428 24223175 17620400 1826138 -8317634 466640 18868733
2975A8868733Q213996m994690n558954j142268l003810m500412L144951J0485775
$$ 18868733 27082729 22088039 16529085 15386817 12383007 7882595 11027546 21513321
2967B1513321M735747p625276j1582975o279703R3139P156428J6385225J9045034
$$ 21513321 26249068 18623792 7040817 761114 854253 8010681 24395906 43440940
2959D3440940R214407p36648K375604Q634250K67228j6894720k1145969r658982
$$ 43440940 52655347 51918699 54294303 62928553 63195781 46301061 25155092 15496110
2951A5496110j158900n143128j1725894j2697150j0397070m333182Q700866J8805112
$$ 15496110 14337210 9194082 -2531812 -15228962 -25626032 -29959214 -21258348 -2453236
2943b453236J0053092j2223693k3122486j2393336M355033J3465763J8591522
$$ -2453236 7599856 -4623837 -27746323 -40139659 -35784626 -22318863 -3727341
2936c727341K1203375J1613573q165916j6793178m809990P894137L215419o996853
$$ -3727341 17476034 29089607 20923691 4130513 -679477 7214660 10430079 3433226
2928C433226m084889M980108K481262p318006o719248L429106O428722n76112
$$ 3433226 -651663 4328445 6809707 -508299 -7227547 -3798441 2630281 2054169
2920B054169m337222q52773N49560j221755L862944J5079840J7474990O130771
$$ 2054169 -2283053 -3135826 -2586266 -3808021 54923 15134763 32609753 38740524
2912C8740524n164436o916264p708351j5080329j8909643p787043R467140J4272402
$$ 38740524 33576088 26659824 18951473 3871144 -15038499 -22825542 -13358402 914000
2904I14000M688858l093885J284872R244285P509958k927988q544343j393220
$$ 914000 5602858 2508973 3793845 13038130 20548088 17620100 9075757 7682537
2896G682537J0526620J3252115L793778p707511j1989132j0284451p541066l320612
$$ 7682537 18209157 31461272 35255050 27547539 15558407 5273956 -2267110 -5587722
2888e587722L992420R164126N437406l823522p732322k728667L125454K593011
$$ -5587722 -1595302 7568824 13006230 9182708 1450386 -1278281 1847173 4440184
2880D440184j337239k043147P56797K737807L102821N284086R879425J1342086
$$ 4440184 3102945 1059798 1816595 4554402 7657223 12941309 22820734 34162820
2872C4162820M136375r042020j7863484j4517292j883808J0186940J5069813J2902586
$$ 34162820 38299195 29257175 11393691 -3123601 -5007409 5179531 20249344 33151930
2864C3151930O175094k448761q161238o708116j011934J053981k168382l693911
$$ 33151930 39327024 36878263 28717025 22008909 20996975 22050956 19882574 16188663
2856A6188663M78942M686736L116645j001306j445346J815590N209639P448792
$$ 16188663 16667605 21354341 24470986 23469680 22024334 23839924 29049563 36498355
2848C6498355P362783K501672m230131m321812K812596M780413n912869j7613286
$$ 36498355 43861138 46362810 42132679 37810867 40623463 45403876 39491007 21877721
2840B1877721j5037128j640283P029280O203358L125868J69478o398896j2672648
$$ 21877721 6840593 5200310 12229590 18432948 21558816 21728294 15329398 2656750
2832B656750r397758J006958N706252J702983o47873L133294N100824J760409
$$ 2656750 -6741008 -5734050 -27798 1675185 1027312 4160606 9261430 11021839
2824A1021839J035271N805710O225486k763278j0486860p514755j355244l957610
$$ 11021839 12057110 17862820 24088306 21325028 10838168 3323413 1968169 -1989441
2816a989441j3551974j9806786j8318242r843642N841645K4189088L2182294K2451682
$$ -1989441 -15541415 -35348201 -53666443 -63510085 -57668440 -33479352 -1297058 21154624
2808B1154624N070814n203721o843110o418346m055769K441111N992482j229901
$$ 21154624 26225438 21021717 14178607 7760261 3704492 6145603 12138085 10908184
2800A0908184j1589189j0631530l02427L149452m816858j0292017m360951L242063
$$ 10908184 -681005 -11312535 -11614962 -8465510 -13282368 -23574385 -27935336 -24693273
2792b4693273K176493p76236O118395J8805517K1865459R916410o373618j4928133
$$ -24693273 -22516780 -23293016 -17174621 1630896 23496355 33412765 27039147 12111014
2784A2111014j4192051r410864m066229J497970O319155P560664L737171j898180
$$ 12111014 -2081037 -11491901 -15558130 -14060160 -7741005 -180341 3556830 1658650
2776A658650l247880J570809O328668L142348p075852j4275941j0686128N58974
$$ 1658650 -1589230 -18421 6310247 9452595 2376743 -11899198 -22585326 -22026352
2768b2026352R820564J0977411N113509k608150o721418m470099J448281M426741
$$ -22026352 -12205788 -1228377 3885132 1276982 -5444436 -9914535 -8466254 -4039513
2760d039513J235199l578110l785474l80032J59238m169965q318624q570947p189639
$$ -4039513 -2804314 -6382424 -10167898 -10547930 -10388692 -14558657 -22877281 -31448228 -38637867
2751c8637867n508370R60225J3888734K3550872J8603341L448221m518405K306048
$$ -38637867 -44146237 -43186012 -29297278 -5746406 12856935 16305156 11786751 14092799
2743A4092799J1162246O855322p387533j5127939q364967M497050J0716030N983219
$$ 14092799 25255045 32110367 24722834 9594895 1229928 5726978 16443008 22426227
2735B2426227m652691j2674584j2360371n377912O96144R05503k038620l714912
$$ 22426227 17773536 5098952 -7261419 -12639331 -11943187 -11037684 -13076304 -16791216
2727a6791216m388499m633546j63472J0888447J9768634J6288369M245640k671130
$$ -16791216 -21179715 -25813261 -25976733 -15088286 4680348 20968717 25214357 22543227
2719B2543227L03155M833332M281832J505913K05232n13956l68932K445503L106819
$$ 22543227 22846382 27679714 31961546 33467459 33672691 33158735 32789803 35235306 38342125
2710C8342125o294892k0923008k3980917j0112116M659931N337634j744893k314704
$$ 38342125 32047233 11124225 -12856692 -22968808 -18308877 -12971243 -14716136 -17030840
2702a7030840L123517M374592J543339L625854J0232002J0176536o97079j2449063
$$ -17030840 -13907323 -9532731 -7989392 -4363538 5868464 16045000 15347921 2898858
2694B898858j4105732m891100Q771926J9315582K0082484R198911o486732j6758185
$$ 2898858 -11206874 -16097974 -7326048 11989534 32072018 41270929 34784197 18026012
2686A8026012j8046962j3841154p080929J384231Q286388R590934O906014N608493
$$ 18026012 -20950 -13862104 -20943033 -19558802 -11272414 -1681480 5224534 10833027
2678A0833027O293034M358982j654944p627837j0331394j0380352q008661j882154
$$ 10833027 17126061 21485043 19830099 12202262 1870868 -8509484 -16518145 -18400299
2670a8400299O282825J0900914Q447458J433648l995139k515133O242608J4749505
$$ -18400299 -12117474 -1216560 7230898 8664546 4669407 2154274 8396882 23146387
2662B3146387J2083604l188203j7275402j4861758K841321J9820253K3308432
$$ 23146387 35229991 32041788 14766386 -95372 2745949 22566202 45874634
2655D5874634J3450985k881412j8812663k7410324k3909139j1590382R5313N601560
$$ 45874634 59325619 56444207 37631544 10221220 -13687919 -25278301 -25182988 -19581428
2647a9581428O777263N614483L63796q035937j1827262m530957Q997545J5634834
$$ -19581428 -12804165 -7189682 -6825886 -14861823 -26689085 -31220042 -22222497 -6587663
2639f587663Q263414n243179r848989p18139J0557594J0817891K853928k00529
$$ -6587663 1675751 -3567428 -13416417 -14134556 -3576962 7240929 10094857 9894328
2631I894328L481300J328875j0839120j7309411m926802J4176515J7658834M230544
$$ 9894328 13375628 14704503 3865383 -13444028 -18370830 -4194315 13464519 17695063
2623A7695063o717574m163569K456349J546042n074388r119861p065258k13417
$$ 17695063 10977489 6813920 9270269 10816311 5741923 -3377938 -10443196 -10656613
2615a0656613P619102R804246K649489o872447p680439l4071M558818p4844p775494
$$ -10656613 -3037511 6766735 9416224 2543777 -5136662 -5170733 -611915 -686759 -8462253
2606h462253j0953479q737740k550999O574591J3951452J3723846P577891K706734
$$ -8462253 -19415732 -28153472 -30704471 -24129880 -10178428 3545418 11123309 13830043
2598A3830043P04538k254185n106728l389557l67983l014666o560709J157255
$$ 13830043 14534581 12280396 7173668 3784111 3416128 401462 -6159247 -5001992
2590e001992J7326276K2905350R273111r377638j6612871j1954015k821215N257329
$$ -5001992 12324284 35229634 44502745 35125107 18512236 6558221 3737006 8994335
2582H994335L776654j4481942l6340809l3232810J83218L0701751K7661970L164954
$$ 8994335 12770989 -1710953 -38051762 -71284572 -71101354 -40399603 -12737633 -9572679
2574i572679r302385k183580M887619J985780n7319N663295J0339679O539596
$$ -9572679 -18875064 -21058644 -16171025 -14185245 -14242564 -8579269 1760410 8300006
2566H300006p30768m626310m682099j649277M184352P986002M316230l578716
$$ 8300006 7569238 2942928 -1739171 -3388448 795904 8781906 13098136 9519420
2558I519420q164751r550441j2283111j3287427o212216M047280N630608j339062
$$ 9519420 1354669 -8195772 -20478883 -33766310 -39978526 -35931246 -30300638 -31639700
2550c1639700m229470K166925Q669962P376054K036170m90236J402235O790945
$$ -31639700 -35869170 -33702245 -25032283 -17656229 -15620059 -16110295 -14708060 -7917115
2542g917115J3702283J6591652J1852460N553819N158323N379084m110818j8102191
$$ -7917115 5785168 22376820 34229280 39783099 44941422 50320506 46209688 28107497
2534B8107497j9956163q355757j628737r112740j5873942o362077J1511557J8949036
$$ 28107497 8151334 -204423 -1833160 -10945900 -26819842 -33181919 -21670362 -2721326
2526b721326J2240470K841087j458512k829716m355707m857171k044859M565131
$$ -2721326 9519144 12360231 10901719 8072003 3716296 -1140875 -3185734 1379397
2518A379397J2217453J4567340P785804j754658l713373M45940j803510j3835679
$$ 1379397 13596850 28164190 35949994 34195336 30481963 30927903 29124393 15288714
2510A5288714k2394603j7022716n012086K220137O173038J2717442J6552360R125490
$$ 15288714 -7105889 -24128605 -29140691 -26920554 -20747516 -8030074 8522286 17647776
2502A7647776m171767r907819o346347l022375k915230m1317N223460M015076
$$ 17647776 13476009 3568190 -2778157 -5800532 -8715762 -8757079 -3533619 481457
2494D81457m263254p367170Q57775Q929188M422810o567549p867515L379325J3182242
$$ 481457 -3781797 -11148967 -10291192 -1362004 3060806 -3506743 -11374258 -7994933 5187309
2485E187309J0500999N96341n123654n216825p149481j3008109j4433134m391999
$$ 5187309 15688308 16284649 11160995 5944170 -1205311 -14213420 -28646554 -33038553
2477c3038553J1534558K0703392J7667036P754145j788132p705500q086643k042439
$$ -33038553 -21503995 -800603 16866433 24620578 22832446 15126946 7040303 4997864
2469D997864M888108K903558q379488j4818904m958972J1843069J5626295L799153
$$ 4997864 9885972 12789530 4410042 -10408862 -15367834 -3524765 12101530 15900683
2461A5900683l781407O699050K0611462J3132570j5032062l5353827k8082250
$$ 15900683 12119276 18818326 39429788 52562358 37530296 2176469 -25905781
$$ [...]
##END NTUPLES=NMR SPECTRUM
##END=
