##TITLE=31Pdec_DE-58tub_Ac3
 
 64 sc
 8.5.2024
##JCAMPDX= 6.0         $$ Bruker NMR JCAMP-DX V2.0
##DATA TYPE= NMR SPECTRUM
##DATA CLASS= NTUPLES
##ORIGIN= UXNMR, Bruker Analytische Messtechnik GmbH
##OWNER= root
$$ XWIN-NMR		Version 3.5
$$ Wed May  8 14:42:56 2024 Russian Standard Time (UT+4h)  she@DPX200
##.OBSERVE FREQUENCY= 81.013821
##.OBSERVE NUCLEUS= ^31P
##.ACQUISITION MODE= SIMULTANEOUS
##.ACQUISITION SCHEME= undefined
##.AVERAGES= 40
##.DIGITISER RES= 16
##SPECTROMETER/DATA SYSTEM= spect
##.PULSE SEQUENCE= zgpg30
##.SOLVENT NAME= CDCl3
##.SHIFT REFERENCE= (INTERNAL, CDCl3, 0, 248.564)
##AUDIT TRAIL= $$ (NUMBER, WHEN, WHO, WHERE, WHAT)
$$ ##TITLE= Audit trail, XWIN-NMR		Version 3.5
$$ ##JCAMPDX= 5.01
$$ ##ORIGIN= Bruker BioSpin GmbH
$$ ##OWNER= she
$$ F:/spectra/data/she/nmr/P31/1/pdata/1/auditp.txt
$$ ##AUDIT TRAIL=  $$ (NUMBER, WHEN, WHO, WHERE, WHAT)
(   1,<2024-05-08 14:42:05.53 +0400>,<she>,<DPX200>,
      <created by zg, POWCHK disabled, PULCHK disabled
       configuration hash MD5:
       00 E9 B6 7A A2 85 ED C7 34 08 36 98 17 FE 4E 26
       data hash MD5: 32K
       43 43 DF 6B 0C 09 07 65 ED FE 31 9D 04 17 86 4F>)
(   2,<2024-05-08 14:42:07.79 +0400>,<she>,<DPX200>,
      <Start of raw data processing
       efp BC_mod = 2 LB = 10 FT_mod = 6 PKNL = 1 PHC0 = -13218.83 PHC1 = -4.916168 SI = 64K 
       data hash MD5: 64K
       17 23 D1 8F C3 3D 38 08 18 42 49 D1 39 74 2E 14>)
(   3,<2024-05-08 14:42:19.90 +0400>,<she>,<DPX200>,
      <pk PHC0 = -12.19408 PHC1 = 0 
       data hash MD5: 64K
       99 C6 33 D2 6A 60 81 03 A6 C0 C2 04 E2 57 09 62>)
$$ ##END=
$$ 
$$ hash MD5
$$ 50 AC 8D FB 23 34 99 82 DA 3F 43 83 55 A1 5B 27
##$RELAX= 
##$RELAX= 
##$RELAX= 
##$RELAX= 
##$RELAX= 
##$RELAX= 
##$RELAX= 
##$RELAX= 
##$RELAX= 
$$ Bruker specific parameters
$$ --------------------------
##$DU= <F:/spectra>
##$EXPNO= 1
##$NAME= <P31>
##$PROCNO= 1
##$TYPE= <nmr>
##$USER= <she>
##$AMP= (0..31)
100 100 100 100 100 100 100 100 100 100 100 100 100 100 100 100 100 100 
100 100 100 100 100 100 100 100 100 100 100 100 100 100 
##$AQSEQ= 0
##$AQ_mod= 1
##$AUNM= <au_zg>
##$AUTOPOS= <>
##$BF1= 81.014009
##$BF2= 200.13
##$BF3= 200.13
##$BF4= 200.13
##$BF5= 200.13
##$BF6= 200.13
##$BF7= 200.13
##$BF8= 200.13
##$BYTORDA= 1
##$CFDGTYP= 0
##$CFRGTYP= 5
##$CHEMSTR= <none>
##$CNST= (0..31)
1 1 145 1 1 1 1 1 1 1 1 1 1 1 1 1 1 1 1 1 1 1 1 1 1 1 1 1 1 1 1 1 
##$CPDPRG= <waltz16>
##$CPDPRG1= <>
##$CPDPRG2= <waltz16>
##$CPDPRG3= <>
##$CPDPRG4= <mlev>
##$CPDPRG5= <mlev>
##$CPDPRG6= <mlev>
##$CPDPRG7= <mlev>
##$CPDPRG8= <mlev>
##$CPDPRGB= <>
##$CPDPRGT= <>
##$D= (0..31)
0 1 0 0 0 0 0 0 0 0 0 0.03 2e-05 3e-06 0 0 0 0 0 0 0 0 0 0 0 0 0 0 0 0 
0 0 
##$DATE= 1715164924
##$DBL= (0..7)
120 120 120 11 120 120 24 19 
##$DBP= (0..7)
150 150 150 150 150 150 150 150 
##$DBP07= 0
##$DBPNAM0= <>
##$DBPNAM1= <>
##$DBPNAM2= <>
##$DBPNAM3= <>
##$DBPNAM4= <>
##$DBPNAM5= <>
##$DBPNAM6= <>
##$DBPNAM7= <>
##$DBPOAL= (0..7)
0.5 0.5 0.5 0.5 0.5 0.5 0.5 0.5 
##$DBPOFFS= (0..7)
$$ [...]
##$SUBNAM2= <"">
##$SUBNAM3= <"">
##$SUBNAM4= <"">
##$SUBNAM5= <"">
##$SUBNAM6= <"">
##$SUBNAM7= <"">
##$SUBNAM8= <"">
##$SUBNAM9= <"">
##$SW= 501.771253377433
##$SWIBOX= (0..15)
0 1 3 0 0 0 0 0 0 0 0 0 0 0 0 0 
##$SW_h= 40650.406504065
##$TD= 32768
##$TD0= 1
##$TE= 0
##$TE2= 300
##$TE3= 300
##$TEG= 300
##$TL= (0..7)
0 120 53 12 22 120 120 120 
##$TP= (0..7)
150 150 150 150 150 150 150 150 
##$TP07= 0
##$TPNAME0= <>
##$TPNAME1= <>
##$TPNAME2= <>
##$TPNAME3= <>
##$TPNAME4= <>
##$TPNAME5= <>
##$TPNAME6= <>
##$TPNAME7= <>
##$TPOAL= (0..7)
0.5 0.5 0.5 0.5 0.5 0.5 0.5 0.5 
##$TPOFFS= (0..7)
0 0 0 0 0 0 0 0 
##$TUNHIN= 0
##$TUNHOUT= 0
##$TUNXOUT= 0
##$USERA1= <user>
##$USERA2= <user>
##$USERA3= <user>
##$USERA4= <user>
##$USERA5= <user>
##$V9= 5
##$VALIST= <valist>
##$VCLIST= <CCCCCCCCCCCCCCC>
##$VD= 0
##$VDLIST= <DDDDDDDDDDDDDDD>
##$VPLIST= <PPPPPPPPPPPPPPP>
##$VTLIST= <TTTTTTTTTTTTTTT>
##$WBST= 1024
##$WBSW= 4
##$XGAIN= (0..3)
0 0 0 0 
##$XL= 0
##$YL= 0
##$YMAX_a= 1861
##$YMIN_a= -1830
##$ZGOPTNS= <>
##$ZL1= 120
##$ZL2= 120
##$ZL3= 120
##$ZL4= 120
##$ABSF1= 0
##$ABSF2= 0
##$ABSG= 0
##$ABSL= 0
##$ALPHA= 0
##$AQORDER= 0
##$ASSFAC= 0
##$ASSFACI= 0
##$ASSFACX= 0
##$ASSWID= 0
##$AUNMP= <proc_1d>
##$AZFE= 0.1
##$AZFW= 0.5
##$BCFW= 0
##$BC_mod= 2
##$BYTORDP= 0
##$COROFFS= 0
##$CY= -3
##$DATMOD= 1
##$DC= 0
##$DFILT= <>
##$DTYPP= 0
##$F1P= 0
##$F2P= 0
##$FCOR= 1
##$FTSIZE= 65536
##$FT_mod= 6
##$GAMMA= 0
##$GB= 0
##$INTBC= 1
##$INTSCL= 6.047779e-11
##$ISEN= 30
##$LB= 10
##$LEV0= 0
##$LPBIN= 0
##$MAXI= 10000
##$MC2= 0
##$MEAN= 0
##$ME_mod= 0
##$MI= 50
##$NCOEF= 0
##$NC_proc= -11
##$NLEV= 6
##$NOISF1= 182.463
##$NOISF2= 159.3651
##$NSP= 0
##$NTH_PI= 0
##$NZP= 0
##$OFFSET= 248.5645
##$PC= 4
##$PHC0= -13231.02
##$PHC1= -4.916168
##$PH_mod= 1
##$PKNL= yes
##$PPARMOD= 0
##$PSCAL= 0
##$PSIGN= 0
##$REVERSE= no
##$SF= 81.0140089999694
##$SI= 65536
##$SIGF1= 159.3651
##$SIGF2= -187.1042
##$SINO= 113.3802
##$SIOLD= 16384
##$SREGLST= <1H.CDCl3>
##$SSB= 0
##$STSI= 65536
##$STSR= 0
##$SW_p= 40650.406504065
##$SYMM= 0
##$S_DEV= 0
##$TDeff= 32768
##$TDoff= 0
##$TI= <>
##$TILT= no
##$TM1= 0
##$TM2= 0
##$TOPLEV= 0
##$USERP1= <user>
##$USERP2= <user>
##$USERP3= <user>
##$USERP4= <user>
##$USERP5= <user>
##$WDW= 1
##$XDIM= 65536
##$YMAX_p= 506723304
##$YMIN_p= -89475400
$$ End of Bruker specific parameters
$$ ---------------------------------
##NTUPLES= NMR SPECTRUM
##VAR_NAME=  FREQUENCY,     SPECTRUM/REAL,   SPECTRUM/IMAG
##SYMBOL=    X,             R,               I
##VAR_TYPE=  INDEPENDENT,   DEPENDENT,       DEPENDENT
##VAR_FORM=  AFFN,          ASDF,            ASDF
##VAR_DIM=   65536,         65536,           65536
##UNITS=     HZ,            ARBITRARY UNITS, ARBITRARY UNITS
##FACTOR=    0.620285442955139, 1,           1
##FIRST=     20137.2065510682, 0,            0
##LAST=      -20513.1999529968, 0,           0
##MIN=       -20513.1999529968, -89475400,   0
##MAX=       20137.2065510682, 506723304,    0
$$ Real data points
##PAGE= N=1
##DATA TABLE= (X++(R..R)), XYDATA
$$ [...]
58109a9526865l39566j07826J90805M97072P34939Q31767P39883M50274o708n69385
58099a7105610j156388j684930k098185k388504k594740k769849k941412l091370
58091c5830988l160910l070194k744700k145487j294345k76819P86273J786068
58083d5951102K662506L407258M033423M536848M878609M999665M854444M440986
58075a2137363L814384L081530K377373J824259J486729J347089J321232J307031
58067D422264J232500J074192Q43730N64092K55926o3267l75998o63498r05455
58058F384486j079706j164430j144574j019769q08729n46856k75834k6681J96729
58049E14636M20944O84776J007976J369448J712475J971498K098058K070213J889791
$$ y = [-19526865, -19866431, -19974257, -19783452, -19286380, -18551441, -17719674, -16979791, -16529517, -16536225, -17105610, -18261998, -19946928, -22045113, -24433617, -27028357, -29798206, -32739618, -35830988, -38991898, -42062092, -44806792, -46952279, -48246624, -48523443, -47737170, -45951102, -43288596, -39881338, -35847915, -31311067, -26432458, -21432793, -16578349, -12137363, -8322979, -5241449, -2864076, -1039817, 446912, 1794001, 3115233, 4422264, 5654764, 6728956, 7572686, 8136778, 8392704, 8329437, 7953439, 7289941, 6384486, 5304780, 4140350, 2995776, 1976007, 1167278, 620422, 344588, 317907, 514636, 935580, 1620356, 2628332, 3997780, 5710255, 7681753, 9779811, 11850024, 13739815]
58040A3739815J579792J183087P53100L34355n3668m15127p60374j087328j373299
58031A3900353j578100j654495j563753j293026q66699l43246K02833P03412J109289
58022H616568J387322J510676J456772J218259Q17599L11049k23274p07203j083127
58013A3304641j323553j425452j395198j237896r60031n79103j26649L58823Q39769
58004G455351J281236J650420J921081K081949K142813K134159K099702K082735
57996B2849446K110891K187217K291160K384174K414264K322467K057317J593344
57988D0210280R40148J34445p76969j747714k728435l657091m457787n056060
57980B2860817n402998n491308n353440n047533m643924m217640l842278l579699
$$ y = [13739815, 15319607, 16502694, 17255794, 17590149, 17536481, 17121354, 16360980, 15273652, 13900353, 12322253, 10667758, 9104005, 7810979, 6944280, 6601034, 6803867, 7507279, 8616568, 10003890, 11514566, 12971338, 14189597, 15007196, 15318245, 15094971, 14387768, 13304641, 11981088, 10555636, 9160438, 7922542, 6962511, 6383408, 6256759, 6615582, 7455351, 8736587, 10387007, 12308088, 14390037, 16532850, 18667009, 20766711, 22849446, 24960337, 27147554, 29438714, 31822888, 34237152, 36559619, 38616936, 40210280, 41150428, 41284873, 40507904, 38760190, 36031755, 32374664, 27916877, 22860817, 17457819, 11966511, 6613071, 1565538, -3078386, -7296026, -11138304, -14718003]
57972a4718003l465660l496418l623484l763113l820826l721229l429739k960617
57964d2999089k374116j763858j230728q46511o25539n25154m76450m22707l38833
57955e1602985k23765p9994J00047L32103O28663R89207J399121J836294K278430
57946d4342879K703287L080627L365458L505238L461633L230635K843828K351535
57938a9800638J804626J247924P22330K65801r0096l24351m28779m09333k86712
57929a7299228r4295J27726L40938N18967O58815P89182R66443J249980J661646
57920a1079826K152159K603063K873817K870333K591972K127965J609594J150902
57912F899979Q09896N82700M23249K72837Q6596j48653m06470o25703p32069o72106
$$ y = [-14718003, -18183663, -21680081, -25303565, -29066678, -32887504, -36608733, -40038472, -42999089, -45373205, -47137063, -48367791, -49214302, -49839841, -50364995, -50841445, -51264152, -51602985, -51826750, -51906744, -51806697, -51474594, -50845931, -49856724, -48457603, -46621309, -44342879, -41639592, -38558965, -35193507, -31688269, -28226636, -24996001, -22152173, -19800638, -17996012, -16748088, -16025758, -15759957, -15850053, -16174404, -16603183, -17012516, -17299228, -17393523, -17265797, -16924859, -16405892, -15747077, -14957895, -13991452, -12741472, -11079826, -8927667, -6324604, -3450787, -580454, 2011518, 4139483, 5749077, 6899979, 7709875, 8292575, 8715824, 8988661, 9075257, 8926604, 8520134, 7894431, 7162362, 6490256]
57902F490256m41777q9234L11819O97773J032493J297609J473461J536169J477078
57893A3785647J324523J142368J000502R37393R39490R47368Q82501O81878L26195
57884B1967865j52835o92108j231690j739612k210488k644344l025689l316580
57876F954519l463662l414073l137651k650651k027170j383122q34016m50235
57868a0406061k38427j57111j48614j62966j64680j30034m3866J03958L25089
57859a1022712O38054J062889J602903K225883K862317L425960L843453M074122
57851H712869M112591L980532L715287L356637K933187K456931J933773J383133
57843C2584940Q46751L73184j3002l31964o39171r88801j394043j811565k159631
$$ y = [6490256, 6048479, 5959245, 6271064, 6968837, 8001330, 9298939, 10772400, 12308569, 13785647, 15110170, 16252538, 17253040, 18190433, 19129923, 20077291, 20959792, 21641670, 21967865, 21815030, 21122922, 19891232, 18151620, 15941132, 13296788, 10271099, 6954519, 3490857, 76784, -3060867, -5711518, -7738688, -9121810, -9955826, -10406061, -10644488, -10801599, -10950213, -11113179, -11277859, -11407893, -11451759, -11347801, -11022712, -10384658, -9321769, -7718866, -5492983, -2630666, 795294, 4638747, 8712869, 12825460, 16805992, 20521279, 23877916, 26811103, 29268034, 31201807, 32584940, 33431691, 33804875, 33791873, 33459909, 32820738, 31831937, 30437894, 28626329, 26466698]
57834B6466698k355915k350903k141137j762188j270647p25768j78996L26138
57826A6007282P48759J048375J189146J148435R27099N59151J12926l26337o89257
57817B0725579r48349j116324j219899j272912j267187j180258r89469o85218
57809A2045963k79201J96565O99233J184925J611890J939834K132557K163911
57801B1695677K021867J709883J250326O90364J02517m26700q16997j014477j005557
57792B4206903q22450n37681k45341l2751M6156j6184j85388m01931o02491p40051
57782B0668791p97100p85296p29958o49935n50038m32039l10108k10485j51989
57773A6051843j25216r0967j796J66943L95953O24109P74095P85928O35459L27123
$$ y = [26466698, 24110783, 21759880, 19618743, 17856555, 16585908, 15860140, 15681144, 16007282, 16756041, 17804416, 18993562, 20141997, 21069096, 21628247, 21741173, 21414836, 20725579, 19777230, 18660906, 17441007, 16168095, 14900908, 13720650, 12731181, 12045963, 11766762, 11963327, 12662560, 13847485, 15459375, 17399209, 19531766, 21695677, 23717544, 25427427, 26677753, 27368117, 27470634, 27043934, 26226937, 25212460, 24206903, 23384453, 22846772, 22601431, 22568680, 22614836, 22598652, 22413264, 22011333, 21408842, 20668791, 19871691, 19086395, 18356437, 17706502, 17156464, 16724425, 16414317, 16203832, 16051843, 15926627, 15835660, 15833864, 16000807, 16396760, 17020869, 17794964, 18580892, 19216351, 19543474]
57763A9543474j24793p00768j359192k020551k580718k953635l111241l087212
57755C605364k941838k717000k414320k007850j477974q41996j61747M76672R98319
57746g482370J366706J585395J675536J648441J493684J189572P27383J34205
57738B338552n17546j117927j542645j686328j496978r97597k81285N21225J284489
57729c496040J919018K379189K654230K752728K687327K464490K084226J549069
57721A4994237Q74369R3379p41615j559725k276962k810841l098884l110797k851490
57712d88329k360632j711161j000711l30457K23489O32352R17779J131293J318485
57703a667892J487545J602064J602952J445322J129411P11706K92508j6319j30980
$$ y = [19543474, 19418681, 18717913, 17358721, 15338170, 12757452, 9803817, 6692576, 3605364, 663526, -2053474, -4467794, -6475644, -7953618, -8795614, -8957361, -8480689, -7482370, -6115664, -4530269, -2854733, -1206292, 287392, 1476964, 2204347, 2338552, 1821006, 703079, -839566, -2525894, -4022872, -5020469, -5301754, -4780529, -3496040, -1577022, 802167, 3456397, 6209125, 8896452, 11360942, 13445168, 14994237, 15868606, 15961985, 15220370, 13660645, 11383683, 8572842, 5473958, 2363161, -488329, -2848961, -4560122, -5560833, -5891290, -5667801, -5035449, -4117670, -2986377, -1667892, -180347, 1421717, 3024669, 4469991, 5599402, 6311108, 6603616, 6587297, 6456317]
57694F456317k2622K82844P25294J228246J700316K033386K122047J907099J412725
57685A7845652P42017K8232o24198j170849j620354k005353k351488k655591k878506
57676E309562k955789k823740k451194j865349j160608m80541K8608K74772K54804
57667e869475M5706k38612m95890o66957p45374p68562p92766q58394r62218j054799
57657a2407341j066970r48859o96228l48870L4515M06476P47463J061170J354071
57648a1864573J614197J805331J882067J814726J605516J287451R13055N42630
57640c99600K31970J5470j09716j84143k64640l91769n65509p41905q51147q27944
57630d088933o40191l02316J32294N93127J014285J345380J551462J609875J510845
$$ y = [6456317, 6433695, 6716539, 7441833, 8670079, 10370395, 12403781, 14525828, 16432927, 17845652, 18587669, 18615901, 17991703, 16820854, 15200500, 13195147, 10843659, 8188068, 5309562, 2353773, -469967, -2921161, -4786510, -5947118, -6427659, -6399051, -6124279, -5869475, -5823769, -6062381, -6558271, -7225228, -7970602, -8739164, -9531930, -10390324, -11352542, -12407341, -13474311, -14423170, -15119398, -15468268, -15433753, -15027277, -14279814, -13218644, -11864573, -10250376, -8445045, -6562978, -4748252, -3142736, -1855285, -942230, -399600, -167630, -152160, -261876, -446019, -710659, -1102428, -1667937, -2409842, -3260989, -4088933, -4729124, -5031440, -4899146, -4306019, -3291734, -1946354, -394892, 1214983, 2725828]
57621B725828J261802Q90751M45316j2895m18282p14744q68502q73592p47800
57612A687882n23856k41348O0853L53072O20051Q57285J061037J221893J327156
57603F424025J368285J347792J283964J211262J171015J192089J272894J379131
57595A6650457J459439J466847J372485J168156Q63077M81099O0284l47841o83671
57586B2490332q91416r34520q08511n45797k09648J22367L81386N28360N63985
57577B0696538N22871M54991M02401L79926L66342L09139J41903j90746p08516
57568B2374849j379867k122670k823214l368176l677199l722359l526604l144025
57560a389265k634203k044679j408513p52802j07879M90850J008573J418426J704847
$$ y = [2725828, 3987630, 4878381, 5323697, 5310802, 4892520, 4177776, 3309274, 2435682, 1687882, 1164026, 922678, 983531, 1336603, 1956654, 2813939, 3874976, 5096869, 6424025, 7792310, 9140102, 10424066, 11635328, 12806343, 13998432, 15271326, 16650457, 18109896, 19576743, 20949228, 22117384, 22980461, 23461560, 23521844, 23174003, 22490332, 21598916, 20664396, 19855885, 19310088, 19100440, 19222807, 19604193, 20132553, 20696538, 21219409, 21674400, 22076801, 22456727, 22823069, 23132208, 23274111, 23083365, 22374849, 20994982, 18872312, 16049098, 12680922, 9003723, 5281364, 1754760, -1389265, -4023468, -6068147, -7476660, -8229462, -8337341, -7846491, -6837918, -5419492, -3714645]
57551c714645J862111J891688J802227J611841J348577J045208P29924M19611
57543F996542J21871j55695l97759n82438o88840p01184o05207l84960l1177M40206
57533D011359R75685J493026J908613K164852K241318K149335J921555J605533
57525A8471276J259568R43537P02708N51390M66988M00377K99110J31710j00260
57516B3126404l67737o30719q53774j013138j096775j101993j033593r03845p33736
57507A5391094n50904l79432k25567p3146J03032L16105N57596Q05684J038797
57498A6983259J240377J394815J484413J493348J415599J260714J053954Q31350
57490B7157829O32196M91227M31329M58562N63598P30947R48513J206588J485852
$$ y = [-3714645, -1852534, 39154, 1841381, 3453222, 4801799, 5847007, 6576931, 6996542, 7118413, 6962718, 6564959, 5982521, 5293681, 4592497, 3987290, 3602330, 3571153, 4011359, 4987044, 6480070, 8388683, 10553535, 12794853, 14944188, 16865743, 18471276, 19730844, 20674381, 21377089, 21928479, 22395467, 22795844, 23094954, 23226664, 23126404, 22758667, 22127948, 21274174, 20261036, 19164261, 18062268, 17028675, 16124830, 15391094, 14840190, 14460758, 14235191, 14162045, 14265077, 14581182, 15138778, 15944462, 16983259, 18223636, 19618451, 21102864, 22596212, 24011811, 25272525, 26326479, 27157829, 27790025, 28281252, 28712581, 29171143, 29734741, 30465688, 31414201, 32620789, 34106641]
57481C4106641J747646J938525K005955J912753J643408J204863O25352m7830
57473D5137313p50988j406754j930750k247116k309727k117416j714441j178054
57465C1482067n99712o3765L72193O85824Q80436R65851R49870Q49472P05715
57456C6227951N77662N12240N15536N51993N69530N23966L83336J19914k88869
57447C9693259q43690j506441k203884k855424l406452l841582m167250m379090
57439A6489446m442934m306072l929249l315812k522290j649736q21626j54355
57431d652628K71297M27252L38983P4665k71338n99729q31625r29665r03037p94324
57421g870149o59156n50582n08516n46950o39766p20090p06906n49975k61767
$$ y = [34106641, 35854287, 37792812, 39798767, 41711520, 43354928, 44559791, 45185143, 45137313, 44386325, 42979571, 41048821, 38801705, 36491978, 34374562, 32660121, 31482067, 30882355, 30818590, 31190783, 31876607, 32757043, 33722894, 34672764, 35522236, 36227951, 36805613, 37317853, 37833389, 38385382, 38954912, 39478878, 39862214, 39982128, 39693259, 38849569, 37343128, 35139244, 32283820, 28877368, 25035786, 20868536, 16489446, 12046512, 7740440, 3811191, 495379, -2026911, -3676647, -4498273, -4652628, -4381331, -3954079, -3615096, -3540431, -3811769, -4411498, -5243123, -6172788, -7075825, -7870149, -8529305, -9079887, -9588403, -10135353, -10775119, -11495209, -12202115, -12752090, -13013857]
57412a3013857Q9483M19152O65055P99077Q14701P12718M99663J94567j67516
57403h986957n39989q74136j129943j286161j346173j334740j284109j215050
57395a7997258j123036r78495p42739l91674O7194N95829J142897J662192K117742
57386a5647348K476234K701187K760777K645631K381301K023492J637600J275614
57378B254488R64603P11425N15173L74475K85604K38914K21017K19861K25141
57369F010701K23957J99542J37284L3409j00477k39302l51970m12361m08397l41570
57359D750816k15497k3432K52161O24384J079931J564201J984182K232697K227332
57350A4476775J947002J446096Q35662K38808k58274o35876r37400j236133j589657
$$ y = [-13013857, -12924374, -12505222, -11840167, -11041090, -10226389, -9513671, -9014008, -8819441, -8986957, -9526946, -10401082, -11531025, -12817186, -14163359, -15498099, -16782208, -17997258, -19120294, -20098789, -20841528, -21233202, -21166008, -20570179, -19427282, -17765090, -15647348, -13171114, -10469927, -7709150, -5063519, -2682218, -658726, 978874, 2254488, 3219091, 3930516, 4445689, 4820164, 5105768, 5344682, 5565699, 5785560, 6010701, 6234658, 6434200, 6571484, 6604893, 6504416, 6265114, 5913144, 5500783, 5092386, 4750816, 4535319, 4511887, 4764048, 5388432, 6468363, 8032564, 10016746, 12249443, 14476775, 16423777, 17869873, 18705535, 18944343, 18686069, 18050193, 17112793, 15876660, 14287003]
57341A4287003k004326k426634k765049k930441k872969k595860k141974j566597
57333e016847r16254k24958M75232J142892J728134K187009K496947K658226K679390
57324G209771K560095K286785J844762J238333N07350k68943r85191j537766j856798
57315A0998398j928461j796570j539962j233875r16189n81380k06540K12391O43164
57306C650976J028595J313465J468133J498206J437507J327963J199123J063256
57298A3987224R28577Q14149P48519P53193Q28976R58633J121185J302391J491524
57289B2934371J668983J798643J835404J744858J520922J189159P96190L94933
57281C3883463L3375k53333m50807n72321o58110p61593r25750j162203j446075
$$ y = [14287003, 12282677, 9856043, 7090994, 4160553, 1287584, -1308276, -3450250, -5016847, -5933101, -6158059, -5682827, -4539935, -2811801, -624792, 1872155, 4530381, 7209771, 9769866, 12056651, 13901413, 15139746, 15647096, 15378153, 14392962, 12855196, 10998398, 9069937, 7273367, 5733405, 4499530, 3583341, 3001961, 2795421, 3007812, 3650976, 4679571, 5993036, 7461169, 8959375, 10396882, 11724845, 12923968, 13987224, 14915801, 15729950, 16478469, 17231662, 18060638, 19019271, 20140456, 21442847, 22934371, 24603354, 26401997, 28237401, 29982259, 31503181, 32692340, 33488530, 33883463, 33916838, 33663505, 33212698, 32640377, 31982267, 31220674, 30294924, 29132721, 27686646]
57272B7686646j729962j968666k141645k262591k370967k507768k687686k884428
57264I132933l037669l074473k931410k570770j992723j243137m10487L93119
57256e734617J061643J523201J756129J789377J688708J533817J394727J316544
57248F329529J317180J393867J528736J687422J814555J836155J674077J268157
57240A8849678N97512l05514j354230k425071l392563m166449m708838n021892
57232a927367n118863n001420m657085m073739l258890k252612j129795P183J043455
57223b6369133J874170K431349K703231K731106K582151K317909J983142J620144
57215h125931J288223J063354J012391J160098J473822J876787K279747K610497
$$ y = [27686646, 25956684, 23988018, 21846373, 19583782, 17212815, 14705047, 12017361, 9132933, 6095264, 3020791, 89381, -2481389, -4474112, -5717249, -6127736, -5734617, -4672974, -3149773, -1393644, 395733, 2084441, 3618258, 5012985, 6329529, 7646709, 9040576, 10569312, 12256734, 14071289, 15907444, 17581521, 18849678, 19447190, 19141676, 17787446, 15362375, 11969812, 7803363, 3094525, -1927367, -7046230, -12047650, -16704735, -20778474, -24037364, -26289976, -27419771, -27412588, -26369133, -24494963, -22063614, -19360383, -16629277, -14047126, -11729217, -9746075, -8125931, -6837708, -5774354, -4761963, -3601865, -2128043, -251256, 2028491, 4638988]
57207D638988K827821K920856K901407K794045K626141K421456K199461J975721
57199B5305896J757414J537438J297625J023311P17545M02693J10106j33511l17459
57190C1701058m54041n77247p30919r52678j263106j661672k124730k606387l048358
57181A8281920l397805l622076l712401l680294l552454l362945l140777k899171
57173i086003k634287k331709j973264j542857j034879m62991J38893P24933J246022
57164a6956142J651645J889710J914260J702711J273243O90377N3674n25357r47112
57155i252991j140325j071228p49255k27929M04700J046376J603492K007943K225895
57146e153322K258897K136485J902937J607283J302397J045606Q87683Q50541
$$ y = [4638988, 7466809, 10387665, 13289072, 16083117, 18709258, 21130714, 23330175, 25305896, 27063310, 28600748, 29898373, 30921684, 31639229, 32041922, 32152028, 32018517, 31701058, 31247017, 30669770, 29938851, 28986173, 27723067, 26061395, 23936665, 21330278, 18281920, 14884115, 11262039, 7549638, 3869344, 316890, -3046055, -6186832, -9086003, -11720290, -14051999, -16025263, -17568120, -18602999, -19065990, -18927097, -18202164, -16956142, -15304497, -13414787, -11500527, -9797816, -8524573, -7834196, -7780522, -8305879, -9252991, -10393316, -11464544, -12213799, -12441728, -12037028, -10990652, -9387160, -7379217, -5153322, -2894425, -757940, 1144997, 2752280, 4054677, 5100283, 5987966, 6838507]
57138F838507R11627J012263J088111J102292J061236J006035R86349J031804
57130A5038224J136007J261651J363306J413438J414616J390513J364694J345115
57122B5727564J325556J298680J265587J232289J197885J147835J060447R20157
57114C5176000P22708M65667J37050k78249p72343j292466j749034k052707k153372
57105B8203254k055257j804271j461148j076550o79305k81763J04563M57872P49418
57096B2156813R56022J068347J088900J025235Q85638O78911M16654J17354j89177
57087B8204697m62174o60070p58492p65648p23041o88505p11813q19036j013093
57078B1602825j283027j609129j960211k290819k546753k678878k658905k489835
$$ y = [6838507, 7750134, 8762397, 9850508, 10952800, 12014036, 13020071, 14006420, 15038224, 16174231, 17435882, 18799188, 20212626, 21627242, 23017755, 24382449, 25727564, 27053120, 28351800, 29617387, 30849676, 32047561, 33195396, 34255843, 35176000, 35898708, 36364375, 36501425, 36223176, 35450833, 34158367, 32409333, 30356626, 28203254, 26147997, 24343726, 22882578, 21806028, 21126723, 20844960, 20949523, 21407395, 22156813, 23112835, 24181182, 25270082, 26295317, 27180955, 27859866, 28276520, 28393874, 28204697, 27742523, 27082453, 26323961, 25558313, 24835272, 24146767, 23434954, 22615918, 21602825, 20319798, 18710669, 16750458, 14459639, 11912886, 9234008, 6575103, 4085268]
57070D085268k204840j851613j467969j064385o27032j39572L93069R35386J430148
57061e11540J817490K053256K118442K016794J764089J377359Q71305K62490m23421
57052A1346264j145880j847681k460075k917853l181159l251196l165520k972525
57044i595625k703325k363139j947494j466807r57530m72147n7166K66763N13733
57035a8782737P27737R65193J270648J655531K088786K502234K808639K928289
57027c835680K816422K479633J971997J373632P65651K14124k35326n58262p51005
57018D241186q26916q07542p12597n56033l50881j17094J16966L22529M81019
57009A790637N87900O48989O77986P01743P66764R32263J244371J706302K269156
$$ y = [4085268, 1880428, 28815, -1439154, -2503539, -3130571, -3270143, -2877074, -1941688, -511540, 1305950, 3359206, 5477648, 7494442, 9258531, 10635890, 11507195, 11769685, 11346264, 10200384, 8352703, 5892628, 2974775, -206384, -3457580, -6623100, -9595625, -12298950, -14662089, -16609583, -18076390, -19033920, -19506067, -19563233, -19296470, -18782737, -18055000, -17089807, -15819159, -14163628, -12074842, -9572608, -6763969, -3835680, -1019258, 1460375, 3432372, 4806004, 5571655, 5785779, 5550453, 4992191, 4241186, 3414270, 2606728, 1894131, 1338098, 987217, 870123, 987089, 1309618, 1790637, 2378537, 3027526, 3705512, 4407255, 5174019, 6106282, 7350653, 9056955, 11326111]
57000A1326111K854439L392323L845969M205625M463500M594273M556036M307623
56992D3545899L829844L141594K306119J423047O04409n8540n22415p98685r38567
56983E2532705j008084j069567j176032j370995j683442k118049k649521l225487
56975C8231528l772857m203864m428220m378979m044992l488433k830334k207933
56967H875916j726365j429998j305386j308179j392741j525298j677096j810560
56959c299707j874734j815713j594044j197150o42435K3436P24566J360924J828809
56950f486048K054236K020205J770027J387569R68106N89125K84781L4266k21851
56941B400416n40663r38769j382645j805236k126955k270417k177208j831616
$$ y = [11326111, 14180550, 17572873, 21418842, 25624467, 30087967, 34682240, 39238276, 43545899, 47375743, 50517337, 52823456, 54246503, 54850912, 54792372, 54269957, 53471272, 52532705, 51524621, 50455054, 49279022, 47908027, 46224585, 44106536, 41457015, 38231528, 34458671, 30254807, 25826587, 21447608, 17402616, 13914183, 11083849, 8875916, 7149551, 5719553, 4414167, 3105988, 1713247, 187949, -1489147, -3299707, -5174441, -6990154, -8584198, -9781348, -10423783, -10400347, -9675781, -8314857, -6486048, -4431812, -2411607, -641580, 745989, 1714095, 2303220, 2588001, 2622267, 2400416, 1859753, 920984, -461661, -2266897, -4393852, -6664269, -8841477, -10673093]
56933a0673093j276477o02475Q6159P05297J203940J558499J763683J829933J785902
56924c618632J679405J571615J521293J561123J678012J814256J895851J873628
56916I976551J752302J591673J481947J506036J703268K047710K450492K787054
56908B5297033K939378K836688K477881J925150J272414O09084L633m87372q04944
56899C6068945q93394p29690l54473J22528N53935Q11177Q37688O69453M11953
56890C7498122J90289J03581K02431M85119R00831J360167J760984K025181K123581
56881D6650286K068693J881705J562865J089819M42434l66933j277775k187112
56873D9863982k972425l522333l763736l676856l297056k707298k022931j368256
$$ y = [-10673093, -11949570, -12552045, -12465886, -11760589, -10556649, -8998150, -7234467, -5404534, -3618632, -1939227, -367612, 1153681, 2714804, 4392816, 6207072, 8102923, 9976551, 11728853, 13320526, 14802473, 16308509, 18011777, 20059487, 22509979, 25297033, 28236411, 31073099, 33550980, 35476130, 36748544, 37357628, 37361261, 36873889, 36068945, 35175551, 34445861, 34091388, 34213916, 34767851, 35579028, 36416716, 37086169, 37498122, 37688411, 37791992, 37994423, 38479542, 39380373, 40740540, 42501524, 44526705, 46650286, 48718979, 50600684, 52163549, 53253368, 53695802, 53328869, 52051094, 49863982, 46891557, 43369224, 39605488, 35928632, 32631576, 29924278, 27901347, 26533091]
56865B6533091q49089n31700m35530n37509p81715j091861j386717j597275j683658
56856A7638037j649705j548367j466708j488440j651126j923502k214583k406514
56848C289092k395584k127439j613153r16901j21874P02207J509208K264813K930661
56839C521030L460178L808502L948711L884510L653151L317904K953568K628508
56831C1176062K386278K232544K135118K038810J886727J637348J274562Q13884
56823D5581333L03617j86100n88605q68828j034984j123423j166716j170000j115287
56814C8631007r89610q11664o33943n20147n16435o33504q42899j084328j283156
56805C1315321j377192j343422j208562j033616q80484p83151p42649p44948p81758
$$ y = [26533091, 25684002, 25152302, 24716772, 24179263, 23397548, 22305687, 20918970, 19321695, 17638037, 15988332, 14439965, 12973257, 11484817, 9833691, 7910189, 5695606, 3289092, 893508, -1233931, -2847084, -3763985, -3885859, -3183652, -1674444, 590369, 3521030, 6981208, 10789710, 14738421, 18622931, 22276082, 25593986, 28547554, 31176062, 33562340, 35794884, 37930002, 39968812, 41855539, 43492887, 44767449, 45581333, 45884950, 45698850, 45110245, 44241417, 43206433, 42083010, 40916294, 39746294, 38631007, 37641397, 36829733, 36195790, 35675643, 35159208, 34525704, 33682805, 32598477, 31315321, 29938129, 28594707, 27386145, 26352529, 25472045, 24688894, 23946245, 23201297, 22419539]
56796B2419539q54903r64203j094563j213704j277670j237769j051353p00853
56788A4024521k12442L44397Q83402J337255J676003J897348K001451J973554
56780B3925489J789547J441109R60474M22762p9613m73153p26221q50002q86582
56771B5523810q94537r32931j042569j231043j470689j710000j889982j957804
56763A4394255j876619j633346j244176p54392k28547K68417O89521J010707J220529
56754A1846349J309611J275130J135258R32310P14265N09693L19129J27508p7636
56745A8091617k96312n13865o99807q09887p99928o50770l87259p2615K22159
56736A4083333M53113O19270P52439Q91330J056586J239429J408027J525589J567981
$$ y = [22419539, 21564636, 20600433, 19505870, 18292166, 17014496, 15776727, 14725374, 14024521, 13812079, 14156476, 15039878, 16377133, 18053136, 19950484, 21951935, 23925489, 25715036, 27156145, 28116619, 28539381, 28459768, 27986615, 27260394, 26410392, 25523810, 24629273, 23696342, 22653773, 21422730, 19952041, 18242041, 16352059, 14394255, 12517636, 10884290, 9640114, 8885722, 8657175, 8925592, 9615113, 10625820, 11846349, 13155960, 14431090, 15566348, 16498658, 17212923, 17722616, 18041745, 18169253, 18091617, 17795305, 17281440, 16581633, 15771746, 14971818, 14321048, 13933789, 13861174, 14083333, 14536446, 15155716, 15908155, 16799485, 17856071, 19095500, 20503527, 22029116, 23597097]
56727B3597097J531656J431160J289427J122906R26920O73593L30639j09871o16919
56718C0176608j133258j604215k000290k320137k575378k768692k881036k880064
56710A2013538k746166k495775k181523j867482j596745j373097j168389r50084
56702b365723p08194m59883k29561k6143J58612L30263M72930N52858N43848M53508
56692a277485L26981K23160J83727K23261L46321N66481R00172J339277J832593
56683D664488K296804K647755K828674K822162K647183K346743J971427J564290
56675B3789526J152350P46584L48606m0476m14201p59996j061160j299917j464840
56666B0996476j563825j632693j725837j890943k147171k481615k858294l225852
$$ y = [23597097, 25128753, 26559913, 27849340, 28972246, 29899166, 30572759, 30903398, 30793527, 30176608, 29043350, 27439135, 25438845, 23118708, 20543330, 17774638, 14893602, 12013538, 9267372, 6771597, 4590074, 2722592, 1125847, -247250, -1415639, -2365723, -3073917, -3533800, -3763361, -3789504, -3630892, -3300629, -2827699, -2274841, -1730993, -1277485, -950504, -727344, -543617, -320356, 25965, 592446, 1492618, 2831895, 4664488, 6961292, 9609047, 12437721, 15259883, 17907066, 20253809, 22225236, 23789526, 24941876, 25688460, 26037066, 25996590, 25582389, 24822393, 23761233, 22461316, 20996476, 19432651, 17799958, 16074121, 14183178, 12036007, 9554392, 6696098, 3470246]
56658C470246l522260l685248l669810l462438l083133k577420k005329j430326
56650a9965718r07836m75015j46437Q0654K13741K53733J94904L6858k02889m88479
56640b1406484p76962j028596j207930j282272j229067j051850p90833n16028
56632b9290022l05271k19725k87048m95516q00316j142737j475049j774481k034543
56623c7824708k242617k367300k368040k215121j899486j427778q16194r4724
56615e1255968O83459J442377K099866K590856K880965K963902K852736K581113
56607c3160694K215984J862806J642444J643723J882393K296626K781065L234867
56599a5600786L597291L859808M056212M235211M423477M596181M675196M561547
$$ y = [3470246, -52014, -3737262, -7407072, -10869510, -13952643, -16530063, -18535392, -19965718, -20873554, -21348569, -21495006, -21414352, -21200611, -20946878, -20751974, -20715116, -20918005, -21406484, -22183446, -23212042, -24419972, -25702244, -26931311, -27983161, -28773994, -29290022, -29595293, -29815018, -30102066, -30597582, -31397898, -32540635, -34015684, -35790165, -37824708, -40067325, -42434625, -44802665, -47017786, -48917272, -50345050, -51161244, -51255968, -50572509, -49130132, -47030266, -44439410, -41558445, -38594543, -35741807, -33160694, -30944710, -29081904, -27439460, -25795737, -23913344, -21616718, -18835653, -15600786, -12003495, -8143687, -4087475, 147736, 4571213, 9167394, 13842590, 18404137]
56591A8404137M185742L547469K724055J845433J048540M30643K0881k18743l66730
56582C1621427n06660p00360r75880j325581j708349k055788k286406k328634
56574A9733769k145463j748642j194802n66642N1308N95193J038643J397079J711235
56565A8871678K013343K296878K512637K593674K489665K189318J723951J157192
56557C5848336N67482K8834m03955p01617q60667r03065q75108q38989q53437
56548C1007814r50644j122016j318847j463886j468333j254612p85212q6477P52296
56539B3310083J612388K393114L040439L539923L887920M069781M061137L845381
56531D9760166L430345K853966K180708J494702Q90320M54428K37385K24036L27822
$$ y = [18404137, 22589879, 26137348, 28861403, 30706836, 31755376, 32186019, 32206900, 31988157, 31621427, 31114767, 30414407, 29438527, 28112946, 26404597, 24348809, 22062403, 19733769, 17588306, 15839664, 14644862, 14078220, 14129528, 14724721, 15763364, 17160443, 18871678, 20885021, 23181899, 25694536, 28288210, 30777875, 32967193, 34691144, 35848336, 36415818, 36444652, 36040697, 35339080, 34478413, 33575348, 32700240, 31861251, 31007814, 30057170, 28935154, 27616307, 26152421, 24684088, 23429476, 22644264, 22557787, 23310083, 24922471, 27315585, 30356024, 33895947, 37783867, 41853648, 45914785, 49760166, 53190511, 56044477, 58225185, 59719887, 60610207, 61064635, 61302020, 61526056, 61853878]
56522F1853878M22945M01278K17509j06712n15474r56878j398684j819211k191755
56513E5906896k479848k645705k662149k517882k214239j759865j171410m81744
56505C9974054K51077R43517J499489J833432J895021J685958J262529P23804
56497E0068881J89319k30409m66637n16461m39543l20182k15696j28089j7819
56488D7923364J56994M07346P01519R70047J122007J073839P85460K83928l43373
56479E3081131r82262j530212j921796k138516k206333k179952k114101k033810
56471C7974149j923238j742239j459238j077811o41400k16574J33566L71767M94759
56462C1913741N24445M88325M00785K55070K8649l02063p44353j276164j842809
$$ y = [61853878, 62276823, 62678101, 62895610, 62788898, 62273424, 61316546, 59917862, 58098651, 55906896, 53427048, 50781343, 48119194, 45601312, 43387073, 41627208, 40455798, 39974054, 40225131, 41168648, 42668137, 44501569, 46396590, 48082548, 49345077, 50068881, 50258200, 50027791, 49561154, 49044693, 48605150, 48284968, 48069272, 47941183, 47923364, 48080358, 48487704, 49189223, 50159270, 51281277, 52355116, 53140576, 53424504, 53081131, 52098869, 50568657, 48646861, 46508345, 44302012, 42122060, 40007959, 37974149, 36050911, 34308672, 32849434, 31771623, 31130223, 30913649, 31047215, 31418982, 31913741, 32438186, 32926511, 33327296, 33582366, 33611015, 33308952, 32564599, 31288435, 29445626]
56453B9445626k365845k761953k965232k944433k708785k302345j793311j264434
56445A0339288q02301m77591l16677k82203k85161k31185p4660J55457L73898
56436H398865M85859M31546K06722j42365n37839q89894j112108j135169r24068
56427D781549m97238O3888O29018J059521J259192J208366R62147O15893K62414
56418A0344750l1168k17660k51846q6338L08872R17412J661262K412388L029243
56409A8086915L404165L498849L345329L009782K545733J971507J282122M76196
56401C7620598m24623j369259k281105l073808l677191m057727m216616m169239
56393A4351030l927776l501249k906324k174571j351547m92011L44870J100325
$$ y = [29445626, 27079781, 24317828, 21352596, 18408163, 15699378, 13397033, 11603722, 10339288, 9536987, 9059396, 8742719, 8460516, 8175355, 7944170, 7869510, 8024967, 8398865, 8884724, 9316270, 9522992, 9380627, 8842788, 7952894, 6840786, 5705617, 4781549, 4284311, 4348199, 4977217, 6036738, 7295930, 8504296, 9466443, 10082336, 10344750, 10313582, 10095922, 9844076, 9757738, 10066610, 10984022, 12645284, 15057672, 18086915, 21491080, 24989929, 28335258, 31345040, 33890773, 35862280, 37144402, 37620598, 37195975, 35826716, 33545611, 30471803, 26794612, 22736885, 18520269, 14351030, 10423254, 6922005, 4015681, 1841110, 489563, -2448, 342422, 1442747]
56385A442747J721812K170534K429483K507017K430427K231660J936303J564329
56377A8434312J138753O91168K58588j25416m40088o83834q73857j036056j188175
56368A6175395j325402j416240j409243j247734q90761l36597L62771J109783
56360A1021972J792683K322527K654573K788538K758506K622772K452383K313539
56352C0727493K247754K261155K328897K409670K461035K450189K358991K183308
56344D9428492J928230J602843J217890P85889L20885j63283o54036j138110j597591
56335E1731209k007975k341424k574167k693781k703297k622494k487132k343620
56327C1957319k236314k191087k205848k255975k310802k348719k363013k361422
$$ y = [1442747, 3164559, 5335093, 7764576, 10271593, 12702020, 14933680, 16869983, 18434312, 19573065, 20264233, 20522821, 20397405, 19957317, 19273483, 18399626, 17363570, 16175395, 14849993, 13433753, 12024510, 10776776, 9886015, 9549418, 9912189, 11021972, 12814655, 15137182, 17791755, 20580293, 23338799, 25961571, 28413954, 30727493, 32975247, 35236402, 37565299, 39974969, 42436004, 44886193, 47245184, 49428492, 51356722, 52959565, 54177455, 54963344, 55284229, 55120946, 54466910, 53328800, 51731209, 49723234, 47381810, 44807643, 42113862, 39410565, 36788071, 34300939, 31957319, 29721005, 27529918, 25324070, 23068095, 20757293, 18408574, 16045561, 13684139]
56319A3684139k365610k408486k521579k713324k953949l182654l333603l359758
56311i154824l238981k967508k556537k037424j466148r15909m56834j31354O2441
56302b2863078J68770K51421L62251N20840P15898R20133J102420J231795J281590
56293a6307960J240454J122824R64593Q01320O45056M80233K83359N0790j86389
56284a0905720l69472m35824l47076j09439K24578N76760Q75729J081573J189099
56275h219792J214308J178884J102749J005011R09938Q53894Q85715J052807J376118
56266A359632J831166K351965K857351L281800L592008L782806L859179L817760
56258B6733667L641667L314349K842390K266556J648226J040112M64123q8008
$$ y = [13684139, 11318529, 8910043, 6388464, 3675140, 721191, -2461463, -5795066, -9154824, -12393805, -15361313, -17917850, -19955274, -21421422, -22337331, -22794165, -22925519, -22863078, -22694308, -22442887, -22080636, -21559796, -20843898, -19923765, -18821345, -17589550, -16307960, -15067506, -13944682, -12980089, -12178769, -11533713, -11053480, -10770121, -10719331, -10905720, -11275192, -11711016, -12058092, -12167531, -11942953, -11366193, -10490464, -9408891, -8219792, -7005484, -5826600, -4723851, -3718840, -2808902, -1955008, -1069293, -16486, 1359632, 3190798, 5542763, 8400114, 11681914, 15273922, 19056728, 22915907, 26733667, 30375334, 33689683, 36532073, 38798629, 40446855, 41486967, 41951090, 41863082]
56250D1863082o34682j181049j707353k173824k535477k755482k811641k699555
56242B5364019k435881k056566j604418j113564o06658j08270L41674O90797Q91588
56233A9362721R18514P75294M92126J15130l08475p41761j158744j535445j839037
56224A6080323k021767k025280j801729j348707p35095q8860M56195Q21417J010602
56215A0347099J089082J133577J184977J228392J206940J056877P41520K66800
56207A8255264l22449r55964j553695k042294k371401k525465k526017k422080
56199C535899k270124k110079j949266j765341j528198j226069q77362n22840
56191h713380k09354K1513J39693J35491K9590j29557k87752m13276n11183o17092
$$ y = [41863082, 41228400, 40047351, 38339998, 36166174, 33630697, 30875215, 28063574, 25364019, 22928138, 20871572, 19267154, 18153590, 17546932, 17438662, 17780336, 18471133, 19362721, 20281235, 21056529, 21548655, 21663785, 21355310, 20613549, 19454805, 17919360, 16080323, 14058556, 12033276, 10231547, 8882840, 8147745, 8058885, 8515080, 9336497, 10347099, 11436181, 12569758, 13754735, 14983127, 16190067, 17246944, 17988464, 18255264, 17932815, 16976851, 15423156, 13380862, 11009461, 8483996, 5957979, 3535899, 1265775, -844304, -2793570, -4558911, -6087109, -7313178, -8190540, -8713380, -8922734, -8901221, -8761528, -8626037, -8596447, -8726004, -9013756, -9427032, -9938215, -10555307]
56181a0555307p76769j017013j314344j581097j691823j545230j120579m86291
56173b0088453K42507R62609J619511K208366K749052L255426L716500M096624
56165a237858M349580M436018M336331M056000L623490L083477K488981J893064
56157B7029083J338989Q52150M40371J02128j67722l81252n62121p40421r39465
56148B6971740j166022j409220j644127j838184j964027k016889k024714k039484
56140A2869073k111194k258907k457376k650835k788433k858205k894336k951981
56132h102194l067976l233145l390874l460183l369879l085943k619892k019545
56124c2349631j353986p01167j36606K80227N17411N71747M58963K03631j59687
$$ y = [-10555307, -11332076, -12349089, -13663433, -15244530, -16936353, -18481583, -19602162, -20088453, -19845946, -18883337, -17263826, -15055460, -12306408, -9050982, -5334482, -1237858, 3111722, 7547740, 11884071, 15940071, 19563561, 22647038, 25136019, 27029083, 28368072, 29220222, 29660593, 29762721, 29594999, 29213747, 28651626, 27911205, 26971740, 25805718, 24396498, 22752371, 20914187, 18950160, 16933271, 14908557, 12869073, 10757879, 8498972, 6041596, 3390761, 602328, -2255877, -5150213, -8102194, -11170170, -14403315, -17794189, -21254372, -24624251, -27710194, -30330086, -32349631, -33703617, -34404784, -34541390, -34261163, -33743752, -33172005, -32713042, -32509411, -32669098]
56115c2669098n74692r55809j200405j219621r68177m54118K71076J126932K014009
56106c4629903K824895L462448L859379L987971L857734L508493L003979K422208
56098g702796J838447J306428Q51045M79549K01344L7532J1081J28200L68347
56089b480823O88602J033768J343595J557757J623634J507656J205649P46411
56081G226249J84425m17680j009285j563264k072342k532846k924624l198525
56073f307892l282248l107980k650215j951450j118769k91471M05035Q98012J181251
56064a6225727J300200J323501J322270J362237J494612J736696K056747K384164
56056c245300K643270K785924K803656K722668K593857K480178K436088K481909
$$ y = [-32669098, -33243790, -34199599, -35400004, -36619625, -37587802, -38041920, -37770844, -36643912, -34629903, -31805008, -28342560, -24483181, -20495210, -16637476, -13128983, -10125004, -7702796, -5864349, -4557921, -3706876, -3227327, -3025983, -2988451, -2977370, -2849170, -2480823, -1792221, -758453, 585142, 2142899, 3766533, 5274189, 6479838, 7226249, 7410674, 6992994, 5983709, 4420445, 2348103, -184743, -3109367, -6307892, -9590140, -12698120, -15348335, -17299785, -18418554, -18710025, -18304990, -17406978, -16225727, -14925527, -13602026, -12279756, -10917519, -9422907, -7686211, -5629464, -3245300, -602030, 2183894, 4987550, 7710218, 10304075, 12784253, 15220341, 17702250]
56048A7702250K588040K682829K682817K528629K207294J752950J231344P17599
56040C4093752K73077p4452l40087n74511q43558j205225j691055k291869k950232
56031B4395840l568686m038724m279376m263685m019170l606916l096181k549429
56023e026327k020804j559018j202734r66696q31187p48756o66541n47318l76470
56014a3945851j58736Q5178L22430N19404O57134P35346P59201P24823O23855
56005i677216M64615K86797J53512J27896K51831N34293R46006J419389J859784
55996c633093K171350K289704K205932J969994J671776J407454J244263J198428
55988A0525808J236998J302539J344249J334435J263674J128724R31567O89818
$$ y = [17702250, 20290290, 22973119, 25655936, 28184565, 30391859, 32144809, 33376153, 34093752, 34366829, 34292377, 33952290, 33377779, 32534221, 31328996, 29637941, 27346072, 24395840, 20827154, 16788430, 12509054, 8245369, 4226199, 619283, -2476898, -5026327, -7047131, -8606149, -9808883, -10775579, -11606766, -12355522, -13022063, -13569381, -13945851, -14104587, -14019409, -13696979, -13177575, -12520441, -11785095, -11025894, -10301071, -9677216, -9212601, -8925804, -8772292, -8644396, -8392565, -7858272, -6912266, -5492877, -3633093, -1461743, 827961, 3033893, 5003887, 6675663, 8083117, 9327380, 10525808, 11762806, 13065345, 14409594, 15744029, 17007703, 18136427, 19067994, 19757812]
55980A9757812M41767K33745R7133L2803J3473J040l1780q7411j44906j74867
55970B0138809j55375p7306O0211K53699M92409P53262J001495J198437J311631
55961B4977272J322822J232334J059276Q36817O03702L95642K39970J53095J38784
55952C0959714J87393K78133L83312M70555N03124M45283K76094J895l47145p35943
55942C2422415j141191j551209j954469k333842k673513k969188l228710l460456
55934A3109837l658289l794641l826821l711804l421360k953732k342193j655585
55926a2254588r81205l90615R1862M94224Q71799J270871J701918K130901K488174
55917d576659K692877K685570K453993K037821J511675R59376M54074N0305k15501
$$ y = [19757812, 20199579, 20433324, 20530457, 20563260, 20576733, 20577773, 20545993, 20458582, 20313676, 20138809, 19983434, 19906128, 19966339, 20220038, 20712447, 21465709, 22467204, 23665641, 24977272, 26300094, 27532428, 28591704, 29428521, 30032223, 30427865, 30667835, 30820930, 30959714, 31147107, 31425240, 31808552, 32279107, 32782231, 33227514, 33503608, 33505503, 33158358, 32422415, 31281224, 29730015, 27775546, 25441704, 22768191, 19799003, 16570293, 13109837, 9451548, 5656907, 1830086, -1881718, -5303078, -8256810, -10599003, -12254588, -13235793, -13626408, -13534546, -13040322, -12168523, -10897652, -9195734, -7064833, -4576659, -1883782, 801788, 3255781, 5293602, 6805277, 7764653, 8218727, 8269032, 8053531]
55908H053531l22971k68315o7000K44029O06638R47027J190770J288119J239703
55899A2911531J104576R78762R51547J063000J286076J541017J730870J778174
55891B3345553J647750J351602R39421M79580L6913l43492o38807q39133r38075
55882B5041312r33536q37206o80514n06247l47682k10341p3005Q9565K78413M59273
55872B2280032N78499N95488N08977L58363J98097O3440m5454j48193k52400l34883
55862B3801966l50979k60949n2469K51553N98501R22480J169377J321214J404008
55853B8804702J469795J560969J678776J776647J783388J641590J336752R01095
55845D0953714L96032j09445n50984q71689j023335r71460p04040k40265L64406
$$ y = [8053531, 7730560, 7462245, 7395245, 7639274, 8245912, 9192939, 10383709, 11671828, 12911531, 14016107, 14994869, 15946416, 17009416, 18295492, 19836509, 21567379, 23345553, 24993303, 26344905, 27284326, 27763906, 27800819, 27457327, 26818520, 25979387, 25041312, 24107776, 23270570, 22590056, 22083809, 21736127, 21525786, 21452781, 21542346, 21820759, 22280032, 22858531, 23454019, 23962996, 24321359, 24519456, 24582896, 24537442, 24389249, 24136849, 23801966, 23450987, 23190038, 23137569, 23389122, 23987623, 24910103, 26079480, 27400694, 28804702, 30274497, 31835466, 33514242, 35290889, 37074277, 38715867, 40052619, 40953714, 41349746, 41240301, 40689317, 39817628, 38794293, 37822833, 37118793, 36878528, 37242934]
55836C7242934J020536J616622K040257K205048K076241J684712J119611M98901
55828D9504862o9984n20706q37898j046604j188013j288872j335560j269652j016916
55819D0930657n39187J24107Q56119J506363J948763K118263K011105J661145
55811E0617335J116792M33946l19165j061036j709921k206061k530317k709932
55803D1631641k808848k903047l045553l234433l402846l441793l247389k769332
55795A6778400k036279j146400k29840N95955J255893J722537K003624K125258
55787B1069148K121158K030819J901894J786550J724460J719123J727780J681031
55779C5761963J525751J263947R60986P17054O18921O98778R19862J191920J405049
$$ y = [37242934, 38263470, 39880092, 41920349, 44125397, 46201638, 47886350, 49005961, 49504862, 49434878, 48914172, 48076274, 47029670, 45841657, 44552785, 43217225, 41947573, 40930657, 40391470, 40515577, 41371696, 42878059, 44826822, 46945085, 48956190, 50617335, 51734127, 52168073, 51848908, 50787872, 49077951, 46871890, 44341573, 41631641, 38822793, 35919746, 32874193, 29639760, 26236914, 22795121, 19547732, 16778400, 14742121, 13595721, 13365881, 13961836, 15217729, 16940266, 18943890, 21069148, 23190306, 25221125, 27123019, 28909569, 30634029, 32353152, 34080932, 35761963, 37287714, 38551661, 39512647, 40229701, 40848622, 41547400, 42467262, 43659182, 45064231]
55770D5064231J466024J325487R90462N20952J2431m31163p27035q36937p74192
55761D6610260n89173l41143p5819J76933L90353N32405N74278N08938L61644
55752D8148676J82098K4314p1009q2719p392J43090L44318N68238P96264J022709
55742E1068587J238892J410584J475059J368244J062561N86347J5039n52376j015189
55733E6657748j287168j311238j072334o01696L2886P47975J466895K133534K714182
55724E9480784L192382L564952L842438M049032M215311M365173M507800M643860
55716I1861732M781378M944422N162236N445373N769047O077302O302785O387370
55708A36731645O296390O029043N624458N153603M691249M280789L916764L557288
$$ y = [45064231, 46530255, 47855742, 48846204, 49367156, 49379587, 48948424, 48221389, 47384452, 46610260, 46021087, 45679944, 45604125, 45781058, 46171411, 46703816, 47278094, 47787032, 48148676, 48330774, 48355088, 48284079, 48201360, 48193968, 48337058, 48681376, 49249614, 50045878, 51068587, 52307479, 53718063, 55193122, 56561366, 57623927, 58210274, 58225313, 57672937, 56657748, 55370580, 54059342, 52987008, 52385312, 52418198, 53166173, 54633068, 56766602, 59480784, 62673166, 66238118, 70080556, 74129588, 78344899, 82710072, 87217872, 91861732, 96643110, 101587532, 106749768, 112195141, 117964188, 124041490, 130344275, 136731645, 143028035, 149057078, 154681536, 159835139, 164526388, 168807177, 172723941, 176281229]
55700A76281229L153432K673107K110567J488796Q61129L06710q6616k45927j29063
55691A86413364K72952R38750J815999K820547L844904M777259N520863O004206
55683B12408844O183781O048075N625748M990182M249410L520002K897323K439787
55675B48363152K174546K114103K265130K620974L146928L773982M408487M954635
55667B73821937N343234N558215N647333N704279N825624O066365O420412O832875
55659C21220274P229628P545158P739842P807241P773629P689324P611324P581527
55651C82197947P611319P683231P768763P847081P908460P942123P923524P814790
55643D44697238P578460P195273O677013O068879N438735M855483M365724L979198
$$ y = [176281229, 179434661, 182107768, 184218335, 185707131, 186568260, 186874970, 186788354, 186542427, 186413364, 186686316, 187625066, 189441065, 192261612, 196106516, 200883775, 206404638, 212408844, 218592625, 224640700, 230266448, 235256630, 239506040, 243026042, 245923365, 248363152, 250537698, 252651801, 254916931, 257537905, 260684833, 264458815, 268867302, 273821937, 279165171, 284723386, 290370719, 296074998, 301900622, 307966987, 314387399, 321220274, 328449902, 335995060, 343734902, 351542143, 359315772, 367005096, 374616420, 382197947, 389809266, 397492497, 405261260, 413108341, 421016801, 428958924, 436882448, 444697238, 452275698, 459470971, 466147984, 472216863, 477655598, 482511081, 486876805, 490856003]
55635D90856003L667193L371375L019201K544267J908762J120646K35857o59218
55627E06064086j478656k165720k704902l114381l428124l679922l895799m093740
55619D81502842m285904m478959m672602m860290n034955n195082n344126n484340
55611D42146584n615049n739741n871831o026717o204573o383027o530764o630730
55603C93144152o691948o741879o809894o916025p067343p253902p439571p556502
55595C36667088p519061p262847o792097o203166n659729n325587n292383n545269
55587B87066949n982856o470394o889393p162230p255326p173720o952899o646570
55579B32533561o310908n989677n704958n456569n230070n008311m779240m539067
$$ y = [490856003, 494523196, 497894571, 500913772, 503458039, 505366801, 506487447, 506723304, 506064086, 504585430, 502419710, 499714808, 496600427, 493172303, 489492381, 485596582, 481502842, 477216938, 472737979, 468065377, 463205087, 458170132, 452975050, 447630924, 442146584, 436531535, 430791794, 424919963, 418893246, 412688673, 406305646, 399774882, 393144152, 386452204, 379710325, 372900431, 365984406, 358917063, 351663161, 344223590, 336667088, 329148027, 321885180, 315093083, 308889917, 303230188, 297904601, 292612218, 287066949, 281084093, 274613699, 267724306, 260562076, 253306750, 246133030, 239180131, 232533561, 226222653, 220232976, 214528018, 209071449, 203841379, 198833068, 194053828, 189514761]
55571A89514761m296585m078870l926489l870252l903581l976282m017516l969492
55563A57475694l811057l568162l314892l157706l193835l457553l890291m360590
55555A28721608m722784m875319m784984m472618l982588l363032k667082j963397
55547I7889804j336843q71929o28532o24494q31956j186323j604961k012191k361983
55538H6430592k646676k886865l110964l338540l574097l807631m016774m171319
55530E8877726m242493m213795m086140l874803l602963l297158k983936k683970
55522B9892468k404161k133389j846266j512664j107467o18152n1520N61581J170020
55513B1950450J718466K167407K501025K716286K804972K746864K520583K123822
$$ y = [189514761, 185218176, 181139306, 177212817, 173342565, 169438984, 165462702, 161445186, 157475694, 153664637, 150096475, 146781583, 143623877, 140430042, 136972489, 133082198, 128721608, 123998824, 119123505, 114338521, 109865903, 105883315, 102520283, 99853201, 97889804, 96552961, 95681032, 95052500, 94428006, 93596050, 92409727, 90804766, 88792575, 86430592, 83783916, 80897051, 77786087, 74447547, 70873450, 67065819, 63049045, 58877726, 54635233, 50421438, 46335298, 42460495, 38857532, 35560374, 32576438, 29892468, 27488307, 25354918, 23508652, 21995988, 20888521, 20270369, 20218849, 20780430, 21950450, 23668916, 25836323, 28337348, 31053634, 33858606, 36605470, 39126053, 41249875]
55505D1249875J590741R97642M50989N7626j11308m3806K13130N72113R30904
55496D5907906J198297J317344J280109J127598R34393P82538P30853P89435R13157
55487E4981630J021523J034608R04051O25913K36389k03431o28913r92079j270985
55478E5708706j465388j585820j644276j649619j610370j547067j505099j547022
55470D3154045j716068j995591k303197k530002k594580k473256k196156j824927
55462B5520268j429196j067386p73806n56732m08918l22592k96614l30029m07954
55453A9927041m92514n28748m64380k71445M4270M50618R05188J366997J797365
55444B2734392K155189K397976K494644K443541K281164K071412J879132J742598
$$ y = [41249875, 42840616, 43838258, 44289247, 44346873, 44235565, 44191759, 44404889, 44977002, 45907906, 47106203, 48423547, 49703656, 50831254, 51765647, 52548185, 53279038, 54068473, 54981630, 56003153, 57037761, 57941812, 58567725, 58804114, 58600683, 57971770, 56979691, 55708706, 54243318, 52657498, 51013222, 49363603, 47753233, 46206166, 44701067, 43154045, 41437977, 39442386, 37139189, 34609187, 32014607, 29541351, 27345195, 25520268, 24091072, 23023686, 22249880, 21693148, 21284230, 20961638, 20665024, 20334995, 19927041, 19434527, 18905779, 18441399, 18169954, 18214224, 18664842, 19570030, 20937027, 22734392, 24889581, 27287557, 29782201, 32225742, 34506906, 36578318, 38457450, 40200048]
55436D0200048J659254J589783J476158J264780R25592M60793r8113o99995j282534
55427D5495766j775711k105269k205823k047120j663249j164511p14972m76604
55419C3342507n44169r08116j470370k102040k699893l202346l566533l744739
55411A5104301l692176l397851k903310k288167j635420j004399m24754R6589
55403a45187N69435J018720J479043J977271K507746L017832L419979L627746
55395A7472585L593398L322864K862542K274298J620536R66158L83427n9930l31046
55386C2104832m57112n17479n99642p47720r39386j104785j171116j102988r16459
55377B4548145o64019m05655j86612l2671M2861L3710n7125k12935m04468n96618
$$ y = [40200048, 41859302, 43449085, 44925243, 46190023, 47115615, 47576408, 47478295, 46778300, 45495766, 43720055, 41614786, 39408963, 37361843, 35698594, 34534083, 33819111, 33342507, 32798338, 31890222, 30419852, 28317812, 25617919, 22415573, 18849040, 15104301, 11412125, 8014274, 5110964, 2822797, 1187377, 182978, -241776, -145187, 424248, 1442968, 2922011, 4899282, 7407028, 10424860, 13844839, 17472585, 21065983, 24388847, 27251389, 29525687, 31146223, 32112381, 32495808, 32435878, 32104832, 31647720, 31130241, 30530599, 29782879, 28843493, 27738708, 26567592, 25464604, 24548145, 23884126, 23478471, 23291859, 23259188, 23302049, 23335759, 23278634, 23065699, 22661231, 22064613]
55367B2064613p54220q43909q37016p18631m97897k07533J11094M25029P13812
55358A9455342R60882J146300J249197J254156J154022R52232O70185L53871O6692
55349B7262879j34181k23666k18969j68433j28406j42672k31907l89773n80349
55340B5044523p41885q07399p37975n43167k67580M3468L63082O69720R23264
55331B3946051J062732J032255Q14207M45166N031m15030p49025r76033j113310
55322B4052044j192982j242558j277014j294514j270773j161813r25757n54773
55314A5131860r2054L82738P89935J080851J243136J283175J205630J008296O94463
55305B2728030K90463j46362n35837p95005q60256p04018l45407J43849O43646
$$ y = [22064613, 21310393, 20466484, 19629468, 18910837, 18412940, 18205407, 18316501, 18741530, 19455342, 20416224, 21562524, 22811721, 24065877, 25219899, 26172131, 26842316, 27196187, 27262879, 27128698, 26905032, 26686063, 26517630, 26389224, 26246552, 26014645, 25624872, 25044523, 24302638, 23495239, 22757264, 22214097, 21946517, 21989985, 22353067, 23022787, 23946051, 25008783, 26041038, 26855245, 27300411, 27305442, 26890412, 26141387, 25165354, 24052044, 22859062, 21616504, 20339490, 19044976, 17774203, 16612390, 15686633, 15131860, 15039806, 15422544, 16212479, 17293330, 18536466, 19819641, 21025271, 22033567, 22728030, 23018493, 22872131, 22336294, 21541289, 20681033, 19977015, 19631608, 19775457, 20419103]
55296B0419103J011258J130136R60157N55259L2206m88847r29440j255756j449058
55287A9985018j479208j308630r21647l49102L35593J044182J699678K243093
55279B1248977K626381K808590K762548K484161J994440J334016N57132k71143
55271C5545102j078190j793093k361010k754250k971367l024831k928264k694762
55263A5939335k346534j924380j485891j092677p96048o28267n98209o87891q51873
55254E527565j025777j145534j168873j086928r21125p11832n08453l63103l21540
55245a725600m07741o10008q82210j163750j404992j579497j676826j687773j600095
55236a2738492j411565j147925q63668o15379m24077k59152o1811K09427N48028
$$ y = [20419103, 21430361, 22560497, 23520654, 24075913, 24108119, 23619272, 22689832, 21434076, 19985018, 18505810, 17197180, 16275533, 15926431, 16262024, 17306206, 19005884, 21248977, 23875358, 26683948, 29446496, 31930657, 33925097, 35259113, 35816245, 35545102, 34466912, 32673819, 30312809, 27558559, 24587192, 21562361, 18634097, 15939335, 13592801, 11668421, 10182530, 9089853, 8293805, 7665538, 7067329, 6379438, 5527565, 4501788, 3356254, 2187381, 1100453, 179328, -532504, -1040957, -1404060, -1725600, -2133341, -2743349, -3625559, -4789309, -6194301, -7773798, -9450624, -11138397, -12738492, -14150057, -15297982, -16161650, -16777029, -17201106, -17460258, -17522069, -17312642, -16764614]
55227a6764614R04114J212261J416712J481905J394444J165258Q32076M56714
55219g901130J12545j37947k69165l08376l28696m19260o48120j035819j546279
55210a2482247k091862k550986k800005k753974k397334j784358j007736j57167
55202b8025669P04770J539447K313579K984684L501971L822054L931191L861323
55194e366650L686439L494569L347941L256035L179120L058157K850460K552120
55186B0058191K200738J861173J599556J453873J415461J435519J456498J448307
55178C2929316J422361J412579J438623J480929J486969J403418J210053R31721
55170D3715969O22794L38225J12082m5666j39362j77625j70445j30652p3689j4232
$$ y = [-16764614, -15860500, -14648239, -13231527, -11749622, -10355178, -9189920, -8357844, -7901130, -7788585, -7926532, -8195697, -8504073, -8832769, -9252029, -9900149, -10935968, -12482247, -14574109, -17125095, -19925100, -22679074, -25076408, -26860766, -27868502, -28025669, -27320899, -25781452, -23467873, -20483189, -16981218, -13159164, -9227973, -5366650, -1680211, 1814358, 5162299, 8418334, 11597454, 14655611, 17506071, 20058191, 22258929, 24120102, 25719658, 27173531, 28588992, 30024511, 31481009, 32929316, 34351677, 35764256, 37202879, 38683808, 40170777, 41574195, 42784248, 43715969, 44338763, 44676988, 44789070, 44743404, 44604042, 44426417, 44255972, 44125320, 44051631, 44037399]
55160D4037399L6263O7790O7933K1613q2347k41114m31830o15221p47355p92376
55150D1320755p29698n54961k78772P3545M61898Q34135J133447J309769J331839
55141D4901957J194162R13521N16065K5540n35221j129417j693820k146320k413811
55132C9632656k461131k300251j976760j549233j077781o22953k43037J9099J53761
55123B9574370J91261J88136J98352K46233L16564L66500L50824K44613N0602
55114C1727455k09697n11284q36175j175002j521817j865968k185327k446381
55106B0975804k614831k672623k630116k522767k391742k259311k114845j921403
55098A848166j640003j257631q03271l43317M2919K98319M16555M44999M54876
$$ y = [44037399, 44073662, 44141452, 44209385, 44230998, 44148651, 43907537, 43475707, 42860486, 42113131, 41320755, 40591057, 40036096, 39757324, 39830869, 40292767, 41126902, 42260349, 43570118, 44901957, 46096119, 47009640, 47525705, 47551245, 47016024, 45886607, 44192787, 42046467, 39632656, 37171525, 34871274, 32894514, 31345281, 30267500, 29644547, 29401510, 29420609, 29574370, 29765631, 29953767, 30152119, 30398352, 30714916, 31081416, 31432240, 31676853, 31727455, 31517758, 31006474, 30170299, 28995297, 27473480, 25607512, 23422185, 20975804, 18360973, 15688350, 13058234, 10535467, 8143725, 5884414, 3769569, 1848166, 208163, -1049468, -1852739, -2196056, -2153137, -1854818, -1438263, -993264, -538388]
55089e38388M94661N58128N90423N29005L52196J03250j25707k38490j78111N8469
55079A605436M37058R14000J450707K006424K519707K898641L035899K848998
55071A7716870K325836J545755O58525j69422q12012j216308j401943j435809
55063A7211492j397531j349721j324319j332124j390391j546996j877297k451060
55055D542053l290764m341834n458322o408439o922475o793620n984875m657950
55047c9316226l089763j540348j71596R48846J805569K410074K797048L017675
55039c3138721L122193L145508L104966L005069K843001K615808K329627K005818
55031a0966731J678403J382896J142672R61161Q24710P12532O05314M88623L55109
$$ y = [-538388, -43727, 514401, 1104824, 1633829, 1986025, 2089275, 1963568, 1725078, 1546967, 1605436, 2042494, 2956494, 4407201, 6413625, 8933332, 11831973, 14867872, 17716870, 20042706, 21588461, 22246986, 22077564, 21265552, 20049244, 18647301, 17211492, 15813961, 14464240, 13139921, 11807797, 10417406, 8870410, 6993113, 4542053, 1251289, -3090545, -8548867, -14957306, -21879781, -28673401, -34658276, -39316226, -42405989, -43946337, -44117933, -43169087, -41363518, -38953444, -36156396, -33138721, -30016528, -26871020, -23766054, -20760985, -17917984, -15302176, -12972549, -10966731, -9288328, -7905432, -6762760, -5801599, -4976889, -4264357, -3659043, -3170420, -2815311]
55022b815311K07764N8441q3267k22836l80233n72365p93140j009520j177414
55013f787881j264368j261653j178243j023909p97168m88902r8024L56360Q37985
55004a1705803J306828J726091K054349K235605K208191J936072J440709Q08052
54996B010094J65630l56062o62351p23374n82649l36613r3242O4830R3284j8906
54986d39359k53472n59842q57196j052122j066018q57255m29627J70342Q61371
54977d483178J539361K096209K445408K545494K407405K079581J620704J079153
54969A1330137M91043j07776o71488j148530j499633j716182j824074j869885
54961B983612j899539j942749k008377k087330k158308k194338k169554k065025
$$ y = [-2815311, -2607547, -2549106, -2632373, -2855209, -3235442, -3807807, -4600947, -5610467, -6787881, -8052249, -9313902, -10492145, -11516054, -12313222, -12802124, -12900148, -12543788, -11705803, -10398975, -8672884, -6618535, -4382930, -2174739, -238667, 1202042, 2010094, 2175724, 1819662, 1157311, 433937, -148712, -485325, -578567, -513737, -420453, -439359, -692831, -1252673, -2109869, -3161991, -4228009, -5085264, -5514891, -5344549, -4483178, -2943817, -847608, 1597800, 4143294, 6550699, 8630280, 10250984, 11330137, 11821180, 11713404, 11041916, 9893386, 8393753, 6677571, 4853497, 2983612, 1084073, -858676, -2867053, -4954383, -7112691, -9307029, -11476583, -13541608]
54953a3541608j872222j593752j242718q42454m25783k9651L16264O00293Q29398
54944a7802233J019644J186760J343804J502016J669297J848947K042303K249212
54936d940250K458078K631901K709459K631266K376474J985016J549364J180765
54928A2582073R69650R60632J149263J492079J919057K348160K706220K949198
54920B7076332L065864L061351K938357K694805K336206J885701J381076Q62406
54912D5302098L59421j14362n56612r62316j312313j576949j734538j790072j779797
54903C5834560j759656j785552j894753k094993k363944k656724k916584l086856
54895A7275498l124938l014704k767142k404263j937670j362879o78898Q0928
$$ y = [-13541608, -15413830, -17007582, -18250300, -19092754, -19518537, -19548188, -19231924, -18631631, -17802233, -16782589, -15595829, -14252025, -12750009, -11080712, -9231765, -7189462, -4940250, -2482172, 149729, 2859188, 5490454, 7866928, 9851944, 11401308, 12582073, 13551723, 14512355, 15661618, 17153697, 19072754, 21420914, 24127134, 27076332, 30142196, 33203547, 36141904, 38836709, 41172915, 43058616, 44439692, 45302098, 45661519, 45547157, 44990545, 44028229, 42715916, 41138967, 39404429, 37614357, 35834560, 34074904, 32289352, 30394599, 28299606, 25935662, 23278938, 20362354, 17275498, 14150560, 11135856, 8368714, 5964451, 4026781, 2663902, 1985004, 2065932]
54887B065932Q33168J459206J843214J910343J646380J096298L51226m67832j229671
54878I508264j818669k161944k245514k110102j829320j482765j136124q33225
54870d109399n98357m44176l79299m10635n39667p56521j035754j333933j588316
54861a1196057j720540j651942j329990p53776J7050Q76265J701119K384495K855977
54852h817399L084520L065490K805278K318647J641253Q42662K1117p23056j318969
54843B919543j741310k004621k144841k200376k198847k151519k057573j917547
54835a3497091j746709j575273j432443j327764j248182j174920j105443j060725
54827b4168550j071070j150801j279964j405553j461963j398238j195746q68191
$$ y = [2065932, 2899100, 4358306, 6201520, 8111863, 9758243, 10854541, 11205767, 10737935, 9508264, 7689595, 5527651, 3282137, 1172035, -657285, -2140050, -3276174, -4109399, -4707756, -5151932, -5531231, -5941866, -6481533, -7238054, -8273808, -9607741, -11196057, -12916597, -14568539, -15898529, -16652305, -16635255, -15758990, -14057871, -11673376, -8817399, -5732879, -2667389, 137889, 2456536, 4097789, 4940451, 4961568, 4238512, 2919543, 1178233, -826388, -2971229, -5171605, -7370452, -9521971, -11579544, -13497091, -15243800, -16819073, -18251516, -19579280, -20827462, -22002382, -23107825, -24168550, -25239620, -26390421, -27670385, -29075938, -30537901, -31936139, -33131885, -34000076]
54819c4000076m50306J1261M59604Q31121J072521J167167J149682J090949J058918
54810b7609159J081679J137827J177952J159878J074995R52887Q46340Q08538
54802a9369063Q75176J057831J346504J715193K125827K530294K873305L099826
54794c745107L169011L071236K838008K534068K231873J982917J802795J674387
54786A5559188J560838J420610J223713R66615O75474L90923J44788n2181k06214
54777B1683754l33213m58813o18482q45313j149933j510698j883818k224161k501333
54768A0157990k704242k835915k902593k902239k819394k630906k320532j894514
54760a0852345j387708q51584l26286J83710P05211J259952J825694K330648K686485
$$ y = [-34000076, -34450382, -34439121, -33979517, -33148396, -32075875, -30908708, -29759026, -28668077, -27609159, -26527480, -25389653, -24211701, -23051823, -21976828, -21023941, -20177601, -19369063, -18493887, -17436056, -16089552, -14374359, -12248532, -9718238, -6844933, -3745107, -576096, 2495140, 5333148, 7867216, 10099089, 12082006, 13884801, 15559188, 17120026, 18540636, 19764349, 20730964, 21406438, 21797361, 21942149, 21889968, 21683754, 21350541, 20891728, 20273246, 19427933, 18278000, 16767302, 14883484, 12659323, 10157990, 7453748, 4617833, 1715240, -1186999, -4006393, -6637299, -8957831, -10852345, -12240053, -13091637, -13417923, -13234213, -12529002, -11269050, -9443356, -7112708, -4426223]
54751d426223K831255K752329K485004K099630J684727J323811J069333R29118
54743A0748984Q77038Q78694R07506R36936R21843P96065M98045O840o40847j365219
54733A4565885k075909k698789l183757l497303l613102l512724l199068k712848
54725i927615k135949j571542j106555p75832n48874l48727r4367K57210O94232
54716a5558019J166982J621917K025069K358816K601439K714007K650461K384021
54708A964693J927901J334427O76226K6207n51419j001438j279440j360578j250890
54699D85689r92691o58220l30779p8196P0663J32689J53684J76263K13207K44005
54689e83686K35483J70895O8354k1874l9654N3576K49624M88974O81660P44512
$$ y = [-4426223, -1594968, 1157361, 3642365, 5741995, 7426722, 8750533, 9819866, 10748984, 11626022, 12504716, 13412222, 14349158, 15271001, 16067066, 16565111, 16571951, 15931104, 14565885, 12489976, 9791187, 6607430, 3110127, -502975, -4015699, -7214767, -9927615, -12063564, -13635106, -14741661, -15517493, -16066367, -16415094, -16509461, -16252251, -15558019, -14391037, -12769120, -10744051, -8385235, -5783796, -3069789, -419328, 1964693, 3892594, 5227021, 5903247, 5929454, 5378035, 4376597, 3097157, 1736579, 485689, -507002, -1165222, -1496001, -1574197, -1503534, -1370845, -1217161, -1040898, -827691, -583686, -348203, -177308, -108954, -130828, -170482, -116906, 132718, 621692, 1303352, 2047864]
54679B047864O36693L77339L7610k90444n34702o71069p21109p22957p00922o56840
54669a198537n81381m65343k99136o9414K33484N99293R88350J339688J592374
54660B139378J707421J679909J536263J317057J053990P56801M21908N6698l02303
54651A0367122n95111p63752p76392o34127l63112m983L88015P56816J042372
54642I416848J195044J185384J016165P30503M05872J31482j7449P668K28469
54633A4299986O37060J186668J789874K337059K725629K879538K753648K335934
54625C0945396J656559P94949j28548r76943j627323k001343k091657j972988
54617B4598102j781914j664037j712664j933822k256150k575718k807167k914109
$$ y = [2047864, 2684557, 3061896, 3099506, 2809062, 2274360, 1603291, 882182, 159225, -541697, -1198537, -1779918, -2245261, -2544397, -2613811, -2380327, -1781034, -792684, 547004, 2139378, 3846799, 5526708, 7062971, 8380028, 9434018, 10190819, 10612727, 10669425, 10367122, 9772011, 9008259, 8231867, 7597740, 7234628, 7229645, 7617660, 8374476, 9416848, 10611892, 11797276, 12813441, 13543944, 13949816, 14081298, 14063849, 14071517, 14299986, 14937046, 16123714, 17913588, 20250647, 22976276, 25855814, 28609462, 30945396, 32601955, 33396904, 33268356, 32291413, 30664090, 28662747, 26571090, 24598102, 22816188, 21152151, 19439487, 17505665, 15249515, 12673797, 9866630, 6952521]
54609F952521k907873k823504k693427k534998k352697k144091j901747j614235
54601a2020051j272929q82988m69114o9612K78259N53341P58340R14965J046450
54592a1163339J157659J229676J235492J162459J019957Q28899O11319L94403
54584c523475K19284J33220J62056K85243M37730N39608N31656L94428J45758
54575f74492j72971n10732q18969j064610j240624j363460j452806j506239j490729
54566a0295632j360533j086880o74393j53142M40338J070810J693975K244577
54558h120880K644387K831467K788862K550863K186395J776235J396860J111351
54550I165540R63782R76025J144653J433624J766648K033943K122576J957519
$$ y = [6952521, 4044648, 1221144, -1472283, -4007281, -6359978, -8504069, -10405816, -12020051, -13292980, -14175968, -14645082, -14714694, -14436435, -13883094, -13124754, -12209789, -11163339, -10005680, -8776004, -7540512, -6378053, -5358096, -4529197, -3917878, -3523475, -3304191, -3170971, -3008915, -2723672, -2285942, -1746334, -1214678, -820250, -674492, -847463, -1358195, -2177164, -3241774, -4482398, -5845858, -7298664, -8804903, -10295632, -11656165, -12743045, -13417438, -13570580, -13130242, -12059432, -10365457, -8120880, -5476493, -2645026, 143836, 2694699, 4881094, 6657329, 8054189, 9165540, 10129322, 11105347, 12250000, 13683624, 15450272, 17484215, 19606791, 21564310]
54542B1564310J527316Q79456R3254p50559j587333k365963l031403l511253l727823
54533I090002l636676l264430k712792k121606j614971j262727j072466j006026
54525g601692j004588j009873r77571q85300p36404n56393l79147k27861j01839
54516a3480668K3664J86961M25587P62862J198428J706867K245909K768575L230682
54507i31133L592014L817726L885484L795771L577735L286633K994126K774009
54499B6792365K684277K746501K927713L136066L242781L130861K748532K132529
54491D9541625J382804O07269j21886p73313j331388j770755k053165k148142
54483D3333049k062017j853784j622142j466286j442577j542497j700202j819666
$$ y = [21564310, 23091626, 23971082, 24064336, 23313777, 21726444, 19360481, 16329078, 12817825, 9090002, 5453326, 2188896, -523896, -2645502, -4260473, -5523200, -6595666, -7601692, -8606280, -9616153, -10593724, -11479024, -12215428, -12771821, -13150968, -13378829, -13480668, -13457004, -13270043, -12844456, -12081594, -10883166, -9176299, -6930390, -4161815, -931133, 2660881, 6478607, 10364091, 14159862, 17737597, 21024230, 24018356, 26792365, 29476642, 32223143, 35150856, 38286922, 41529703, 44660564, 47409096, 49541625, 50924429, 51531698, 51409812, 50636499, 49305111, 47534356, 45481191, 43333049, 41271032, 39417248, 37795106, 36328820, 34886243, 33343746, 31643544, 29823878]
54475B9823878j808298j609837j228158p28931k14033K15944M86780N54164L99340
54466B5890849L3551m90524j078312j616675k013590k231477k293972k262562
54458A3937288k197835k128642k045740j919046j722022j445950j100182p07682
54450F70189l03858O5464L56916N52581O75857P81183R17501J089597J248526
54441F053956J323333J274185J127715R67072Q84453R32706J109158J374542J682389
54432A6729509J993191K268311K458691K506296K363148K015868J496754Q71307
54424C2703075K10327m33679j030991j561542j998038k298993k416482k314377
54416B0859300j988689j481565q82513l13176J03616K82511K06326o8276m36136
$$ y = [29823878, 28015580, 26405743, 25177585, 24448654, 24234621, 24450565, 24937345, 25491509, 25890849, 25924400, 25433876, 24355564, 22738889, 20725299, 18493822, 16199850, 13937288, 11739453, 9610811, 7565071, 5646025, 3924003, 2478053, 1377871, 670189, 366331, 431795, 788711, 1341292, 2017149, 2798332, 3715833, 4805430, 6053956, 7377289, 8651474, 9779189, 10746261, 11630714, 12563420, 13672578, 15047120, 16729509, 18722700, 20991011, 23449702, 25955998, 28319146, 30335014, 31831768, 32703075, 32913402, 32479723, 31448732, 29887190, 27889152, 25590159, 23173677, 20859300, 18870611, 17389046, 16506533, 16193357, 16296973, 16579484, 16785810, 16717534, 16281398]
54407A6281398p87988j050275j201418j262265j272878j270460j276010j289341
54399F870763j289311j238117j091056q12857l97238J19806O64302J149334J509652
54390E485278J726369J828724J874896J922996K002290K092418K121180J990490
54382B1044641J624864J016073K34268o00508j363442j957684k325717k450387
54374A5222108k355192k099344j759895j406265j082647q06696n78716l91820
54366D741533k40721j30367q0831j21352k72054n21438q13157j053668j143103
54357C64842j016374o71048j66039M02697R29541J318062J496204J434729J163160
54348E255774P69187L74181R1632j3764N3576K31170M33421N88824O61222O52338
$$ y = [16281398, 15493410, 14443135, 13241717, 11979452, 10706574, 9436114, 8160104, 6870763, 5581452, 4343335, 3252279, 2439422, 2042184, 2161990, 2826292, 3975626, 5485278, 7211647, 9040371, 10915267, 12838263, 14840553, 16932971, 19054151, 21044641, 22669505, 23685578, 23919846, 23319338, 21955896, 19998212, 17672495, 15222108, 12866916, 10767572, 9007677, 7601412, 6518765, 5712069, 5133353, 4741533, 4500812, 4370445, 4289614, 4168262, 3896208, 3374770, 2561613, 1507945, 364842, -651532, -1322580, -1488619, -1085922, -156381, 1161681, 2657885, 4092614, 5255774, 6024961, 6399142, 6490774, 6477010, 6530586, 6761756, 7195177, 7784001, 8445223, 9097561]
54338I097561N92314N22888M76891M63045M65542M56438M08219K98181J08427
54329A2889506j71070n35346r57711j387809j758847k007774k104649k074409
54321A891891j991455j943876j988667k127845k317926k497722k609326k603708
54313a6188634k443865k118101j655748j126447o17178k00891Q6672K55591L55112
54304b3653489M51125N94034P93935J016851J199108J267270J158171Q41014L36881
54295a5995100k77622q90047j387225j690781j781234j702884j544750j402279
54287b6671922j337454j357244j418280j451307j393929j220818r60276o87341
54279c6498571m92979m43872n54671p86390j066686j316352j469763j487356j361653
$$ y = [9097561, 9689875, 10212763, 10689654, 11152699, 11618241, 12074679, 12482898, 12781079, 12889506, 12718436, 12183090, 11225379, 9837570, 8078723, 6070949, 3966300, 1891891, -99564, -2043440, -4032107, -6159952, -8477878, -10975600, -13584926, -16188634, -18632499, -20750600, -22406348, -23532795, -24149973, -24350864, -24264192, -24008601, -23653489, -23202364, -22608330, -21814395, -20797544, -19598436, -18331166, -17172995, -16331981, -15995100, -16272722, -17162769, -18549994, -20240775, -22022009, -23724893, -25269643, -26671922, -28009376, -29366620, -30784900, -32236207, -33630136, -34850954, -35811230, -36498571, -36991550, -37435422, -37990093, -38776483, -39843169, -41159521, -42629284, -44116640, -45478293]
54270d5478293j113908p79099l86741M8890N24485J037842J580812K133803K659678
54261c9772531L104301L411117L541417L482300L238136K822509K265865J630669
54253a6276217J011621N11305K04527J12068J94988L69095N32858N97936N10021
54244a2231798K54891j43857o27398j108469j494080j723328j797526j776989
54236b0648554j743246j753185j814621j892598j935080j900409j772341j556021
54228c5016055j259749q78799l96903J95176Q79701J604672K290418K844912L185788
54219b6550839L266463L094919K730222K255556J745594J249350P93254L91685
54211a1023796N1782k27792m55697o40992p86186q86623r35067r26203q59932
$$ y = [-45478293, -46592201, -47371300, -47758041, -47709151, -47184666, -46146824, -44566012, -42432209, -39772531, -36668230, -33257113, -29715696, -26233396, -22995260, -20172751, -17906886, -16276217, -15264596, -14753291, -14548764, -14436696, -14241708, -13872613, -13339755, -12741819, -12231798, -11976907, -12120764, -12748162, -13856631, -15350711, -17074039, -18871565, -20648554, -22391800, -24144985, -25959606, -27852204, -29787284, -31687693, -33460034, -35016055, -36275804, -37154603, -37551506, -37356330, -36476629, -34871957, -32581539, -29736627, -26550839, -23284376, -20189457, -17459235, -15203679, -13458085, -12208735, -11415481, -11023796, -10972014, -11199806, -11655503, -12296495, -13082681, -13969304, -14904371, -15830574, -16690506]
54202a6690506p45590o05855m74703l87105l66064m15544n23569o73540q55989
54193b1738465j069186j302821j516653j638983j596642j356255r41595m13889
54185c1574489J63321P44116J295479J782205K159355K378639K403372K222257
54177a8425745J854535J346026P61020J73713l42398p28375r51271j004271q94858
54168a8211624o31970k25293L00660Q88849J445248J858147K036826J950868J646532
54159h941757J226566Q01532M41204J56980p6397k82141m58476n84357o39865
54150h356711o20361n36544m04362k30573j055L16624P49313J284185J849504
54141e949980K327955K597454K578235K265131J733860J120960N84740K58586
$$ y = [-16690506, -17436096, -18041951, -18516654, -18903759, -19269823, -19685367, -20208936, -20882476, -21738465, -22807651, -24110472, -25627125, -27266108, -28862750, -30219005, -31160600, -31574489, -31411168, -30667052, -29371573, -27589368, -25430013, -23051374, -20648002, -18425745, -16571210, -15225184, -14464164, -14290451, -14632849, -15361224, -16312495, -17316766, -18211624, -18843594, -19068887, -18768227, -17879378, -16434130, -14575983, -12539157, -10588289, -8941757, -7715191, -6913659, -6472455, -6315475, -6391872, -6674013, -7132489, -7716846, -8356711, -8977072, -9513616, -9917978, -10148551, -10149606, -9832982, -9083669, -7799484, -5949980, -3622025, -1024571, 1553664, 3818795, 5552655, 6673615, 7258355, 7516941]
54133G516941K08922M11343P57963J099586J306895J320292J163078R14532O60833
54124A5360385M50624K77123R2669j58144n10346r69262j514540k104594k677822
54115H246093l157885l468645l554514l396311l015674k467575j825610j166315
54107a3806436n56723m6447L34725N72452O58441N83708L42215n5930n72035j138108
54097a3684138j670458k090351k340752k392658k243882j918746j471619r85164
54089b8797768n51301k37546o0313J2276K7866J3042l8711j46636l09975m92324
54079c0581390o37167p02580o87318o27209n64533n15450m62394l76850k51066
54070c5405957j10689L06M6671J9368o4391j72216k69661l30284l39461k90628
$$ y = [7516941, 7725863, 8137206, 8895169, 9994755, 11301650, 12621942, 13785020, 14699552, 15360385, 15811009, 16088132, 16180801, 16022657, 15512311, 14543049, 13028509, 10923915, 8246093, 5088208, 1619563, -1934951, -5331262, -8346936, -10814511, -12640121, -13806436, -14363159, -14409606, -14074881, -13502429, -12843988, -12260280, -11918065, -11973995, -12546030, -13684138, -15354596, -17444947, -19785699, -22178357, -24422239, -26340985, -27812604, -28797768, -29349069, -29586615, -29646928, -29634652, -29606786, -29593744, -29632455, -29779091, -30089066, -30581390, -31218557, -31921137, -32608455, -33235664, -33800197, -34315647, -34778041, -35154891, -35405957, -35516646, -35516340, -35469669, -35450301, -35514692, -35686908, -35956569, -36286853, -36626314, -36916942]
54060c6916942j78048N467K61842N77700R21033J248022J514653J686320J743817
54051b9136136J687126J535724J322621J084274Q53659O59292N23932M56566M42814
54042b0570128M45735M20194L30983J64362o8371l33730n87029p90386r26468
54033b1914838r95633r99285r27298p63917n08220j90509J32562M05241O04878
54024b5157019P55248R10839J123644J413729J756896K091862K344863K464079
54016a2295859K445955K334849K196851K089910K050018K090898K202611K346348
54008E461581K458848K476092K365058K138931J842328J519493J193239Q70127
54000B0325697N60545K91587J03952M0341J31246L76031P23310J068352J280850
$$ y = [-36916942, -37094990, -37089523, -36827681, -36249981, -35328948, -34080926, -32566273, -30879953, -29136136, -27449010, -25913286, -24590665, -23506391, -22652732, -21993440, -21469508, -21012942, -20570128, -20124393, -19704199, -19373216, -19208854, -19277225, -19610955, -20197984, -20988370, -21914838, -22910471, -23909756, -24837054, -25600971, -26109191, -26299700, -26167138, -25761897, -25157019, -24401771, -23490932, -22367288, -20953559, -19196663, -17104801, -14759938, -12295859, -9849904, -7515055, -5318204, -3228294, -1178276, 912622, 3115233, 5461581, 7920429, 10396521, 12761579, 14900510, 16742838, 18262331, 19455570, 20325697, 20886242, 21177829, 21281781, 21322122, 21453368, 21829399, 22552709, 23621061, 24901911]
53991B4901911J252163R34518L53250m07553j234631k016355k661009l097300
53983A8024994l268950l142732k731979k112952j410214p53600k34354J13187
53975D483400L00396L60273L30971K54854J83995J75536K70291M67360P17398
53966G544474R45922J094110J149216J143852J126767J127043J134642J105632
53958A6371658R85496P37512L63730r1091n56395r67460j296217j563659j824432
53949A2159142k130295k495072k886218l248579l537317l728641l801851l719395
53941a3388226l434492k924518k218426j391511n33140K84148J013259J622588
53933b0970318K084903K376226K482584K407126K173037J820526J397395R46610
$$ y = [24901911, 26154074, 27088592, 27441842, 27034289, 25799658, 23783303, 21122294, 18024994, 14756044, 11613312, 8881333, 6768381, 5358167, 4604567, 4370213, 4483400, 4783796, 5144069, 5475040, 5729894, 5913889, 6089425, 6359716, 6827076, 7544474, 8490396, 9584506, 10733722, 11877574, 13004341, 14131384, 15266026, 16371658, 17357154, 18094666, 18458396, 18367305, 17810910, 16843450, 15547233, 13983574, 12159142, 10028847, 7533775, 4647557, 1398978, -2138339, -5866980, -9668831, -13388226, -16822718, -19747236, -21965662, -23357173, -23890313, -23606165, -22592906, -20970318, -18885415, -16509189, -14026605, -11619479, -9446442, -7625916, -6228521, -5281911]
53925e281911M98858P5712l00913o03136q00345q68186p98302o05146l24549N60
53915i007358L41014O91105J055666J425508J765879K030130K185744K229076
53907B716764K177205K046229J835834J532835J128714O33905P6877n06974j082503
53898A0558886j612785k056672k375547k546577k571376k473608k288693k052761
53890g419133j795838j541305j310675j128485j019997r99871j060058j168911
53882a7444273j284350j369726j398951j351368j210871r79096o92259m20069
53874b6150963k38007j88916k59943l88920m93878n07657m00838j85753R5071
53865b8719804L87121O41175Q25592R30374R61167R27983Q39573P08649N59347
$$ y = [-5281911, -4783053, -4707341, -5008254, -5611390, -6411735, -7279921, -8078223, -8683369, -9007918, -9007358, -8666344, -7975239, -6919573, -5494065, -3728186, -1698056, 487688, 2716764, 4893969, 6940198, 8776032, 10308867, 11437581, 12071486, 12148363, 11641389, 10558886, 8946101, 6889429, 4513882, 1967305, -604071, -3077679, -5366372, -7419133, -9214971, -10756276, -12066951, -13195436, -14215433, -15215304, -16275362, -17444273, -18728623, -20098349, -21497300, -22848668, -24059539, -25038635, -25730894, -26150963, -26388970, -26577886, -26837829, -27226749, -27720627, -28228284, -28629122, -28814875, -28719804, -28332683, -27691508, -26865916, -25935542, -24974375, -24046392, -23206819, -22498170, -21938823]
53856b1938823M24509L33564L04419L46892M68469O69586R30772J207912J446179
53847a5806521J604298J671006J664703J623086J593158J621722J739472J940678
53839b348398K174431K360760K424592K325166K065551J684075J238006P87057
53831A2711240L81391N7143j63138k71635k77983k04199o8449J27923L91684P09539
53821A3393516J025267J244890J269315J033821N32020j84961j026912j885363
53813A5401593k647807l209424l490251l455868l130045k590624j948376j314462
53805f385264p67561l37895j9219K02904L33736L75509L41707K59868J65183J00200
53795e730832J21301K94949O73155J259526J988144K730571L331873L661874L656703
$$ y = [-21938823, -21514314, -21180750, -20876331, -20529439, -20060970, -19391384, -18460612, -17252700, -15806521, -14202223, -12531217, -10866514, -9243428, -7650270, -6028548, -4289076, -2348398, -173967, 2186793, 4611385, 6936551, 9002102, 10686177, 11924183, 12711240, 13092631, 13149774, 12986636, 12715001, 12437018, 12232819, 12164370, 12292293, 12683977, 13393516, 14418783, 15663673, 16932988, 17966809, 18498829, 18313868, 17286956, 15401593, 12753786, 9544362, 6054111, 2598243, -531802, -3122426, -5070802, -6385264, -7152825, -7490720, -7509939, -7307035, -6973299, -6597790, -6256083, -5996215, -5831032, -5730832, -5609531, -5314582, -4641427, -3381901, -1393757, 1336814, 4668687, 8330561, 11987264]
53786A1987264L328634K743728J988855J149838L03664m85239j169845j722109
53778A8124790k127785k379281k474120k420011k239389j965433j629196j247021
53770A642554q19416l43982J66969O77399J133272J478083J668652J685516J537801
53761H826848J262746R16788N58025K29178m6382k54961l84367m30570m13743
53752A0263562l85713m19207n85492r31766j464487k141906k879666l569629m105471
53743f219775m407080m438979m218270l807164l291238k754539k263425j860714
53735c3261184j563812j363891j230312j124000j016098r02478q05321p59032
53727d2026128p86078q74939r73182j002704q93402o19249k15126K37841O48702
$$ y = [11987264, 15315898, 18059626, 20048481, 21198319, 21501983, 21016744, 19846899, 18124790, 15997005, 13617724, 11143604, 8723593, 6484204, 4518771, 2889575, 1642554, 823138, 479156, 646125, 1323524, 2456796, 3934879, 5603531, 7289047, 8826848, 10089594, 11006382, 11564407, 11793585, 11747203, 11492242, 11107875, 10677305, 10263562, 9877849, 9458642, 8873150, 7941384, 6476897, 4334991, 1455325, -2114304, -6219775, -10626855, -15065834, -19284104, -23091268, -26382506, -29137045, -31400470, -33261184, -34824996, -36188887, -37419199, -38543199, -39559297, -40461775, -41267096, -42026128, -42812206, -43687145, -44660327, -45663031, -46556433, -47175682, -47390808, -47152967, -46504265]
53718d6504265R49944J110266J130133J033330Q60907O65100N01575M21783M66480
53709c9364747O60689J012416J515769K152573K886162L651905M357438M899085
53701a8228710N188067N176259M874600M357078L741679L149147K657303K275049
53693A3190472J948061J590134J123833N13478k21847j018314j792613k469074
53685A2864130k997410l356038l542713l560696l411806l101378k649251k096203
53677a1851365j501218r31709m49476r4930J23913K29503K59898K51643K30776
53668a3732965K11881J97961J78428J30066K6118j48476l84039o43556q73157
53659a5037739j021033j055589r74363q00829n72681l28631j00113Q9989K24785
$$ y = [-46504265, -45554321, -44444055, -43313922, -42280592, -41419685, -40754585, -40253010, -39831227, -39364747, -38704058, -37691642, -36175873, -34023300, -31137138, -27485233, -23127795, -18228710, -13040643, -7864384, -2989784, 1367294, 5108973, 8258120, 10915423, 13190472, 15138533, 16728667, 17852500, 18365978, 18144131, 17125817, 15333204, 12864130, 9866720, 6510682, 2967969, -592727, -4004533, -7105911, -9755162, -11851365, -13352583, -14284292, -14733768, -14828698, -14704785, -14475282, -14215384, -13963741, -13732965, -13521084, -13323123, -13144695, -13014629, -12988511, -13136987, -13521026, -14164582, -15037739, -16058772, -17114361, -18088724, -18889553, -19462234, -19790865, -19890978, -19800989, -19576204]
53650a9576204K92690K90991K29539J28237Q074j16156k33085l24030l56910k96085
53640a9952939j25484J31016M08279O20946O95100N93573L24377o6941n12939
53631a7885012r40244j283308j497162j569028j524153j419030j320000j275087
53623b8713024j294152j348901j391562j379598j293315j140652r50132p55115
53615c8266451n74694m00724k00049O7991M29307Q81209J393335J920894K421716
53606c2327466K866759L237487L513447L662109L642204L421395K999066K421263
53598f563736J776910J171064O84522L42464J14056n5926k06949l43563m48305
53589c529463n11526n50655o01722o90724q09374r14136r45877q53774o12730
$$ y = [-19576204, -19283514, -18992523, -18762984, -18634747, -18626673, -18742829, -18975914, -19299944, -19656854, -19952939, -20078423, -19947407, -19539128, -18918182, -18223082, -17629509, -17305132, -17372073, -17885012, -18825256, -20108564, -21605726, -23174754, -24698907, -26117937, -27437937, -28713024, -30007176, -31356077, -32747639, -34127237, -35420552, -36561204, -37511336, -38266451, -38841145, -39241869, -39441918, -39373927, -38944620, -38063411, -36670076, -34749182, -32327466, -29460707, -26223220, -22709773, -19047664, -15405460, -11984065, -8984999, -6563736, -4786826, -3615762, -2931240, -2588776, -2474720, -2530646, -2737595, -3081158, -3529463, -4040989, -4591644, -5193366, -5884090, -6693464, -7607600, -8553477, -9407251, -10019981]
53580a0019981k33921K32800P10738J121484J408788J547406J539237J408029
53572b285420J194973R49368P15506N26055M05094L70606M28263N63415P43207
53563C611067R28649J086288J192789J234362J203908J096213R03429O16069K31749
53554A2104523k32640p32893j199731j553592j727763j688923j444061j031589
53546B493331n04051Q7876P03581J310117J872079K344068K676567K834585K815257
53537A6633410K650914K396596K110757J837506J594320J367526J117758P95785
53529C0504572L65369j74786p80896j373186j861532k176232k292472k241314
53521A9969523k101796j972314j930940k005175k166610k348501k473613k482309
$$ y = [-10019981, -10253902, -10021102, -9310364, -8188880, -6780092, -5232686, -3693449, -2285420, -1090447, -141079, 574427, 1100482, 1505576, 1876182, 2304445, 2867860, 3611067, 4539716, 5626004, 6818793, 8053155, 9257063, 10353276, 11256705, 11872774, 12104523, 11871883, 11138990, 9939259, 8385667, 6657904, 4968981, 3524920, 2493331, 1989280, 2077156, 2780737, 4090854, 5962933, 8307001, 10983568, 13818153, 16633410, 19284324, 21680920, 23791677, 25629183, 27223503, 28591029, 29708787, 30504572, 30869941, 30695155, 29914259, 28541073, 26679541, 24503309, 22210837, 19969523, 17867727, 15895413, 13964473, 11959298, 9792688, 7444187, 4970574, 2488265]
53513B488265k353926k111863j806577j486387j177299q83888o04014l41231j04577
53504h381497J03461L00197N21342P97526J123281J446823J693208J801833J747788
53495A153962J537143J191583P40671K23767l07976p97164j192060j457870j581199
53486d89143j567681j438517j229910r90828p71113o01333m79036l76296k67116
53477h210973j54963p8663r0858k23532m63179p50827j007085j169050j218992
53468a3368122j187871j132035j100243j113090j161766j216117j232217j161793
53460b2673254r68404o44147k14708K69935P50301J169275J479953J650217J663259
53451a7517573J516480J225113Q31634M10928N8256j42066j54472j5685J73811
$$ y = [2488265, 134339, -1977524, -3784101, -5270488, -6447787, -7331675, -7935689, -8276920, -8381497, -8278036, -7977839, -7456497, -6658971, -5535690, -4088867, -2395659, -593826, 1153962, 2691105, 3882688, 4623359, 4847126, 4539150, 3741986, 2549926, 1092056, -489143, -2056824, -3495341, -4725251, -5716079, -6487192, -7088525, -7567561, -7943857, -8210973, -8365936, -8444599, -8535457, -8758989, -9222168, -9972995, -10980080, -12149130, -13368122, -14555993, -15688028, -16788271, -17901361, -19063127, -20279244, -21511461, -22673254, -23641658, -24285805, -24500513, -24230578, -23480277, -22311002, -20831049, -19180832, -17517573, -16001093, -14775980, -13944346, -13533418, -13475162, -13617228, -13771700, -13787385, -13613574]
53442a3613574K94295K70054J16475o1350j23840K4929L85102Q66748J343945
53433a0497216J715818J937178K013532J980458J885064J771168J664961J565622
53425D036585J448548J280535J037346P13370L19260j28596o15881j125785j625277
53416E340105k059028k363341k492398k436146k218164j879228j459204r85372
53408a0552776m70722P7359O43017J192426J674959K031933K206829K156664J867374
53399H27063J369613P42643R6022m67300q87558j163174j336332j460464j570273
53390c849760j668701j732213j727031j627126j425563j134563p76967l78287
53382a4320211L4147M28666P72937J046852J255463J428159J599630J783519J957517
$$ y = [-13613574, -13319279, -13049225, -12932750, -12994100, -13117940, -13093011, -12707909, -11841161, -10497216, -8781398, -6844220, -4830688, -2850230, -965166, 806002, 2470963, 4036585, 5485133, 6765668, 7803014, 8516384, 8835644, 8707048, 8091167, 6965382, 5340105, 3281077, 917736, -1574662, -4010808, -6228972, -8108200, -9567404, -10552776, -11023498, -10946139, -10303122, -9110696, -7435737, -5403804, -3196975, -1040311, 827063, 2196676, 2939319, 3035341, 2568041, 1680483, 517309, -819023, -2279487, -3849760, -5518461, -7250674, -8977705, -10604831, -12030394, -13164957, -13941924, -14320211, -14286064, -13857398, -13084461, -12037609, -10782146, -9353987, -7754357, -5970838, -4013321]
53373d013321K071634K074630J941242J683998J344762R72679O01415K38380j27931
53364F787488n07166q86763j225190j462626j542660j433472j138761o95073j60047
53355b264270M01428R30158J385257J753398K046882K287987K488584K637847
53347A1667271K703171K642498K425663K059149J599537J140798P78784N75650
53339B5592521N44729O57157Q59147J091128J303463J462309J543386J523736
53331C4577576J385638J132449P99137M42049J12058j68843m09542o29167q30717
53322C6410638r91249j077626j074144r97989q91740q03452p70802q13900r30801
53313B8058935j093353j249317j335481j297287j105644p66348l23969J39388
$$ y = [-4013321, -1941687, 132943, 2074185, 3758183, 5102945, 6075624, 6677039, 6915419, 6787488, 6280322, 5393559, 4168369, 2705743, 1163083, -270389, -1409150, -2104223, -2264270, -1862842, -932684, 452573, 2205971, 4252853, 6540840, 9029424, 11667271, 14370442, 17012940, 19438603, 21497752, 23097289, 24238087, 25016871, 25592521, 26137250, 26794407, 27653554, 28744682, 30048145, 31510454, 33053840, 34577576, 35963214, 37095663, 37894800, 38336849, 38448907, 38280064, 37870522, 37241355, 36410638, 35419389, 34341763, 33267619, 32269630, 31377890, 30574438, 29803636, 28989736, 28058935, 26965582, 25716265, 24380784, 23083497, 21977853, 21211505, 20887536, 21026924]
53305B1026924N16482P04280O43159L44374j13762o19840j071780j405252j601240
53296A8423345j678741j679557j649115j619235j601338j593269j591914j598891
53288E411285j613843j622657j593298j485529j269663r43594n39049j12238K79839
53279c488747O06173Q72368J103382J310656J473024J549759J514472J381764
53271F322851J207838J066577J015241J067482J188893J318593J401952J411642
53263A6001069J347419J224717J065190Q89734P07647N04698K43427j16382n87225
53254B1280294j135164j687379k161600k499333k686348k753830k761011k763472
53246B832157k778638k768472k655559k366682j875914j218966m73136K78931
$$ y = [21026924, 21543406, 22247686, 22890845, 23235219, 23121457, 22501617, 21429837, 20024585, 18423345, 16744604, 15065047, 13415932, 11796697, 10195359, 8602090, 7010176, 5411285, 3797442, 2174785, 581487, -904042, -2173705, -3117299, -3656348, -3768586, -3488747, -2882574, -2010206, -906824, 403832, 1876856, 3426615, 4941087, 6322851, 7530689, 8597266, 9612507, 10679989, 11868882, 13187475, 14589427, 16001069, 17348488, 18573205, 19638395, 20528129, 21235776, 21740474, 21983901, 21867519, 21280294, 20145130, 18457751, 16296151, 13796818, 11110470, 8356640, 5595629, 2832157, 53519, -2714953, -5370512, -7737194, -9613108, -10832074, -11305210, -11026279]
53238a1026279R76950J589814K107538K532378K874323L143308L333293L411726
53230H943051L333371L074198K654437K127583J548154R50730L54052k24587p62824
53221B1998165j235585j617700j884078k010892j978899j777100j407197q91022
53213I195692k78748L50808R05733J309691J527169J566497J458093J227785Q88966
53204A8151686M56799l4377n28531r60362j270802j417328j378865j158480p87536
53195A1072204l32080J06644M12098M95152L36103p127m33134q46509j187141
53186I616210j428840j563672j591252j517367j356278j132063q77032o24840
53178d75134l99039k05675l9246J02329K11556K84245L37649M09503N32571P06333
$$ y = [-11026279, -10049329, -8459515, -6351977, -3819599, -945276, 2198032, 5531325, 8943051, 12276422, 15350620, 18005057, 20132640, 21680794, 22631524, 22985576, 22760989, 21998165, 20762580, 19144880, 17260802, 15249910, 13271011, 11493911, 10086714, 9195692, 8916944, 9267752, 10173485, 11483176, 13010345, 14576842, 16034935, 17262720, 18151686, 18608485, 18574108, 18045577, 17085215, 15814413, 14397085, 13018220, 11859740, 11072204, 10740124, 10846768, 11258866, 11754018, 12090121, 12082994, 11649860, 10803351, 9616210, 8187370, 6623698, 5032446, 3515079, 2158801, 1026738, 149706, -475134, -874173, -1079848, -1119094, -1016765, -805209, -520964, -183315, 226188, 758759, 1465092]
53168A465092Q90316J021597J040745R12949O41346K70811j23306m61965o93123
53159D964462q09391q43535q45166q50948q64321q57369p94741o62813m81250
53150b045072k86940j02751Q3428L10329O07656R56247J273915J442509J363999
53141C603320J012465M51347j91111p71039j176482j353150j300635j046216o16606
$$ y = [1465092, 2355408, 3377005, 4417750, 5330699, 5972045, 6242856, 6119550, 5657585, 4964462, 4155071, 3311536, 2466370, 1615422, 751101, -106268, -901009, -1563822, -2045072, -2332012, -2434763, -2351335, -2041006, -1433350, -477103, 796812, 2239321, 3603320, 4615785, 5067132, 4876021, 4104982, 2928500, 1575350, 274715, -771501, -1388107]
$$ [...]
##END NTUPLES=NMR SPECTRUM
##END=
