##TITLE=31Pdec_DE-58tub_Ac2
 
 64 sc
 7.5.2024
##JCAMPDX= 6.0         $$ Bruker NMR JCAMP-DX V2.0
##DATA TYPE= NMR SPECTRUM
##DATA CLASS= NTUPLES
##ORIGIN= UXNMR, Bruker Analytische Messtechnik GmbH
##OWNER= root
$$ XWIN-NMR		Version 3.5
$$ Tue May  7 16:20:54 2024 Russian Standard Time (UT+4h)  she@DPX200
##.OBSERVE FREQUENCY= 81.013821
##.OBSERVE NUCLEUS= ^31P
##.ACQUISITION MODE= SIMULTANEOUS
##.ACQUISITION SCHEME= undefined
##.AVERAGES= 128
##.DIGITISER RES= 16
##SPECTROMETER/DATA SYSTEM= spect
##.PULSE SEQUENCE= zgpg30
##.SOLVENT NAME= CDCl3
##.SHIFT REFERENCE= (INTERNAL, CDCl3, 0, 248.564)
##AUDIT TRAIL= $$ (NUMBER, WHEN, WHO, WHERE, WHAT)
$$ ##TITLE= Audit trail, XWIN-NMR		Version 3.5
$$ ##JCAMPDX= 5.01
$$ ##ORIGIN= Bruker BioSpin GmbH
$$ ##OWNER= she
$$ F:/spectra/data/she/nmr/P31/1/pdata/1/auditp.txt
$$ ##AUDIT TRAIL=  $$ (NUMBER, WHEN, WHO, WHERE, WHAT)
(   1,<2024-05-07 16:19:54.84 +0400>,<she>,<DPX200>,
      <continue with go, POWCHK disabled, PULCHK disabled
       configuration hash MD5:
       00 E9 B6 7A A2 85 ED C7 34 08 36 98 17 FE 4E 26
       data hash MD5: 32K
       47 D0 D1 35 31 5F 89 09 C0 4A 2B D7 61 08 59 10>)
(   2,<2024-05-07 16:19:57.26 +0400>,<she>,<DPX200>,
      <Start of raw data processing
       efp BC_mod = 2 LB = 10 FT_mod = 6 PKNL = 1 PHC0 = -13162.15 PHC1 = -428.3165 SI = 64K 
       data hash MD5: 64K
       0B BA 1C 7C E1 31 93 4E 06 C1 2A A8 D9 35 1E 95>)
(   3,<2024-05-07 16:20:19.92 +0400>,<she>,<DPX200>,
      <pk PHC0 = -59.77856 PHC1 = 423.4003 
       data hash MD5: 64K
       07 16 BE A6 76 7D F3 4D B0 61 13 67 5A 5F F7 9B>)
$$ ##END=
$$ 
$$ hash MD5
$$ 12 F1 62 23 94 CE 52 3C 45 66 5A F1 81 52 41 CA
##$RELAX= 
##$RELAX= 
##$RELAX= 
##$RELAX= 
##$RELAX= 
##$RELAX= 
##$RELAX= 
##$RELAX= 
##$RELAX= 
$$ Bruker specific parameters
$$ --------------------------
##$DU= <F:/spectra>
##$EXPNO= 1
##$NAME= <P31>
##$PROCNO= 1
##$TYPE= <nmr>
##$USER= <she>
##$AMP= (0..31)
100 100 100 100 100 100 100 100 100 100 100 100 100 100 100 100 100 100 
100 100 100 100 100 100 100 100 100 100 100 100 100 100 
##$AQSEQ= 0
##$AQ_mod= 1
##$AUNM= <au_zg>
##$AUTOPOS= <>
##$BF1= 81.014009
##$BF2= 200.13
##$BF3= 200.13
##$BF4= 200.13
##$BF5= 200.13
##$BF6= 200.13
##$BF7= 200.13
##$BF8= 200.13
##$BYTORDA= 1
##$CFDGTYP= 0
##$CFRGTYP= 5
##$CHEMSTR= <none>
##$CNST= (0..31)
1 1 145 1 1 1 1 1 1 1 1 1 1 1 1 1 1 1 1 1 1 1 1 1 1 1 1 1 1 1 1 1 
##$CPDPRG= <waltz16>
##$CPDPRG1= <>
##$CPDPRG2= <waltz16>
##$CPDPRG3= <>
##$CPDPRG4= <mlev>
##$CPDPRG5= <mlev>
##$CPDPRG6= <mlev>
##$CPDPRG7= <mlev>
##$CPDPRG8= <mlev>
##$CPDPRGB= <>
##$CPDPRGT= <>
##$D= (0..31)
0 1 0 0 0 0 0 0 0 0 0 0.03 2e-05 3e-06 0 0 0 0 0 0 0 0 0 0 0 0 0 0 0 0 
0 0 
##$DATE= 1715084270
##$DBL= (0..7)
120 120 120 11 120 120 24 19 
##$DBP= (0..7)
150 150 150 150 150 150 150 150 
##$DBP07= 0
##$DBPNAM0= <>
##$DBPNAM1= <>
##$DBPNAM2= <>
##$DBPNAM3= <>
##$DBPNAM4= <>
##$DBPNAM5= <>
##$DBPNAM6= <>
##$DBPNAM7= <>
##$DBPOAL= (0..7)
0.5 0.5 0.5 0.5 0.5 0.5 0.5 0.5 
$$ [...]
##$SUBNAM2= <"">
##$SUBNAM3= <"">
##$SUBNAM4= <"">
##$SUBNAM5= <"">
##$SUBNAM6= <"">
##$SUBNAM7= <"">
##$SUBNAM8= <"">
##$SUBNAM9= <"">
##$SW= 501.771253377433
##$SWIBOX= (0..15)
0 1 3 0 0 0 0 0 0 0 0 0 0 0 0 0 
##$SW_h= 40650.406504065
##$TD= 32768
##$TD0= 1
##$TE= 0
##$TE2= 300
##$TE3= 300
##$TEG= 300
##$TL= (0..7)
0 120 53 12 22 120 120 120 
##$TP= (0..7)
150 150 150 150 150 150 150 150 
##$TP07= 0
##$TPNAME0= <>
##$TPNAME1= <>
##$TPNAME2= <>
##$TPNAME3= <>
##$TPNAME4= <>
##$TPNAME5= <>
##$TPNAME6= <>
##$TPNAME7= <>
##$TPOAL= (0..7)
0.5 0.5 0.5 0.5 0.5 0.5 0.5 0.5 
##$TPOFFS= (0..7)
0 0 0 0 0 0 0 0 
##$TUNHIN= 0
##$TUNHOUT= 0
##$TUNXOUT= 0
##$USERA1= <user>
##$USERA2= <user>
##$USERA3= <user>
##$USERA4= <user>
##$USERA5= <user>
##$V9= 5
##$VALIST= <valist>
##$VCLIST= <CCCCCCCCCCCCCCC>
##$VD= 0
##$VDLIST= <DDDDDDDDDDDDDDD>
##$VPLIST= <PPPPPPPPPPPPPPP>
##$VTLIST= <TTTTTTTTTTTTTTT>
##$WBST= 1024
##$WBSW= 4
##$XGAIN= (0..3)
0 0 0 0 
##$XL= 0
##$YL= 0
##$YMAX_a= 9447
##$YMIN_a= -7434
##$ZGOPTNS= <>
##$ZL1= 120
##$ZL2= 120
##$ZL3= 120
##$ZL4= 120
##$ABSF1= 0
##$ABSF2= 0
##$ABSG= 0
##$ABSL= 0
##$ALPHA= 0
##$AQORDER= 0
##$ASSFAC= 0
##$ASSFACI= 0
##$ASSFACX= 0
##$ASSWID= 0
##$AUNMP= <proc_1d>
##$AZFE= 0.1
##$AZFW= 0.5
##$BCFW= 0
##$BC_mod= 2
##$BYTORDP= 0
##$COROFFS= 0
##$CY= -3
##$DATMOD= 1
##$DC= 0
##$DFILT= <>
##$DTYPP= 0
##$F1P= 0
##$F2P= 0
##$FCOR= 1
##$FTSIZE= 65536
##$FT_mod= 6
##$GAMMA= 0
##$GB= 0
##$INTBC= 1
##$INTSCL= 6.047779e-11
##$ISEN= 30
##$LB= 10
##$LEV0= 0
##$LPBIN= 0
##$MAXI= 10000
##$MC2= 0
##$MEAN= 0
##$ME_mod= 0
##$MI= 50
##$NCOEF= 0
##$NC_proc= -7
##$NLEV= 6
##$NOISF1= 182.463
##$NOISF2= 159.3651
##$NSP= 0
##$NTH_PI= 0
##$NZP= 0
##$OFFSET= 248.5645
##$PC= 4
##$PHC0= -13221.93
##$PHC1= -4.916199
##$PH_mod= 1
##$PKNL= yes
##$PPARMOD= 0
##$PSCAL= 0
##$PSIGN= 0
##$REVERSE= no
##$SF= 81.0140089999694
##$SI= 65536
##$SIGF1= 159.3651
##$SIGF2= -187.1042
##$SINO= 113.3802
##$SIOLD= 16384
##$SREGLST= <1H.CDCl3>
##$SSB= 0
##$STSI= 65536
##$STSR= 0
##$SW_p= 40650.406504065
##$SYMM= 0
##$S_DEV= 0
##$TDeff= 32768
##$TDoff= 0
##$TI= <>
##$TILT= no
##$TM1= 0
##$TM2= 0
##$TOPLEV= 0
##$USERP1= <user>
##$USERP2= <user>
##$USERP3= <user>
##$USERP4= <user>
##$USERP5= <user>
##$WDW= 1
##$XDIM= 65536
##$YMAX_p= 313687482
##$YMIN_p= -7188181
$$ End of Bruker specific parameters
$$ ---------------------------------
##NTUPLES= NMR SPECTRUM
##VAR_NAME=  FREQUENCY,     SPECTRUM/REAL,   SPECTRUM/IMAG
##SYMBOL=    X,             R,               I
##VAR_TYPE=  INDEPENDENT,   DEPENDENT,       DEPENDENT
##VAR_FORM=  AFFN,          ASDF,            ASDF
##VAR_DIM=   65536,         65536,           65536
##UNITS=     HZ,            ARBITRARY UNITS, ARBITRARY UNITS
##FACTOR=    0.620285442955139, 1,           1
##FIRST=     20137.2065510682, 0,            0
##LAST=      -20513.1999529968, 0,           0
##MIN=       -20513.1999529968, -7188181,    0
##MAX=       20137.2065510682, 313687482,    0
$$ Real data points
##PAGE= N=1
##DATA TABLE= (X++(R..R)), XYDATA
$$ [...]
58323c098344j45520j80526k09970k30153k39783k39625k31425k16749j96522
58314d988617j71334j42139j11009q1642n9104m8430n2528p0585r7697j26002
58304e949087j47191j55864j51968j40369j27457j17144j08976r9011q2359n5878
58294g135304j9970K1457O2946J00096J31029J56085J76845J95354K13465K31938
58284e866059K49835K65012K75395K79741K77211K66589K46533K16880J79806
58275c609057J39871J03186P6364O5304P3452J00070J39651J83115K20155K41797
58265b266092K42660K22596J86822J43969J02720O8986M5141L1036K5246K5442
58255a171474K8391L0941L2127L4631M3583O3004R2785J28861J66376K02846K38580
$$ plain form
58323 -3098344 -3243864 -3424390 -3634360 -3864513 -4104296 -4343921 -4575346 -4792095 -4988617
58314 -4988617 -5159951 -5302090 -5413099 -5494741 -5553845 -5602275 -5654803 -5725388 -5823085 -5949087
58304 -5949087 -6096278 -6252142 -6404110 -6544479 -6671936 -6789080 -6898056 -6997067 -7079426 -7135304
58294 -7135304 -7155274 -7133817 -7070871 -6970775 -6839746 -6683661 -6506816 -6311462 -6097997 -5866059
58284 -5866059 -5616224 -5351212 -5075817 -4796076 -4518865 -4252276 -4005743 -3788863 -3609057
58275 -3609057 -3469186 -3366000 -3289636 -3224332 -3150880 -3050810 -2911159 -2728044 -2507889 -2266092
58265 -2266092 -2023432 -1800836 -1614014 -1470045 -1367325 -1298339 -1253198 -1222162 -1196916 -1171474
58255 -1171474 -1143083 -1112142 -1080015 -1045384 -1001801 -938797 -846012 -717151 -550775 -347929 -109349
58244a09349K74379L09111L39431L61583L72949L71856L56449L24576K75098K09238
58234C085321J30802M5689l8654j14312j75150k19434k50693k75656l00384l27014
58224A560515l53079l73380l82937l79043l61492l31541k90678k40085j80876
58215a332596j14958m5891K0919P8939J21846J45041J47133J30856J02486O9486
58205f76739L7712R958j3494l3255m9083n8625n7321m0288n769M2092R3428J36104
58193f15280J60371J62122J43491J11159P3515L7882Q596j3606l1004m7626o7655
58182g8035r3443j23521j51813j69539j69325j48834j11291o3000j0210M2648
58172a076363R3132J40163J83077K20587K50054K67702K69700K53439K18211J65101
$$ plain form
58244 -109349 165030 474141 813572 1175155 1548104 1919960 2276409 2600985 2876083 3085321
58234 3085321 3216123 3261812 3223158 3108846 2933696 2714262 2463569 2187913 1887529 1560515
58224 1560515 1207436 834056 451119 72076 -289416 -620957 -911635 -1151720 -1332596
58215 -1332596 -1447554 -1493445 -1472526 -1393587 -1271741 -1126700 -979567 -848711 -746225 -676739
58205 -676739 -639027 -629069 -642563 -675818 -724901 -783526 -840847 -881135 -886904 -844812 -751384 -615280
58193 -615280 -454909 -292787 -149296 -38137 35378 73260 81856 68250 37246 -10380 -78035
58182 -78035 -171478 -294999 -446812 -616351 -785676 -934510 -1045801 -1108801 -1119011 -1076363
58172 -1076363 -983231 -843068 -659991 -439404 -189350 78352 348052 601491 819702 984803
58162I84803R6663J7002o7944j50814k24517k84390l29182l60009l77947l82018
58152a078353l69058l35624k80712k07446j22924l6874M0115R8808J33998J46580
58142b011490J43350J34403J29501J34813J50935J73076J94098K08874K16679
58133e25761K19684K19616K15838K05970J87302J57795J17016O7500J5395l0943
58123H49412o3890p9020p5751n6717k7050O193L5461N5389O5263O9057P2495P9141
58111I29983Q8096R4350R1171P3605M1704J607l6951o5781q2722r2527j03740
58100I38795j23641j54064j90122k22257k40152k36134k06790j53258q1141R0
58090f68674P8912J44719J90695K15172K21101K14258K01298J88370J79947J77260
$$ plain form
58162 984803 1081466 1098468 1030524 879710 655193 370803 41621 -318388 -696335 -1078353
58152 -1078353 -1447411 -1783035 -2063747 -2271193 -2394117 -2430991 -2390876 -2292068 -2158070 -2011490
58142 -2011490 -1868140 -1733737 -1604236 -1469423 -1318488 -1145412 -951314 -742440 -525761
58133 -525761 -306077 -86461 129377 335347 522649 680444 797460 864960 880355 849412
58123 849412 785522 706502 630751 574034 546984 553177 588638 644027 709290 778347 850842 929983
58111 929983 1018079 1112429 1203600 1277205 1318909 1320516 1283565 1217784 1135062 1042535 938795
58100 938795 815154 661090 470968 248711 8559 -227575 -434365 -587623 -668764 -668674
58090 -668674 -589762 -445043 -254348 -39176 181925 396183 597481 785851 965798 1143058
58080A143058J76937J71695J54207J22065Q0199L8783Q383m399J213K0690M6265
58069A959096O9457Q3120Q2318O4210K7962k4709q8808j56222k17573k65199k95701
58058A237951l10511l14267l12169l07723l01611k91777k74854k48549k13923
58049a337433j76031j42210j18675j07211j04105j02383r6254q4606p0857n9561
58039b399326n2908m9664m6395l9156k4750j795K8387O1929R4032J21043J41438
58028b167165J55273J63141J65865J64787J61521J56707J48907J35244J13685
58019h02035Q5047N2996K2378k365j7713k1022j0945J1536M2273P4346R9990J13326
58007c52188J12291R8456P5057M4964J0282k6591o2056r1838j12620j23411j25887
$$ plain form
58080 1143058 1319995 1491690 1645897 1767962 1848161 1886944 1895327 1890928 1892141 1912831 1959096
58069 1959096 2028553 2111673 2193991 2258201 2286163 2261454 2172646 2016424 1798851 1533652 1237951
58058 1237951 927440 613173 301004 -6719 -308330 -600107 -874961 -1123510 -1337433
58049 -1337433 -1513464 -1655674 -1774349 -1881560 -1985665 -2088048 -2184302 -2268908 -2339765 -2399326
58039 -2399326 -2452234 -2501898 -2548293 -2587449 -2612199 -2613994 -2585607 -2523678 -2429646 -2308603 -2167165
58028 -2167165 -2011892 -1848751 -1682886 -1518099 -1356578 -1199871 -1050964 -915720 -802035
58019 -802035 -716988 -663992 -641614 -643979 -661692 -682714 -693659 -682123 -639850 -565504 -465514 -352188
58007 -352188 -239897 -141441 -66384 -21420 -11138 -37729 -99785 -191623 -304243 -427654 -553541
57996e53541j23767j21481j22135j25562j27950j23930j09760q5363n4220k1930
57986a569639N549K3659L0530K6927J4869l478k5313m5970n8954n7878l9027k906
57974a701631M5650R8580J46609J81606J98487J96077J76841J45699J08383P0183
57964c33516L5682Q877p560j4033j5064j7791k8209m7731p2678r6964j15683j26822
57952h31492j30414j26786j15913r8105p4786m8393k1546L865K7291M9496P1871
57941a294912R5647J21538J49346J76659J97447K02822J84889J41183P6052k002
57931D8669q4371j64693k38889l04478l60477m07444m46348m76384m93645m92597
57921c420657m69468m24704l62718k90158k14684j44209q5518m2268j3923L765
$$ plain form
57996 -553541 -677308 -798789 -920924 -1046486 -1174436 -1298366 -1408126 -1493489 -1547709 -1569639
57986 -1569639 -1564090 -1540431 -1509901 -1482974 -1468105 -1471583 -1496896 -1542866 -1601820 -1659698 -1698725 -1701631
57974 -1701631 -1655981 -1557401 -1410792 -1229186 -1030699 -834622 -657781 -512082 -403699 -333516
57964 -333516 -297834 -288957 -296517 -310550 -325614 -343405 -371614 -419345 -492023 -588987 -704670 -831492
57952 -831492 -961906 -1088692 -1204605 -1302710 -1377496 -1425889 -1447435 -1443570 -1416279 -1366783 -1294912
57941 -1294912 -1199265 -1077727 -928381 -751722 -554275 -351453 -166564 -25381 50671 48669
57931 48669 -35702 -200395 -439284 -743762 -1104239 -1511683 -1958031 -2434415 -2928060 -3420657
57921 -3420657 -3890125 -4314829 -4677547 -4967705 -5182389 -5326598 -5412116 -5454384 -5468307 -5464542
57911e464542J7636L5833O5448J08989J62045K14776K56685K81016K85901K72900
57901c763313K45302K07473J64525J21568Q2759N0856K7270J2299N210M347P370
57890b834334J1647J4735J4636R529k711k4313n6274r6923j41854j85438k22581
57879c513881k49417k63225k62342k46344k16346j75369j28681q3391m6523k2207
57869e207726r656l404M335K0412M7999Q5384J26890J65528J95942K15918K25801
57858d132577K27082K21961K14079K08760K11151K23341K42979K64594K82136
57849b036494K90814K88033K74028K51869K25851J98913J71186J41164J08484
57840h6152P5830M8244L0052K1475J7487J0031p825l8729q0703j29201j79662
$$ plain form
57911 -5464542 -5446906 -5411073 -5345625 -5236636 -5074591 -4859815 -4603130 -4322114 -4036213 -3763313
57901 -3763313 -3518011 -3310538 -3146013 -3024445 -2941686 -2890830 -2863560 -2851261 -2846051 -2841704 -2834334
57890 -2834334 -2822687 -2807952 -2793316 -2783787 -2786498 -2810811 -2867085 -2964008 -3105862 -3291300 -3513881
57879 -3513881 -3763298 -4026523 -4288865 -4535209 -4751555 -4926924 -5055605 -5138996 -5185519 -5207726
57869 -5207726 -5217382 -5220786 -5216451 -5196039 -5148040 -5062656 -4935766 -4770238 -4574296 -4358378 -4132577
57858 -4132577 -3905495 -3683534 -3469455 -3260695 -3049544 -2826203 -2583224 -2318630 -2036494
57849 -2036494 -1745680 -1457647 -1183619 -931750 -705899 -506986 -335800 -194636 -86152
57840 -86152 -10322 37922 67974 89449 106936 116967 109142 70413 -10290 -139491 -319153
57829c19153k29107k76175l19935l58533l88687m06027m05507l81783l30735k52684
57819c668326j55375n3434L6789J04196J46995J71297J85857J97034K06954K14829
57809b613184K19205K19339K15428K08265J98819J88006J76983J67894J64313
57800h54932J70590J90169K23709K67771L14494L52671L70333L58331L13298K38768
57790A945202J44115M1927n5081j36573j95620k28412k33856k14143j75586j27827
57780G64146q0586l9766n730K5132N6848R0669J23643J49437J61050J54068J28642
57769A527553Q9186M2486m491m6245p9802j04841j22795j35541j44770j52187
57759H68553j59737j69201j81229j94470k05255k08607k00747j81937j57101j33118
$$ plain form
57829 -319153 -548260 -824435 -1144370 -1502903 -1891590 -2297617 -2703124 -3084907 -3415642 -3668326
57819 -3668326 -3823701 -3877135 -3840346 -3736150 -3589155 -3417858 -3232001 -3034967 -2828013 -2613184
57809 -2613184 -2393979 -2174640 -1959212 -1750947 -1552128 -1364122 -1187139 -1019245 -854932
57800 -854932 -684342 -494173 -270464 -2693 311801 664472 1034805 1393136 1706434 1945202
57790 1945202 2089317 2131244 2076163 1939590 1743970 1515558 1281702 1067559 891973 764146
57780 764146 683560 643794 638064 663196 720044 810713 934356 1083793 1244843 1398911 1527553
57769 1527553 1616739 1659225 1654734 1608489 1528687 1423846 1301051 1165510 1020740 868553
57759 868553 708816 539615 358386 163916 -41339 -249946 -450693 -632630 -789731 -922849
57749i22849j14296r9317q1773n3961j1701M2534R9977J48988J79394J85631J68118
57738d59255J33233R1669N5051L1980K5748L5034N6238Q5378J18494J51314J79263
57727E04147J98320K06319K03999J94921J84134J76344J74806J81224J95719K15923
57717B435856K35813K46159K37580K04761J48907P6992j306p6989j44036k00240
57707C163497k46464k84635l15705l39118l53928l60126l58607l49948l33458
57698B21508l07503k70783k23556j68459j10793n7949j7355O415J3533Q349k870
57687i09463j3724j8047j0173J3470N2039R9598J47361J87664K16879K35573K46150
57676B47327K49954K45679K29578J97011J44919P4805m963p9903j34214j57333
$$ plain form
57749 -922849 -1037145 -1136462 -1218235 -1272196 -1283897 -1241363 -1141386 -992398 -813004 -627373 -459255
57738 -459255 -326022 -234353 -179302 -147322 -121574 -86540 -30302 55076 173570 324884 504147
57727 504147 702467 908786 1112785 1307706 1491840 1668184 1842990 2024214 2219933 2435856
57717 2435856 2671669 2917828 3155408 3360169 3509076 3586068 3584762 3507773 3363737 3163497
57707 3163497 2917033 2632398 2316693 1977575 1623647 1263521 904914 554966 221508
57698 221508 -85995 -356778 -580334 -748793 -859586 -917535 -934890 -928475 -914942 -906593 -909463
57687 -909463 -923187 -941234 -951407 -937937 -885898 -786300 -638939 -451275 -234396 1177 247327
57676 247327 497281 742960 972538 1169549 1314468 1389273 1384310 1304407 1170193 1012860
57666A012860j48047j13685o5608j4310L3403P4577J08366J33916J49446J53090
57656A324008J44585J26151J01974P6841N4875L8770K9427K5949K5885K5855K2503
57645A996823J3720l59j7238l3142m4960n1869n5434n7880n9782n9228n3284m0681
57633A536686k3338n661P705J3916J2734O027l373j2796k0290k4560k4824k1192
57621A441034j5435j1279j3508k6161n0813q5727j25938j64110j92110k03118
57611E52835j93638j64567j20917p0489k1860J7754M4004N5512N2616L5988O299
57600A93537l4768q3211j32291j73660j99748k06354j94192j68747j38622j13169
57590a251225r9935j02424j18983j43467j67543j83626j87321j78527j60566j37511
$$ plain form
57666 1012860 864813 751128 685520 671210 704613 779190 887556 1021472 1170918 1324008
57656 1324008 1468593 1594744 1696718 1773559 1828434 1867204 1896631 1922580 1948465 1974320 1996823
57645 1996823 2010543 2010184 1992946 1959804 1914844 1862975 1807541 1749661 1689879 1630651 1577367 1536686
57633 1536686 1513348 1507687 1515392 1529308 1542042 1548069 1544696 1531900 1511610 1487050 1462226 1441034
57621 1441034 1425599 1414320 1400812 1374651 1323838 1238111 1112173 948063 755953 552835
57611 552835 359197 194630 73713 3224 -18636 -882 43122 98634 151250 187238 193537
57600 193537 158769 75558 -56733 -230393 -430141 -636495 -830687 -999434 -1138056 -1251225
57590 -1251225 -1351160 -1453584 -1572567 -1716034 -1883577 -2067203 -2254524 -2433051 -2593617 -2731128
57580b731128j11200q0267m2128L775N4342J04101J48184J84487K13405K35532
57570b020897K49551K52465K42163K19666J88453J51334J08353N8153J570n6035
57560f05224j05823j39181j51625j44738j25097j00845p8076n9231m4053l1561
57550a585454k1273j3283p988o009q165j5056k6473m1225n7723p5034r3544j14644
57538b065871j39388j66688j91961k07220k03135j72618j14256l3806N6910J43101
57528c094932K10865K50688K59422K39911J98615J42934P9930J6581l9828q2405
57518a818219j06323j10015r4804o3318j8299L7160R8729J61093K19656K71873
57508a422467L16413L50846L70466L69857L46025L00636K39938J72874J08648
$$ plain form
57580 -2731128 -2842328 -2922595 -2964723 -2960948 -2906606 -2802505 -2654321 -2469834 -2256429 -2020897
57570 -2020897 -1771346 -1518881 -1276718 -1057052 -868599 -717265 -608912 -550759 -549189 -605224
57560 -605224 -711047 -850228 -1001853 -1146591 -1271688 -1372533 -1450609 -1509840 -1553893 -1585454
57550 -1585454 -1606727 -1620010 -1627998 -1634007 -1642172 -1657228 -1683701 -1724926 -1782649 -1857683 -1951227 -2065871
57538 -2065871 -2205259 -2371947 -2563908 -2771128 -2974263 -3146881 -3261137 -3294943 -3238033 -3094932
57528 -3094932 -2884067 -2633379 -2373957 -2134046 -1935431 -1792497 -1712567 -1695986 -1735814 -1818219
57518 -1818219 -1924542 -2034557 -2129361 -2192679 -2210978 -2173818 -2075089 -1913996 -1694340 -1422467
57508 -1422467 -1106054 -755208 -384742 -14885 331140 631776 871714 1044588 1153236
57499A153236N4470J3573j6062m1235p0382j08775j54991k01280k37452k55366
57489A35736k51310k26114j84341j33466q2546l9965j0767N106J2588J9292L2329
57478g23458N5637Q8767J27192J63898J91816K06297K06347J93691J70674J39005
57468H19866J00505N8537J7944j6974m4632o6206q3557r6894j04181j02506r0040
57457C91862o7160l6253p99L5534O9573R9297J24387J45997J65257J81223J90001
57446A298919J86020J64757J25051P0021O597n5805j07274j39521j47397j29437
57436A271931q8019k9557L5971R7287J45396J76261J90502J90637J78628J55889
57426B324926J25059R0762N7886K8897K951k2469m9120p6745j02950j23374j32361
$$ plain form
57499 1153236 1207706 1221279 1205217 1163982 1093600 984825 829834 628554 391102 135736
57489 135736 -115574 -341688 -526029 -659495 -742041 -782006 -792773 -787667 -775079 -755787 -723458
57478 -723458 -667821 -579054 -451862 -287964 -96148 110149 316496 510187 680861 819866
57468 819866 920371 978908 996852 979878 935246 869040 785483 688589 584408 481902 391862
57457 391862 324702 288449 287650 323184 392757 492054 616441 762438 927695 1108918 1298919
57446 1298919 1484939 1649696 1774747 1844768 1851365 1795560 1688286 1548765 1401368 1271931
57436 1271931 1183912 1154355 1190326 1287613 1433009 1609270 1799772 1990409 2169037 2324926
57426 2324926 2449985 2540747 2598633 2627530 2630481 2608012 2558892 2482147 2379197 2255823 2123462
57415B123462j25018j00202o2259j9765J7932M4032N5635N2916L7044Q341l3852
57404A998266q8982j52235k13595k60785k84711k83490k62218k29216j91961j55227
57394a24154j21335r0898o3265l6824r404K1482N8421J03328J55871K11915K63436
57383C68573L00604L15665L07115K81844K53267K35496K36594K54976K80884L01340
57373C136358L05215K86218K43679J82039J09564L5963l0826q7176j33541j71241
57363C876252j98814k11252k03094j72865j25404p0458j8713K2236N0046O7298
57353C015232P9376R1589J06362J21369J29412J20666Q6508K3215o6159j72014
57343C535556k80157l74942m43046m76732m75171m43200l88282l17290k34784
$$ plain form
57415 2123462 1998444 1898242 1835983 1816218 1834150 1878182 1933817 1986733 2023777 2032118 1998266
57404 1998266 1909284 1757049 1543454 1282669 997958 714468 452250 223034 31073 -124154
57394 -124154 -245489 -336387 -399652 -436476 -445880 -424398 -365977 -262649 -106778 105137 368573
57383 368573 669177 984842 1291957 1573801 1827068 2062564 2299158 2554134 2835018 3136358
57373 3136358 3441573 3727791 3971470 4153509 4263073 4299036 4268210 4181034 4047493 3876252
57363 3876252 3677438 3466186 3263092 3090227 2964823 2894365 2875652 2897888 2947934 3015232
57353 3015232 3094608 3186197 3292559 3413928 3543340 3664006 3750514 3773729 3707570 3535556
57343 3535556 3255399 2880457 2437411 1960679 1485508 1042308 654026 336736 101952
57334A01952j43509m6617N0170J38243K08025K51844K66098K51845K13976J59480
57324A451507R5630K9027l4096q7213j23965j40187j36158j16895q9918o1749
57314G85983l5378j0180J5763M2104O3768P1546N6108J3203n3125j31265k06019
57303F12508k63821k96979l05254k94062k70366k38929k01328j57731j09253n8760
57293a583975r801L5236P6199J14654J52002J87412K16974K34577K33914K10573
57283a32235J63759R7362J9953n6674j20416j62300j79058j73815j54613j31409
57273h29446j12578j02032r8346r6611r2012q2371o7565m6900j7933K1486P0255
57262a454053J23821J77311K28481K77099L21432L56000L73446L68956L43004
$$ plain form
57334 101952 -41557 -88174 -38004 100239 308264 560108 826206 1078051 1292027 1451507
57324 1451507 1547137 1576164 1542068 1454855 1330890 1190703 1054545 937650 847732 785983
57314 785983 750605 740425 756188 798292 862060 933606 989714 1002917 949792 818527 612508
57303 612508 348687 51708 -253546 -547608 -817974 -1056903 -1258231 -1415962 -1525215 -1583975
57293 -1583975 -1593776 -1558540 -1482341 -1367687 -1215685 -1028273 -811299 -576722 -342808 -132235
57283 -132235 31524 128886 148839 92165 -28251 -190551 -369609 -543424 -698037 -829446
57273 -829446 -942024 -1044056 -1142402 -1239013 -1331025 -1413396 -1480961 -1527861 -1545794 -1524308 -1454053
57262 -1454053 -1330232 -1152921 -924440 -647341 -325909 30091 403537 772493 1115497
57253A115497L00182K45922J84463J19058N2784j1618p2295j27844j75856k12015
57243A418278k31073k29493k08027j72444j31701r4790o8261n5511n6998p0328
57233I9652r0305j09858j21947j21543j07082q1351n1488k7278j7526k6084m9693
57222g04503p9024j02570j11908j05831r0944p7875p5250q5275j03352j21108
57212a657640j30216j25102j04265p0515k9922J0464M4949P0156Q4638Q8688Q4958
57201a733807P8510P4760P6223Q0690Q2375P4976N4860K3528j1167l6227l8019
57190a273298q520N0373J27305K06189K71987L14483L29205L16510K80139K25896
57180H40269J60474R0558K2296l8962q8891j24598j45174j52180j49532j42258
$$ plain form
57253 1115497 1415679 1661601 1846064 1965122 2017906 2006288 1933993 1806149 1630293 1418278
57243 1418278 1187205 957712 749685 577241 445540 350750 282489 226978 169980 99652
57233 99652 9347 -100511 -222458 -344001 -451083 -532434 -583922 -611200 -628726 -654810 -704503
57222 -704503 -783527 -886097 -998005 -1103836 -1194780 -1272655 -1347905 -1433180 -1536532 -1657640
57212 -1657640 -1787856 -1912958 -2017223 -2087738 -2117660 -2107196 -2062247 -1992091 -1907453 -1818765 -1733807
57201 -1733807 -1655297 -1580537 -1504314 -1423624 -1341249 -1266273 -1211413 -1187885 -1199052 -1235279 -1273298
57190 -1273298 -1281818 -1231445 -1104140 -897951 -625964 -311481 17724 334234 614373 840269
57180 840269 1000743 1091301 1113597 1074635 985744 861146 715972 563792 414260 272002
57170B72002j34343j27026j18909j07620r1413o9377m0708m393L9804Q9679J39605
57159a52699J81467K07422K12687J96340J59924J05923L7778l9017j16784j87233
57149F05808k43735k82999l05437l14177l12863l03556k86607k62956k36593k14013
57139b157128k00228j94347j88516j71225j32583o8354J8733J19908K22509L13027
57129b438204L80570M19649M30792M18577L88305L43571K86147K17854J42524
57120E89785O6202m360o3277j05840j28153j27680j04883o4316j3627L9030Q7402
57109A70283J28146J60483J84973K01787K09052K02477J77134J30866O7134m756
57099A627579p2380j24232j53044j57379j41529j14014q4922o2830n2592n4858
$$ plain form
57170 272002 137659 10633 -108276 -215896 -307309 -376686 -417394 -421787 -381983 -292304 -152699
57159 -152699 28768 236190 448877 645217 805141 911064 948842 909825 793041 605808
57149 605808 362073 79074 -226363 -540540 -853403 -1156959 -1443566 -1706522 -1943115 -2157128
57139 -2157128 -2357356 -2551703 -2740219 -2911444 -3044027 -3112381 -3093648 -2973740 -2751231 -2438204
57129 -2438204 -2057634 -1637985 -1207193 -788616 -400311 -56740 229407 447261 589785
57120 589785 655987 651627 588350 482510 354357 226677 121794 57478 43851 82881 170283
57109 170283 298429 458912 643885 845672 1054724 1257201 1434335 1565201 1632335 1627579
57099 1627579 1555199 1430967 1277923 1120544 979015 865001 780079 717249 664657 609799
57089F09799o7198q5848j07184j28251j46308j58105j60114j50110j29124j01948
57079f24391p5544n6385m8374n2149o5420q3818j01992j15023j19869j16374j07475
57068a566814r8607r6307j05891j28674j60016j89825k05785j97678j60797r7439
57058c007833j6662O7577J39951J88291K07275J99547J74107J43038J17873J06099
57048a680737J08419J17992J22764J10679P5430J9724m5914j08211j57300j90367
57038a627521k10633k22619k27433k21584j99762j58934j00783l1693L9003J01635
57028b860324J48963J77848J88907J84839J69159J46091J20440R6738P8488O8454
57018a480397O9065Q1306J02666J26601J44992J51756J44814J25470R6533O0865
$$ plain form
57089 609799 542601 456753 349569 221318 75010 -83095 -243209 -393319 -522443 -624391
57079 -624391 -699935 -756320 -804694 -856843 -922263 -1006081 -1108073 -1223096 -1342965 -1459339 -1566814
57068 -1566814 -1665421 -1761728 -1867619 -1996293 -2156309 -2346134 -2551919 -2749597 -2910394 -3007833
57058 -3007833 -3024495 -2956918 -2816967 -2628676 -2421401 -2221854 -2047747 -1904709 -1786836 -1680737
57048 -1680737 -1572318 -1454326 -1331562 -1220883 -1145453 -1125729 -1171643 -1279854 -1437154 -1627521
57038 -1627521 -1838154 -2060773 -2288206 -2509790 -2709552 -2868486 -2969269 -3000962 -2961959 -2860324
57028 -2860324 -2711361 -2533513 -2344606 -2159767 -1990608 -1844517 -1724077 -1627339 -1548851 -1480397
57018 -1480397 -1411332 -1330026 -1227360 -1100759 -955767 -804011 -659197 -533727 -437194 -376329
57008c76329K0988k0277n8573q7351r9328r0125o1845k3713J1068L0272K6543
56997g28670j305m9250j10031j74922k34749k80431l04089l01246k73196k27626
56987b685515j76307j30545r6613p3372n3331k6522J4782P2997J44841K23034
56977b786551K98807L64351M14682M48182M65618M68384M57364M33000L96233
56968I60070L49734K98431K48558K05010J68790J36762J04132O7453K6062j8273
56958B546729o2267j01890j33123j52583j57870j47873j23449q8130m7992j0458
56948A521094J7278K9556K3413l89l6994p8346j15251j39702j46682j35197j08521
56937H30259p3539l8639j0445R143K3226L6824N2518O8205P8491P8115O4732L9670
$$ plain form
57008 -376329 -355341 -375618 -434191 -521542 -620870 -710995 -772840 -796553 -785485 -755213 -728670
56997 -728670 -729975 -779225 -889256 -1064178 -1298927 -1579358 -1883447 -2184693 -2457889 -2685515
56987 -2685515 -2861822 -2992367 -3088980 -3162352 -3215683 -3242205 -3227423 -3154426 -3009585 -2786551
56977 -2786551 -2487744 -2123393 -1708711 -1260529 -794911 -326527 130837 563837 960070
56968 960070 1309804 1608235 1856793 2061803 2230593 2367355 2471487 2538940 2565002 2546729
56958 2546729 2484462 2382572 2249449 2096866 1938996 1791123 1667674 1579544 1531552 1521094
56948 1521094 1538372 1567928 1591341 1590952 1553958 1475612 1360361 1220659 1073977 938780 830259
56937 830259 756720 718081 707636 716779 740005 776829 829347 897552 976043 1054158 1118890 1158560
56925A158560P095k7484n8768q2970r8502j05707j05781r9620q7463o9302m5202
56914C84856j5135K0852O1140J00727J31547J45936J41024J20609R3177O7799
56904A252532N0538M2805M1876M3103M2861M0581L8616L9896M5113N1547N4256
56893A743724M8479L1485L296l3065p1442j03497j21658j23156j12451r9823r6472
56882A065420j08817j35172j66480j90274j95354j75184j29418o4289Q334P3722
56872a7512J18783J36298J26419R4840M9123m242o0513j15481j64138k00989k22090
56861b59502k26936k18210j99457j72966j39865j01861o2217k4615Q946L9169
56851a357514O8703J00471J35998J74031K10231K38837K55962K62088K61303K57740
$$ plain form
56925 1158560 1165655 1138171 1079403 996433 897931 792224 686443 586823 499360 430058 384856
56914 384856 369721 390573 451713 552440 683987 829923 970947 1091556 1184733 1252532
56904 1252532 1303070 1345875 1387751 1430854 1473715 1514296 1552912 1592808 1637921 1689468 1743724
56893 1743724 1792203 1823688 1826984 1793919 1722477 1618980 1497322 1374166 1261715 1161892 1065420
56882 1065420 956603 821431 654951 464677 269323 94139 -35279 -99568 -91234 -17512
56872 -17512 101271 237569 363988 458828 507951 503709 443196 327715 163577 -37412 -259502
56861 -259502 -486438 -704648 -904105 -1077071 -1216936 -1318797 -1381014 -1405629 -1396683 -1357514
56851 -1357514 -1288811 -1188340 -1052342 -878311 -668080 -429243 -173281 88807 350110 607850
56841F07850K52519K43941K30375K12584J93080J73415J52538J28122R9330O7931
56831B361685L6613O676k2327n0970p8545j03134j22272j32926j31179j13070
56821A650551p6882k5259L4836R4568J46216J84428K05396K05696J82480J34814
56811B736844O4418k4953j28459k40189l52448m55769n40338n98143o24508o18328
56801g81873n81406n17966m34888l42041k51084j72070j09628o1807k2938J1594
56791c264107M2528O7687Q5025R4578R7989R6864R1843Q2905P0210N4782L8760
56780b440936K4805J4749Q407L836j129p642j6038k6817m0821n8250p7364r3933
56768b711133j01800r4523o7745k1338L9812J06917J69953K20901K56406K78586
$$ plain form
56841 607850 860369 1104310 1334685 1547269 1740349 1913764 2066302 2194424 2293754 2361685
56831 2361685 2398298 2404974 2382647 2331677 2253132 2149998 2027726 1894800 1763621 1650551
56821 1650551 1573669 1548410 1583246 1677814 1824030 2008458 2213854 2419550 2602030 2736844
56811 2736844 2801262 2776309 2647850 2407661 2055213 1599444 1059106 460963 -163545 -781873
56801 -781873 -1363279 -1881245 -2316133 -2658174 -2909258 -3081328 -3190956 -3252763 -3275701 -3264107
56791 -3264107 -3221579 -3153892 -3068867 -2974289 -2876300 -2779436 -2687593 -2604688 -2534478 -2479696 -2440936
56780 -2440936 -2416131 -2401382 -2392975 -2389139 -2390268 -2397910 -2413948 -2440765 -2481586 -2539836 -2617200 -2711133
56768 -2711133 -2812933 -2907456 -2975201 -2996539 -2956727 -2849810 -2679857 -2458956 -2202550 -1923964
56758a923964K93350L07093L23674L43238L62805L77691L82954L74448L49518
56749A190807L07473K50168J82610J12721M9526K14l2422n0837o1525p2210q8339
56738A788186j10468j34259j53526j64192j66090j61527j52602j40048j24119
56729D81355j05745q6482o7630m9746l2767j6064J829K2958M8595P7485J05370
56718C79158J26772J38203J40706J39814J42556J53412J71722J92270K08413K15494
56708B008520K12307K00155J80894J55886J26588R5838O8210M8876M1637M7485
56698C186396O4163Q6506J07155J17723J10543Q0568K6709m7717j35117k24478
56688C372451l03477l61861l94420m01624l87738l58112l17288k68051k11221
$$ plain form
56758 -1923964 -1630614 -1323521 -999847 -656609 -293804 83887 466841 841289 1190807
56749 1190807 1498280 1748448 1931058 2043779 2093305 2093519 2061097 2010260 1948735 1876525 1788186
56738 1788186 1677718 1543459 1389933 1225741 1059651 898124 745522 605474 481355
56729 481355 375610 289128 221498 171752 138985 122921 124750 147708 196303 273788 379158
56718 379158 505930 644133 784839 924653 1067209 1220621 1392343 1584613 1793026 2008520
56708 2008520 2220827 2420982 2601876 2757762 2884350 2980188 3048398 3097274 3138911 3186396
56698 3186396 3250559 3337065 3444220 3561943 3672486 3753054 3779763 3732046 3596929 3372451
56688 3372451 3068974 2707113 2312693 1911069 1523331 1165219 847931 579880 368659
56679C68659j46409p4126J930P4050J31990J66017J70205J44697R5703L3017l3379
56668I32354r5436j47163j84100k03464k04635j88952j58733j16220o3135j085
56658d30569O7275J37127K01735K54469K90865L08835L07385K86099K46407J93039
56648A862667J33578P6126K6794j1652l9848o0878p8597r5773j12955j28740j41235
56637A429487j49673j54953j58620j61164j61059j55358j41289j17836q6732n2456
56627I0347k0858L390J9039K8558L6340M6161N9409P4517Q7699R4878R4043Q6744
56615G00267P7795P3550P9572R8166J26325J55503J74346J73560J50041J07874
56605A916999N5930L879m1064p5157r6929j05557j00834q5028o4509m8858m7578
$$ plain form
56679 368659 222250 148124 150054 224104 356094 522111 692316 837013 932716 965733 932354
56668 932354 836918 689755 505655 302191 97556 -91396 -250129 -366349 -429484 -430569
56658 -430569 -363294 -226167 -24432 230037 520902 829737 1137122 1423221 1669628 1862667
56648 1862667 1996245 2072371 2099165 2087513 2047665 1986787 1908190 1812417 1699462 1570722 1429487
56637 1429487 1279814 1124861 966241 805077 644018 488660 347371 229535 142803 90347
56627 90347 69489 72879 91918 120476 156816 202977 262386 336903 424602 519480 613523 700267
56615 700267 778062 851612 931184 1029350 1155675 1311178 1485524 1659084 1809125 1916999
56605 1916999 1972929 1976808 1935744 1860587 1763658 1658101 1557267 1472239 1407730 1358872 1311294
56594A311294o6681j06856j63196k25865k82085l19767l31497l16425k78883k25143
56584a005104j60611q8814j1996O7442J45606K16878K75224L16173L37909L40882
56574D33589L26925K99147K62396K22933J86586J56460J32072J10574Q8668O3508
56564B282858L2379p272n6404j12511j69169k17703k49841k60008k46740k13028
56554G82561j65460j12313o1506j9078J1908L2075M5364N7032P0885Q7595J04869
56543H33932J18874J25857J23407J10944Q9204N9279K2462j8813o0225r6532j23919
56532A184470j41747j51953j56379j54127j41077j12140o4852k164O6787J28261
56522D55079J67650J74730J48329R7482L7826j4693m8941o0383n0026k2241J7544
$$ plain form
56594 1311294 1244613 1137757 974561 748696 466611 146844 -184653 -501078 -779961 -1005104
56584 -1005104 -1165715 -1254529 -1266525 -1199083 -1053477 -836599 -561375 -245202 92707 433589
56574 433589 760514 1059661 1322057 1544990 1731576 1888036 2020108 2130682 2219350 2282858
56564 2282858 2315237 2307965 2251561 2139050 1969881 1752178 1502337 1242329 995589 782561
56554 782561 617101 504788 443282 424204 436112 468187 513551 570583 641468 729063 833932
56543 833932 952806 1078663 1202070 1313014 1402218 1461497 1483959 1465146 1404921 1308389 1184470
56532 1184470 1042723 890770 734391 580264 439187 327047 262195 260031 326818 455079
56522 455079 622729 797459 945788 1043270 1081096 1066403 1017462 957079 907053 884812 902356
56511I02356O4829J17046J72787K29405K80482L15368L22183K93314K30099J43309
56501C071178M8667l9842j14727j75393k25119k67271l03110l31722l51114l59418
56491I52129l55666l40364l15915k86640k57660k32739k12360j93937j74495j53723
56481a571370j34638j21301j15828j17011j20891j22225j16255j00616p6377m7050
56471b643562j5752J7180N3958R6437J42957J87468K22074K41336K45280K38813
56461a213811K28380K18565K10654K02921J91663J72769J43757J05168N9994J1545
56451C31605l8170q8257j37719j84799k27172k62100k86151k95284k86162k58168
56441a732377k14642j62199j08693o1159k4624j647Q015P820M405O183K0265M8813
$$ plain form
56511 902356 967185 1084231 1257018 1486423 1766905 2082273 2404456 2697770 2927869 3071178
56501 3071178 3119845 3080003 2965276 2789883 2564764 2297493 1994383 1662661 1311547 952129
56491 952129 596463 256099 -59816 -346456 -604116 -836855 -1049215 -1243152 -1417647 -1571370
56481 -1571370 -1706008 -1827309 -1943137 -2060148 -2181039 -2303264 -2419519 -2520135 -2596512 -2643562
56471 -2643562 -2659314 -2642134 -2588176 -2491739 -2348782 -2161314 -1939240 -1697904 -1452624 -1213811
56461 -1213811 -985431 -766866 -556212 -353291 -161628 11141 154898 260066 320060 331605
56451 331605 293435 205178 67459 -117340 -344512 -606612 -892763 -1188047 -1474209 -1732377
56441 -1732377 -1947019 -2109218 -2217911 -2279070 -2303694 -2305341 -2297326 -2289506 -2285101 -2278918 -2258653 -2209840
56429b209840Q7156J25541J53749J65696J61195J44382J20378R2350O0392K2766
56419a076235k1377o9754j16851j55974j81854j92417j89309j77387j63272j53046
56409b497476j49886j52508j55050j48506j23572p4261j100Q7563J77053K50550
56399b787193K94588L03768K82455K42466J97828J59271J31076J11382R4998P6743
56389h92618N3610K5243o650l9174o9031r3164j09193j15635j12002r9062p9092
56378a536768n5670l2552j1917O970K7581N4213Q9322J31800J77135K19195K52405
56367f78286K73369K81518K78885K69153K56420K44202K34950K29737K27816K26230
56357A843994K19973K02955J69448J15787M2229m5555j36647k17883k78779l15446
$$ plain form
56429 -2209840 -2122684 -1997143 -1843394 -1677698 -1516503 -1372121 -1251743 -1159393 -1099001 -1076235
56419 -1076235 -1097612 -1167366 -1284217 -1440191 -1622045 -1814462 -2003771 -2181158 -2344430 -2497476
56409 -2497476 -2647362 -2799870 -2954920 -3103426 -3226998 -3301259 -3302359 -3214796 -3037743 -2787193
56399 -2787193 -2492605 -2188837 -1906382 -1663916 -1466088 -1306817 -1175741 -1064359 -969361 -892618
56389 -892618 -839008 -813765 -820415 -859589 -928620 -1021784 -1130977 -1246612 -1358614 -1457676 -1536768
56378 -1536768 -1592438 -1624990 -1636907 -1629937 -1602356 -1548143 -1458821 -1327021 -1149886 -930691 -678286
56367 -678286 -404917 -123399 155486 424639 681059 925261 1160211 1389948 1617764 1843994
56357 1843994 2063967 2266922 2436370 2552157 2594386 2548831 2412184 2194301 1915522 1600076
56347A600076l30650l30068l17811k94632k59585k13080j58403j00599m3822J0636
56337d37938O4126J18556J74008K27681K74423L08162L23520L17263K89530K44429
56327A903760J89595J34662Q8848N8074M2701L7446L4233K6757J3797q73j1815
56316B517185j6012j4909j3244j5915k5452m1662o2643q5331j05132j16292j14247
56305A906346r8905p6109n5691m6949n4146p4534j00059j21509j32307j29654
56295A016483j13380q4778m6813m731L4625O5011Q2977Q8534Q4272P3930O1549
56284A257679N1215M6688N0291O1807P8636R7518J16301J34154J50273J62688
56274B207250J68346J64168J48047J19274P8536K7806k9610q8762j42696j82760
$$ plain form
56347 1600076 1269426 939358 621547 326915 67330 -145750 -304153 -404752 -448574 -437938
56337 -437938 -373812 -255256 -81248 146433 420856 729018 1052538 1369801 1659331 1903760
56327 1903760 2093355 2228017 2316865 2374939 2417640 2455086 2489319 2516076 2529873 2529000 2517185
56316 2517185 2501173 2486264 2473020 2457105 2431653 2389991 2327348 2242017 2136885 2020593 1906346
56305 1906346 1807441 1731332 1675641 1628692 1574546 1500012 1399953 1278444 1146137 1016483
56295 1016483 903103 818325 771512 766781 801406 866417 949394 1037928 1122200 1196130 1257679
56284 1257679 1308894 1355582 1405873 1467680 1546316 1643834 1760135 1894289 2044562 2207250
56274 2207250 2375596 2539764 2687811 2807085 2885621 2913427 2883817 2795055 2652359 2469599
56264B469599k00281j89546j50643r0386k0347M7194J03355J44880J73767J94873
56254B482465K12792K29355K43037K50593K50031K42951K34386K30041K32803
56245D608454K41002K49511K52643K46958K32879K14903K00322J96227K05662
56236F648561K25142K45397K55193K46054K15512J67352J08764M5814j9951r1148
56226H046690j70599k56670l41507m13117m59769m74252m56245m12314l53704
56217D708513k92836k39733j99503j71615j51035j30629j03840o6910k0162L1823
56207C364073Q1336J19688J39458J36051J08595O0479o25o4169j19639j59712
56197C665535j81895j88030j82264j68632j49169j23249q8463m2672J3785P6742
$$ plain form
56264 2469599 2269318 2079772 1929129 1838743 1818396 1865590 1968945 2113825 2287592 2482465
56254 2482465 2695257 2924612 3167649 3418242 3668273 3911224 4145610 4375651 4608454
56245 4608454 4849456 5098967 5351610 5598568 5831447 6046350 6246672 6442899 6648561
56236 6648561 6873703 7119100 7374293 7620347 7835859 8003211 8111975 8157789 8137838 8046690
56226 8046690 7876091 7619421 7277914 6864797 6405028 5930776 5474531 5062217 4708513
56217 4708513 4415677 4175944 3976441 3804826 3653791 3523162 3419322 3352412 3332250 3364073
56207 3364073 3445409 3565097 3704555 3840606 3949201 4009680 4009055 3944886 3825247 3665535
56197 3665535 3483640 3295610 3113346 2944714 2795545 2672296 2583833 2541161 2554946 2631688
56187B631688J38232J88040K16584K18144J92878J46393Q7186K3633l7952r3539
56177C711287j40306j75351j95579j99450j89437j72615j58145j53354j61510
56168B165540j82365k13707k51967k92034l27504l51620l58140l42133l01522
56159d55452k39511j65898r4984m0312r317j263r285k4552l9859n1340n8491o2874
56147a253138o5798o5994n9166m0513q779L1440P1143J00997J15365J14218J02499
56136i57726Q7410P4664O5661N7365M4812K3932p543n0942j07107j74886k48673
56125a193033l17534l67695l87545l72255l25306k56463j78046j01883l7700P845
56115c529615L2261L8098L2480K4840K3828L4977O0145R8221J45742J96787K43077
$$ plain form
56187 2631688 2769920 2957960 3174544 3392688 3585566 3731959 3819145 3842778 3804826 3711287
56177 3711287 3570981 3395630 3200051 3000601 2811164 2638549 2480404 2327050 2165540
56168 2165540 1983175 1769468 1517501 1225467 897963 546343 188203 -153930 -455452
56159 -455452 -694963 -860861 -955845 -996157 -1005474 -1006737 -1016022 -1040574 -1080433 -1131773 -1190264 -1253138
56147 -1253138 -1318936 -1384930 -1444096 -1484609 -1493388 -1461948 -1390805 -1289808 -1174443 -1060225 -957726
56136 -957726 -870316 -795652 -729991 -672626 -627814 -603882 -611425 -662367 -769474 -944360 -1193033
56125 -1193033 -1510567 -1878262 -2265807 -2638062 -2963368 -3219831 -3397877 -3499760 -3537460 -3529615
56115 -3529615 -3497354 -3459256 -3426776 -3401936 -3378108 -3343131 -3282986 -3184765 -3039023 -2842236 -2599159
56104b599159K75756K88846K82166K61375K34876K09906J90453J77814J72394
56095e05573J74759J85122K02080K21952K39314K48448K44929K26857J95398J54327
56085A587613J08534O2237J8029k2536n7377q2916r5103r2177p7203n8035m4133
56074A246933m2056n2465p0275q7492r6878r4650q1333o1067l9995k4248j7838
56063E78636k1084l0498m0445m5598m2542k9776o797K6446O9093J18380J69119
56052G44934K14280K46574K60438K53888K29845J96297J64208J43100J36291J39058
56042B728913J41388J33691J11680P7670L8205K80l1314n4181o6571o5735m8294
56031B965732j3038L5753Q7404J27975J46035J37440J06084O0643J0098l9136
$$ plain form
56104 -2599159 -2323403 -2034557 -1752391 -1491016 -1256140 -1046234 -855781 -677967 -505573
56095 -505573 -330814 -145692 56388 278340 517654 766102 1011031 1237888 1433286 1587613
56085 1587613 1696147 1758384 1776413 1753877 1696500 1613584 1518481 1426304 1349101 1291066 1246933
56074 1246933 1204877 1152412 1082137 994645 897767 803117 721784 660717 620722 596474 578636
56063 578636 557552 527054 486609 441011 398469 368693 361896 388342 457435 575815 744934
56052 744934 959214 1205788 1466226 1720114 1949959 2146256 2310464 2453564 2589855 2728913
56042 2728913 2870301 3003992 3115672 3193342 3231547 3231827 3200513 3146332 3079761 3014026 2965732
56031 2965732 2952694 2988447 3075851 3203826 3349861 3487301 3593385 3654028 3664126 3624990
56021C624990q3618j21923j53533j78143j95274k04063k03420j92630j72142j43756
56011A976488j09922p2825l4393K717L4485N6447O5632O1784M6985K4495k137
56000B049756k9464n4561p5450r1056j00587j02918r6408p9210m9949q968M0116
55989A401301Q9809J30245J52440J51052J24993P6342R458o8922j49520k21544
55979A695654k74803l01843k99352k68677k15526j48839p8837j4594L8321P8963
55969B10467J09796J33366J49164J53490J42778J17675Q4304N1682K7520J5665
55959A195907J6502K8990N2092Q4607J24194J66624K05768K34405K46169K38458
55949B593716K14549J82812J52685J30048J14985J02782Q6598O0215K0348l1686
$$ plain form
56021 3624990 3541372 3419449 3265916 3087773 2892499 2688436 2485016 2292386 2120244 1976488
56011 1976488 1866566 1793741 1759348 1762065 1796550 1852997 1918629 1980413 2027398 2051893 2049756
56000 2049756 2020292 1965731 1890281 1799225 1698638 1595720 1499312 1420102 1370153 1361185 1401301
55989 1401301 1491110 1621355 1773795 1924847 2049840 2126182 2135640 2066718 1917198 1695654
55979 1695654 1420851 1119008 819656 550979 335453 186614 107777 93183 131504 210467
55969 210467 320263 453629 602793 756283 899061 1016736 1101040 1152722 1180242 1195907
55959 1195907 1212409 1241399 1293491 1378098 1502292 1668916 1874684 2109089 2355258 2593716
55949 2593716 2808265 2991077 3143762 3273810 3388795 3491577 3578175 3638390 3658738 3627052
55939C627052q9856j45427j90187k18741k28749k19820j92653j49095r2740k9368
55929B070416L3164Q5842J20326J31131J17100Q1504L1116k4936p6261j12662
55919B456740j26252j13998p9754l4454O613K9094K4956n000n2702j06748j56052
55908A842443j91631k07041j98713j66774j15785n4266P698O2001J05162J38222
55898A221316J64021J84095J97682K03385K01724J96104J91299J90499J93122
55889B943247J94923J90321J75396J49666J15711P7439L8300K14l6894p4699j14849
55878C658775j56623j95986k27423k47190k54849k51698k38203k13447j77353
55869A696003j33361q9033n3844l5587l7405n6817q6750j17854j41197j50683
$$ plain form
55939 3627052 3537196 3391769 3201582 2982841 2754092 2534272 2341619 2192524 2099784 2070416
55929 2070416 2103580 2189422 2309748 2440879 2557979 2639483 2670599 2645663 2569402 2456740
55919 2456740 2330488 2216490 2136736 2102282 2108895 2137989 2162945 2157945 2105243 1998495 1842443
55908 1842443 1650812 1443771 1245058 1078284 962499 908233 915931 977932 1083094 1221316
55898 1221316 1385337 1569432 1767114 1970499 2172223 2368327 2559626 2750125 2943247
55889 2943247 3138170 3328491 3503887 3653553 3769264 3846703 3885003 3885217 3848323 3773624 3658775
55878 3658775 3502152 3306166 3078743 2831553 2576704 2325006 2086803 1873356 1696003
55869 1696003 1562642 1473609 1419765 1384178 1346773 1289956 1203206 1085352 944155 793472
55859G93472j44504j25082r7554o7600l9359j3862J1660M2764Q4902J40055K05005
55848G89897K72233L32434L77204M01222M03788L89116L64781L38902L17588L03879
55838D291044K97830K96958K96916K92999K82293K65233K45239K26491K11218
55829F706221J98046J82229J57553J18851O3525q716r6879j98441l07442m13058
55819F401889n01427n60710n86131n81288n54778n14737m65154m06181l37335
55810A894148k60452j80083j01742l0194L0799P7833J07836J19278J13889R7384
55800A868696P7916O2411N2901M5815L5490J9786L496l273R286M4986R9517J62725
55788B479752K23276K72745L07158L25926L29549L18005K90910K49065J95822
$$ plain form
55859 793472 648968 523886 426332 358732 319373 305511 317171 359935 444837 584892 789897
55848 789897 1062130 1394564 1771768 2172990 2576778 2965894 3330675 3669577 3987165 4291044
55838 4291044 4588874 4885832 5182748 5475747 5758040 6023273 6268512 6495003 6706221
55829 6706221 6904267 7086496 7244049 7362900 7426425 7417709 7320830 7122389 6814947 6401889
55819 6401889 5900462 5339752 4753621 4172333 3617555 3102818 2637664 2231483 1894148
55810 1894148 1633696 1453613 1351871 1321677 1352476 1430309 1538145 1657423 1771312 1868696
55800 1868696 1946612 2009023 2061924 2107739 2143229 2163015 2166511 2163238 2172524 2217510 2317027 2479752
55788 2479752 2703028 2975773 3282931 3608857 3938406 4256411 4547321 4796386 4992208
55779D992208J36980P9323K9009r384l3276m2297l8089k3373p45K7802O0298R3861
55767E272317J24362J47012J57575J53727J35946J07312P2124L4124m572m3396
55757F156531q2379j21074j57838j89821k13762k27246k29684k22440k07970j88397
55747D315920j64224j34043r5641m7768Q827P1774J37875K03152K62374L09511
55737D867757L39495L49852L40573L12687K67444K07040J35839O0439j1774p4523
55727F794829j23911j58821j80738j93168k00719k07973k18212k31916k45377
55718E033994k50944k40237k09471j63065j12065o7990l6552j5570K357K4872
55708C965329N5621R2533J29226J58502J75601J79349J71430J55518J36852J21264
$$ plain form
55779 4992208 5129188 5208511 5237520 5228136 5194860 5152563 5114474 5091101 5090356 5118158 5178456 5272317
55767 5272317 5396679 5543691 5701266 5854993 5990939 6098251 6170375 6204499 6199927 6156531
55757 6156531 6074152 5953078 5795240 5605419 5391657 5164411 4934727 4712287 4504317 4315920
55747 4315920 4151696 4017653 3922012 3874244 3883071 3954845 4092720 4295872 4558246 4867757
55737 4867757 5207252 5557104 5897677 6210364 6477808 6684848 6820687 6881126 6869352 6794829
55727 6794829 6670918 6512097 6331359 6138191 5937472 5729499 5511287 5279371 5033994
55718 5033994 4783050 4542813 4333342 4170277 4058212 3990222 3953670 3938100 3940457 3965329
55708 3965329 4020950 4113483 4242709 4401211 4576812 4756161 4927591 5083109 5219961 5341225
55698E341225J12973J12477J16301J18926J15345J02692Q0598N0848J7121j4906
55688F153600l7854m4456l1088j248L3871N9099O1795L7468q489o3540j13177
55677F045981j45783j55426j42411j12191p3265l4742m053J4650K1081J8075R737
55666E441653l27r302j3989r952P443M0523Q7264J40993J91779K29001K44635
55655F349721K36138K07148J65284J18564P2941L1911k743l0347n1029o5253p3125
55644F959210p3992o6793n1157k8864m861J3358J8457P068j7693m6764o8591p3664
55632F565714n8095k4869J7699N9689R3584J16331J28717J33447J33807J33314
55622G299338J35180J40882J48559J52983J47635J27829R2964M6923l084m8241
$$ plain form
55698 5341225 5454198 5566675 5682976 5801902 5917247 6019939 6100537 6151385 6168506 6153600
55688 6153600 6115746 6071290 6040202 6038954 6072825 6131924 6193719 6231187 6222698 6159158 6045981
55677 6045981 5900198 5744772 5602361 5490170 5416905 5382163 5378110 5392760 5413841 5431916 5441653
55666 5441653 5441326 5432024 5418035 5408083 5415526 5456049 5543313 5684306 5876085 6105086 6349721
55655 6349721 6585859 6793007 6958291 7076855 7149796 7181707 7178964 7148617 7097588 7032335 6959210
55644 6959210 6885218 6818425 6767268 6738404 6733543 6746901 6765358 6772426 6754733 6707969 6639378 6565714
55632 6565714 6507619 6482750 6500449 6560138 6653722 6770053 6898770 7032217 7166024 7299338
55622 7299338 7434518 7575400 7723959 7876942 8024577 8152406 8245370 8292293 8289209 8240968
55612H240968q0101r2894q5850o3962l5797q821J4736L8401O7848J06092J51072
55601H251692J96776K35997K62268K70527K57771K24286J74483J16042N7575O030
55591A0053447l5042o5987r0055j10854j29166j41165j39598j17515p2130o381
55581I145554P2458J55607K35149L05095L61558M02558M27430M35979M28064M04384
55571A2373836L67975L25035K83993K52939K36547K33950K38880K42300K36299
55562A4791754K17303J87339J53273J24312J08433J09228J25055J50844J80548
55553A6148089K08195K27838K34365K25626K03913J75143J46435J24184J13429
55544A7807217J17590J37815J72505K17856K69255L22431L73595M18770M53412
$$ plain form
55612 8240968 8160867 8067973 7982123 7918161 7882364 7873543 7888279 7926680 7994528 8100620 8251692
55601 8251692 8448468 8684465 8946733 9217260 9475031 9699317 9873800 9989842 10047417 10053447
55591 10053447 10018405 9952418 9862363 9751509 9622343 9481178 9341580 9224065 9151935 9145554
55581 9145554 9218012 9373619 9608768 9913863 10275421 10677979 11105409 11541388 11969452 12373836
55571 12373836 12741811 13066846 13350839 13603778 13840325 14074275 14313155 14555455 14791754
55562 14791754 15009057 15196396 15349669 15473981 15582414 15691642 15816697 15967541 16148089
55553 16148089 16356284 16584122 16818487 17044113 17248026 17423169 17569604 17693788 17807217
55544 17807217 17924807 18062622 18235127 18452983 18722238 19044669 19418264 19837034 20290446
55535B0290446M73351M77013M67576M53225M44848M52107M79661N24913N78132
55526B4641272O25503O54549O59515O43660O17450N94506N87927O07539O57356
55517C0289277P33486Q24373R14627R90762J045380J077670J090876J089139J075692
55508C9131282J052980J024104R94411R71927R65980R84667J032735J111080J217593
55499D8486759J348150J496934J656598J819028J977019K126003K264812K394862
55491F3570165K518242K635976K747624K852385K950680L045221L141338L246844
55483H6708475L371170L523100L707453L922506M160261M409871M662416M914408
55475A19379660N168584N432224N714085O021103O355928O716389P096979P490826
$$ plain form
55535 20290446 20763797 21240810 21708386 22161611 22606459 23058566 23538227 24063140 24641272
55526 24641272 25266775 25921324 26580839 27224499 27841949 28436455 29024382 29631921 30289277
55517 30289277 31022763 31847136 32761763 33752525 34797905 35875575 36966451 38055590 39131282
55508 39131282 40184262 41208366 42202777 43174704 44140684 45125351 46158086 47269166 48486759
55499 48486759 49834909 51331843 52988441 54807469 56784488 58910491 61175303 63570165
55491 63570165 66088407 68724383 71472007 74324392 77275072 80320293 83461631 86708475
55483 86708475 90079645 93602745 97310198 101232704 105392965 109802836 114465252 119379660
55475 119379660 124548244 129980468 135694553 141715656 148071584 154787973 161884952 169375778
55467A69375778P889972Q283493Q655656Q986683R256217R447210R547761R550371
55459B40993141R449461R238809Q910458Q456134P870404P153252O310202N350491
55451C03732352M285645L130227J904260O34998o43942j896148l086651m184709
55443C03876032n164794o007320o700442p242276p641466p914718q082093q162148
55435B46960775q169126q112886q000824p840085p638445p403610p141913o858099
55427A85795787o557079o246593n938330n645686n379285n143550m936805m754278
55419A41194181m591277m444564m312152m192684m085045l988056l900079l818537
55411A07861787l739688l658927l571786l475259l368767l254125l134419l012401
$$ plain form
55467 169375778 177265750 185549243 194204899 203191582 212447799 221895009 231442770 240993141
55459 240993141 250442602 259681411 268591869 277048003 284918407 292071659 298381861 303732352
55451 303732352 308017997 311148224 313052484 313687482 313043540 311147392 308060741 303876032
55443 303876032 298711238 292703918 286003476 278761200 271119734 263205016 255122923 246960775
55435 246960775 238791649 230678763 222677939 214837854 207199409 199795799 192653886 185795787
55427 185795787 179238708 172992115 167053785 161408099 156028814 150885264 145948459 141194181
55419 141194181 136602904 132158340 127846188 123653504 119568459 115580403 111680324 107861787
55411 107861787 104122099 100463172 96891386 93416127 90047360 86793235 83658816 80646415
55403H0646415k889224k764076k634886k499974k360005k219274k085171j965623
55395F1228182j865722j785362j718995j657421j591030j513538j424663j329926
55387D8341525j237405j153775j082448j024462r80232r50237r34393r30953r35616
55378C9112004r41223r38759r20135q82009q28214p68608p14362o72562o43701
55369C1802431o23296o05772n87515n67854n48601n33168n25384n27962n41071
55360B6741808n61767n84585o03049o11741o08215n93721n72149n47893n24142
55351B1534546n02445m83142m65777m49280m32356m14386l96177l79787l67139
55342A7644057l58461l51841l44316l33606l19237l02406k85090k69176k56074
$$ plain form
55403 80646415 77757191 74993115 72358229 69858255 67498250 65278976 63193805 61228182
55395 61228182 59362460 57577098 55858103 54200682 52609652 51096114 49671451 48341525
55387 48341525 47104120 45950345 44867897 43843435 42863203 41912966 40978573 40047620 39112004
55378 39112004 38170781 37232022 36311887 35429878 34601664 33833056 33118694 32446132 31802431
55369 31802431 31179135 30573363 29985848 29417994 28869393 28336225 27810841 27282879 26741808
55360 26741808 26180041 25595456 24992407 24380666 23772451 23178730 22606581 22058688 21534546
55351 21534546 21032101 20548959 20083182 19633902 19201546 18787160 18390983 18011196 17644057
55342 17644057 17285596 16933755 16589439 16255833 15936596 15634190 15349100 15079924 14823850
55333A4823850k46437k39560k32780k21956k03571j77316j46948j18348r5932
55324A3141002p9958o6571n0528k8941l648J9361L3230L4152K3611P955m255n756
55312A3019654O504L0461O0456R0189J15313J34412J48501J59672J69500J77804
55302A4112466J82325J79520J65737J38221R6242M2645j5232o7237j04963j26508
55292A4603216j37746j49019j69381k01874k42096k80335l06040l12334k98311
55283A2506080k68343k29641j89782j54759j27259j05513q3919n5750j6527L3968
55273A1308555R1684J49418J98144K28598K33508K10276J62667J00138L4570k3999
55263A2693559p0337j04145j27771j43292j50967j49810j39265j20208r4390o3271
$$ plain form
55333 14823850 14577413 14337853 14105073 13883117 13679546 13502230 13355282 13236934 13141002
55324 13141002 13061044 12994473 12943945 12915004 12911356 12930717 12963947 12998099 13021710 13029665 13025410 13019654
55312 13019654 13026158 13056619 13117075 13207264 13322577 13456989 13605490 13765162 13934662 14112466
55302 14112466 14294791 14474311 14640048 14778269 14874511 14917156 14901924 14834687 14729724 14603216
55292 14603216 14465470 14316451 14147070 13945196 13703100 13422765 13116725 12804391 12506080
55283 12506080 12237737 12008096 11818314 11663555 11536296 11430783 11346864 11291114 11274587 11308555
55273 11308555 11400239 11549657 11747801 11976399 12209907 12420183 12582850 12682988 12717558 12693559
55263 12693559 12623222 12519077 12391306 12248014 12097047 11947237 11807972 11687764 11593374 11530103
55253A1530103k7930R747M6199P7096R9551J13568J21431J25574J26676J23260
55243A2345275J12774R3133O3660K5053k1130p2681j26478j78217k23010k57157
55233A1761222k80173k95150l06345l15361l19183l12014k89207k49768j95769
55224I198252j30279n6402K2031R9441J68429K20882K49877K51815K28020J84759
55214A0436825J31446P7908L2045j364k0725k6858k1708p192J5016M2546P1182
55203A0729121R5132J09308J12351J08023J03505J05506J16578J33948J51305
55194A1764777J62369J64075J57666J47296J37322J30179J26038J23703J21480
55185A3034905J17230J08168R1138O3614K4794k3712p7889j32013j79960k16857
$$ plain form
55253 11530103 11502173 11511920 11558119 11635215 11734766 11848334 11969765 12095339 12222015 12345275
55243 12345275 12458049 12551182 12614842 12639895 12618765 12546084 12419606 12241389 12018379 11761222
55233 11761222 11481049 11185899 10879554 10564193 10245010 9932996 9643789 9394021 9198252
55224 9198252 9067973 9011571 9033602 9133043 9301472 9522354 9772231 10024046 10252066 10436825
55214 10436825 10568271 10646179 10678224 10676860 10656135 10629277 10607569 10600377 10615393 10657939 10729121
55203 10729121 10824253 10933561 11045912 11153935 11257440 11362946 11479524 11613472 11764777
55194 11764777 11927146 12091221 12248887 12396183 12533505 12663684 12789722 12913425 13034905
55185 13034905 13152135 13260303 13351441 13415055 13439849 13416137 13338248 13206235 13026275 12809418
55175A2809418k40498k51782k53656k48919k38131k19210j89005j45540q9388
55166A0933289k3804M5495J10546J62088J91860J95480J73993J33155Q1001K5539
55156A2028642k6104o7021q9868q7935n7937k556O9399J45217K11286K55659K70179
55145A2648961K52043K03932J32499M6589m3458j26150j90754k30737k46075k42329
55135A2204521k27311k08033j89339j73515j59914j44954j23418r1262m8644j302
55125A0836829M1074O8925P6897O5424L9447O227k6131m9730n8610n0976l0303
55114A0919073m265J8020K9190K6150J1182q809k4607k7451j1310K5499P9318
55103A1031990J41312J99487K42243K61700K55207K24634J74794J12238M4707
$$ plain form
55175 12809418 12568920 12317138 12063482 11814563 11576432 11357222 11168217 11022677 10933289
55166 10933289 10909485 10954980 11065526 11227614 11419474 11614954 11788947 11922102 12003103 12028642
55156 12028642 12002538 11935517 11845649 11757714 11699777 11697221 11766620 11911837 12123123 12378782 12648961
55145 12648961 12901004 13104936 13237435 13284024 13240566 13114416 12923662 12692925 12446850 12204521
55135 12204521 11977210 11769177 11579838 11406323 11246409 11101455 10978037 10886775 10838131 10836829
55125 10836829 10877903 10946828 11023725 11089149 11128596 11134823 11108692 11058962 11000352 10949376 10919073
55114 10919073 10914808 10932828 10962018 10988168 10999350 10990541 10965934 10938483 10927173 10952672 11031990
55103 11031990 11173302 11372789 11615032 11876732 12131939 12356573 12531367 12643605 12688312
55094A2688312j9656p3695j12574j34145j38442j27318j04489p5306m5566j9936
55084A1837185j103R988J3407R737J97j2772k5047l1497k7953j3093J1500M3092
55072A1813641P9457J18617J57017J88071K02624J91522J49343P7497j5171j15244
55062A2847374k09700k90083l53554m00762m32528m47728m43762m19162l76052
55053I474043l19974k56791j89485j18052m2687L3091J02549J58944J98517K20675
55043I260830K25576K11763J76368J18215M1629m2261j18466j73963k02910k08271
55033I288510j99279j86706j78648j78702j86372j98094k07669k06874j87843
55024G558323j46963q7507j8387N0263J11164J60841J97768K20358K26710K15904
$$ plain form
55094 12688312 12668656 12594961 12482387 12348242 12209800 12082482 11977993 11902687 11857121 11837185
55084 11837185 11836082 11846070 11859477 11869214 11869411 11856639 11831592 11800095 11772142 11759049 11770549 11813641
55072 11813641 11893098 12011715 12168732 12356803 12559427 12750949 12900292 12977789 12962618 12847374
55062 12847374 12637674 12347591 11994037 11593275 11160747 10713019 10269257 9850095 9474043
55053 9474043 9154069 8897278 8707793 8589741 8547054 8580145 8682694 8841638 9040155 9260830
55043 9260830 9486406 9698169 9874537 9992752 10034381 9992120 9873654 9699691 9496781 9288510
55033 9288510 9089231 8902525 8723877 8545175 8358803 8160709 7953040 7746166 7558323
55024 7558323 7411360 7323853 7305466 7355729 7466893 7627734 7825502 8045860 8272570 8488474
55014H488474J89313J50948J07002O4914L1701J1605M394O004J1364J6972K1317
55003I104008K3769K3998K2639K1859K4556L2477M4808N8360O9293P5129P5463
54992I576359P0841O1109M5126K2164o724l9034p2534j06257j39419j69061j88742
54981I053828j89994j66130j16167m6496L0594J00843J52807J81569J89680J84920
54971I375454J76432J71416J73354J81242J89521J89589J73326J36956Q2728J7648
54961A0867666m9077j08121j51440j73726j73642j53730j18753p4079k5726J8427
54951I857799M8715N6661L9387K255m2419p9893r8307r2141o2596j5351M2170
54940I656280J02144J56081J94816K10284J98394J60797J04090L7022l2570r9614
$$ plain form
55014 8488474 8677787 8828735 8935737 9000651 9032352 9043957 9048351 9054355 9065719 9082691 9104008
55003 9104008 9127777 9151775 9174414 9196273 9220829 9253306 9298114 9356474 9425767 9500896 9576359
54992 9576359 9647200 9708309 9753435 9775599 9768875 9729841 9657307 9551050 9411631 9242570 9053828
54981 9053828 8863834 8697704 8581537 8535041 8565635 8666478 8819285 9000854 9190534 9375454
54971 9375454 9551886 9723302 9896656 10077898 10267419 10457008 10630334 10767290 10850018 10867666
54961 10867666 10818589 10710468 10559028 10385302 10211660 10057930 9939177 9865098 9839372 9857799
54951 9857799 9906514 9963175 10002562 10004817 9962398 9882505 9784198 9692057 9629461 9614110 9656280
54940 9656280 9758424 9914505 10109321 10319605 10517999 10678796 10782886 10819908 10787338 10687724
54930A0687724j61997k19389k71336l15399l46630l59548l52276l29943l03592
54921H027614k83924k73890k65876k45829k01343j28281l2556P2849J72801K54008
54911G095573L06659L24355L04078K47117J60319N6025n0053j42401k09171k44395
54901G848106k48686k28482j93811j54878j18659q7300n9167l1601l339K4670
54891F746853N0113P0956Q6816R9189J10181J20534J28389J29739J20213R7211
54881G760194O1374J6925k9413p0675j02122j22465j32964j34992j28027j09864
54871G007971p8906l6367J3561O5466J14418J56413J88251K07850K14741K09661
54861H063059J93331J65676J26685P8290K5748k2942n9623p9382q2642p4465o1494
$$ plain form
54930 10687724 10525727 10306338 10035002 9719603 9372973 9013425 8661149 8331206 8027614
54921 8027614 7743690 7469800 7203924 6958095 6756752 6628471 6595915 6668764 6841565 7095573
54911 7095573 7402232 7726587 8030665 8277782 8438101 8494126 8444073 8301672 8092501 7848106
54901 7848106 7599420 7370938 7177127 7022249 6903590 6816290 6757123 6725522 6722183 6746853
54891 6746853 6796966 6867922 6954738 7053927 7164108 7284642 7413031 7542770 7662983 7760194
54881 7760194 7821568 7838493 7809080 7738405 7636283 7513818 7380854 7245862 7117835 7007971
54871 7007971 6929065 6892698 6906259 6971725 7086143 7242556 7430807 7638657 7853398 8063059
54861 8063059 8256390 8422066 8548751 8627041 8652789 8629847 8570224 8490842 8408200 8333735 8272241
54850H272241m8703l8124k9815k3614k0216k1516l0809n2758r1934j49594k20568
54839G544590k93376l54531l94151m08677l99608l70898l28009k78276k30135
54830D486929j90479j62285j44687j34922j29727j25084j15700r6187o4036k2413
54820C301409J9500M9426N6997L8303k345n4431j05844j47542j75947j92352k00505
54809B586669k03820k03374j97064j80397j48996j01572m1222K6086R4438J59677
54799A790425K18728K68085L03565L21770L21774L05583K77210K41090K00691
54790D248921J57959J13853O9623K7656r121l8959o2441q1740r8472j12066j20241
54779D094972j21070j14779j03533q9355p2076m9473j9917J4831M9458P8013R7069
$$ plain form
54850 8272241 8223538 8185414 8155599 8131985 8111769 8090253 8059444 8006686 7914752 7765158 7544590
54839 7544590 7251214 6896683 6502532 6093855 5694247 5323349 4995340 4717064 4486929
54830 4486929 4296450 4134165 3989478 3854556 3724829 3599745 3484045 3387858 3323822 3301409
54820 3301409 3320909 3370335 3427332 3465635 3463290 3408859 3303015 3155473 2979526 2787174 2586669
54809 2586669 2382849 2179475 1982411 1802014 1653018 1551446 1510224 1536310 1630748 1790425
54799 1790425 2009153 2277238 2580803 2902573 3224347 3529930 3807140 4048230 4248921
54790 4248921 4406880 4520733 4590356 4618012 4608891 4569932 4507491 4425751 4327279 4215213 4094972
54779 4094972 3973902 3859123 3755590 3666235 3594159 3544686 3524769 3539600 3589058 3667071 3764140
54768C764140J06053J04795R1305O2547J7565l9972j02154j59784k05730k36655
54758C402110k52631k55516k47315k29489k03479j71978j39783j12992r6360r0299
54748A602268q9851q6862p4272m9842j6968J7768M8479P2631R1055J06062J19497
54737A739965J32037J43446J52875J58828J59080J51039J32495J02402O1385J2017
54727B945569m0962r0696j28997j48294j44240j17984p6877l2914R43J5291P403
54716B188242j8665n4721r1978j23834j47242j62549j71673j75369j71361j54945
54706I15905j21726p0491m440O9567J42863K06891K54543K80752K82528K58671
54696B215063K09449J36455M3096o4411j76269k79594l60515m07504m14936l85534
$$ plain form
54768 3764140 3870193 3974988 4066293 4128840 4146405 4106433 4004279 3844495 3638765 3402110
54758 3402110 3149479 2893963 2646648 2417159 2213680 2041702 1901919 1788927 1692567 1602268
54748 1602268 1512417 1425555 1351283 1301441 1284473 1302241 1350720 1423351 1514406 1620468 1739965
54737 1739965 1872002 2015448 2168323 2327151 2486231 2637270 2769765 2872167 2933552 2945569
54727 2945569 2904607 2813911 2684914 2536620 2392380 2274396 2197519 2164605 2165548 2180839 2188242
54716 2188242 2169577 2114856 2022878 1899044 1751802 1589253 1417580 1242211 1070850 915905
54706 915905 794179 723688 719248 788815 931678 1138569 1393112 1673864 1956392 2215063
54696 2215063 2424512 2560967 2604063 2539652 2363383 2083789 1723274 1315770 900834 515300
54686E15300l30136k63920k00233j45022r5316m3036J7937Q5975J51265K01121
54676a06065K27227K29846K16779J98692J84012J75636J70249J60262J37674R8058
54666A692370M2567k2811q9602j48862j92273k13087k07616j76723j25912o3641
54656D94410J254O1460J11720J48168J67406J66261J42803R8131L7494l0369r5589
54645A303149j50052j89514k14211k27804k35065k39439k41656k39903k31170
54636f65665k12880j84120j46065j01568n4265p673L5413P3130J04365J28412
54626a030916J44863J53847J56243J53495J47194J38893J30355J23776J21530
54617B39280J25325J35264J49575J65441J80284J92208J99121J97753J84210J56085
$$ plain form
54686 515300 185164 -78756 -278989 -424011 -519327 -562363 -544426 -458451 -307186 -106065
54676 -106065 121162 351008 567787 766479 950491 1126127 1296376 1456638 1594312 1692370
54666 1692370 1734937 1712126 1622524 1473662 1281389 1068302 860686 683963 558051 494410
54656 494410 495664 557124 668844 817012 984418 1150679 1293482 1391613 1429107 1398738 1303149
54645 1303149 1153097 963583 749372 521568 286503 47064 -194592 -434495 -665665
54636 -665665 -878545 -1062665 -1208730 -1310298 -1364563 -1372236 -1336823 -1263693 -1159328 -1030916
54626 -1030916 -886053 -732206 -575963 -422468 -275274 -136381 -6026 117750 239280
54617 239280 364605 499869 649444 814885 995169 1187377 1386498 1584251 1768461 1924546
54607A924546J14626O5488J7745j8541l5776l2000j1809J5914M2164O0999O9955
54596B213311O8093N3986K5694j7189p1225j28689j79289k12746k21207k01497
54586A329242j57077r8405m0258L451K4838K4513J0286o898j7520j6415l256J8715
54574A071216M4444O8680Q7301R8076J00497R4725Q0253N5056J5882m0036j12401
54563A563693j95841k79859l51094l97128m10410l90664l44214k80456k07748
54554a293721j31683n6229J4425P5422J22004J50197J57126J41846J06636N7435
54544f56542K489m9851r2429j18973j23236r9082m2164M7244J61781K86652M02480
54533b81631M90496N37588N38670M95868M16135L09426J88270O7353l8630j19125
$$ plain form
54607 1924546 2039172 2104660 2122405 2103864 2068088 2036088 2024279 2040193 2082357 2143356 2213311
54596 2213311 2281404 2335390 2361084 2343895 2272670 2143981 1964692 1751946 1530739 1329242
54586 1329242 1172165 1073760 1033502 1036953 1061791 1086304 1096590 1089692 1072172 1055757 1052501 1071216
54574 1071216 1115660 1184340 1271641 1369717 1470214 1564939 1645192 1700248 1716130 1676094 1563693
54563 1563693 1367852 1087993 736899 339771 -70639 -461303 -805517 -1085973 -1293721
54554 -1293721 -1425404 -1481633 -1467208 -1391786 -1269782 -1119585 -962459 -820613 -713977 -656542
54544 -656542 -654053 -703904 -796333 -915306 -1038542 -1137624 -1179788 -1132544 -970763 -684111 -281631
54533 -281631 208865 746453 1285123 1780991 2197126 2506552 2694822 2762175 2723545 2604420
54523B604420j71598k02045k21162k38502k58075k77373k89382k86229k63201
54514C96853k21511j68336j13831o6871l2072r251N190J6172K7992M3048O1595
54503f1022Q2266J02743J19878J29556J26989J08014P0919J7760m5647j11063
54493E40393j69916k15542k44853k58554k59511k50446k32901k08159j78623j47571
54483a625683j17177q6848n3846j6118K4767O3002R1131J04323J03197R2930P9463
54472a340859O6088N3172M0639L0214K5020K7152L5989M8990O3788P8905R2443
54461g78459J00980J00947R1735P7249O4027N7469N9361O8159Q0896R4745J07574
54450A24683J18133J26463J34094J43280J55254J68589J78713J78931J62643J26176
$$ plain form
54523 2604420 2432822 2230777 2009615 1771113 1513038 1235665 946283 660054 396853
54514 396853 175342 7006 -106825 -173696 -205768 -215019 -209829 -193657 -165665 -122617 -61022
54503 -61022 21244 123987 243865 373421 500410 608424 679343 697103 651456 540393
54493 540393 370477 154935 -89918 -348472 -607983 -858429 -1091330 -1299489 -1478112 -1625683
54483 -1625683 -1742860 -1829708 -1883554 -1899672 -1874905 -1811903 -1720772 -1616449 -1513252 -1420322 -1340859
54472 -1340859 -1274771 -1221599 -1180960 -1150746 -1125726 -1098574 -1062585 -1013595 -949807 -870902 -778459
54461 -778459 -677479 -576532 -484797 -407548 -343521 -286052 -226691 -158532 -77636 17109 124683
54450 124683 242816 369279 503373 646653 801907 970496 1149209 1328140 1490783 1616959
54440A616959P1222N442n9588j12164j43839j51017j34925j00974n7877j6404
54430I16835J2482K0120K847l6164q7262j37377j74666j92526j91176j76262j55467
54419a98616j34997j17595j02456q6144o3775l0625J5403P1265J27953J72571
54409c47016J92731J81289J39262P5605M044o1571j11236j40739j51159j46435
54399c65225j30360j04880p0756k9691J4627N7699R6072J27613J50260J61449
54389i3192J59245J43722J16911Q1813M1964J476l5964o9167j00354j33121j68815
54378e5482k04606k34898k54626k61615k56291k39351k09659j64433j01931k4344
54368b007236O1664J47164K23989K86626L32621L62093L76537L77144L63838L36223
$$ plain form
54440 1616959 1688181 1693623 1634035 1521871 1378032 1227015 1092090 991116 933239 916835
54430 916835 929317 949437 952284 916120 828858 691481 516815 324289 133113 -43149 -198616
54419 -198616 -333613 -451208 -553664 -639808 -703583 -734208 -718805 -647540 -519587 -347016
54409 -347016 -154285 27004 166266 241871 245915 184344 73108 -67631 -218790 -365225
54399 -365225 -495585 -600465 -671221 -700912 -686285 -628586 -532514 -404901 -254641 -93192
54389 -93192 66053 209775 326686 408499 450463 451939 415975 346808 246454 113333 -55482
54378 -55482 -260088 -494986 -749612 -1011227 -1267518 -1506869 -1716528 -1880961 -1982892 -2007236
54368 -2007236 -1945572 -1798408 -1574419 -1287793 -955172 -593079 -216542 160602 524440 860663
54358H60663K95741K46562J93727J40178Q5797K9514k7608q1349j26035j57172
54348A460018j72724j72805j59045j34657j04737p5478n2124l7149l0375l0834
54338D90090l8361n3383p5435j02278j30444j56484j77935j93714k04106k10336
54328h52386k13843k15834k17217k18433k18702k15374k04491j82878j50591j12176
54318b801925p5568m8729l5540l3562l5339l2429j9385M382L4920O5230Q7405
54307b890540R5642Q9423P4973O3087O3757Q0750J09904J41992J67457J79647
54297a823908J75716J56657J27214R4853O7261M9629M3571M8011O0993Q1166J08132
54286h10705J41521J79523K18296K52996K79454K94942K97754K86632K60952K21624
$$ plain form
54358 860663 1156404 1402966 1596693 1736871 1822668 1852182 1824574 1743225 1617190 1460018
54348 1460018 1287294 1114489 955444 820787 716050 640572 588448 551299 520924 490090
54338 490090 451729 398346 322911 220633 90189 -66295 -244230 -437944 -642050 -852386
54328 -852386 -1066229 -1282063 -1499280 -1717713 -1936415 -2151789 -2356280 -2539158 -2689749 -2801925
54318 -2801925 -2877493 -2926222 -2961762 -2995324 -3030663 -3063092 -3082477 -3078095 -3043175 -2977945 -2890540
54307 -2890540 -2794898 -2705475 -2630502 -2567415 -2503658 -2422908 -2313004 -2171012 -2003555 -1823908
54297 -1823908 -1648192 -1491535 -1364321 -1269468 -1202207 -1152578 -1109007 -1060996 -1000003 -918837 -810705
54286 -810705 -669184 -489661 -271365 -18369 261085 556027 853781 1140413 1401365 1622989
54276A622989J72182J19255P1389L5793J4478K631r113k9855o4290j11649j67517
54265A656293k26324k82444l29823l61910l73374l62728l33401k92104k45879
54256a151694j99996j57277j17885p9010l5223J9609Q9275J72698K63520L51917
54246h44066M27366M80899N06466N01909M69655M16287L50509K80453K12125J49737
54236B951340R6910N7317L3961K7273L3019M1768M1565K3158j5168o6553j18948
54225C105642j60439j83409j85946j70990j44316j12460q1164n4566l5103k4045
54215A953204k2574l2750n7246r7255j49413k04058k46720k62982k44311j91669
54205D44226j14877k8454N3282J19518J64119J85760J87633J76362J59623J43165
$$ plain form
54276 1622989 1795171 1914426 1985815 2021608 2036086 2038717 2029604 1999749 1935459 1823810 1656293
54265 1656293 1429969 1147525 817702 455792 82418 -280310 -613711 -905815 -1151694
54256 -1151694 -1351690 -1508967 -1626852 -1705862 -1741085 -1721476 -1632201 -1459503 -1195983 -844066
54246 -844066 -416700 64199 570665 1072574 1542229 1958516 2309025 2589478 2801603 2951340
54236 2951340 3048250 3105567 3139528 3166801 3199820 3241588 3283153 3306311 3291143 3224590 3105642
54225 3105642 2945203 2761794 2575848 2404858 2260542 2148082 2066918 2012352 1977249 1953204
54215 1953204 1930630 1897880 1840634 1743379 1593966 1389908 1143188 880206 635895 444226
54205 444226 329349 300895 354177 473695 637814 823574 1011207 1187569 1347192 1490357
54195A490357J28930J15564J00703Q3166O3310M1859J8933n363k9562n0598o5574
54184A891725p4009p8355q2367q9064j00143j16658j39209j66804j95707k20211
54174F29198k35264k38788k31700k16053j93378j64642j31229r5398n9442k4262
54164i60958J1150M8523Q8262J28303J65002J95408K19040K37915K54783K70734
54154F58162K83805K89622K83755K63976K30758J86378J34354P9882K9954q498
54144B432148l1861m2196m6779n5016p4588j08729j55545k08850k59612k97765
54134A151207l14797l06702k75706k29204j76575j26055q3319n1578l2146k4883
54124d69758k8562m1091n9592q0411r9171j10967j11034r6205o6748k7078J6029
$$ plain form
54195 1490357 1619287 1734851 1835554 1918720 1982030 2023889 2042822 2037459 2007897 1957299 1891725
54184 1891725 1817716 1739361 1656994 1567930 1467787 1351129 1211920 1045116 849409 629198
54174 629198 393934 155146 -76554 -292607 -485985 -650627 -781856 -877254 -936696 -960958
54164 -960958 -949808 -901285 -813023 -684720 -519718 -324310 -105270 132645 387428 658162
54154 658162 941967 1231589 1515344 1779320 2010078 2196456 2330810 2410692 2440646 2432148
54144 2432148 2400287 2358091 2311312 2256296 2181708 2072979 1917434 1708584 1448972 1151207
54134 1151207 836410 529708 254002 24798 -151777 -277832 -361151 -412729 -444875 -469758
54124 -469758 -498320 -539411 -599003 -679414 -778585 -889552 -1000586 -1096791 -1163539 -1190617 -1174588
54113a174588N6864R3237J25788J55034J79047J93903J96260J85665J64893J38383
54103C14486J10202Q2926N8135L8016K6483K8481M7774Q4936J36801J96951K56194
54092A381385L03237L26635L18027K74897K01052J04696m342j16602k23650l17896
54082B247439l92438m41601m62273m55456m26904l85955l42571l04061k73503
54073a237323k50649k34119k22739k15273k09722k03693j95650j85446j73166
54064c127780j57216j33639r7565m5871K0649R6679J73631K42503K97411L37867
54054b393331L67790L91481M09375M17042M08187L79418L33328K78016K23377
54045H14683J76545J39315J09029Q1967N6589L4634J9946J6272K5181M4942P0727
$$ plain form
54113 -1174588 -1117724 -1024487 -898699 -743665 -564618 -370715 -174455 11210 176103 314486
54103 314486 424688 507614 565749 603765 630248 658729 706503 791439 928240 1125191 1381385
54092 1381385 1684622 2011257 2329284 2604181 2805233 2909929 2905587 2788985 2565335 2247439
54082 2247439 1855001 1413400 951127 495671 68767 -317188 -659759 -963820 -1237323
54073 -1237323 -1487972 -1722091 -1944830 -2160103 -2369825 -2573518 -2769168 -2954614 -3127780
54064 -3127780 -3284996 -3418635 -3516200 -3562071 -3541422 -3444743 -3271112 -3028609 -2731198 -2393331
54054 -2393331 -2025541 -1634060 -1224685 -807643 -399456 -20038 313290 591306 814683
54045 814683 991228 1130543 1239572 1321539 1378128 1412762 1432708 1448980 1474161 1519103 1589830
54034A589830R6144J15375J24855J23807J13719R7361P7979N8785M2563L1166
54024B471584K5152K3877K5862K9073L1018K9227K2231J0288m935k1519l8172
54013B603686n4167o8635q0103q6763q7262q1582p1390n9653m9706m4311m5085
54002A875029n2209o4295p8679r2333j03061j09954j12741j10805j03283r0485
53992I57184p5371o3317n9692o6533q0630r4815j02053r9698r0719q1183p6321
53981F6852p8355q6827r9766j14013j24895j26610j13810q3528l6316K3736Q9768
53970f83764J53274K05495K38959K48870K33981J96669J42414P8727J3751m5152
53960G83224r2494j25261j43212j48545j44767j35230j22461j08666r6154q6469
$$ plain form
54034 1589830 1685974 1801349 1926204 2050011 2163730 2261091 2339070 2397855 2440418 2471584
54024 2471584 2496736 2520613 2546475 2575548 2606566 2635793 2658024 2668312 2663377 2641858 2603686
54013 2603686 2549519 2480884 2400781 2314018 2226756 2145174 2073784 2014131 1964425 1920114 1875029
54002 1875029 1822820 1758525 1679846 1587513 1484452 1374498 1261757 1150952 1047669 957184
53992 957184 881813 818496 758804 692271 611641 516826 414773 315075 224356 143173 66852
53981 66852 -11503 -98330 -198096 -312109 -437004 -563614 -677424 -760952 -797268 -773532 -683764
53970 -683764 -530490 -324995 -86036 162834 396815 593484 735898 814625 828376 783224
53960 783224 690730 565469 422257 273712 128945 -6285 -128746 -237412 -333566 -420035
53950d20035p8794o9324n2345k2312K3853Q4627J52824K16738K63467K82732K69656
53939F51087K26005J59623Q1559J752p3793j42172k00584k44914k71448k79551
53929i2436k72267k54089k27856j93092j47079q8046j8034N7062J30440J97735
53919i07662K57601L09119L48805L70489L68834L43835L02340K54842K09711J69268
53909B027182J30454Q9108M4266n53l9424o7668q4561r3743j01371j13255j32488
53898A657947j58748j89411k21456k52536k80478l02107l13005l08915k87878
53889f56587k51629k05028j53618j00667m6154J1071O9443J22765J62450J82560
53879h65394J83699J72904J59759J51653J51101J55967J61376J61616J51686J28840
$$ plain form
53950 -420035 -498829 -568153 -620498 -642810 -618957 -534330 -381506 -164768 98699 381431 651087
53939 651087 877092 1036715 1118274 1120026 1046233 904061 703477 458563 187115 -92436
53929 -92436 -364703 -618792 -846648 -1039740 -1186819 -1274865 -1292899 -1235837 -1105397 -907662
53919 -907662 -650061 -340942 7863 378352 747186 1091021 1393361 1648203 1857914 2027182
53909 2027182 2157636 2246744 2291010 2290457 2251033 2183365 2098804 2005061 1903690 1790435 1657947
53898 1657947 1499199 1309788 1088332 835796 555318 253211 -59794 -368709 -656587
53889 -656587 -908216 -1113244 -1266862 -1367529 -1413683 -1402612 -1333169 -1210404 -1047954 -865394
53879 -865394 -681695 -508791 -349032 -197379 -46278 109689 271065 432681 584367 713207
53869G13207R3861N0950N871l6298p2357j00722j20584j31012j30254j15670q4704
53858G2288l6540K6543R8847J72045K36799K84847L10711L12163K89612K45492
53848B012807J84312J13002M0490k3723p1700r9298j07826j04273r9248j02828
53838A741715j20151j49284j82806k11823k29435k31761k17296j86706j43485
53829F8968r4035m6014o112K1142L3423L0773J6232m106k2495l1983k8677j3153
53817g6037R531L1434M4594M3860K8420K008k7858n1654o1131n3103l1149l541
53805a44626K1329L8528M6895M7012L9545K5589Q299o456j1865l826J6188M1449
53793A18061O3610P6794P9195P1947N7637L9981K3644J2530P325M947P45q725
$$ plain form
53869 713207 807068 858018 863889 827591 755234 654512 533928 402916 272662 156992 72288
53858 72288 35748 62291 161138 333183 569982 854829 1165540 1477703 1767315 2012807
53848 2012807 2197119 2310121 2350611 2326888 2255188 2155890 2048064 1943791 1844543 1741715
53838 1741715 1621564 1472280 1289474 1077651 848216 616455 399159 212453 68968
53829 68968 -25067 -71081 -77193 -56051 -22628 8145 24377 20271 -2224 -34207 -62884 -76037
53817 -76037 -66506 -35072 9522 53382 81802 83810 55952 4298 -56833 -109936 -141085 -144626
53805 -144626 -123297 -84769 -37874 9138 48683 74272 82571 76115 64250 60424 76612 118061
53793 118061 181671 258465 337660 409607 467244 507225 530869 543399 550724 555671 556416 547691
53781E47691k4950m8313p8270j12089j44036j66729j73808j61764j30148q1275
53771e73691k0487M3516R9604J36822J47703J30745R0998L8648j3786n4606p5675
53760e0209p4052n2190j6700K3692O0351Q6532R8748R7320Q5712O8929N1970L9133
53748D19236L3565L6177M4338N2155N3138M3520K3704k984l2615o2116q9224j11544
53736D07350j25698j27387j12812q0956l5227J6815O5679J02924J23491J26414
53726C60593J13765Q8780N4796J5720k2995n4753p4045p8965p2389o1382n5353
53715B13772o3220q9888j33281j83773k26978k49069k42194k07434j53948r4891
53705a430904m2351l611K0256L3573M3519N6706P6278J01115J27347J50759J68503
$$ plain form
53781 547691 522741 474428 396158 284069 140033 -26696 -200504 -362268 -492416 -573691
53771 -573691 -594178 -550662 -451058 -314236 -166533 -35788 55210 93858 80072 25466 -50209
53760 -50209 -124261 -176451 -193151 -169459 -109108 -22576 76172 173492 259204 328133 380103 419236
53748 419236 452801 488978 533316 585471 638609 682129 705833 702849 670234 608118 518894 407350
53736 407350 281652 154265 41453 -39503 -74730 -57915 7764 110688 234179 360593
53726 360593 474358 563138 617934 633654 610659 555906 481861 402896 330507 269125 213772
53715 213772 150552 60664 -72617 -256390 -483368 -732437 -974631 -1182065 -1336013 -1430904
53705 -1430904 -1473255 -1476866 -1456610 -1423037 -1379518 -1322812 -1246534 -1145419 -1018072 -867313 -698810
53694f98810J79537J84083J82512J74210J57309J29867R1861M6571M09l8735o4187
53683C44627p3557p0646o4284o3788p3698r1516j09718j20082j17179r9508o8786
53672f08135k8654J6101N9218R2306J05752R2261N1329q988p4891j32703j73996
53661f10400j97343k06441k06275j99653j86072j63174j29276q4988l3153K2164
53651a994611P6754J27103J70874K07027K35618K57380K73004K82028K81835K67753
53641A84765K34696J79688J03962J3283q3719j78324k63746l35177l88606m20199
53631i53377m27223m09725l71458l19356k61479k04222j50243r8896m8955j191
53621c246125M1619P6847J03730J23038J35589J41473J40628J33858J23128J10873
$$ plain form
53694 -698810 -519273 -335190 -152678 21532 178841 308708 400569 447140 447549 408814 344627
53683 344627 271070 200424 136140 72352 -1346 -92862 -202580 -322662 -439841 -539349 -608135
53672 -608135 -636789 -620688 -561470 -469164 -363412 -271151 -219822 -228810 -303701 -436404 -610400
53661 -610400 -807743 -1014184 -1220459 -1420112 -1606184 -1769358 -1898634 -1983622 -2016775 -1994611
53651 -1994611 -1917857 -1790754 -1619880 -1412853 -1177235 -919855 -646851 -364823 -82988 184765
53641 184765 419461 599149 703111 716394 632675 454351 190605 -144572 -533178 -953377
53631 -953377 -1380600 -1790325 -2161783 -2481139 -2742618 -2946840 -3097083 -3195979 -3244934 -3246125
53621 -3246125 -3204506 -3127659 -3023929 -2900891 -2765302 -2623829 -2483201 -2349343 -2226215 -2115342
53611b115342R8968Q8476Q0378P6435P8995Q9788J08798J33981J61656J87335
53601a010532K07001K18482K21993K19310K12304K02022J88603J71657J50922
53592G81762J27087J02138P8478N7259L7553J7458l668k3640l7674m0149k6874
53581A069730K813M4574Q8737J21953J31344J09662N8592j2315r0222j63777k25074
53570A136017k69004k92283k93751k75399k42734k03688j66606j38176j21928
53561h67552j17528j21078j26435j27288j19389j02338q0432o1994n6441o9331
53551a849806r7683j29173j46859j37077r5661k9098M9046J23652J82792K20131
53541a909736K34767K29577K09641J81629J53516J33290J26632J34954J55450
$$ plain form
53611 -2115342 -2016374 -1927898 -1847520 -1771085 -1692090 -1602302 -1493504 -1359523 -1197867 -1010532
53601 -1010532 -803531 -585049 -363056 -143746 68558 270580 459183 630840 781762
53592 781762 908849 1010987 1089465 1146724 1184277 1201735 1198067 1174427 1136753 1096604 1069730
53581 1069730 1072543 1117117 1205854 1327807 1459151 1568813 1627405 1615090 1524868 1361091 1136017
53570 1136017 867013 574730 280979 5580 -237154 -440842 -607448 -745624 -867552
53561 -867552 -985080 -1106158 -1232593 -1359881 -1479270 -1581608 -1662040 -1724034 -1780475 -1849806
53551 -1849806 -1947489 -2076662 -2223521 -2360598 -2456259 -2485357 -2436311 -2312659 -2129867 -1909736
53541 -1909736 -1674969 -1445392 -1235751 -1054122 -900606 -767316 -640684 -505730 -350280
53532c50280J83228K13894K44450K71896K91119K94749K75930K32225J67504R0598
53522A915313J1955n9556j18767j65144k02433k36629k72697l11661l49856l80952
53512a70427l99404m02743l91125l64884l22853k63697j89595j09106l6109J5376
53502b634567L7466L1534O089k8827o6278j02897j35771j59689j67832j55362
53492c376134j22508p4598j9512L5223Q4267J25463J60085J91712K23562K55962
53482b516478K86011L09480L22932L24502L13961K93251K67373K43931K30587
53473G5550K31420K44376K61584K72559K68758K46988K09950J64250J17459P5835
53463B168729M3276K1398R947O860P840O524l814k7625o5446j14173j68349k21244
$$ plain form
53532 -350280 -167052 46842 291292 563188 854307 1149056 1424986 1657211 1824715 1915313
53522 1915313 1927268 1867712 1748945 1583801 1381368 1144739 872042 560381 210525 -170427
53512 -170427 -569831 -972574 -1363699 -1728583 -2051436 -2315133 -2504728 -2613834 -2649943 -2634567
53502 -2634567 -2597101 -2565567 -2559478 -2588305 -2654583 -2757480 -2893251 -3052940 -3220772 -3376134
53492 -3376134 -3498642 -3573240 -3592752 -3557529 -3473262 -3347799 -3187714 -2996002 -2772440 -2516478
53482 -2516478 -2230467 -1920987 -1598055 -1273553 -959592 -666341 -398968 -155037 75550
53473 75550 306970 551346 812930 1085489 1354247 1601235 1811185 1975435 2092894 2168729
53463 2168729 2212005 2233403 2243350 2250210 2258050 2264574 2260760 2233135 2167689 2053516 1885167 1663923
53451A663923k65931k97112l13189l16998l14268l10574l08486l06432k99971
53442a069038k84841k59757k26876j89870j51611j13189p3972l1628J7671P7698
53432b305413J49424K29113L08846L79002M30834M58162M58310M32529L85707
53423I26514L25442K60789K00945J53554J22822J08265J05130J06394J05396R7917
53413B513168Q3045O2845M1136K1826O971n005j9830m5332q7038j43979k07827
53402B219980k66063l07005l23803l16062k89279k52518k14974j82925j58550
53393i1199j40932j27755j16444j04718r1259p6409o1991n0136m2257l8952m0291
53382i82343m5223n0507n1072m2776k5768n501R671J2368j067k9980p0385j16437
$$ plain form
53451 1663923 1397992 1100880 787691 470693 156425 -154149 -462635 -769067 -1069038
53442 -1069038 -1353879 -1613636 -1840512 -2030382 -2181993 -2295182 -2369154 -2400782 -2383111 -2305413
53432 -2305413 -2155989 -1926876 -1618030 -1239028 -808194 -350032 108278 540807 926514
53423 926514 1251956 1512745 1713690 1867244 1990066 2098331 2203461 2309855 2415251 2513168
53413 2513168 2596213 2659058 2700194 2722020 2728991 2723986 2704156 2658824 2571786 2427807 2219980
53402 2219980 1953917 1646912 1323109 1007047 717768 465250 250276 67351 -91199
53393 -91199 -232131 -359886 -476330 -581048 -672307 -748716 -810707 -860843 -903100 -942052 -982343
53382 -982343 -1027566 -1078073 -1129145 -1171921 -1197689 -1203190 -1193519 -1181151 -1182218 -1212198 -1282583 -1399020
53370a399020j61742j99956k24519k28479k05845j54669q0056N674Q6528J48294
53360b413790J82770J88777J70281J33460Q4748L0633k1480o3042q5839q4456
53350a877938n7872r089N6251J30842K06020K72565L22477L50801L56268L40645
53340I0970L07636K62040K09387J55830J08032P2355N3286N1702O4161Q3740J02255
53329A561394J13196J14232J07745R8696R1131Q5950Q1259P4329O3264M7748K9214
53318B468158J0626m458j3387j5605j2793q115m990n749j0514j6829k0487j7272
53306B348585m856J5882M0542O2171P3706P1302N7026L8924K7829L2533N6327
53295B819971R6765J48080K04039K59596L11063L55448L89573M09356M09768L85830
$$ plain form
53370 -1399020 -1560762 -1760718 -1985237 -2213716 -2419561 -2574230 -2654286 -2648612 -2562084 -2413790
53360 -2413790 -2231020 -2042243 -1871962 -1738502 -1653754 -1623121 -1644601 -1707643 -1793482 -1877938
53350 -1877938 -1935810 -1944899 -1888648 -1757806 -1551786 -1279221 -956744 -605943 -249675 90970
53340 90970 398606 660646 870033 1025863 1133895 1206250 1259536 1311238 1375399 1459139 1561394
53329 1561394 1674590 1788822 1896567 1995263 2086394 2172344 2253603 2327932 2391196 2438944 2468158
53318 2468158 2478784 2474326 2460939 2445334 2432541 2424426 2419436 2413687 2403173 2386344 2365857 2348585
53306 2348585 2343729 2359611 2400153 2462324 2536030 2607332 2664358 2703282 2731111 2763644 2819971
53295 2819971 2916736 3064816 3268855 3528451 3839514 4194962 4584535 4993891 5403659 5789489
53285E789489L34722K58214J63979O4378k7370j01764j55801j92536k18066k37676
53275E677569k52967k61383k58488k41674k12610j76871j41554j13161r6934r6920
53265C825007j15487j52110k02320k57896l08708l45757l63872l62733l45681
53256A370443l17339k81542k40832j97707j56512j23959j07141j10187j32120
53247b96896j67401k08108k45881k73094k83906k75372k47796k03774j46679p9955
53237b428862p595O4987J30861J82606K13977K21323K04434J66811J15339N9188
53227a076931P981l0037m9281m7578k6749P285M5742P9635J02593J12194J09280
53216g65866R6078P4520M5649J0245k9922p1322j09267j40003j63065j82030k02415
$$ plain form
53285 5789489 6124211 6382425 6546404 6610782 6583412 6481648 6325847 6133311 5915245 5677569
53275 5677569 5424602 5163219 4904731 4663057 4450447 4273576 4132022 4018861 3921927 3825007
53265 3825007 3709520 3557410 3355090 3097194 2788486 2442729 2078857 1716124 1370443
53256 1370443 1053104 771562 530730 333023 176511 52552 -54589 -164776 -296896
53247 -296896 -464297 -672405 -918286 -1191380 -1475286 -1750658 -1998454 -2202228 -2348907 -2428862
53237 -2428862 -2436457 -2371470 -2240609 -2058003 -1844026 -1622703 -1418269 -1251458 -1136119 -1076931
53227 -1076931 -1068950 -1098987 -1148268 -1195846 -1222595 -1215310 -1169568 -1089933 -987340 -875146 -765866
53216 -765866 -669788 -595268 -549619 -539374 -569296 -640618 -749885 -889888 -1052953 -1234983 -1437398
53205a437398k27630k55748k79530k89710k79108k45097j89921j19809m3589K9333
53195c338207R1575J39642J73493J93879J99732J88411J59205J17339P4574M5020
53185a955337L8698N7284R4450J39594J81881K12760K27181K24271K07392J83009
53175c88817J58667J41012J34405J39817J53945J69538J77936J73162J55075J29242
53165A143982J03542Q4034P3008O9906P3317Q1841R3603J05650J14233J15440
53155B058556J05836Q3336M8364M387m3088q8295j26227j52615j64086j59025
53145A567143j38274j04658o1724j2886L8359Q7677J29570J58422J70738J67024
53135B001391J51267J28078R9938O6921K8655j3821n7991j01127j41494j78564
$$ plain form
53205 -1437398 -1665028 -1920776 -2200306 -2490016 -2769124 -3014221 -3204142 -3323951 -3367540 -3338207
53195 -3338207 -3246632 -3106990 -2933497 -2739618 -2539886 -2351475 -2192270 -2074931 -2000357 -1955337
53185 -1955337 -1916639 -1859355 -1764905 -1625311 -1443430 -1230670 -1003489 -779218 -571826 -388817
53175 -388817 -230150 -89138 45267 185084 339029 508567 686503 859665 1014740 1143982
53165 1143982 1247524 1331558 1404566 1474472 1547789 1629630 1723233 1828883 1943116 2058556
53155 2058556 2164392 2247728 2296092 2300479 2257391 2169096 2042869 1890254 1726168 1567143
53145 1567143 1428869 1324211 1262487 1249601 1287960 1375637 1505207 1663629 1834367 2001391
53135 2001391 2152658 2280736 2380674 2447595 2476250 2462429 2404438 2303311 2161817 1983253
53125A983253k12214k41539k64191k76981k77512k65662k43799k15524j83985
53116a98154j51007j17479q4022n0907j7604J6548N0204P8423R3893R0441O5899
53105b23765K2384l5048r9349j61624k11897k41328k44902k22682j78772j19261
53095a716244n1072J7780P8077J21079J41319J38171J14921P6605K8585k3695
53085a074474p4741j19445j53528j73611j77102j62313j28913p8490j4888N5978
53075b101527J26936J90693K40774K72026K81037K66992K32881J85986J36419
53066a67783R3579O2478M2505K9323J8286O906m624j4508k1171k4762k7167l0235
53054c7173l3704l5028l1499k2690j1049l78O411Q613P411M181j236j0693k5846
$$ plain form
53125 1983253 1771039 1529500 1265309 988328 710816 445154 201355 -14169 -198154
53116 -198154 -349161 -466640 -550662 -601569 -619173 -602625 -552421 -473998 -380105 -289664 -223765
53105 -223765 -201381 -236429 -335778 -497402 -709299 -950627 -1195529 -1418211 -1596983 -1716244
53095 -1716244 -1767316 -1749536 -1671459 -1550380 -1409061 -1270890 -1155969 -1079364 -1050779 -1074474
53085 -1074474 -1149215 -1268660 -1422188 -1595799 -1772901 -1935214 -2064127 -2142617 -2157505 -2101527
53075 -2101527 -1974591 -1783898 -1543124 -1271098 -990061 -723069 -490188 -304202 -167783
53066 -167783 -74204 -11726 30779 60102 78388 85294 80670 66162 44991 20229 -6938 -37173
53054 -37173 -70877 -105905 -137404 -160094 -171143 -171521 -165110 -156497 -149086 -144905 -146141 -156834 -182680
53041a82680m5720o5874q0078q3465p5284n9646m3760l4456l4888m3152n3224
53030h02227n7357m9109k6109Q963N0459R3857J38189J84241K30164K69175K91847
53019C32093K91083K65766K21151J66884J14305P3874N2818N3405P2684J04301
53009A748364J41744J80951K20287K58076K90293L10875L14546K99572K68279
53000D032987K25252J74868J19883O1786K260n5616j07503j49078j77492j92265
52990C935082j95355j90263j80307j66999j49746j26922r7096n9558j4570L6195
52980B790461Q9468J41188J87679K26090K53766K67711K65011K44030K05466J52608
52970D823478R0770K6425l3429q1891j13339j25275j19600j02237q1211o4339
$$ plain form
53041 -182680 -228400 -294274 -374352 -457817 -533101 -592747 -636507 -670963 -705851 -749003 -802227
53030 -802227 -859584 -908693 -934802 -925839 -875380 -781523 -643334 -459093 -228929 40246 332093
53019 332093 623176 888942 1110093 1276977 1391282 1465156 1517974 1571379 1644063 1748364
53009 1748364 1890108 2071059 2291346 2549422 2839715 3150590 3465136 3764708 4032987
53000 4032987 4258239 4433107 4552990 4614776 4617036 4561420 4453917 4304839 4127347 3935082
52990 3935082 3739727 3549464 3369157 3202158 3052412 2925490 2828394 2768836 2754266 2790461
52980 2790461 2879929 3021117 3208796 3434886 3688652 3956363 4221374 4465404 4670870 4823478
52970 4823478 4914248 4940673 4907244 4825353 4712014 4586739 4467139 4364902 4283691 4219352
52960D219352n7006o0223p0006p9418q2639p7852o6502n0001k7523K951M1568
52949C692701Q4328J23406J49792J56636J41535J06669N7158r18o1439j17992
52939D331876j63656j91990j99178j85907j57585j22601q9510o4529n0210m5665
52929C061045m8162n5205o5950q1075j01251j25393j50216j71791j88256k01604
52919A872142k16895k39361k71548l12368l57926m02672m39790m61364m59418
52910a289200m28173l66507k79103j75595o8268L0500J10251J63931J88998J87839
52900a925327J67029J35365J01396P1389M8452L2956K3714J9296J8694K1196K5684
52889a260156L0248L2931L3490L4733M1717N8785Q6540J21158J56481J87137K10525
$$ plain form
52960 4219352 4162346 4102123 4032117 3952699 3870060 3792208 3725706 3675705 3648182 3651133 3692701
52949 3692701 3777029 3900435 4050227 4206863 4348398 4455067 4512225 4511307 4449868 4331876
52939 4331876 4168220 3976230 3777052 3591145 3433560 3310959 3221449 3156920 3106710 3061045
52929 3061045 3012883 2957678 2891728 2810653 2709402 2584009 2433793 2262002 2073746 1872142
52919 1872142 1655247 1415886 1144338 831970 474044 71372 -368418 -829782 -1289200
52910 -1289200 -1717373 -2083880 -2362983 -2538578 -2606846 -2576346 -2466095 -2302164 -2113166 -1925327
52900 -1925327 -1758298 -1622933 -1521537 -1450148 -1401696 -1368740 -1345026 -1325730 -1307036 -1285840 -1260156
52889 -1260156 -1229908 -1196977 -1163487 -1128754 -1087037 -1028252 -941712 -820554 -664073 -476936 -266411
52878b66411K26918K38377K47377K55454K61841K62478K50691K20132J68523R9398
52868A964778K0236o1304j39828k11952k74722l24760l58611l73712l69473l48361
52858d77709l16138k80377k47692k21549k02050j87280j74702j61760j45861j24229
52848b539347r4018n3016j030N8653J18840J69659K01192K06772J86010J46160
52838a600125J00657O4807N0623O3297J00633J55172K17628K79886L36010L80953
52828A49541M08882M13398L90204L39897K68329J84213R5993J0228o8040j34226
52818B058419j84343k16701k33556k40504k43290k44391k42117k32499k12036
52809H982j79404j35890q5114l2265J7443O0697R7127J28410J55780J77801J90202
$$ plain form
52878 -266411 -39493 198884 446261 701715 963556 1226034 1476725 1696857 1865380 1964778
52868 1964778 1985014 1923710 1783882 1571930 1297208 972448 613837 240125 -129348 -477709
52858 -477709 -793847 -1074224 -1321916 -1543465 -1745515 -1932795 -2107497 -2269257 -2415118 -2539347
52848 -2539347 -2633365 -2686381 -2687411 -2628758 -2509918 -2340259 -2139067 -1932295 -1746285 -1600125
52838 -1600125 -1499468 -1434661 -1384038 -1320741 -1220108 -1064936 -847308 -567422 -231412 149541
52828 149541 558423 971821 1362025 1701922 1970251 2154464 2250457 2260685 2192645 2058419
52818 2058419 1874076 1657375 1423819 1183315 940025 695634 453517 221018 8982
52809 8982 -170422 -306312 -391426 -423691 -406248 -345551 -248424 -120014 35766 213567 403769
52798D03769J88054J68536J32502Q4236L0309k1630o3960r0293r6911q4172n7244
52787E93196k5324R89J3206P527j4809m9057q9103j29049j63868j89458k02747
52776b48497k02239j88718j65367j36941j08160q1930n8040l3228l097L5044Q0568
52765a110605J30433J81314K30550K75135L10574L31648L34987L21548K97088
52756A302672K70422K50391K42687K47636K59643K68850K64717K40252J94784
52747C542054J33577O4621n160p1708j32973j86853k29833k57323k65219k51678
52737B339505k18122j69036j10748m9844Q052N8867R9964J29481J45559J46108
52727B379786J29548R6064M8574p142o3127j10594j41881j52518j42519j16322
$$ plain form
52798 403769 591823 760359 892861 977097 1007406 985776 921816 831523 734612 650440 593196
52787 593196 567872 568861 582067 589594 574785 525728 436625 307576 143708 -45750 -248497
52776 -248497 -450736 -639454 -804821 -941762 -1049922 -1131852 -1189892 -1223120 -1226217 -1191173 -1110605
52765 -1110605 -980172 -798858 -568308 -293173 17401 349049 684036 1005584 1302672
52756 1302672 1573094 1823485 2066172 2313808 2573451 2842301 3107018 3347270 3542054
52747 3542054 3675631 3740252 3735092 3663384 3530411 3343558 3113725 2856402 2591183 2339505
52737 2339505 2121383 1952347 1841599 1791755 1799807 1858674 1958638 2088119 2233678 2379786
52727 2379786 2509334 2605398 2653972 2646830 2583703 2473109 2331228 2178710 2036191 1919869
52717A919869q1748m8455k5891k0503l3029n7779q5072j05773j15089j13432j04394
52706A128704r1883p8352o4793n1618l9454k9373k2565j9504j8956j7445j0029
52695F84732P843L8331Q0195J28965J77962K19771K48020K59008K52543K31696
52685B329066K01703J68446J36585J07759P9908M8887J1731l0633p3486j10870
52675B869096j38347j53991j57910j51689j38549j23605j13163j12663j23890
52666A655289j43075j61589j69692j61522j38127j06541p5797n2663l9451l4347
52656E72485l3080l0665k2724o725J6650M2720O3881P2853O6235M5692J5895j8695
52644G84522n5219r1267j23337j47184j59741j60433j50565j31767j05062p0972
$$ plain form
52717 1919869 1838121 1789666 1763775 1743272 1710243 1652464 1567392 1461619 1346530 1233098 1128704
52706 1128704 1036821 958469 893676 842058 802604 773231 750666 731162 712206 694761 684732
52695 684732 692575 730906 811101 940066 1118028 1337799 1585819 1844827 2097370 2329066
52685 2329066 2530769 2699215 2835800 2943559 3023467 3072354 3084085 3053452 2979966 2869096
52675 2869096 2730749 2576758 2418848 2267159 2128610 2005005 1891842 1779179 1655289
52666 1655289 1512214 1350625 1180933 1019411 881284 774743 698946 646283 606832 572485
52656 572485 539405 508740 486016 479291 495941 538661 602542 675395 741630 787322 803217 784522
52644 784522 729303 638036 514699 367515 207774 47341 -103224 -234991 -340053 -411025
52634d11025k9820J8160P2424J30944J88895K38488K70881K79601K63707K28482
52624A250737J83016J36131R3227N5754K2837o792l4096o0308q7455j17576j50839
52613A284636j84074k11154k25112k20948j98102j61697j21528q8471o9999o7869
52603b64318p9242r9457j23674j46952j64591j73824j75510j73727j73058j75607
52593a749960j79887j82079j78507j67696j50955j31149j10226q7095n7571j6958
52583c012083L6436R9593J65976K28252K80208L17039L35110L32451L10096K72882
52573f34040K28427J84093J43469J04805O2817J2758m5995j09038j68833k17840
$$ plain form
52634 -411025 -440845 -422685 -350261 -219317 -30422 208066 478947 758548 1022255 1250737
52624 1250737 1433753 1569884 1663111 1718865 1741702 1734910 1700814 1640506 1553051 1435475 1284636
52613 1284636 1100562 889408 664296 443348 245246 83549 -37979 -126450 -196449 -264318
52603 -264318 -343560 -443017 -566691 -713643 -878234 -1052058 -1227568 -1401295 -1574353 -1749960
52593 -1749960 -1929847 -2111926 -2290433 -2458129 -2609084 -2740233 -2850459 -2937554 -2995125 -3012083
52583 -3012083 -2975647 -2876054 -2710078 -2481826 -2201618 -1884579 -1549469 -1217018 -906922 -634040
52573 -634040 -405613 -221520 -78051 26754 89571 102329 56334 -52704 -221537 -439377
$$ [...]
##END NTUPLES=NMR SPECTRUM
##END=
