##TITLE=31Pdec_DE-58tubJFA
 
 24 sc
 7.5.2024
##JCAMPDX= 6.0         $$ Bruker NMR JCAMP-DX V2.0
##DATA TYPE= NMR SPECTRUM
##DATA CLASS= NTUPLES
##ORIGIN= UXNMR, Bruker Analytische Messtechnik GmbH
##OWNER= root
$$ XWIN-NMR		Version 3.5
$$ Tue May  7 14:50:16 2024 Russian Standard Time (UT+4h)  she@DPX200
##.OBSERVE FREQUENCY= 81.013821
##.OBSERVE NUCLEUS= ^31P
##.ACQUISITION MODE= SIMULTANEOUS
##.ACQUISITION SCHEME= undefined
##.AVERAGES= 24
##.DIGITISER RES= 16
##SPECTROMETER/DATA SYSTEM= spect
##.PULSE SEQUENCE= zgpg30
##.SOLVENT NAME= CDCl3
##.SHIFT REFERENCE= (INTERNAL, CDCl3, 0, 248.564)
##AUDIT TRAIL= $$ (NUMBER, WHEN, WHO, WHERE, WHAT)
$$ ##TITLE= Audit trail, XWIN-NMR		Version 3.5
$$ ##JCAMPDX= 5.01
$$ ##ORIGIN= Bruker BioSpin GmbH
$$ ##OWNER= she
$$ F:/spectra/data/she/nmr/P31/1/pdata/1/auditp.txt
$$ ##AUDIT TRAIL=  $$ (NUMBER, WHEN, WHO, WHERE, WHAT)
(   1,<2024-05-07 14:48:48.03 +0400>,<she>,<DPX200>,
      <created by zg, POWCHK disabled, PULCHK disabled
       configuration hash MD5:
       00 E9 B6 7A A2 85 ED C7 34 08 36 98 17 FE 4E 26
       data hash MD5: 32K
       81 07 6D 9A D5 DD 0E EF C5 88 9C 89 35 4C B8 8E>)
(   2,<2024-05-07 14:48:50.59 +0400>,<she>,<DPX200>,
      <Start of raw data processing
       efp BC_mod = 2 LB = 10 FT_mod = 6 PKNL = 1 PHC0 = -13241.88 PHC1 = 132.0835 SI = 64K 
       data hash MD5: 64K
       49 D5 FF 0A 49 B5 67 92 FD 5A 5A 4F 34 95 E4 06>)
(   3,<2024-05-07 14:49:03.10 +0400>,<she>,<DPX200>,
      <pk PHC0 = -11.98094 PHC1 = 0 
       data hash MD5: 64K
       AF 0C D8 CC 2D 5E F1 3F 6A 8C 97 B8 EF 3F 50 EC>)
$$ ##END=
$$ 
$$ hash MD5
$$ 45 2B 76 65 A1 F5 81 D3 C5 E0 B8 D8 D2 33 08 F9
##$RELAX= 
##$RELAX= 
##$RELAX= 
##$RELAX= 
##$RELAX= 
##$RELAX= 
##$RELAX= 
##$RELAX= 
##$RELAX= 
$$ Bruker specific parameters
$$ --------------------------
##$DU= <F:/spectra>
##$EXPNO= 1
##$NAME= <P31>
##$PROCNO= 1
##$TYPE= <nmr>
##$USER= <she>
##$AMP= (0..31)
100 100 100 100 100 100 100 100 100 100 100 100 100 100 100 100 100 100 
100 100 100 100 100 100 100 100 100 100 100 100 100 100 
##$AQSEQ= 0
##$AQ_mod= 1
##$AUNM= <au_zg>
##$AUTOPOS= <>
##$BF1= 81.014009
##$BF2= 200.13
##$BF3= 200.13
##$BF4= 200.13
##$BF5= 200.13
##$BF6= 200.13
##$BF7= 200.13
##$BF8= 200.13
##$BYTORDA= 1
##$CFDGTYP= 0
##$CFRGTYP= 5
##$CHEMSTR= <none>
##$CNST= (0..31)
1 1 145 1 1 1 1 1 1 1 1 1 1 1 1 1 1 1 1 1 1 1 1 1 1 1 1 1 1 1 1 1 
##$CPDPRG= <waltz16>
##$CPDPRG1= <>
##$CPDPRG2= <waltz16>
##$CPDPRG3= <>
##$CPDPRG4= <mlev>
##$CPDPRG5= <mlev>
##$CPDPRG6= <mlev>
##$CPDPRG7= <mlev>
##$CPDPRG8= <mlev>
##$CPDPRGB= <>
##$CPDPRGT= <>
##$D= (0..31)
0 1 0 0 0 0 0 0 0 0 0 0.03 2e-05 3e-06 0 0 0 0 0 0 0 0 0 0 0 0 0 0 0 0 
0 0 
##$DATE= 1715078927
##$DBL= (0..7)
120 120 120 11 120 120 24 19 
##$DBP= (0..7)
150 150 150 150 150 150 150 150 
##$DBP07= 0
##$DBPNAM0= <>
##$DBPNAM1= <>
##$DBPNAM2= <>
##$DBPNAM3= <>
##$DBPNAM4= <>
##$DBPNAM5= <>
##$DBPNAM6= <>
##$DBPNAM7= <>
##$DBPOAL= (0..7)
0.5 0.5 0.5 0.5 0.5 0.5 0.5 0.5 
##$DBPOFFS= (0..7)
$$ [...]
##$SUBNAM2= <"">
##$SUBNAM3= <"">
##$SUBNAM4= <"">
##$SUBNAM5= <"">
##$SUBNAM6= <"">
##$SUBNAM7= <"">
##$SUBNAM8= <"">
##$SUBNAM9= <"">
##$SW= 501.771253377433
##$SWIBOX= (0..15)
0 1 3 0 0 0 0 0 0 0 0 0 0 0 0 0 
##$SW_h= 40650.406504065
##$TD= 32768
##$TD0= 1
##$TE= 0
##$TE2= 300
##$TE3= 300
##$TEG= 300
##$TL= (0..7)
0 120 53 12 22 120 120 120 
##$TP= (0..7)
150 150 150 150 150 150 150 150 
##$TP07= 0
##$TPNAME0= <>
##$TPNAME1= <>
##$TPNAME2= <>
##$TPNAME3= <>
##$TPNAME4= <>
##$TPNAME5= <>
##$TPNAME6= <>
##$TPNAME7= <>
##$TPOAL= (0..7)
0.5 0.5 0.5 0.5 0.5 0.5 0.5 0.5 
##$TPOFFS= (0..7)
0 0 0 0 0 0 0 0 
##$TUNHIN= 0
##$TUNHOUT= 0
##$TUNXOUT= 0
##$USERA1= <user>
##$USERA2= <user>
##$USERA3= <user>
##$USERA4= <user>
##$USERA5= <user>
##$V9= 5
##$VALIST= <valist>
##$VCLIST= <CCCCCCCCCCCCCCC>
##$VD= 0
##$VDLIST= <DDDDDDDDDDDDDDD>
##$VPLIST= <PPPPPPPPPPPPPPP>
##$VTLIST= <TTTTTTTTTTTTTTT>
##$WBST= 1024
##$WBSW= 4
##$XGAIN= (0..3)
0 0 0 0 
##$XL= 0
##$YL= 0
##$YMAX_a= 4351
##$YMIN_a= -4032
##$ZGOPTNS= <>
##$ZL1= 120
##$ZL2= 120
##$ZL3= 120
##$ZL4= 120
##$ABSF1= 0
##$ABSF2= 0
##$ABSG= 0
##$ABSL= 0
##$ALPHA= 0
##$AQORDER= 0
##$ASSFAC= 0
##$ASSFACI= 0
##$ASSFACX= 0
##$ASSWID= 0
##$AUNMP= <proc_1d>
##$AZFE= 0.1
##$AZFW= 0.5
##$BCFW= 0
##$BC_mod= 2
##$BYTORDP= 0
##$COROFFS= 0
##$CY= -3
##$DATMOD= 1
##$DC= 0
##$DFILT= <>
##$DTYPP= 0
##$F1P= 0
##$F2P= 0
##$FCOR= 1
##$FTSIZE= 65536
##$FT_mod= 6
##$GAMMA= 0
##$GB= 0
##$INTBC= 1
##$INTSCL= 6.047779e-11
##$ISEN= 30
##$LB= 10
##$LEV0= 0
##$LPBIN= 0
##$MAXI= 10000
##$MC2= 0
##$MEAN= 0
##$ME_mod= 0
##$MI= 50
##$NCOEF= 0
##$NC_proc= -10
##$NLEV= 6
##$NOISF1= 182.463
##$NOISF2= 159.3651
##$NSP= 0
##$NTH_PI= 0
##$NZP= 0
##$OFFSET= 248.5645
##$PC= 4
##$PHC0= -13253.86
##$PHC1= 132.0835
##$PH_mod= 1
##$PKNL= yes
##$PPARMOD= 0
##$PSCAL= 0
##$PSIGN= 0
##$REVERSE= no
##$SF= 81.0140089999694
##$SI= 65536
##$SIGF1= 159.3651
##$SIGF2= -187.1042
##$SINO= 113.3802
##$SIOLD= 16384
##$SREGLST= <1H.CDCl3>
##$SSB= 0
##$STSI= 65536
##$STSR= 0
##$SW_p= 40650.406504065
##$SYMM= 0
##$S_DEV= 0
##$TDeff= 32768
##$TDoff= 0
##$TI= <>
##$TILT= no
##$TM1= 0
##$TM2= 0
##$TOPLEV= 0
##$USERP1= <user>
##$USERP2= <user>
##$USERP3= <user>
##$USERP4= <user>
##$USERP5= <user>
##$WDW= 1
##$XDIM= 65536
##$YMAX_p= 422841786
##$YMIN_p= -41008996
$$ End of Bruker specific parameters
$$ ---------------------------------
##NTUPLES= NMR SPECTRUM
##VAR_NAME=  FREQUENCY,     SPECTRUM/REAL,   SPECTRUM/IMAG
##SYMBOL=    X,             R,               I
##VAR_TYPE=  INDEPENDENT,   DEPENDENT,       DEPENDENT
##VAR_FORM=  AFFN,          ASDF,            ASDF
##VAR_DIM=   65536,         65536,           65536
##UNITS=     HZ,            ARBITRARY UNITS, ARBITRARY UNITS
##FACTOR=    0.620285442955139, 1,           1
##FIRST=     20137.2065510682, 0,            0
##LAST=      -20513.1999529968, 0,           0
##MIN=       -20513.1999529968, -41008996,   0
##MAX=       20137.2065510682, 422841786,    0
$$ Real data points
##PAGE= N=1
##DATA TABLE= (X++(R..R)), XYDATA
$$ [...]
40539I925705m84601n02328n28960n54378n60220n31968m69117l85374l00132
$$ 9925705 9441104 8938776 8409816 7855438 7295218 6763250 6294133 5908759 5608627
40530E608627k28858j78968j51879j47334j66100k10141k81533l80816n04479
$$ 5608627 5379769 5200801 5048922 4901588 4735488 4525347 4243814 3862998 3358519
40521C358519o42801p80931r04080j002650j072370j110400j113354j080288j016209
$$ 3358519 2715718 1934787 1030707 28057 -1044313 -2154713 -3268067 -4348355 -5364564
40512e364564r30239q28935p11538n72214m07255k21010k6707J56500L07038M04384
$$ -5364564 -6294803 -7123738 -7835276 -8407490 -8814745 -9035755 -9062462 -8905962 -8598924 -8194540
40502h194540M34426L96669L08513K01501J10468O2925P4953J52626K93300M83789
$$ -8194540 -7760114 -7363445 -7054932 -6853431 -6742963 -6680038 -6605085 -6452459 -6159159 -5675370
40492e675370O98170Q99799J048959J113304J076626R42461P31398M73095J96192
$$ -5675370 -4977200 -4077401 -3028442 -1915138 -838512 103949 835347 1308442 1504634
40483A504634p9546l44726n94403q18713r97237j102206j109647j012201q26566
$$ 1504634 1425088 1080362 485959 -332754 -1329991 -2432197 -3541844 -4554045 -5380611
40474e380611n91436l56406j66666n0548j4767m7034j22340k10563k85697l35317
$$ -5380611 -5972047 -6328453 -6495119 -6545667 -6560434 -6607468 -6729808 -6940371 -7226068 -7561385
40464g561385l64957l92569m35803n01598n85237o76636p65890q43678q99111
$$ -7561385 -7926342 -8318911 -8754714 -9256312 -9841549 -10518185 -11284075 -12127753 -13026864
40455a3026864r19331q91680q07007o63656m71634k53446l7541J53594L11867
$$ -13026864 -13946195 -14837875 -15644882 -16308538 -16780172 -17033618 -17071159 -16917565 -16605698
40446a6605698M41043N45826O22721O60606O49735N91327N00467M00237L10488
$$ -16605698 -16164655 -15618829 -14996108 -14335502 -13685767 -13094440 -12593973 -12193736 -11883248
40437a1883248K37367J69387Q2247m9574k39598m80329p42611r83991j162274
$$ -11883248 -11645881 -11476494 -11394247 -11443821 -11683419 -12163748 -12906359 -13890350 -15052624
40428a5052624j247489j226775j102046q84955n93541k50325J20928M99750Q70523
$$ -15052624 -16300113 -17526888 -18628934 -19513889 -20107430 -20357755 -20236827 -19737077 -18866554
40419a8866554J218407J523915J763855J920239J989857J985971J931435J849526
$$ -18866554 -17648147 -16124232 -14360377 -12440138 -10450281 -8464310 -6532875 -4683349
40411d683349J758022J667087J579254J491191J397404J294476J183311J068030
$$ -4683349 -2925327 -1258240 321014 1812205 3209609 4504085 5687396 6755426
40403F755426R52471Q36466P14425N77334M17038K29683J6038k20073m72050p28256
$$ 6755426 7707897 8544363 9258788 9836122 10253160 10482843 10498881 10278808 9806758 9078502
40393I078502r70197j175327j324918j411688j440553j420977j356897j243183
$$ 9078502 8108305 6932978 5608060 4196372 2755819 1334842 -22055 -1265238
40385a265238j072574q48225n91880l40813j34814j041N5429N1939K0445n507
$$ -1265238 -2337812 -3186037 -3777917 -4118730 -4253544 -4254585 -4199156 -4147217 -4126772 -4132279
40375d132279m558K4226O3935R2245R5163P2715L4533q851n2201r7338j52149
$$ -4132279 -4136837 -4112611 -4048676 -3956431 -3861268 -3788553 -3754020 -3762871 -3815072 -3912410 -4064559
40364d064559k27596l32016m63683o05923p29643q04001q10207p50886o49836
$$ -4064559 -4292155 -4624171 -5087854 -5693777 -6423420 -7227421 -8037628 -8788514 -9438350
40355i438350n42490m61712m25024m28147m47293m49687m08302l14475j82521
$$ -9438350 -9980840 -10442552 -10867576 -11295723 -11743016 -12192703 -12601005 -12915480 -13098001
40346a3098001m3732O7882J31236J47140J35740J24534J34211J70028K21841K70907
$$ -13098001 -13141733 -13073851 -12942615 -12795475 -12659735 -12535201 -12400990 -12230962 -12009121 -11738214
40336a1738214K99136K96985K67990K28825K03777K13896K65285L44410M25255
$$ -11738214 -11439078 -11142093 -10874103 -10645278 -10441501 -10227605 -9962320 -9617910 -9192655
40327i192655M83960N10420N10296M99681M98289N23390N84088O77777P92103
$$ -9192655 -8708695 -8198275 -7687979 -7188298 -6690009 -6166619 -5582531 -4904754 -4112651
40318d112651R11043J019389J102593J146070J138771J079193R76943Q46975P01286
$$ -4112651 -3201608 -2182219 -1079626 66444 1205215 2284408 3261351 4108326 4809612
40309D809612N45005L78849K03952K4239j55032l29706m96673o50757p81744q75242
$$ 4809612 5354617 5733466 5937418 5961657 5806625 5476919 4980246 4329489 3547745 2672503
40299B672503r17737r02718q34098p25344n95243m62830l44209k52158j96811
$$ 2672503 1754766 852048 17950 -707394 -1302637 -1765467 -2109676 -2361834 -2558645
40290b558645j85010k18053k89560l84512m79417n44743n52026m84824l47056
$$ -2558645 -2743655 -2961708 -3251268 -3635780 -4115197 -4659940 -5211966 -5696790 -6043846
40281f043846j61682M0503K34705M10276N69590P19471Q60554R81277J060752
$$ -6043846 -6205528 -6165025 -5930320 -5520044 -4950454 -4230983 -3370429 -2389152 -1328400
40272a328400J078880J027285R15165P67951O19489N00140M25971L95465L95563
$$ -1328400 -249520 777765 1692930 2460881 3080370 3580510 4006481 4401946 4797509
40263D797509M11573M33454M56377M78586M99071N14967N19197N00632M48094
$$ 4797509 5209082 5642536 6098913 6577499 7076570 7591537 8110734 8611366 9059460
40254I059460L56428K31410R0614m1219j41229j96827k07865j82043j28919n7142
$$ 9059460 9415888 9647298 9737912 9696693 9555464 9358637 9150772 8968729 8839810 8782668
40244H782668K5387J10635J88742K45091K59417K11332R1351q9990l02098n04164
$$ 8782668 8808055 8918690 9107432 9352523 9611940 9823272 9914623 9824633 9522535 9018371
40234I018371o59319p45291p56390o97641n77871m08621k08733p022J63320K76479
$$ 9018371 8359052 7613761 6857371 6159730 5581859 5173238 4964505 4957483 5120803 5397282
40224E397282L23333L11891K59671J84089R6891N173q3513j57920k06828k27881
$$ 5397282 5720615 6032506 6292177 6476266 6573157 6578330 6494817 6336897 6130069 5902188
40214E902188k32775k41310k67503l10335l58086m01029m38599m74126n04488
$$ 5902188 5669413 5428103 5160600 4850265 4492179 4091150 3652551 3178425 2673937
40205B673937n16758m94903m29359l21626j82538k7190J30693K82954M27817N67099
$$ 2673937 2157179 1662276 1232917 911291 728753 701563 832256 1115210 1543027 2110126
40195B110126P02181Q31563R50423J051252J125354J165438J168041J134142J068052
$$ 2110126 2812307 3643870 4594293 5645545 6770899 7936337 9104378 10238520 11306572
40186A1306572R76103Q65343P41080O04011M50478K78203R4291q1479k22065l03863
$$ 11306572 12282675 13148018 13889098 14493109 14943587 15221790 15316081 15234602 15012537 14708674
40176A4708674l15350k59457j51744j8120J08273J94412K18557J78206Q8043l0894
$$ 14708674 14393324 14133867 13982123 13964003 14072276 14266688 14485245 14663451 14751494 14720600
40166A4720600j62195k98088m35964n71638o93983p84871q26423q12194p53640
$$ 14720600 14558405 14260317 13824353 13252715 12558732 11773861 10947438 10135244 9381604
40157I381604o74854n98102n30930m64485l83773k82404j72099q0785m0381p1773
$$ 9381604 8706750 8108648 7577718 7113233 6729460 6447056 6274957 6194172 6153791 6082018
40147F082018j75916l34493n17008o89695q24417r06679r39171r36879r15488
$$ 6082018 5906102 5571609 5054601 4364906 3540489 2633810 1694639 757760 -157728
40138a57728q81441q30887p56623o55536n31076l91716k49132j16970q365O8149
$$ -157728 -1039169 -1870056 -2626679 -3282215 -3813291 -4205007 -4454139 -4571109 -4579474 -4511325
40128d511325J11650J28639J30688J32081J47481J88127K57233L47491M42570
$$ -4511325 -4399675 -4271036 -4140348 -4008267 -3860786 -3672659 -3415426 -3067935 -2625365
40119b625365N21722N65481N60996N05148M03180K63370R2557j02558l09358n05113
$$ -2625365 -2103643 -1538162 -977166 -472018 -68838 194532 287089 184531 -124827 -629940
40109f29940o59960p46126p47818o66738n21179l39693j52165J7960J57973K66980
$$ -629940 -1289900 -2036026 -2783844 -3450582 -3971761 -4311454 -4463619 -4445659 -4287686 -4020706
40099d020706L54746M37915N32623O45733P70615Q91479R92807J065358J104092
$$ -4020706 -3665960 -3228045 -2695422 -2049689 -1279074 -387595 605212 1670570 2774662
40090B774662J102685J052480R47789P91890N98320L87784J83635O740j30176
$$ 2774662 3877347 4929827 5877616 6669506 7267826 7655610 7839245 7845985 7715809
40081G715809k25560k85612l16020l16293k81903k11738j13914o130Q8768J49732
$$ 7715809 7490249 7204637 6888617 6572324 6290421 6078683 5964769 5958639 6047407 6197139
40071F197139J65173J38564Q8223L9723J4352K0188N0555Q9053J16718J17673
$$ 6197139 6362312 6500876 6589099 6628822 6643174 6663362 6713917 6802970 6919688 7037361
40061G037361Q3324J6288o7226j40222j74553j54032q3837J0002R2385J36635
$$ 7037361 7120685 7136973 7069747 6929525 6754972 6600940 6517103 6527105 6619490 6756125
40051F756125J37392J10609Q0951O5367O3091N7056K5627m1326j31770k15682
$$ 6756125 6893517 7004126 7085077 7150444 7213535 7270591 7296218 7254892 7123122 6907440
40041F907440k64266k71243k58864k63330l11483m06816n32707o66130p89041
$$ 6907440 6643174 6371931 6113067 5849737 5538254 5131438 4598731 3932601 3143560
40032C143560q90476r62534r97777r91609r46192q70670p76691o72728n60910
$$ 3143560 2253084 1290550 292773 -698836 -1645028 -2515698 -3292389 -3965117 -4526027
40023d526027m37533k96779j36314L8122K12525L69706M96462N88021O47359O80675
$$ -4526027 -4963560 -5260339 -5396653 -5358531 -5146006 -4776300 -4279838 -3691817 -3044458 -2363783
40013b363783O92744O85321O58707O13921N53242M79802L97658L11533K24751
$$ -2363783 -1671039 -985718 -327011 286910 840152 1319954 1717612 2029145 2253896
40004B253896J36968M5244n1957j53001k56279l64063m80700o05493p26971q24340
$$ 2253896 2390864 2436108 2384151 2231150 1974871 1610808 1130108 524615 -202356 -1026696
39994a026696q75562q67290q01119o92991n66613m45493l47893k84471k55961
$$ -1026696 -1902258 -2769548 -3570667 -4263658 -4830271 -5275764 -5623657 -5908128 -6164089
39985f164089k50911k47066k18284j44401j9495J44342L19643M73525N81653O37685
$$ -6164089 -6415000 -6662066 -6880350 -7024751 -7044246 -6899904 -6580261 -6106736 -5525083 -4887398
39975d887398O51217O36591O02885N52569M86938M11554L38054K83449K67851
$$ -4887398 -4236181 -3599590 -2996705 -2444136 -1957198 -1545644 -1207590 -924141 -656290
39966f56290L09032M13368N67403P36966Q77230R49941R38970Q55469P29588N94214
$$ -656290 -347258 66110 633513 1370479 2247709 3197650 4136620 4992089 5721677 6315891
39956F315891M71530L70404K93108K42308K20970K26259K44534K53380K31306
$$ 6315891 6787421 7157825 7450933 7693241 7914211 8140470 8385004 8638384 8869690
39947H869690J70409Q4513N923k9773k728Q0415J90436K90248L50516L58105L15624
$$ 8869690 9040099 9124612 9130535 9100762 9098034 9178449 9368885 9659133 10009649 10367754 10683378
39936A0683378K35776J35793L4253n1708j11628j47481j73896k09177k61617l20823
$$ 10683378 10919154 11054947 11089200 11037492 10925864 10778383 10604487 10395310 10133693 9812870
39926I812870l60934l54200k86213j63277q072J51561K91911L96317M54989M66729
$$ 9812870 9451936 9097736 8811523 8648246 8640174 8791735 9083646 9479963 9934952 10401681
39916A0401681M41543L98126L54054L14988K71756K07585J08859k9141k04335
$$ 10401681 10843224 11241350 11595404 11910392 12182148 12389733 12498592 12469451 12265116
39907A2265116m12849o49650r02744j146477j342112j448213j435072j294560
$$ 12265116 11852267 11202617 10299873 9153396 7811284 6363071 4927999 3633439
39899C633439j041152p06423l31976L6135L51876N74912O78473O57094N29364
$$ 3633439 2592287 1885864 1553888 1590023 1941899 2516811 3195284 3852378 4381742
39890D381742L32626J11155r6681k67154l93092m79168n33377n60064n59576n34794
$$ 4381742 4714368 4825523 4728842 4461688 4068596 3589428 3056051 2495987 1936411 1401617
39880A401617m98155m71253m74703n14387n74224o22320o28558n83175n03368
$$ 1401617 903462 432209 -42494 -556881 -1131105 -1753425 -2381983 -2965158 -3468526
39871c468526m22129l66129l37917l14626k63081j60053m783J81744L67050N19151
$$ -3468526 -3890655 -4256784 -4594701 -4909327 -5172408 -5332461 -5337244 -5155500 -4788450 -4269299
39861d269299O14893O44049O10589N30897M27960L23055K29789J53826R6515N7657
$$ -4269299 -3654406 -3010357 -2399768 -1868871 -1440911 -1117856 -888067 -734241 -637726 -580069
39851e80069L5554K6574K6468L2445M3568N9612Q0486J06902J40354J80757K23661
$$ -580069 -544515 -517941 -491473 -459028 -415460 -355848 -275362 -168460 -28106 152651 376312
39840C76312K60580K83371K89229K81902K68308K53466K37131K13418J73261J09242
$$ 376312 636892 920263 1209492 1491394 1759702 2013168 2250299 2463717 2636978 2746220
39830B746220K1185q0492j76262k43574k64904k34688j62572p0606J5741P8719
$$ 2746220 2767405 2686913 2510651 2267077 2002173 1767485 1604913 1534307 1550048 1628767
39820A628767J15287J36575J61286K06128K75895L56826M18479M26074L57394
$$ 1628767 1744054 1880629 2041915 2248043 2523938 2880764 3299243 3725317 4082711
39811D082711K14068K1491j80542l51104m60771m99858m78725m19946l47399k78650
$$ 4082711 4296779 4318270 4137728 3786624 3325853 2825995 2347270 1927324 1579925 1301275
39801A301275k22690j80636j47268j13735p1754j7250M9202J25023K08571K99727
$$ 1301275 1078585 897949 750681 636946 565192 547942 597144 722167 930738 1230465
39791A230465L97934M99377N95232O71928P13508P05629O40480N21272L64216
$$ 1230465 1628399 2127776 2723008 3394936 4108444 4814073 5454553 5975825 6340041
39782F340041J95679M4308o8579j35213j60933j58553j41844j21358j03004q8484
$$ 6340041 6535720 6580028 6511449 6376236 6215303 6056750 5914906 5793548 5690544 5602060
39772E602060p7159o8922o6463p5300j01297j47287k10566k82253l48627l93850
$$ 5602060 5524901 5455979 5389516 5314216 5212919 5065632 4855066 4572813 4224186 3830336
39762C830336m03127l65661k77081j40544L4449K34613M43420O38215P88627Q63234
$$ 3830336 3427209 3061548 2784467 2643923 2678372 2912985 3356405 3994620 4783247 5646481
39752E646481Q44116P39010N80360M11485K69351J73121J21007R4796P0942L4417
$$ 5646481 6490597 7229607 7809967 8221452 8490803 8663924 8784931 8879727 8950669 8985086
39742H985086j2746n4624p4275o6701m2984k4131k9928p0471j45311k48896l75567
$$ 8985086 8972340 8917716 8843441 8776740 8733756 8709625 8679697 8609226 8463915 8215019 7839452
39731G839452n18127o61594p80171q43072q25804p19012n30875k85199j7720K29923
$$ 7839452 7321325 6659731 5879560 5036488 4210684 3491672 2960797 2675598 2657878 2887801
39721B887801M19394N25089N39295M71425L43732J86230L1704q9420j54347j52697
$$ 2887801 3307195 3832284 4371579 4843004 5186736 5372966 5404670 5315250 5160903 5008206
39711E008206q9636J4642J30354K27143K83305K92362K65384K27189K05403K16167
$$ 5008206 4918570 4933212 5063566 5290709 5574014 5866376 6131760 6358949 6564352 6780519
39701F780519K55478L03137L36624L44634L31723L13406L06424L19639L49887
$$ 6780519 7035997 7339134 7675758 8020392 8352115 8665521 8971945 9291584 9641471
39692I641471L84990M11448M20050M04774L58275K72327J46028o052j56837k82215
$$ 9641471 10026461 10437909 10857959 11262733 11621008 11893335 12039363 12033311 11876474 11594259
39682A1594259l76710m54427n32938o14277o80783p09841o94031o48695o00903
$$ 11594259 11217549 10763122 10230184 9615907 8935124 8225283 7531252 6882557 6281654
39673F281654n69623n52449n27414m66808l52869j85980J7352K32515M34238O00334
$$ 6281654 5712031 5159582 4632168 4165360 3812491 3626511 3643863 3876378 4310616 4910950
39663D910950P13470P63879P53060O95539O16123N43205N00791N02002N45664
$$ 4910950 5624420 6388299 7141359 7836898 8453021 8996226 9497017 9999019 10544683
39654A0544683O17122O93817P53881P83657P80241P48885O98420O37525N72240
$$ 10544683 11161805 11855622 12609503 13393160 14173401 14922286 15620706 16258231 16830471
39645A6830471N04272M30832L47053K50373J44553M0701m6568j07567j46147j80919
$$ 16830471 17334743 17765575 18112628 18363001 18507554 18548255 18501687 18394120 18247973 18067054
39635A8067054k35083l20586m29212n38446o27509o90828p39163p88853q47761
$$ 18067054 17831971 17511385 17082173 16543727 15916218 15225390 14486227 13697374 12849613
39626A2849613r08021r50493r57614r25345q66013q01530p53794p39315p68726
$$ 12849613 11941592 10991099 10033485 9108140 8242127 7440597 6686803 5947488 5178762
39617E178762q46156r65095j103883j227624j298712j290338j194585j021893
$$ 5178762 4332606 3367511 2263628 1036004 -262708 -1553046 -2747631 -3769524
39609c769524p95460n45484l04370j01202M5189J31776J71405J85623J93962K06988
$$ -3769524 -4564984 -5110468 -5414838 -5516040 -5470851 -5339075 -5167670 -4982047 -4788085 -4581097
39599d581097K27682K57745L00460L56131M15485M59805M70393M40817L82293
$$ -4581097 -4353415 -4095670 -3795210 -3439079 -3023594 -2563789 -2093396 -1652579 -1270286
39590a270286L17080K63343K21965J75739J02539p528j44050k81852l93886m62431
$$ -1270286 -953206 -689863 -467898 -292159 -189620 -197148 -341198 -623050 -1016936 -1479367
39580a479367m84388m70300m37334l97550l47146k64902j23799Q9871L62748O56608
$$ -1479367 -1963755 -2434055 -2871389 -3268939 -3616085 -3880987 -4004786 -3914915 -3552167 -2895559
39570b895559R25949J138562J285468J376313J427157J449511J444436J401710
$$ -2895559 -1969610 -831048 454420 1830733 3257890 4707401 6151837 7553547
39562G553547J304288J137056Q95712N91149K48894r4082l95091o15861p35101
$$ 7553547 8857835 9994891 10890603 11481752 11730646 11636564 11241473 10625612 9890511
39553I890511p56074p02870o06929m92199l67848k32496q6690N5795J67613K20055
$$ 9890511 9134437 8431567 7824638 7332439 6964591 6732095 6645405 6701200 6868813 7088868
39543G088868J99005J12824j1791j41208k46479l11269l34648l28180l08881k92123
$$ 7088868 7287873 7400697 7388906 7247698 7001219 6689950 6355302 6027122 5718241 5426118
39533E426118k87756k99079l22992l51423l74855l85858l78774l45626k74394
$$ 5426118 5138362 4839283 4516291 4164868 3790013 3404155 3025381 2679755 2405361
39524B405361j55687M633J77590L17745L83011L55342K48530R8791n4312j83970
$$ 2405361 2249674 2254307 2431897 2749642 3132653 3487995 3736525 3835316 3781004 3597034
39514C597034k81221l49789l97250m28792m45892m48408m37090m14352l82968
$$ 3597034 3315813 2966024 2568774 2139982 1694090 1245682 808592 394240 11272
39505A1272l44107k96369k36687j63023p8021Q488Q1239J26990J43985J45929
$$ 11272 -332835 -629204 -865891 -1028914 -1106935 -1098447 -1017208 -890218 -746233 -600304
39495f00304J55867J93580K65515L62904M66586N53754O04052O04879N54963M64273
$$ -600304 -444437 -250857 14658 377562 844148 1397902 2001954 2606833 3161796 3626069
39485C626069L50236K32633J29252N2554P646o683O621M7480J18202K17461L34725
$$ 3626069 3976305 4208938 4338190 4390744 4398390 4391707 4398328 4445808 4564010 4781471 5116196
39474E116196M51840N51688O26625O79163P14297P30175P14893O52047N31231
$$ 5116196 5568036 6119724 6746349 7425512 8139809 8869984 9584877 10236924 10768155
39465A0768155L56737J49335n9832k39825l69253m39855m53497m15666l30377
$$ 10768155 11124892 11274227 11214395 10974570 10605317 10165462 9711965 9296299 8965922
39456H965922k00294l2593J53604L25286M43975M81480M32920L17754J68258J3949
$$ 8965922 8765628 8733035 8886639 9211925 9655900 10137380 10570300 10888054 11056312 11070261
39446A1070261j28298k54475l67163m68385n55330o19526o48808o31653n62920
$$ 11070261 10941963 10687488 10320325 9851940 9296610 8677084 8028276 7396623 6833703
39437F833703m48348l04636j54618k0372Q2580J48581J82162J94237J94886J87384
$$ 6833703 6385355 6080719 5926101 5905729 5988309 6136890 6319052 6513289 6708175 6895559
39427F895559J68507J34813Q8632L8613m373l1173l5002r786N0457J48450K77711
$$ 6895559 7064066 7198879 7287511 7326124 7321751 7290578 7255576 7245790 7296247 7444697 7722408
39416G722408M19321N46553O35797O75299O65295O12442N26704M23671L27068
$$ 7722408 8141729 8688282 9324079 9999378 10664673 11277115 11803819 12227490 12554558
39407A2554558K65071K60038L17478M21534N40847O42457P04875P21554O94245
$$ 12554558 12819629 13079667 13397145 13818679 14359526 15001983 15706858 16428412 17122657
39398A7122657O25051N15421L70517K00396J4134j87171m10039o60191r33424
$$ 17122657 17747708 18263129 18633646 18834042 18848176 18661005 18250966 17590775 16657351
39389A6657351j212617j470636j675043j793476j801825j694452j489556j223034
$$ 16657351 15444734 13974098 12299055 10505579 8703754 7009302 5519746 4296712
39381D296712r32915o45160l70356j11423J25896L28683M82210N81248O38683
$$ 4296712 3363797 2718637 2348281 2236858 2362754 2691437 3173647 3754895 4393578
39372D393578O83171P45082Q39270R56406J068133J141176J150543J085144R46022
$$ 4393578 5076749 5821831 6661101 7617507 8685640 9826816 10977359 12062503 13008525
39363A3008525P41906M86372J97422j02490l88079o34906q24171r46749j004004
$$ 13008525 13750431 14236803 14434225 14331735 13943656 13308750 12484579 11537830 10533826
39354A0533826j003977r54764q59989p20088n38379l27399j11646P5130J98764
$$ 10533826 9529849 8575085 7715096 6995008 6456629 6129230 6017584 6092714 6291478
39345F291478K38250J97961J09726K0856k5668o934P5954K04173L50777M88219
$$ 6291478 6529728 6727689 6837415 6858271 6832603 6825669 6901623 7105796 7456573 7944792
39335G944792N92867O47991O46295N91084M94395L71603K34808Q9405o3017k17049
$$ 7944792 8537659 9185650 9831945 10423029 10917424 11289027 11523835 11613240 11550223 11333174
39325A1333174l57261m59659n01385m71991l77421k33765n7014J41041L47332
$$ 11333174 10975913 10516254 10014869 9542878 9165457 8931692 8874678 9015719 9363051
39316I363051N39814O88549P68046P71182P12240O16336N04201L83668K52021
$$ 9363051 9902865 10591414 11359460 12130642 12842882 13459218 13963419 14347087 14599108
39307A4599108J04727n6652k22266l77932n11825o19093p01798p65314q14127
$$ 14599108 14703835 14647183 14424917 14046985 13535160 12916067 12214269 11448955 10634828
39298A0634828q48562q62529q43342p75481o48117m62647k35636M590K26058M02788
$$ 10634828 9786266 8923737 8080395 7304914 6656797 6194150 5958514 5963104 6189162 6591950
39288F591950N22848N91500O27597O54721O92035P49354Q26452R13153R88733
$$ 6591950 7114798 7706298 8333895 8988616 9680651 10430005 11256457 12169610 13158343
39279A3158343J024438R93675Q87286P23288N41535L85120K80545K28240K06082
$$ 13158343 14182781 15176456 16063742 16787030 17328565 17713685 17994230 18222470 18428552
39270A8428552J81234J24640K3822j11253k53648l74731m59381n10317n39475
$$ 18428552 18609786 18734426 18758248 18646995 18393347 18018616 17559235 17048918 16509443
39261A6509443n55101n55326n31637m77679l96870l05136k27291j86754j91909
$$ 16509443 15954342 15399016 14867379 14389700 13992830 13687694 13460403 13273649 13081740
39252A3081740k27139k56671k41301j58310j2754J64827L30510M41638M68790
$$ 13081740 12854601 12597930 12356629 12198319 12185565 12350392 12680902 13122540 13591330
39243A3591330M02630K54883N3785j63829l60544n04174n71421n50629m43903
$$ 13591330 13993960 14248843 14302628 14138799 13778255 13274081 12702660 12152031 11708128
39234A1708128k67508m9745J73315L63608M88457N28740M84733L76230K36692
$$ 11708128 11440620 11390875 11564190 11927798 12416255 12944995 13429728 13805958 14042650
39225A4042650J04386J2992j7320J3945Q8842J81326K70825L49475M19011M82388
$$ 14042650 14147036 14160028 14142708 14156653 14245495 14426821 14697646 15047121 15466132 15948520
39215A5948520N37935N78797N94962N75011N07708L85146K07430j3539k54332
$$ 15948520 16486455 17065252 17660214 18235225 18742933 19128079 19335509 19321970 19067638
39206A9067638m85250o78217q13221q81014q82746q28476p35370o24999n19080
$$ 19067638 18582388 17904171 17090950 16209936 15327190 14498714 13763344 13138345 12619265
39197A2619265m33674l73341l28395k78966k06125j04441J2276J16092J77673
$$ 12619265 12185591 11812250 11483855 11204889 10998764 10894323 10906599 11022691 11200364
39188A1200364J79533J23849L1917o4790j38450j76967j88221j95242k25672k99584
$$ 11200364 11379897 11503746 11535663 11470873 11332423 11155456 10967235 10771993 10546321 10246737
39178A0246737m19050n63781o97420p84081q06235p71957p06551o35059n67648
$$ 10246737 9827687 9263906 8566486 7782405 6976170 6204213 5497662 4862603 4294955
39169D294955m95940m00008k60129o6813J74364M43641P12418R51555J140225
$$ 4294955 3799015 3399007 3138878 3072065 3246429 3690070 4402488 5354043 6494268
39160F494268J271775J353503J400513J427651J443683J448836J434360J383640
$$ 6494268 7766043 9119546 10520059 11947710 13391393 14840229 16274589 17658229
39152A7658229J276044J094006Q31098M97848J22829k52500n85379q46361j029108
$$ 17658229 18934273 20028279 20859377 21357225 21480054 21227554 20642175 19795814 18766706
39143A8766706j148667j229461j291607j343024j378052j380137j328338j208156
$$ 18766706 17618039 16388578 15096971 13753947 12375895 10995758 9667420 8459264
39135H459264j022542p95725n66569l75285k49551j94085j87134j87767j53596
$$ 8459264 7436722 6640997 6074428 5699143 5449592 5255507 5068373 4880606 4727010
39126D727010o0379Q7735K61848M20805N24849N45952M73845L18148J06953j18154
$$ 4727010 4666631 4754366 5016214 5437019 5961868 6507820 6981665 7299813 7406766 7288612
39116G288612l11449m35974m74808m33698l33122j96085m0645J18894K65520L74886
$$ 7288612 6977163 6541189 6066381 5632683 5299561 5103476 5062831 5181725 5447245 5822131
39106E822131M18297L73589K37404L0067k10546m41176o24158p34343p63187p19750
$$ 5822131 6240428 6614017 6851421 6881488 6670942 6229766 5605608 4871265 4108078 3388328
39096C388328o26457n10342l95017k97950k31987k06188k22904k73116l35048
$$ 3388328 2761871 2251529 1856512 1558562 1326575 1120387 897483 624367 289319
39087B89319l79447l79938l22552k09084n3726J23424L02053M65106O00344P01046
$$ 289319 -90128 -470066 -792618 -1001702 -1055428 -932004 -629951 -164845 435499 1136545
39077A136545P66691Q02954Q18286Q16258P88761P18131N89505M04195J82796
$$ 1136545 1903236 2706190 3524476 4340734 5129495 5847626 6437131 6841326 7024122
39068G024122m3810k47368m10563n28614o06636o54824o82594o93516o83536o43453
$$ 7024122 6980312 6732944 6322381 5793767 5187131 4532307 3849713 3156197 2472661 1829208
39058A829208n64329m43238k86655j09258P2028K45584M08583N63131P08182Q34947
$$ 1829208 1264879 821641 534986 425728 497756 743340 1151923 1715054 2423236 3258183
39048C258183R30717R87470J006849R97171R66461R18188Q51963P66470O62055
$$ 3258183 4188900 5176370 6183219 7180390 8146851 9065039 9917002 10683472 11345527
39039A1345527N42531M15788K91858J78644P8721r568q7588j52837j99298k20697
$$ 11345527 11888058 12303846 12595704 12774348 12853069 12843501 12755913 12603076 12403778 12183081
39029A2183081k13423j77550j16986l9980M1144J13072J66655J99718K14081K09266
$$ 12183081 11969658 11792108 11675122 11635142 11676286 11789358 11956013 12155731 12369812 12579078
39019A2579078J79563J18213K5558q5342j89856k59406k72198k21849j19213J3344
$$ 12579078 12758641 12876854 12902412 12817070 12627214 12367808 12095610 11873761 11754548 11767892
39009A1767892J50447K69240L50982L82477L59413K88583J84896O3715o6272k04582
$$ 11767892 11918339 12187579 12538561 12921038 13280451 13569034 13753930 13817645 13751373 13546791
38999A3546791l54027n12533o67056p94327q69208q75818q14026o97598n47075
$$ 13546791 13192764 12680231 12013175 11218848 10349640 9473822 8659796 7962198 7415123
38990G415123l83834k28330j00129j5776J5987j941n5876j27183k00070k67125
$$ 7415123 7031289 6802959 6702830 6687054 6703041 6701100 6645224 6518041 6317971 6050846
38980F050846l29676l92993m59592n25309n80182o11860o08201n59167m60700
$$ 6050846 5721170 5328177 4868585 4343276 3763094 3151234 2543033 1983866 1523166
38971A523166l20186j58157j551J28422K25136K95833L53080M05248M52109M87421
$$ 1523166 1202980 1044823 1043272 1171694 1396830 1692663 2045743 2450991 2903100 3390521
38961C390521N05810N08586N04131N03275N14111N39533N76546O15465O40445
$$ 3390521 3896331 4404917 4909048 5412323 5926434 6465967 7042513 7657978 8298423
38952H298423O34439N87633N03466L97257K88821J95101J27420R2929R6249J38234
$$ 8298423 8932862 9520495 10023961 10421218 10710039 10905140 11032560 11125489 11221738 11359972
38942A1359972K12760L05479L97000M68414N04909M96244M36794L27385J77187
$$ 11359972 11572732 11878211 12275211 12743625 13248534 13744778 14181572 14508957 14686144
38933A4686144K907j74411l32170m47571m99535m73120l65386j89481K6494K46909
$$ 14686144 14689051 14514640 14182470 13734899 13235364 12762244 12396858 12207377 12233871 12480780
38923A2480780M39633N84658O75508P14236P05535O54241N65824M47612L10035
$$ 12480780 12920413 13505071 14180579 14894815 15600350 16254591 16820415 17268027 17578062
38914A7578062J68150M2116m5756p7551m7013L6264J48137K56785L32284L54091
$$ 17578062 17746212 17788328 17742572 17665021 17618008 17654272 17802409 18059194 18391478 18745569
38904A8745569L13315K11132N7455j28908l21501m91769o17040o86119o99619
$$ 18745569 19058884 19270016 19327471 19198563 18877062 18385293 17768253 17082134 16382515
38895A6382515o66569o00829n18886m37900l72274l29461l08541l04232l14009
$$ 16382515 15715946 15115117 14596231 14158331 13786057 13456596 13148055 12843823 12529814
38886A2529814l41786l93833m70168n59420o41936o98537p18476p02468o60652
$$ 12529814 12188028 11794195 11324027 10764607 10122671 9424134 8705658 8003190 7342538
38877G342538o07248n53932n04882m56491m02204l39036k71513k11414j74474
$$ 7342538 6735290 6181358 5676476 5219985 4817781 4478745 4207232 3995818 3821344
38868C821344j75218k20416l03372m03270m91573n41994n37943m74755l58512
$$ 3821344 3646126 3425710 3122338 2719068 2227495 1685501 1147558 672803 314291
38859C14291k03726k9549J45548L08150M50431N67714O56617P15629P46385P53278
$$ 314291 110565 81016 226564 534714 985145 1552859 2209476 2925105 3671490 4424768
38849D424768P41747P17257O85974O55769O35199O29478O35662O41288O29283
$$ 4424768 5166515 5883772 6569746 7225515 7860714 8490192 9125854 9767142 10396425
38840A0396425N86567N10229M06982K87892J63638M3455o3921j50381k10441k43270
$$ 10396425 10982992 11493221 11900203 12188095 12351733 12395188 12331267 12180886 11970445 11727175
38830A1727175k52827k45856k28880k05750j77297j43622j07489p5774n7298n8967
$$ 11727175 11474348 11228492 10999612 10793862 10616565 10472943 10365454 10289680 10232382 10173415
38820A0173415q3533j29800j93011k64220l30582l78229l95816l75843l14815
$$ 10173415 10089882 9960082 9767071 9502851 9172269 8794040 8398224 8022381 7707566
38811G707566k15420q9713M2399J61845K60095L41191M14499M84867N47454N89617
$$ 7707566 7492146 7402433 7444832 7606677 7866772 8207963 8622462 9107329 9654783 10244400
38801A0244400N97984N67110N04823M29938L62540L12953K76692K37957J78444
$$ 10244400 10842384 11409494 11914317 12344255 12706795 13019748 13296440 13534397 13712841
38792A3712841Q5747m3095k03664l88520n88889p92200r79746j129765j225148
$$ 13712841 13798588 13755493 13551829 13163309 12574420 11782220 10802474 9672709 8447561
38783H447561j258910j232102j147315j005921q13046n85169l51737j47790k579
$$ 8447561 7188651 5956549 4809234 3803313 2990267 2405098 2053361 1905571 1902992
38774A902992O8576O6313M765r3053k00753k92988l46448l38078k45497n3604
$$ 1902992 1971568 2037881 2042646 1949593 1748840 1455852 1109404 771326 525829 472225
38764D72225K35282N95648R82799J344675J634982J822209J892734J848665J702936
$$ 472225 707507 1303155 2285954 3630629 5265611 7087820 8980554 10829219 12532155
38755A2532155J475234J191210Q83592N91010L51885J95282J33429J59586K51650
$$ 12532155 14007389 15198599 16082191 16673201 17025086 17220368 17353797 17513383 17765033
38746A7765033L78956N08568O08424O48293O02604M57872K21428p6334l91048
$$ 17765033 18143989 18652557 19260981 19909274 20511878 20969750 21191178 21114844 20723796
38737B0723796o81229r23425j117783j282204j438569j597345j748095j861675
$$ 20723796 20042567 19119142 18001359 16719155 15280586 13683241 11935146 10073471
38729A0073471j903930j853154j710357j496504j240356r66649o92292m30280
$$ 10073471 8169541 6316387 4606030 3109526 1869170 902521 210229 -220051
38721b20051j95165m425J24939J82177J68720J02412J6689m7905n7618K645J25544
$$ -220051 -415216 -419641 -294702 -112525 56195 158607 175296 127391 69773 72418 197962
38710A97962K85747M49074N83505O69417P04685P00892O73037O30369N73978N00128
$$ 197962 483709 932783 1516288 2185705 2890390 3591282 4264319 4894688 5468666 5968794
38700E968794M04679K85837J45261j1639j75581l33246m68168n64552o13394o16359
$$ 5968794 6373473 6659310 6804571 6792932 6617351 6284105 5815937 5251385 4637991 4021632
38690D021632n83248n24631m45560l44385k15619n4064J41071L62532N93483Q09658
$$ 4021632 3438384 2913753 2468193 2123808 1908189 1854125 1995196 2357728 2951211 3760869
38680C760869R84808J097402J136776J107180J027652R26275Q30037P54458O97818
$$ 3760869 4745677 5843079 6979855 8087035 9114687 10040962 10870999 11625457 12323275
38671A2323275O43681N71539M70283L44932K10616P8415n3632j95157l48445m98132
$$ 12323275 12966956 13538495 14008778 14353710 14564326 14642741 14589109 14393952 14045507 13547375
38661A3547375o15523o74171o64784n99689n05639m10723l32928k75226k27800
$$ 13547375 12931852 12257681 11592897 10993208 10487569 10076846 9743918 9468692 9240892
38652I240892j74899j03187q932R8854K01878K81840L29542L46533L38376L06796
$$ 9240892 9065993 8962806 8953874 9052728 9254606 9536446 9865988 10212521 10550897 10857693
38642A0857693K49129J65711O7286k5165q8314j06000p5386q918O7620J22588
$$ 10857693 11106822 11272533 11339819 11314654 11226340 11120340 11044954 11036036 11103656 11226244
38632A1226244J31523Q9566J3602o9179j37854j86104k16870k30610k19512j73510
$$ 11226244 11357767 11447333 11460935 11391756 11253902 11067798 10850928 10620318 10400806 10227296
38622A0227296r2603N879R2390J39460J34019P8805j5994j41742k93884m68898
$$ 10227296 10134693 10140572 10232962 10372422 10506441 10585246 10569252 10427510 10133626 9664728
38612I664728o60479q57049j039739j181898j253793j233493j118424r29524p04336
$$ 9664728 9004249 8147200 7107461 5925563 4671770 3438277 2319853 1390329 685993
38603F85993m82672k91994j38814r303J21021K72384M47970O30655P91566R04886
$$ 685993 203321 -88673 -227487 -236790 -115769 156615 604585 1235240 2026806 2931692
38593B931692R59078R58038R13296Q34200P23125N78571M03433K11741K7832j21939
$$ 2931692 3890770 4848808 5762104 6596304 7319429 7898000 8301433 8513174 8541006 8419067
38583H419067k18148k51296k19344j25563K0266K00672L93219N75739P29387Q37972
$$ 8419067 8200919 7949623 7730279 7604716 7624982 7825654 8218873 8794612 9523999 10361971
38573A0361971Q86574Q62679P59518N78968L32321L9355k72991n72579q26725
$$ 10361971 11248545 12111224 12870742 13449710 13782031 13821386 13548395 12975816 12149091
38564A2149091j010541j115010j147674j123357j051530r30895p54569n19809
$$ 12149091 11138550 10023540 8875866 7752509 6700979 5770084 5015515 4495706
38556D495706k34300Q3052M04190O95243R21889J056722J086280J014933Q64733
$$ 4495706 4261406 4344458 4748648 5443891 6365780 7422502 8508782 9523715 10388448
38547A0388448O71013M73948L07386J89143J18020P9683N7477M0500K4341P272
$$ 10388448 11059461 11533409 11840795 12029938 12147958 12227641 12285118 12325618 12349959 12357231
38537A2357231j1678l0071l9059k5568K0058R6233J87513K68483L11799K97054
$$ 12357231 12345553 12315482 12276423 12250855 12270913 12367146 12554659 12823142 13134941 13431995
38527A3431995K17628Q3589q0486k42626l73278m53332m75892m41415l51061k04102
$$ 13431995 13649623 13733212 13652726 13410100 13036822 12583490 12107598 11666183 11315122 11111020
38517A1111020p55K52949N41897Q40993J116358J329348J444269J438194J308640
$$ 11111020 11110265 11363214 11905111 12746104 13862462 15191810 16636079 18074273 19382913
38508A9382913J075186P74217M49730J44473j06198k78348l62532l65304l07448
$$ 19382913 20458099 21232316 21682046 21826519 21720321 21441973 21079441 20714137 20406689
38499B0406689k18847j31499p1739n2521o8915j01411j27443j34616j27133j22389
$$ 20406689 20187842 20056343 19984604 19932083 19863168 19761757 19634314 19499698 19372565 19250176
38489A9250176j40740j93561k74729l60411m19009m26168l75463k79620j65063
$$ 19250176 19109436 18915875 18641146 18280735 17861726 17435558 17060095 16780475 16615412
38480A6615412o4511q678j6692q8542k05076l36142m51589n29492n60118n46160
$$ 16615412 16550901 16542223 16525531 16436989 16231913 15895771 15444182 14914690 14354572 13808412
38470A3808412m98824m30205l45761k42043j11061N2531K46418M59687O74455
$$ 13808412 13309588 12879383 12533622 12291579 12180518 12233049 12479467 12939154 13613609
38461A3613609Q68043J015560J094393J091217J008953Q68763P03805N47137M20833
$$ 13613609 14481652 15497212 16591605 17682822 18691775 19560538 20264343 20811480 21232313
38452B1232313L32610K80345K58664K60955K75462K80771K47864J50521k1330
$$ 21232313 21564923 21845268 22103932 22364887 22640349 22921120 23168984 23319505 23298175
38443B3298175k53167n06638p29100q69122q93373p98018o08379l67057j18742
$$ 23298175 23045008 22538370 21809270 20940148 20046775 19248757 18640378 18273321 18154579
38434A8154579R9535K61209L50918L66613L20930K38216J47141P2721L1417L0149
$$ 18154579 18254114 18515323 18866241 19232854 19553784 19792000 19939141 20011862 20043279 20073428
38424B0073428O7140J32179K06362K64589K83288K50198J68785N3459p9628k17931
$$ 20073428 20140568 20272747 20479109 20743698 21026986 21277184 21445969 21499428 21419800 21201869
38414B1201869l51076m67156n52189n93741n85897n32586m47535l50526k61047
$$ 21201869 20850793 20383637 19831448 19237707 18651810 18119224 17671689 17321163 17060116
38405A7060116j91687j43575j05509n7844J9164J35493K84856M45118N85613O78163
$$ 17060116 16868429 16724854 16619345 16561501 16580665 16716158 17001014 17446132 18031745 18709908
38395A8709908P06985O72617N87941M69866L33379J91167N5842n9941j46095j98289
$$ 18709908 19416893 20089510 20677451 21147317 21480696 21671863 21727705 21667764 21521669 21323380
38385B1323380k20498k26503k37915k76416l52796m59678n72292o55991o76962
$$ 21323380 21102882 20876379 20638464 20362048 20009252 19549574 18977282 18321291 17644329
38376A7644329o14042m68817k68617n8505J15088K21255K54912K37338K07234
$$ 17644329 17030287 16561470 16292853 16234348 16349436 16570691 16825603 17062941 17270175
38367A7270175K05399K59156L73055N29076O94974Q36788R30306R66135R46062
$$ 17270175 17475574 17734730 18107785 18636861 19331835 20168623 21098929 22065064 23011126
38358B3011126Q74958P56462N96425M09188K18121M7340q9563j95193k84473l74748
$$ 23011126 23886084 24642546 25238971 25648159 25866280 25913620 25824057 25628864 25344391 24969643
38348B4969643m76723n90718p07550q10824q78993q88694q21242o71383m53893
$$ 24969643 24492920 23902202 23194652 22383828 21504835 20616141 19794899 19123516 18669623
38339A8669623k02872L8492K33852L66823M43788M85912N16873N53282N99893
$$ 18669623 18466751 18505243 18739095 19105918 19549706 20035618 20552491 21105773 21705666
38330B1705666O48255O78541O66140N92433M55071K71523P3217j07177k49255
$$ 21705666 22353921 23032462 23698602 24291035 24746106 25017629 25090846 24983669 24734414
38321B4734414l52781m35845n23168o29959p50710q60810r30789r43683r03866
$$ 24734414 24381633 23945788 23422620 22792661 22041951 21181141 20250352 19306669 18402803
38312A8402803q32981p58163p00773o70264o63285o67058o65616o46683o06335
$$ 18402803 17569822 16811659 16110886 15440622 14777337 14110279 13444663 12797980 12191645
38303A2191645n49954m89517m37738m00955l75089l48632l11167k60035j98736
$$ 12191645 11641691 11152174 10714436 10313481 9938392 9589760 9278593 9018558 8819822
38294H819822j28791m3451P0229K22657M14224O35180Q71708J111275J341935
$$ 8819822 8691031 8647580 8717809 8940466 9354690 9989870 10861578 11972853 13314788
38285A3314788J547157J703192J784265J773783J674010J507443J309286J115835
$$ 13314788 14861945 16565137 18349402 20123185 21797195 23304638 24613924 25729759
38277B5729759R54715Q40232P74043P49310P55081P77669P98746P94559P41073
$$ 25729759 26684474 27524706 28298749 29048059 29803140 30580809 31379555 32174114 32915187
38268C2915187O23726M44119K17806l4119k92003n39250p60988r43330j074059
$$ 32915187 33538913 33983032 34200838 34166719 33874716 33335466 32574478 31631148 30557089
38259C0557089j144222j150769j099527j005935q91569p77754o79656o03738n49443
$$ 30557089 29412867 28262098 27162571 26156636 25265067 24487313 23807657 23203919 22654476
38250B2654476n13519m92995m83458m74541m49208l90358k89837j51659J2449
$$ 22654476 22140957 21647962 21164504 20689963 20240755 19850397 19560560 19408901 19421350
38241A9421350J89393L67477N35835O83906Q02306Q84145R25902R27795Q93509
$$ 19421350 19610743 19978220 20514055 21197961 22000267 22884412 23810314 24738109 25631618
38232B5631618Q29163P42115O40359N32456M27394L33746K57960K01990J61516
$$ 25631618 26460781 27202896 27843255 28375711 28803105 29136851 29394811 29596801 29758317
38223B9758317J26640Q5978L2826k9584q6950j18591j06951m7694M5584J45810
$$ 29758317 29884957 29970935 30003761 29974177 29887227 29768636 29661685 29613991 29659575 29805385
38213B9805385K24672K66028K72287K59147K41838K22835J90696J31041M0868
$$ 29805385 30030057 30296085 30568372 30827519 31069357 31292192 31482888 31613929 31654797
38204C1654797o4786j58139k11668k10805j59906p9086O149P6963J28612J69968
$$ 31654797 31590011 31431872 31220204 31009399 30849493 30770407 30776556 30853519 30982131 31152099
38194C1152099K16445K80668L65084M59406N44005N97925O07406N70259M94628
$$ 31152099 31368544 31649212 32014296 32473702 33017707 33615632 34223038 34793297 35287925
38185C5287925L94762K87275J88237J09104N1402L787n4551j44222k74312m35569
$$ 35287925 35682687 35969962 36158199 36267303 36318705 36322492 36267941 36123719 35849407 35413838
38175C5413838o02393p43473q35000q67582q42759p64715o36989m66937k70454
$$ 35413838 34811445 34067972 33232972 32365390 31522631 30757916 30120927 29653990 29383536
38166B9383536o8748J21391K94521M54206O04163P40311Q48345R06565Q92067
$$ 29383536 29314788 29436179 29730700 30184906 30789069 31529380 32377725 33284290 34176357
38157C4176357P89179N98480L42498O3277j89533l75149m73998m89526m40184
$$ 34176357 34965536 35564016 35906514 35969791 35780258 35405109 34931111 34441585 34001401
38148C4001401l48544k34946j17674j5176N5677Q6315Q2918O6196O3490R7871
$$ 34001401 33652857 33417911 33300237 33285061 33340738 33427053 33509971 33576167 33639657 33737528
38138C3737528J79944L04930M54778O03620P24323P94230P99741P40270O30318
$$ 33737528 33917472 34222402 34677180 35280800 36005123 36799353 37599094 38339364 38969682
38129C8969682M96744L70485K76458K26702K18716K38340K66515K88909L04114
$$ 38969682 39466426 39836911 40113369 40340071 40558787 40797127 41063642 41352551 41656665
38120D1656665L24437L67504M44063N50319O69337P79645Q65012R19249R43322
$$ 41656665 41981102 42348606 42792669 43342988 44012325 44791970 45656982 46576231 47519553
38111D7519553R37300Q94136Q01607O52829M58041K47687O2282o5638j26428j37101
$$ 47519553 48456853 49350989 50152596 50805425 51263466 51511153 51573435 51507797 51381369 51244268
38101E1244268j33700j56935k36350l78440n64415p59729r29477j049380j106801
$$ 51244268 51110568 50953633 50717283 50338843 49774428 49014699 48085222 47035842 45929041
38092D5929041j095707j013150q60706o48148l94738j25684J34890L70050N70868
$$ 45929041 44833334 43820184 42959478 42311330 41916592 41790908 41925798 42295848 42866716
38083D2866716P31646Q44046Q95447Q73433P73803O07256L99739J84509j0131
$$ 42866716 43598362 44442408 45337855 46211288 46985091 47592347 47992086 48176595 48166464
38074D8166464j68613k85303l54588l64521l01435j62183L6616K60656M70265
$$ 48166464 47997851 47712548 47357960 46993439 46692004 46529821 46566437 46827093 47297358
38065D7297358O34414P37737P78742P64167P05519O18903N24687M43589L90173
$$ 47297358 47931772 48669509 49448251 50212418 50917937 51536840 52061527 52505116 52895289
38056E2895289L68184L71395L89551M14645M42603M69738M88902M90934M71674
$$ 52895289 53263473 53634868 54024419 54439064 54881667 55351405 55840307 56331241 56802915
38047E6802915M38353M08610M01669M28326M87421N70410O68636P76807Q90966
$$ 56802915 57241268 57649878 58051547 58479873 58967294 59537704 60206340 60983147 61874113
38038F1874113J004684J107825J189391J243132J273103J295148J330787J394697
$$ 61874113 62878797 63986622 65176013 66419145 67692248 68987396 70318183 71712880
38030G1712880J483581J575715J643253J669416J658607J632738J616694J622987
$$ 71712880 73196461 74772176 76415429 78084845 79743452 81376190 82992884 84615871
38022H4615871J645578J665626J663051J624955J547532J435327J301977J170835
$$ 84615871 86261449 87927075 89590126 91215081 92762613 94197940 95499917 96670752
38014I6670752J070594J025700J047731J133508J268916J432981J599969J742410
$$ 96670752 97741346 98767046 99814777 100948285 102217201 103650182 105250151 106992561
38006A06992561J837332J872596J848266J773203J662280J537290J427632J364933
$$ 106992561 108829893 110702489 112550755 114323958 115986238 117523528 118951160 120316093
37998A20316093J371902J452228J587904J744655J881957J963963J968623J892871
$$ 120316093 121687995 123140223 124728127 126472782 128354739 130318702 132287325 134180196
37990A34180196J752661J578322J407095J274778J208614J223069J318569J481572
$$ 134180196 135932857 137511179 138918274 140193052 141401666 142624735 143943304 145424876
37982A45424876J685205J892490K064564K172156K204153K168257K084807J979370
$$ 145424876 147110081 149002571 151067135 153239291 155443444 157611701 159696508 161675878
37974A61675878J878126J805065J778325J805893J884207K001982K146863K309970
$$ 161675878 163554004 165359069 167137394 168943287 170827494 172829476 174976339 177286309
37966A77286309K485514K667402K846848L013166L156893L272508L358622L415465
$$ 177286309 179771823 182439225 185286073 188299239 191456132 194728640 198087262 201502727
37958B01502727L441863L434705L391958L316561L217071L104070K986099K869785
$$ 201502727 204944590 208379295 211771253 215087814 218304885 221408955 224395054 227264839
37950B27264839K764275K684786K650008K673597K755586K880195L022060L157344
$$ 227264839 230029114 232713900 235363908 238037505 240793091 243673286 246695346 249852690
37942B49852690L272870L367855L447695L515208L566652L595451L599411L584122
$$ 249852690 253125560 256493415 259941110 263456318 267022970 270618421 274217832 277801954
37934B77801954L559472L533341L508996L488256L476368L483346L520909L597999
$$ 277801954 281361426 284894767 288403763 291892019 295368387 298851733 302372642 305970641
37926C05970641L717451L873724M051644M227887M376263M474508M509151M477592
$$ 305970641 309688092 313561816 317613460 321841347 326217610 330692118 335201269 339678861
37918C39678861M388331M258565M107722L949880L791208L633761L479159L327094
$$ 339678861 344067192 348325757 352433479 356383359 360174567 363808328 367287487 370614581
37910C70614581L173042L012784K851732K708098K604422K554891K559348K605691
$$ 370614581 373787623 376800407 379652139 382360237 384964659 387519550 390078898 392684589
37902C92684589K674550K742375K784971K783149K727943K621604K473855K296175
$$ 392684589 395359139 398101514 400886485 403669634 406397577 409019181 411493036 413789211
37894D13789211K097050J879448J640294J371285J061525P03250K99723j29679
$$ 413789211 415886261 417765709 419406003 420777288 421838813 422542063 422841786 422712107
37886D22712107n52436r33761j248862j489907j665635j795470j900678j995386
$$ 422712107 422159671 421225910 419977048 418487141 416821506 415026036 413125358 411129972
37878D11129972k081276k149091k186097k184884k148632k091184k033561j999708
$$ 411129972 409048696 406899605 404713508 402528624 400379992 398288808 396255247 394255539
37870C94255539k013138k093880k253617k488802k775257l069461l318570l475510
$$ 394255539 392242401 390148521 387894904 385406102 382630845 379561384 376242814 372767304
37862C72767304l512958l431141l257199l036349k818026k642973k536706k510171
$$ 372767304 369254346 365823205 362566006 359529657 356711631 354068658 351531952 349021781
37854C49021781k563994k692669k888023l142395l450194l805538m196215m598067
$$ 349021781 346457787 343765118 340877095 337734700 334284506 330478968 326282753 321684686
37846C21684686m975112n287510n504183n612806n621007n548654n417000n241112
$$ 321684686 316709574 311422064 305917881 300305075 294684068 289135414 283718414 278477302
37838B78477302n027846m778052m491388m171911l831404l487814l160249k865259
$$ 278477302 273449456 268671404 264180016 260008105 256176701 252688887 249528638 246663379
37830B46663379k616725k426921k305278k255033k271085k341345k451033k587543
$$ 246663379 244046654 241619733 239314455 237059422 234788337 232446992 229995959 227408416
37822B27408416k743305k915170l100932l295101l485833l654195l777173l835163
$$ 227408416 224665111 221749941 218649009 215353908 211868075 208213880 204436707 200601544
37814B00601544l820856l742904l620492l472633l310411l136580k949907k749286
$$ 200601544 196780688 193037784 189417292 185944659 182634248 179497668 176547761 173798475
37806A73798475k535344k310702k080635j854587j646858j474235j350538j281409
$$ 173798475 171263131 168952429 166871794 165017207 163370349 161896114 160545576 159264167
37798A59264167j263448j288266j347995j437951j554590j690263j828929j947109
$$ 159264167 158000719 156712453 155364458 153926507 152371917 150681654 148852725 146905616
37790A46905616k020840k034449j985490j884143j749522j605494j476417j382452
$$ 146905616 144884776 142850327 140864837 138980694 137231172 135625678 134149261 132766809
37782A32766809j335061j333583j363887j401088j417983j396910j338192j258921
$$ 132766809 131431748 130098165 128734278 127333190 125915207 124518297 123180105 121921184
37774A21921184j182424j125348j090737j071116j058352j052064j060107j092300
$$ 121921184 120738760 119613412 118522675 117451559 116393207 115341143 114281036 113188736
37766A13188736j154845j250481j381397j548349j744637j951165k139657k283883
$$ 113188736 112033891 110783410 109402013 107853664 106109027 104157862 102018205 99734322
37758I9734322k370942k403780k393267k346343k259240k119929j918019j656930
$$ 99734322 97363380 94959600 92566333 90219990 87960750 85840821 83922802 82265872
37750H2265872j362100j078815q56903p28239o90073p05078p18120o79928n65646
$$ 82265872 80903772 79824957 78968054 78239815 77549742 76844664 76126544 75446616 74880970
37741G4880970l80972j55821O8638K52295L64150L86711L17728J68336m2226k91811
$$ 74880970 74499998 74344177 74412815 74665110 75029260 75415971 75733699 75902035 75859809 75567998
37731G5567998n56947q12171j031441j193813j290523j328481j326210j302635
$$ 75567998 75011051 74198880 73167439 71973626 70683103 69354622 68028412 66725777
37723F6725777j265193j206686j114544r84955q29819o71871n33783m29617l62054
$$ 66725777 65460584 64253898 63139354 62154399 61324580 60652709 60118926 59689309 59327255
37714E9327255l24688l07632l04139l14594l45205m01849m82469n72621o47711
$$ 59327255 59002567 58694935 58390796 58076202 57730997 57329148 56846679 56274058 55626347
37705E5626347o81930o58596n75053m40262k69825q3644R3915K35771L18345L29959
$$ 55626347 54944417 54285821 53710768 53270506 53000681 52917037 53010952 53246723 53565068 53895027
37695E3895027K76059J76769N6900o5964j87673l14314m52845o02482p52056q84191
$$ 53895027 54171086 54347855 54404755 54338791 54151118 53836804 53383959 52781477 52029421 51145230
37685E1145230r83208j041843j062695j054091j023569r73282q99649p97083o63465
$$ 51145230 50162022 49120179 48057484 47003393 45979824 45006542 44106893 43309810 42646345
37676D2646345n03668l29377j57029o798R8616J39842J11137K7502p9315j74187
$$ 42646345 42142677 41813300 41656271 41649473 41748089 41887931 41999068 42026570 41947255 41773068
37666D1773068k31716k41295k04735j31884l7728N9659J42685J99383K27051K30879
$$ 41773068 41541352 41300057 41095322 40963438 40925710 40985369 41128054 41327437 41554488 41785367
37656D1785367K18057J92386J53479R9379K8197o2697j76991l16166m73786o31987
$$ 41785367 42003424 42195810 42349289 42448668 42476865 42414168 42237177 41921011 41447225 40815238
37646D0815238p63995q42628q50672p87676o70351n27495l92525k96098k60105
$$ 40815238 40051243 39208615 38357943 37570267 36899916 36372421 35979896 35683798 35423693
37637C5423693k93780l91986n35577o94029q31077r12919r16794q37365o88929
$$ 35423693 35129913 34737927 34202350 33508321 32677244 31764325 30847531 30010166 29321237
37628B9321237n01992l14252j59671o1278k9342o1226j40229k36980l17502l54465
$$ 29321237 28819245 28504993 28345322 28284044 28254702 28193476 28053247 27816267 27498765 27144300
37618B7144300l33107k48915j02785J00310L49353O25310R00592J140391J307737
$$ 27144300 26811193 26562278 26459493 26559803 26909156 27534466 28435058 29575449 30883186
37609C0883186J372870J323206J168060R35391O62411L84621J28060r2366k69704
$$ 30883186 32256056 33579262 34747322 35682713 36345124 36729745 36857805 36765439 36495735
37600C6495735m00984m84636n18188m95843m09151k53264l5336K21766M83413
$$ 36495735 36094751 35610115 35091927 34596084 34186933 33933669 33898333 34120099 34603512
37591C4603512P11741Q73856R47587R25059Q14888O42079M42744K52062R0644
$$ 34603512 35315253 36189109 37136696 38061755 38876643 39518722 39961466 40213528 40304172
37582D0304172m0173j48653k36836k93389l00908k49173j42808L4J54057K94232
$$ 40304172 40263999 40115346 39878510 39585121 39284213 39035040 38892232 38892266 39046323 39340555
37572C9340555M02027M68340M92223M78178M35381L78131L23632K86240K72108
$$ 39340555 39742582 40210922 40703145 41181323 41616704 41994835 42318467 42604707 42876815
37563D2876815K78037K94359L09209L12437K97981K63411K07045J25784J6668
$$ 42876815 43154852 43449211 43758420 44070857 44368838 44632249 44839294 44965078 44981746
37554D4981746j19173k74441m37380n95040p35489q49477r33298r91965j039067
$$ 44981746 44862573 44588132 44150752 43555712 42820223 41970746 41037448 40045483 39006416
37545C9006416j091358j160050j243433j324564j375549j367207j280236j112749
$$ 39006416 37915058 36755008 35511575 34187011 32811462 31444255 30164019 29051270
37537B9051270q81012o14411l48060j15263N9727J67334K13422K13213J81067
$$ 29051270 28170258 27555847 27207787 27092524 27152251 27319585 27533007 27746220 27927287
37528B7927287J22541L3580r3137k59150m54354o58374q48368j007106j124764
$$ 27927287 28049828 28083408 27990271 27731121 27276767 26618393 25770025 24762919 23638155
37519B3638155j194561j209646j167219j076296r59367q44018p51012o87810o49450
$$ 23638155 22443594 21233948 20066729 18990433 18031066 17187048 16436036 15748226 15098776
37510A5098776o22610n90110n36384m53379l43469k17500r0514K1519J04290J49349
$$ 15098776 14476166 13886056 13349672 12896293 12552824 12335324 12244810 12266329 12370619 12519968
37500A2519968J59517J51535J52397J89820K81163M26404O08515Q00148R71970
$$ 12519968 12679485 12831020 12983417 13173237 13454400 13880804 14489319 15289467 16261437
37491A6261437J098605J161486J150129J062610R05306O92401M45633J92702l8086
$$ 16261437 17360042 18521528 19671657 20734267 21639573 22331974 22777607 22970309 22932223
37482B2932223k26077l64190m57229n13131n33714n12218m39373l12809j42208
$$ 22932223 22706146 22341956 21884727 21371596 20837882 20325664 19886291 19573482 19431274
37473A9431274N3315K52470M37448N94818P13567P84365Q01829P68168O94600
$$ 19431274 19484589 19737059 20174507 20769325 21482892 22267257 23069086 23837254 24531854
37464B4531854N98103M94247L90033K81126J55267j12j90197m08670o38490q55422
$$ 24531854 25129957 25624204 26014237 26295363 26450630 26450518 26260321 25851651 25213161 24357739
37454B4357739j030963j134001j135004j016019p82840m69952j32041J74107M07215
$$ 24357739 23326776 22192775 21057771 20041752 19258912 18788960 18656919 18831026 19238241
37445A9238241N50826O12428O14437N81187N28140M59219L72880K70974J63232
$$ 19238241 19789067 20401495 21015932 21597119 22125259 22584478 22957358 23228332 23391564
37436B3391564O4906r610n3122o8799o8397o5803o9698q0369r2059r6816q5277
$$ 23391564 23456470 23446860 23393738 23324939 23256542 23190739 23121041 23040672 22948613 22851797 22766520
37425B2766520m4906L9499J79887L76211O10751Q49795J052843J185478J229786
$$ 22766520 22721614 22761113 22941000 23317211 23927962 24777757 25830600 27016078 28245864
37416B8245864J187534J075778R18902P41136N60467L84239K09056K7456j62028
$$ 28245864 29433398 30509176 31428078 32169214 32729681 33113920 33322976 33350432 33188404
37407C3188404l49671n19119o57297p60664q33685q83075r13534r27077r24259
$$ 33188404 32838733 32319614 31662317 30901653 30067968 29184893 28271359 27344282 26420023
37398B6420023r04925q67874q10339p28714o20703m86919l29829j51109M8178
$$ 26420023 25515098 24647224 23836885 23108171 22487468 22000549 21670720 21519611 21567789
37389B1567789K61818M70808O42039P38288P35574O37357M76454L03042J65262
$$ 21567789 21829607 22300415 22942454 23680742 24416316 25053673 25530127 25833169 25998431
37380B5998431R2575Q9650J41780K26513L24086M22002N13044N89029O34784O27769
$$ 25998431 26091006 26180656 26322436 26548949 26873035 27295037 27808081 28397110 29031894 29659663
37370B9659663N46372L83518J57203q9462l00048m24275m37745l52863k13420
$$ 29659663 30206035 30589553 30746756 30657294 30357246 29932971 29495226 29142363 28928943
37361B8928943p3820K4585O4999N0078j0297j06214k26405l53905m65234n35330
$$ 28928943 28855123 28879708 28944707 28994785 28984488 28878274 28651869 28297964 27832730 27297400
37351B7297400n46176m94907l96723k80512j78988j18064j09700j50695k27287
$$ 27297400 26751224 26256317 25859594 25579082 25400094 25282030 25172330 25021635 24794348
37342B4794348l22523m21075n08592n68455n82268n36874m33694k93003j49173
$$ 24794348 24471825 24050750 23542158 22973703 22391435 21854561 21420867 21127864 20978691
37333B0978691l9204R065j6130j09184k48683m00237n22125n75239n34475l96181
$$ 20978691 20939487 20948552 20932422 20823238 20574555 20174318 19652193 19076954 18542479 18146298
37323A8146298j78920Q0944L36926N43567O70300P12895O95200O58371O42788
$$ 18146298 17967378 18048322 18385248 18928815 19599115 20312010 21007210 21665581 22308369
37314B2308369O73123P54176Q76306J022110J168196J284950J341732J318561
$$ 22308369 22981492 23735668 24611974 25634084 26802280 28087230 29428962 30747523
37306C0747523J215780J053399Q61143O66784M88284L30492J86367M2765j12180
$$ 30747523 31963303 33016702 33877845 34544629 35032913 35363405 35549772 35592537 35480357
37297C5480357k84865m76149o81147q86327j067719j195528j244426j203133j078054
$$ 35480357 35195492 34719343 34038196 33151869 32084150 30888622 29644196 28441063 27363009
37288B7363009q90300o67948m36236k09918P521K17197M16387N95547P42821Q51296
$$ 27363009 26472709 25804761 25368525 25158607 25166128 25383325 25799712 26395259 27138080 27989376
37278B7989376R22472R63626R82078R81289R61142R20568Q59136P76256O69894
$$ 27989376 28911848 29875474 30857552 31838841 32799983 33720551 34579687 35355943 36025837
37269C6025837N37719L81522K12778N4961o0959j07552p2751L5398J94505L79207
$$ 36025837 36563556 36945078 37157856 37212817 37151858 37044306 36971555 37006953 37201458 37580665
37259C7580665N69063P47878Q98054R98349J030328R90705R00247Q00520P37432
$$ 37580665 38149728 38897606 39795660 40794009 41824337 42815042 43715289 44515809 45253241
37250D5253241P40366Q09757R20359J036307J126737J172314J162058J087649
$$ 45253241 45993607 46803364 47723723 48760030 49886767 51059081 52221139 53308788
37242E3308788R43203P31719M71521J94987o1147k66664m02689m60492m39667
$$ 53308788 54251991 54983710 55455231 55650218 55589071 55322407 54919718 54459226 54019559
37233E4019559l48584k04344k8917J57162L39376N10221O68030Q14647R51643
$$ 54019559 53670975 53466631 53437714 53594876 53934252 54444473 55112503 55927150 56878793
37224E6878793J075983J178395J246718J272139J253837J199395J121546J033181
$$ 56878793 57954776 59133171 60379889 61652028 62905865 64105260 65226806 66259987
37216F6259987R42348Q49647P50292O40433N23299M10039L14170K43650J96104
$$ 66259987 67202335 68051982 68802274 69442707 69966006 70376045 70690215 70933865 71129969
37207G1129969J60149J21802P2372J3443m3833q4844r9403q6923n6480k2538Q24
$$ 71129969 71290118 71411920 71484292 71497735 71453902 71369058 71269655 71182732 71126252 71103714 71104538
37196G1104538M316j4737n2407r8609j38495j57200j48363j21165r8300j03318
$$ 71104538 71108854 71094117 71041710 70943101 70804606 70647406 70499043 70377878 70279578 70176260
37186G0176260j45878k16245k92084l50292l74829l57996k98301j98395o4330
$$ 70176260 70030382 69814137 69522053 69171761 68796932 68438936 68140635 67942240 67877910
37177F7877910R3426K57892M05425N10890N56992N41228M75060L76836K64857
$$ 67877910 67971336 68229228 68634653 69145543 69702535 70243763 70718823 71095659 71360516
37168G1360516J54156N5191k7993r8433j62652k24282k80975l28157l65714m00453
$$ 71360516 71514672 71569863 71541870 71443437 71280785 71056503 70775528 70447371 70081657 69681204
37158F9681204m42301m98754n71979o57972p45701q18238q59482q64231q42763
$$ 69681204 69238903 68740149 68168170 67510198 66764497 65946259 65086777 64222546 63379783
37149F3379783q14243p93640p82461p68428p31646o53251n24840l55775j72623
$$ 63379783 62565540 61771900 60989439 60221011 59489365 58836114 58311274 57955499 57782876
37140E7782876p973J15112J91975K33342K55246K70720K87618L10606L42998L85568
$$ 57782876 57774903 57890015 58081990 58315332 58570578 58841298 59128916 59439522 59782520 60168088
37130F0168088M32931M71435M82722M52836L80735K79135J66532N6596m7330j49930
$$ 60168088 60601019 61072454 61555176 62008012 62388747 62667882 62834414 62891010 62843680 62693750
37120F2693750k57011l69118m79478n77396o55288p14745p66646q24644q97007
$$ 62693750 62436739 62067621 61588143 61010747 60355459 59640714 58874068 58049424 57152417
37111E7152417r83101j075713j165482j243929j305205j346998j368595j364833
$$ 57152417 56169316 55093603 53928121 52684192 51378987 50031989 48663394 47298561
37103D7298561j320501j212633j022113p46900m07834m4992K91358N52010P01204
$$ 47298561 45978060 44765427 43743314 42996414 42588580 42543588 42834946 43386956 44088160
37094D4088160P26801O42002M76272K61902K6140k07783m16432n76277o69465
$$ 44088160 44814961 45456963 45933235 46195137 46221277 46013494 45597062 45020785 44351320
37085D4351320o90406o48103n63135m61768l69988l08588k89373l12783l68411
$$ 44351320 43660914 43012811 42449676 41987908 41617920 41309332 41019959 40707176 40338765
37076D0338765m39672n11527n76887o36972o95044p48479p86049p93384p62976
$$ 40338765 39899093 39387566 38810679 38173707 37478663 36730184 35944135 35150751 34387775
37067C4387775p01508o28844n68458n34718n24600n18976m92567m26493l16441
$$ 34387775 33686267 33057423 32488965 31954247 31429647 30910671 30418104 29991611 29675170
37058B9675170j72911j5170J36442K65712L62455M23346M53085M63934M70700
$$ 29675170 29502259 29487089 29623531 29889243 30251698 30675044 31128129 31592063 32062763
37049C2062763M82519M97481N04302M88341M35973L35654J79454l2354k86749
$$ 32062763 32545282 33042763 33547065 34035406 34471379 34807033 34986487 34954133 34667384
37040C4667384n58679q17985j038621j205482j316733j382042j418158j443351
$$ 34667384 34108705 33290720 32252099 31046617 29729884 28347842 26929684 25486333
37032B5486333j471514j506684j539987j551939j520614j431482j282582j082321
$$ 25486333 24014819 22508135 20968148 19416209 17895595 16464113 15181531 14099210
37024A4099210q43020n75695k89307O440K98240N69534Q04482R92553J130050
$$ 14099210 13256190 12680495 12391188 12397628 12695868 13265402 14069884 15062437 16192487
37015A6192487J217664J256535J246033J184692J073615R20421P41083N57681
$$ 16192487 17410151 18666686 19912719 21097411 22171026 23091447 23832530 24390211
37007B4390211L92580K62321J74677J29457J20814J38407J67387J89951J90799
$$ 24390211 24782791 25045112 25219789 25349246 25470060 25608467 25775854 25965805 26156604
36998B6156604J64381J17910O6448K3604m842k1627l6341o3767j19469k10711
$$ 26156604 26320985 26438895 26505343 26528947 26524105 26502478 26466137 26402370 26282901 26072190
36988B6072190l28459m49236n47519o08998o35149o39005o38530o52183o95797
$$ 26072190 25743731 25294495 24746976 24137978 23502829 22863824 22225294 21573111 20877314
36979B0877314p78491q97549j035035j159630j235297j233765j143973r72977
$$ 20877314 20098823 19201274 18166239 17006609 15771312 14537547 13393574 12420597
36971A2420597p39529m67119j81881Q6024L03807M44419M98767M82978M33403
$$ 12420597 11681068 11213949 11032068 11118092 11421899 11866318 12365085 12848063 13281466
36962A3281466L90624L82132M14102M75146N46229O08672O46644O46499N97854
$$ 13281466 13672090 14054222 14468324 14943470 15489699 16098371 16745015 17391514 17989368
36953A7989368M99026L63984K23891J18175P8373J14971K15653L53722M98543
$$ 17989368 18488394 18852378 19076269 19194444 19272817 19387788 19603441 19957163 20455706
36944B0455706O21996P01811P25068O91892O16111N21051M31786L66637L30486
$$ 20455706 21077702 21779513 22504581 23196473 23812584 24333635 24765421 25132058 25462544
36935B5462544L12432K89360K34388J26529m1576k59114m96976p14302q71785
$$ 25462544 25774976 26064336 26298724 26425253 26383677 26124563 25627587 24913285 24041500
36926B4041500r46129r37129q63469p51524o25058n00350l86136k85596j98789
$$ 24041500 23095371 22158242 21294773 20543249 19918191 19417841 19031705 18746109 18547320
36917A8547320j25158o5676k3586k815m515k4213n2259p8005r4832j02136j02606
$$ 18547320 18422162 18356486 18332900 18330085 18325570 18301357 18249098 18171093 18076261 17974125 17871519
36906A7871519r6526p7000l0110N8344J92455L59015N29377O69681P52821P66121
$$ 17871519 17774993 17697993 17667883 17726227 17918682 18277697 18807074 19476755 20229576 20995697
36896B0995697P13870O16754N08126M25529L99010M42014N49652P03207Q76267
$$ 20995697 21709567 22326321 22834447 23259976 23658986 24101000 24650652 25353859 26230126
36887B6230126J039548J164765J228168J213342J113460R33955O94729M28316
$$ 26230126 27269674 28434439 29662607 30875949 31989409 32923364 33618093 34046409
36879C4046409J71698m5271k08282l19036l87752m21916m17674l59797k31636
$$ 34046409 34218107 34172836 33964554 33645518 33257766 32835850 32418176 32058379 31826743
36870C1826743k9230K30084N10095P66704R60088J062357J059265R48402P37684
$$ 31826743 31797513 32027597 32537692 33304396 34264484 35326841 36386106 37334508 38072192
36861C8072192M46739J09474k27786n17055p25557q48758r09689r43247r74696
$$ 38072192 38518931 38628405 38400619 37883564 37158007 36309249 35399560 34456313 33481617
36852C3481617j005919j017126r81066q79823p15540n11997l07750j43226m6132
$$ 33481617 32475698 31458572 30477506 29597683 28882143 28370146 28062396 27919170 27873038
36843B7873038k1653n2462j08375j60457j92639k05243k08671k11510k11716j97654
$$ 27873038 27851385 27798923 27690548 27530091 27337452 27132209 26923538 26712028 26500312 26302658
36833B6302658j57647r0265q241O5651J07657J02444M8619m1619j47413k45647
$$ 26302658 26145011 26054746 26046505 26112156 26219813 26322257 26370876 26329257 26181844 25936197
36823B5936197l16667l48679l40031k98280k36538j69167j08606o3737m0242m2993
$$ 25936197 25619530 25270851 24930820 24632540 24396002 24226835 24118229 24054492 24014250 23971257
36813B3971257p8203j51827k64150m05083n54328o85740p72812p94304p40337
$$ 23971257 23893054 23741227 23477077 23071994 22517666 21831926 21059114 20264810 19524473
36804A9524473o17372m48724k69435j17147k1351O234k4257q6123j48987j91596
$$ 19524473 18907101 18458377 18188942 18071795 18050444 18056678 18032421 17946298 17797311 17605715
36794A7605715k07496k02798j89920j80838j81776j91225k02939k12790k24882
$$ 17605715 17398219 17195421 17005501 16824663 16642887 16451662 16248723 16035933 15811051
36785A5811051k51931l08626m01631n22689o49591p54118q11398q05486p31108
$$ 15811051 15559120 15250494 14848863 14326174 13676583 12922465 12111067 11305581 10574473
36776A0574473n94682m15433k23123m9282Q5245J78816K47530L14429L95787M92359
$$ 10574473 9979791 9564358 9341235 9291953 9377198 9556014 9803544 10117973 10513760 11006119
36766A1006119N90485O72210P27427P58905P76232P84202P76198P38003O57630
$$ 11006119 11596604 12268814 12996241 13755146 14531378 15315580 16091778 16829781 17487411
36757A7487411N32329L68473J76860l1852k49561m71184o93174r09538j106697
$$ 17487411 18019740 18388213 18565073 18533221 18283660 17812476 17119302 16209764 15103067
36748A5103067j260969j342461j325301j199181r75310o83348l62064n0034K19571
$$ 15103067 13842098 12499637 11174336 9975155 8999845 8316497 7954433 7904399 8123970
36739H123970M21435N41381N80603N55889M92015M09919L20195K27082J37430
$$ 8123970 8545405 9086786 9667389 10223278 10715293 11125212 11445407 11672489 11809919
36730A1809919O4153K0616J2380L4185P3004J12921J39270J42625J22584Q9088
$$ 11809919 11874072 11894688 11907068 11941253 12014257 12127178 12266448 12409073 12531657 12620745
36720A2620745O0116N6611R5716J82968L06584M38811N45502N98062N80115M87476
$$ 12620745 12680861 12737472 12833188 13016156 13322740 13761551 14307053 14905115 15485230 15972706
36710A5972706L26082J11701j30386l69819n80134p47263q70918r56857j005882
$$ 15972706 16298788 16410489 16280103 15910284 15330150 14582887 13711969 12755112 11749230
36701A1749230j009524r57404q50333p07370n60581m42245l73759l60778l92771
$$ 11749230 10739706 9782302 8931969 8224599 7664018 7221773 6848014 6487236 6094465
36692F094465m44297m78711m56439l47600j45008J28613M24338O82648Q55437
$$ 6094465 5650168 5171457 4715018 4367418 4222410 4351023 4775361 5458009 6313446
36683F313446R24259R05420Q39206P69004P21546O98194O80137O41945N64235
$$ 6313446 7237705 8143125 8982331 9751335 10472881 11171075 11851212 12493157 13057392
36674A3057392M39931K74588Q4218j08104k77447m03732m77199m99653m80916
$$ 13057392 13497323 13771911 13856129 13748025 13470578 13066846 12589647 12089994 11609078
36665A1609078m32527l62245k72648j64871m5005P1514J60952J97577J62570N2343
$$ 11609078 11176551 10814306 10541658 10376787 10331782 10403296 10564248 10761825 10924395 10976738
36655A0976738j16536l08294m76068n75452n78332m80768l01231p1060J76385
$$ 10976738 10860202 10551908 10075840 9500388 8922056 8441288 8140057 8068997 8245382
36646H245382M11886O11237P54807Q28704Q26576P50345O10496M26472K24436
$$ 8245382 8657268 9268505 10023312 10852016 11678592 12428937 13039433 13465905 13690341
36637A3690341K9692j42782k91484m21986n37449o35248p11432p66811q07962
$$ 13690341 13720033 13577251 13285767 12863781 12326332 11691084 10979652 10212841 9404879
36628I404879q42217q70477q83349q64205p98120o80426n18455l26384j19408
$$ 9404879 8562662 7692185 6808836 5944631 5146511 4466085 3947630 3621246 3501838
36619C501838Q7751K79623M40733N58880O26860O40304N95296M91606L41472J75834
$$ 3501838 3589589 3869212 4309945 4868825 5495685 6135989 6731285 7222891 7564363 7740197
36609G740197L8744l0263j4826P1844J96624L23788M28210M99202N37296N48490
$$ 7740197 7778941 7748678 7733852 7805696 8002320 8326108 8754318 9253520 9790816 10339306
36599A0339306N39095N13222M73836M25376L73726L21989K66055J95714J01905
$$ 10339306 10878401 11391623 11865459 12290835 12664561 12986550 13252605 13448319 13550224
36590A3550224j5250j43613k62761l51335l94038l85769l32166k47591j52500
$$ 13550224 13534974 13391361 13128600 12777265 12383227 11997458 11665292 11417701 11265201
36581A1265201p1156k8148m1871j16521k38095l78910n08785o05925o61465o77156
$$ 11265201 11194045 11165897 11124026 11007505 10769410 10390500 9881715 9275790 8614325 7937169
36571G937169o59353o12861n37635m31191k96587j50010j9456O7607R9515Q7144
$$ 7937169 7277816 6664955 6127320 5696129 5399542 5249532 5230076 5297683 5397198 5484342
36561E484342N7461L8708M6308P6926J13520J37832J40959J23763Q8944L5886
$$ 5484342 5541803 5580511 5626819 5703745 5817265 5955097 6096056 6219819 6308763 6344649
36551F344649l3973j07163j57161j57522r9322J858J14368K06542K58740K65910
$$ 6344649 6310676 6203513 6046352 5888830 5789508 5791366 5905734 6112276 6371016 6636926
36541F636926K33267J70526Q8199l698r5579j78043k42806k85544l09368l25372
$$ 6636926 6870193 7040719 7128918 7125220 7029641 6851598 6608792 6323248 6013880 5688508
36531E688508l47863l86198m38203m88843n14294m89915m00403k48852n9090J32373
$$ 5688508 5340645 4954447 4516244 4027401 3513107 3023192 2622789 2373937 2314847 2447220
36521B447220K91584M00154M58370M78858M78156M73059M81832N24435O16436
$$ 2447220 2738804 3138958 3597328 4076186 4554342 5027401 5509233 6033668 6650104
36512F650104P58316R28656J088576J195578J216885J134256R42217O47344K71363
$$ 6650104 7408420 8337076 9425652 10621230 11838115 12972371 13914588 14561932 14833295
36503A4833295j47573n61584r25779j209050j397443j491016j497854j428100
$$ 14833295 14685722 14124138 13198359 11989309 10591866 9100850 7602996 6174896
36495F174896j290497j093565q50118n79892l06446n0995J70738L46761M66396
$$ 6174896 4884399 3790834 2940716 2360824 2054378 2003383 2174121 2520882 2987278
36486B987278N21677N11847M46548L44523K28171J16623K0708n7971j24006j83792
$$ 2987278 3508955 4020802 4467350 4811873 5040044 5156667 5177375 5119404 4995398 4811606
36476D811606k42399l02256l62740m20136m68042m98122n00962m67430l91624
$$ 4811606 4569207 4266951 3904211 3484075 3016033 2517911 2016949 1549519 1157895
36467A157895k75594j33763O890J14751J68910J73958J62184J77461K49374L75578
$$ 1157895 882301 748538 755428 870179 1039089 1213047 1375231 1552692 1802066 2177644
36457B177644N24173O51619P21742P15700O33141M88522L04058J00416j09798
$$ 2177644 2701817 3353436 4075178 4790878 5424019 5912541 6216599 6317015 6207217
36448F207217l20310n22449o97621q17689q53131p84538o13307l67448r7403J39933
$$ 6207217 5886907 5364458 4666837 3849148 2996017 2211479 1598172 1230724 1133321 1273254
36438A273254L02980L81566L98837L98674M25019N02296O25493P63835Q74579
$$ 1273254 1576234 1957800 2356637 2755311 3180330 3682626 4308119 5071954 5946533
36429E946533R18508Q71090P28673N10689K55910J0296j90644l35764m39512n29445
$$ 5946533 6865041 7736131 8464804 8975493 9231403 9241699 9051055 8715291 8275779 7746334
36419G746334o27967p39437q48622r28100r48471q87652p38847n15601k50418
$$ 7746334 7118367 6378930 5530308 4602208 3653737 2766085 2027238 1511637 1261219
36410A261219J3958K35631L81055M28270L69485K14215j0346k65299n11272p19799
$$ 1261219 1275177 1510808 1891863 2320133 2689618 2903833 2893487 2628188 2116916 1397117
36400A397117q79172r91598j063265j094025j074654r93965q49593o52757m22999
$$ 1397117 517945 -473653 -1536918 -2630943 -3705597 -4699562 -5549155 -6201912 -6624911
36391f624911j77945P2781L24964N72459Q02755R99382J148373J243533J288120
$$ -6624911 -6802856 -6730075 -6405111 -5832652 -5029897 -4030515 -2882142 -1638609 -350489
36382c50489J293453J275013J246296J212538J168111J099420R91307Q33546O25275
$$ -350489 942964 2217977 3464273 4676811 5844922 6944342 7935649 8769195 9394470
36373I394470L76158J02963j78116m59174p41734j027790j304929j536710j669419
$$ 9394470 9770628 9873591 9695475 9236301 8494567 7466777 6161848 4625138 2955719
36364B955719j656223j485300j192044q45526n18519k61067r0808J710M2193O2591
$$ 2955719 1299496 -185804 -1377848 -2223374 -2741893 -3002960 -3093768 -3092058 -3049865 -2987274
36354b987274R2778J53770K54044L89927N49050P14801Q70605J003333J105035
$$ -2987274 -2894496 -2740726 -2486682 -2096755 -1547705 -832904 37701 1041034 2146069
36345B146069J172404J204522J200626J159797J083265R77618Q55423P31146O14449
$$ 2146069 3318473 4522995 5723621 6883418 7966683 8944301 9799724 10530870 11145319
36336A1145319N06206M00674K92061J80253P1630k4927j03525j64115k11044k48576
$$ 11145319 11651525 12052199 12344260 12524513 12596143 12571216 12467691 12303576 12092532 11843956
36326A1843956k76523k88307k72411k17734j21925J926J26847K23435K74116K80522
$$ 11843956 11567433 11279126 11006715 10788981 10667056 10668982 10795829 11019264 11293380 11573902
36316A1573902K60765K41039K46430K92739L80894M97282O20772P31929Q18640
$$ 11573902 11834667 12075706 12322136 12614875 12995769 13493051 14113823 14845752 15664392
36307A5664392Q76919R09129R21155R18295R01009Q63185P94524O85776N33900
$$ 15664392 16541311 17450440 18371595 19289890 20190899 21054084 21848608 22534384 23068284
36298B3068284L44678J31996q4638k82468m38427n35160n69011n53273n11367
$$ 23068284 23412962 23544958 23460320 23177852 22739425 22204265 21635254 21081981 20570614
36289B0570614m64152m21838l85926l56459l36435l30633l41977l69524m09466
$$ 20570614 20106462 19684624 19298698 18942239 18605804 18275171 17933194 17563670 17154204
36280A7154204m57887n12562n72016o33029o89480p33714p59005p61539p42019
$$ 17154204 16696317 16183755 15611739 14978710 14289230 13555516 12796511 12034972 11292953
36271A1292953p06954o68660o43159o46676o91191p79053q98075j020965j111631
$$ 11292953 10585999 9917339 9274180 8627504 7936313 7157260 6259185 5238220 4126589
36262D126589j136466j075645r29994p20738m81371k44590l1234J52104L06770
$$ 4126589 2990123 1914478 984484 263746 -217625 -462215 -493449 -341345 -34575
36253c4575M33213N26320N76855N76684N24067M26483L00185J67316N1841k4783
$$ -34575 398638 924958 1501813 2078497 2602564 3029047 3329232 3496548 3548389 3523606
36243C523606m7411j0122Q1343K07678L37344M35101M76745M60998M08478L47598
$$ 3523606 3476195 3466073 3547416 3755094 4092438 4527539 5004284 5465282 5873760 6221358
36233F221358K98408K65852K44060K24666K02517J77581J54944J43495J52127
$$ 6221358 6519766 6785618 7029678 7254344 7456861 7634442 7789386 7932881 8085008
36224H085008J83548K28784K66308K67690K08075P7372j12881l31219n36837o93401
$$ 8085008 8268556 8497340 8763648 9031338 9239413 9316785 9203904 8872685 8335848 7642447
36214G642447p77614p78754o93708n24736k81984J3112L27329O18980Q45295R74121
$$ 7642447 6864833 6086079 5392371 4867635 4585651 4598763 4926092 5545072 6390367 7364488
36204G364488R96387R31488Q20337P09946O38680O27628O77430P69355Q72273
$$ 7364488 8360875 9292363 10112700 10822646 11461326 12088954 12766384 13535739 14408012
36195A4408012R55388J000339J004616R74879R17044Q30968P11840N55368L63532
$$ 14408012 15363400 16363739 17368355 18343234 19260278 20091246 20803086 21358454 21721986
36186B1721986J48921o4301k44633l62112l97965l50668k36469q4932O9057J95241
$$ 21721986 21870907 21806606 21561973 21199861 20801896 20451228 20214759 20129827 20198884 20394125
36176B0394125K76998L15116L23155L15891K97762K59394J84524O1736j07402
$$ 20394125 20671123 20986239 21309394 21625285 21923047 22182441 22366965 22428701 22321299
36167B2321299l07660n14478o99132q33351q94339q70657p66911o03885m12141
$$ 22321299 22013639 21499161 20800029 19966678 19072339 18201682 17434771 16830886 16418745
36158A6418745k21672n4050P8544J70308K21152K39307K41069K43828K57269K80316
$$ 16418745 16197073 16143023 16221567 16391875 16613027 16852334 17093403 17337231 17594500 17874816
36148A7874816L04539L18750L11966K76070K08092J09178j9704j80180l73470
$$ 17874816 18179355 18498105 18810071 19086141 19294233 19403411 19383707 19203527 18830057
36139A8830057n94883q31004j060649j258056j398168j464155j453550j378167
$$ 18830057 18235174 17404170 16343521 15085465 13687297 12223142 10769592 9391425
36131I391425j257941j114123r65777q28509p13150o25052n65196n31395n16742
$$ 9391425 8133484 7019361 6053584 5225075 4511925 3886873 3321677 2790282 2273540
36122B273540n06578m79162m12909k96110j31781O5455K76398M82279O66007Q12647
$$ 2273540 1766962 1287800 874891 578781 447000 512455 788853 1271132 1937139 2749786
36112B749786R11809R60926R66010R38290Q88590Q23316P44585O53366N51876
$$ 2749786 3661595 4622521 5588531 6526821 7415411 8238727 8983312 9636678 10188554
36103A0188554M42877L28053K09503R4481j991o1723p3768m3573N624M0425L0524
$$ 10188554 10631431 10959484 11168987 11263468 11261477 11199754 11125986 11082413 11088037 11128462 11158986
36092A1158986l8414j58287l01777m33439n22856n53864n26845m54061l50451
$$ 11158986 11120572 10962285 10660508 10227069 9704213 9150349 8623504 8169443 7818992
36083G818992k24861p7373R5039K88633M86349O59519P76857Q15581P69307O49167
$$ 7818992 7594131 7516758 7611797 7900430 8386779 9046298 9823155 10638736 11408043 12057210
36073A2057210M77634K78125O6364j51287l72289n90406p91928r57505j066985
$$ 12057210 12534844 12812969 12879333 12728046 12355757 11765351 10973423 10015918 8948933
36064H948933j104533j063445r51015p91892o25961m97938m40622m59702n29535
$$ 8948933 7844400 6780955 5829940 5038048 4412087 3914149 3473527 3013825 2484290
36055B484290o03758o35307n94868m79703l11996j30103K4480J21764J54276J37856
$$ 2484290 1880532 1245225 650357 170654 -141342 -271445 -246965 -125201 29075 166931
36045A66931J00791O8313N2604N3356O5646Q7943J25028J84759K71168L78105
$$ 166931 267722 336035 388639 441995 507641 595584 720612 905371 1176539 1554644
36035A554644M87475N73807O13142N92088N13158L94733K65849J57373R2298P8534
$$ 1554644 2042119 2615926 3229068 3821156 4334314 4729047 4994896 5152269 5244567 5323101
36025E323101J07096J56359K00487K18347J99738J48152Q1186K8373K3394Q9067
$$ 5323101 5430197 5586556 5787043 6005390 6205128 6353280 6434466 6462839 6486233 6575300
36015F575300K21219L83950N23290N91490N65160M47616K60810L7776j81226l54352
$$ 6575300 6796519 7180469 7703759 8295249 8860409 9308025 9568835 9606611 9425385 9071033
36005I071033m48880m51721l71815k33161o4989J04301K48672L45508L79464L48088
$$ 9071033 8622153 8170432 7798617 7565456 7500467 7604768 7853440 8198948 8578412 8926500
35995H926500K64868J55724M9289l3844q6018j09076j07056q2304l7613J9834
$$ 8926500 9191368 9347092 9396381 9362537 9276519 9167443 9060387 8978083 8940470 8960304
35985H960304P8300J25789J54930J65077J61202J50371J36796J18216Q7423L9271
$$ 8960304 9038604 9164393 9319323 9484400 9645602 9795973 9932769 10050985 10138408 10177679
35975A0177679k2367q4280j30472j49234j35212q7609r443R0599J97735K95812
$$ 10177679 10155312 10071032 9940560 9791326 9656114 9568505 9559062 9649661 9847396 10143208
35965A0143208L74453M31105M64812M68072M26737L30467J84764J2883j55559
$$ 10143208 10517661 10948766 11413578 11881650 12308387 12638854 12823618 12836501 12680942
35956A2680942l00834m22085n32890o47650p69539q88409r88260j056394j087403
$$ 12680942 12380108 11958023 11425133 10777483 10007944 9119535 8131275 7074881 5987478
35947E987478j082038j045386r86164r14973q40250p64632o85456n98987n04033
$$ 5987478 4905440 3860054 2873890 1958917 1118667 354035 -331421 -930408 -1434441
35938a434441m01485k90959j69122l3147J12461K51477L59073M11902L99261L28712
$$ -1434441 -1835926 -2126885 -2296007 -2329154 -2216693 -1965216 -1606143 -1194241 -794980 -466268
35928d66268K23108J10882J5120n1929q6042q4025m0990M4447J63049K95162M19336
$$ -466268 -243160 -132278 -117158 -169087 -255129 -339154 -380144 -335697 -172648 122514 541850
35917E41850N20393N88929O14842N84574M86582L19755R7294j55171m03329o07599
$$ 541850 1062243 1651172 2266014 2850588 3337170 3656925 3754219 3599048 3195719 2588120
35907B588120p28463p35869o20531m01372j23734J52665L71360M93973N06045
$$ 2588120 1859657 1123788 503257 101885 -21849 130816 502176 996149 1502194
35898A502194M14559K42588K4390k00824l98521n49061o52245p22819p79381q32958
$$ 1502194 1916753 2159341 2183731 1982907 1584386 1035325 383080 -339739 -1119120 -1952078
35888a952078q81314r11515r08428q63515p79149o67444n45261m27698l22946
$$ -1952078 -2833392 -3744907 -4653335 -5516850 -6295999 -6963443 -7508704 -7936402 -8259348
35879h259348k31472j49517p2816L133Q4450J77325K83027L94232M96257N71905
$$ -8259348 -8490820 -8640337 -8713153 -8710020 -8625570 -8448245 -8165218 -7770986 -7274729 -6702824
35869f702824O07033N95713N44223M71408M03880L67862L81195M47428N53294
$$ -6702824 -6095791 -5500078 -4955855 -4484447 -4080567 -3712705 -3331510 -2884082 -2330788
35860b330788O71466P68383Q12839P80635O56120M35195J30832k24140n82179
$$ -2330788 -1659322 -890939 -78100 702535 1358655 1793850 1924682 1700542 1118363
35851A118363q93396j119274j242223j267976j219997j127169j009896q71845
$$ 1118363 224967 -894307 -2136530 -3404506 -4624503 -5751672 -6761568 -7633413
35843g633413p02132m85999k16455J00172M46281P98768J134376J433095J679658
$$ -7633413 -8335545 -8821544 -9037999 -8937827 -8491546 -7692778 -6558402 -5125307 -3445649
35834c445649J862801J972658J999272J935333J782272J554155J274811R69406
$$ -3445649 -1582848 389810 2389082 4324415 6106687 7660842 8935653 9905059
35826I905059O56707L47528M9328k28244m72429o71659q20250r18373r67274r64232
$$ 9905059 10561766 10909294 10958622 10730378 10257949 9586290 8766040 7847667 6880393 5916161
35816E916161r01510p70466n69287l10830k5082K47919M71914O25421P02316P04353
$$ 5916161 5014651 4244185 3674898 3364068 3338986 3586905 4058819 4684240 5386556 6090909
35806F090909O35154N01654L19625J15398q0060k41251l55600m24150m56773m66415
$$ 6090909 6726063 7227717 7547342 7662740 7582680 7341429 6985829 6561679 6104906 5638491
35796E638491m65251m62119m59932m54227m35609l96071l35544k64123j98290
$$ 5638491 5173240 4711121 4251189 3796962 3361353 2965282 2629738 2365615 2167325
35787B167325j53149j35127j40082j58312j82482k11553k47528k88390l23530
$$ 2167325 2014176 1879049 1738967 1580655 1398173 1186620 939092 650702 327172
35778C27172l35277l06199k29077j14282J1428J16524J80460K02862K00218J93877
$$ 327172 -8105 -314304 -543381 -657663 -646235 -529711 -349251 -146389 53829 247706
35768B47706J98753K19469K53657K96938L44254L87089M11371M00936L45939K50080
$$ 247706 446459 665928 919585 1216523 1560777 1947866 2359237 2760173 3106112 3356192
35758C356192J31211J5496p0903j09047r1890k5565P3456J84637K90288L79622
$$ 3356192 3487403 3502899 3431996 3322949 3231059 3205494 3278950 3463587 3753875 4133497
35748D133497M48159M93971N14714N08110M73973M13232L23868K00041L9548j45705
$$ 4133497 4581656 5075627 5590341 6098451 6572424 6985656 7309524 7509565 7549113 7403408
35738G403408l28041m75655n67864o01019n83597n29959m59009l93258l51363
$$ 7403408 7075367 6599712 6031848 5430829 4847232 4317273 3858264 3465006 3113643
35729C113643l36938l34616l19460k73470j96523j04450j7337N2537J04971J46963
$$ 3113643 2776705 2442089 2122629 1849159 1652636 1548186 1530849 1583386 1688357 1835320
35719A835320J84277K16833K40250K49385K39486K05841J45966O4396k5132j04307
$$ 1835320 2019597 2236430 2476680 2726065 2965551 3171392 3317358 3381754 3356622 3252315
35709C252315j59438j88635k02272k16783k45728k93437l55150m22829m90983
$$ 3252315 3092877 2904242 2701970 2485187 2239459 1946022 1590872 1168043 677060
35700F77060n56981o16173o57721o66473o30559n49600m37992l20892k24675j66683
$$ 677060 120079 -496094 -1153815 -1820288 -2450847 -3000447 -3438439 -3759331 -3984006 -4150689
35690d150689j49368j61580j85585k05389k11631k01314j74628j32486p5984o133
$$ -4150689 -4300057 -4461637 -4647222 -4852611 -5064242 -5265556 -5440184 -5572670 -5648654 -5654787
35680e654787P7277J75854K89819M14011N37328O47633P38881Q14498Q84021R55041
$$ -5654787 -5577510 -5401656 -5111837 -4697826 -4160498 -3512865 -2773984 -1959486 -1075465 -120424
35670a20424J026402J087668J124867J127015J087570J001005Q60409O61071M07781
$$ -120424 905978 1993646 3118513 4245528 5333098 6334103 7194512 7855583 8263364
35661H263364J18629j79360m59905p05037r05679j057077j154488j192312j165385
$$ 8263364 8381993 8202633 7742728 7037691 6132012 5074935 3920447 2728135 1562750
35652A562750j070370r07235o81355m04776r5080K26967N38436Q14880J034019
$$ 1562750 492380 -414855 -1096210 -1500986 -1596066 -1369099 -830663 -15783 1018236
35643A018236J182570J260534J277929J246262J172237J058681R10434P38860
$$ 1018236 2200806 3461340 4739269 5985531 7157768 8216449 9126883 9865743
35635I865743N60319L89290K31542Q3099o3989k13367l59458m88799n86667o45213
$$ 9865743 10426062 10815352 11046894 11129993 11066004 10852637 10493179 10004380 9417713 8772500
35625H772500o67979o67075o54700o36263o11259n80539n52453n42258n65489
$$ 8772500 8104521 7437446 6782746 6146483 5535224 4954685 4402232 3859974 3294485
35616C294485o30176p32154q55259r76063j071118j123939j129204j092709j027147
$$ 3294485 2664309 1932155 1076896 100833 -970285 -2094224 -3223428 -4316137 -5343284
35607e343284r45996q59415p74312o96432o30437n77401n33572m93288m53731
$$ -5343284 -6289280 -7148695 -7923007 -8619439 -9249876 -9827277 -10360849 -10854137 -11307868
35598a1307868m16351l83206l51592l11852k50299j55147k1501J47434L42596
$$ -11307868 -11724219 -12107425 -12459017 -12770869 -13021168 -13176315 -13197816 -13050382 -12707786
35589a2707786N51713P59728R47804J094053J178064J187414J122687R98817Q43008
$$ -12707786 -12156073 -11396345 -10448541 -9354488 -8176424 -6989010 -5866323 -4867506 -4024498
35580d024498O89759N73068N16796N26490N86785O66528P30214P51354P21825
$$ -4024498 -3334739 -2761671 -2244875 -1718385 -1131600 -465072 265142 1016496 1738321
35571A738321O52606N66049M85087M25475L92681L81504L77755L63562L25420
$$ 1738321 2390927 2956976 3442063 3867538 4260219 4641723 5019478 5383040 5708460
35562E708460K59834J72085P0140m0034j54081k65685l64205m36630m74028m78891
$$ 5708460 5968294 6140379 6210519 6170485 6016404 5750719 5386514 4949884 4475856 3996965
35552C996965m67309m61627m76077n04661n20748m91046l96646k47465p9152O6275
$$ 3996965 3529656 3068029 2591952 2087291 1566543 1075497 678851 431386 352234 418509
35542D18509J61845K03806K03475J72954J16605L2115q2287k19976l62318m82415
$$ 418509 580354 784160 987635 1160589 1277194 1309309 1227022 1007046 644728 162313
35532A62313n55144n67542n23199m39324l39744k48000j83025j58127j81602k55610
$$ 162313 -392831 -960373 -1483572 -1922896 -2262640 -2510640 -2693665 -2851792 -3033394 -3289004
35522c289004l72052n09592o37704p27545p61903p36806o55731n23965l48226
$$ -3289004 -3661056 -4170648 -4808352 -5535897 -6297800 -7034606 -7690337 -8214302 -8562528
35513h562528j39637Q4758L03786M95890O44051P41685P96684Q28449Q57228Q92900
$$ -8562528 -8702165 -8617407 -8313621 -7817731 -7173680 -6431995 -5635311 -4806862 -3949634 -3056734
35503c056734R31816R62455R73015R55288R05563Q24911P18505N92953M54065
$$ -3056734 -2124918 -1162463 -189448 765840 1671403 2496314 3214819 3807772 4261837
35494D261837L08214J65901M2246m8358j00195j20590j26986j38081j64512k04984
$$ 4261837 4570051 4735952 4778198 4729840 4629645 4509055 4382069 4243988 4079476 3874492
35484C874492k50010k89981l21894l51025l87128m37594n01726n70186o29666
$$ 3874492 3624482 3334501 3012607 2661582 2274454 1836860 1335134 764948 135282
35475A35282o67803o73700o35938n44697m00049k19887l8402J06826J91318K12729
$$ 135282 -532521 -1206221 -1842159 -2386856 -2786905 -3006792 -3045194 -2938368 -2747050 -2534321
35465b534321J86811J34730P2326Q672m8206q7003r5795o9375j4734M9949J02605
$$ -2534321 -2347510 -2212780 -2140454 -2131782 -2179988 -2266991 -2362786 -2432161 -2446895 -2396946 -2294341
35454b294341J26501J15335P1029k174j00283k16779l40409m59178n67180o65217
$$ -2294341 -2167840 -2052505 -1981476 -1983650 -2083933 -2300712 -2641121 -3100299 -3667479 -4332696
35444d332696p52360q16327q32670p74449o25309l87769q3933K49773N71600Q45878
$$ -4332696 -5085056 -5901383 -6734053 -7508502 -8133811 -8521580 -8605513 -8355740 -7784140 -6938262
35434f938262J054103J200484J307314J401288J498233J594563J668863J691340
$$ -6938262 -5884159 -4683675 -3376361 -1975073 -476840 1117723 2786586 4477926
35426D477926J636554J494292J273899R99911P02024M05857J29340j15512l19161
$$ 4477926 6114480 7608772 8882671 9882582 10584606 10990463 11119803 11004291 10685130
35417A0685130m72920n69922o07126n86231n13757m02210k72304j51730o6781
$$ 10685130 10212210 9642288 9035162 8448931 7935174 7532964 7260660 7108930 7042149
35408G042149l0681l8405p3053j18489j68715k29543l14010m33742n88701p60639
$$ 7042149 7011468 6973063 6900010 6781521 6612806 6383263 6069253 5635511 5046810 4286171
35398D286171r16589j022007j054808j011476r04823p59127o06123m79678m06282
$$ 4286171 3369582 2347575 1292767 281291 -623532 -1382659 -1988782 -2468460 -2874742
35389b874742l93931m26442m68379m79085m28682l09050j36793N1219K08334K92218
$$ -2874742 -3268673 -3695115 -4163494 -4642579 -5071261 -5380311 -5517104 -5465885 -5257551 -4965333
35379d965333K77731J62962l3040k77072n28836p47941r01810r71912r53862q51624
$$ -4965333 -4687602 -4524640 -4557680 -4834752 -5363588 -6111529 -7013339 -7985251 -8939113 -9790737
35369i790737o72323m27063j35608J72024M60529O97860Q62240R44714R47269
$$ -9790737 -10463060 -10890123 -11025731 -10853707 -10393178 -9695318 -8833078 -7888364 -6941095
35360f941095Q77667P43655N50069L00717L064l28204o70687r95835j271377j464941
$$ -6941095 -6063428 -5319773 -4769704 -4468987 -4465923 -4794127 -5464814 -6460649 -7732026 -9196967
35350i196967j549242j507222j335270j044559o61891k29642J97869N63687Q21471
$$ -9196967 -10746209 -12253431 -13588701 -14633260 -15295151 -15524793 -15326924 -14763237 -13941766
35341a3941766R47778R47748Q50630O95881N16358L28590J36522n5306k31174
$$ -13941766 -12993988 -12046240 -11195610 -10499729 -9983371 -9654781 -9518259 -9573565 -9804739
35332i804739l65842m36679m35599l71738k64911j36219j546J30339K55898L73092
$$ -9804739 -10170581 -10607260 -11042859 -11414597 -11679508 -11815727 -11817273 -11686934 -11431036 -11057944
35322a1057944M78686N69265O45063P12128P79502Q53606R35008J019608J101357
$$ -11057944 -10579258 -10009993 -9364930 -8652802 -7873300 -7019694 -6084686 -5065078 -3963721
35313c963721J172973J224580J243021J214137J127709R82057P84843N49088K88062
$$ -3963721 -2790748 -1566168 -323147 890990 2018699 3000756 3785599 4334687 4622749
35304D622749J4154k57405n05072p03330q30615q77407q49151p63005o40889n02729
$$ 4622749 4636903 4379498 3874426 3171096 2340481 1463074 613923 -149082 -789971 -1292700
35294a292700l63023k31515j15937k3592M0021P4307Q5354Q3966Q0517Q0524Q4611
$$ -1292700 -1655723 -1887238 -2003175 -2026767 -1986746 -1912439 -1827085 -1743119 -1662602 -1582078 -1497467
35283a497467R1914J01863J11648J13045R4473M8316k2934j07317j89989k60276
$$ -1497467 -1405553 -1303690 -1192042 -1078997 -984524 -936208 -959142 -1066459 -1256448 -1516724
35273a516724l15069l57571l92915m22953m43182m44168m17556l63255k92418
$$ -1516724 -1831793 -2189364 -2582279 -3005232 -3448414 -3892582 -4310138 -4673393 -4965811
35264d965811k22850j68984j33602j07260p5139k5669M4430J30251K22455L11703
$$ -4965811 -5188661 -5357645 -5491247 -5598507 -5673646 -5699315 -5654885 -5524634 -5302179 -4990476
35254d990476L90803M53442M91995M98188M66838L98838L00334J79719M6233q8776
$$ -4990476 -4599673 -4146231 -3654236 -3156048 -2689210 -2290372 -1990038 -1810319 -1764086 -1852862
35244a852862k10660l03846l58439l77457l78453l85937m18078m76915n48501
$$ -1852862 -2063522 -2367368 -2725807 -3103264 -3481717 -3867654 -4285732 -4762647 -5311148
35235e311148o11229o45349o38550n87085m94559l70017k25920p5553P0127K04301
$$ -5311148 -5922377 -6567726 -7206276 -7793361 -8287920 -8657937 -8883857 -8959410 -8889283 -8684982
$$ [...]
##END NTUPLES=NMR SPECTRUM
##END=
