##TITLE=31Pdec_DE-58_Ac6_R
 
 24 sc
 3.6.2024
##JCAMPDX= 6.0         $$ Bruker NMR JCAMP-DX V2.0
##DATA TYPE= NMR SPECTRUM
##DATA CLASS= NTUPLES
##ORIGIN= UXNMR, Bruker Analytische Messtechnik GmbH
##OWNER= root
$$ XWIN-NMR		Version 3.5
$$ Mon Jun  3 16:21:45 2024 Russian Standard Time (UT+4h)  she@DPX200
##.OBSERVE FREQUENCY= 81.013821
##.OBSERVE NUCLEUS= ^31P
##.ACQUISITION MODE= SIMULTANEOUS
##.ACQUISITION SCHEME= undefined
##.AVERAGES= 24
##.DIGITISER RES= 16
##SPECTROMETER/DATA SYSTEM= spect
##.PULSE SEQUENCE= zgpg30
##.SOLVENT NAME= CDCl3
##.SHIFT REFERENCE= (INTERNAL, CDCl3, 0, 248.564)
##AUDIT TRAIL= $$ (NUMBER, WHEN, WHO, WHERE, WHAT)
$$ ##TITLE= Audit trail, XWIN-NMR		Version 3.5
$$ ##JCAMPDX= 5.01
$$ ##ORIGIN= Bruker BioSpin GmbH
$$ ##OWNER= she
$$ F:/spectra/data/she/nmr/P31/1/pdata/1/auditp.txt
$$ ##AUDIT TRAIL=  $$ (NUMBER, WHEN, WHO, WHERE, WHAT)
(   1,<2024-06-03 16:20:43.35 +0400>,<she>,<DPX200>,
      <created by zg, POWCHK disabled, PULCHK disabled
       configuration hash MD5:
       00 E9 B6 7A A2 85 ED C7 34 08 36 98 17 FE 4E 26
       data hash MD5: 32K
       64 89 B5 D7 F1 CF 85 31 36 BC A4 16 19 BF 8B 2F>)
(   2,<2024-06-03 16:20:49.96 +0400>,<she>,<DPX200>,
      <Start of raw data processing
       efp BC_mod = 2 LB = 10 FT_mod = 6 PKNL = 1 PHC0 = -224.9977 PHC1 = 0 SI = 64K 
       data hash MD5: 64K
       24 5B 96 3D 28 AD 9D 01 A5 10 9C 32 5B 7E 85 D7>)
(   3,<2024-06-03 16:21:05.90 +0400>,<she>,<DPX200>,
      <pk PHC0 = -0.05053421 PHC1 = 0 
       data hash MD5: 64K
       AF 46 31 C3 8E AE 85 FE CE B8 BC 85 30 70 81 02>)
$$ ##END=
$$ 
$$ hash MD5
$$ 1C BB B7 BC 17 7E 1B 30 AB AD 23 D1 92 CA C8 1E
##$RELAX= 
##$RELAX= 
##$RELAX= 
##$RELAX= 
##$RELAX= 
##$RELAX= 
##$RELAX= 
##$RELAX= 
##$RELAX= 
$$ Bruker specific parameters
$$ --------------------------
##$DU= <F:/spectra>
##$EXPNO= 1
##$NAME= <P31>
##$PROCNO= 1
##$TYPE= <nmr>
##$USER= <she>
##$AMP= (0..31)
100 100 100 100 100 100 100 100 100 100 100 100 100 100 100 100 100 100 
100 100 100 100 100 100 100 100 100 100 100 100 100 100 
##$AQSEQ= 0
##$AQ_mod= 1
##$AUNM= <au_zg>
##$AUTOPOS= <>
##$BF1= 81.014009
##$BF2= 200.13
##$BF3= 200.13
##$BF4= 200.13
##$BF5= 200.13
##$BF6= 200.13
##$BF7= 200.13
##$BF8= 200.13
##$BYTORDA= 1
##$CFDGTYP= 0
##$CFRGTYP= 5
##$CHEMSTR= <none>
##$CNST= (0..31)
1 1 145 1 1 1 1 1 1 1 1 1 1 1 1 1 1 1 1 1 1 1 1 1 1 1 1 1 1 1 1 1 
##$CPDPRG= <waltz16>
##$CPDPRG1= <>
##$CPDPRG2= <waltz16>
##$CPDPRG3= <>
##$CPDPRG4= <mlev>
##$CPDPRG5= <mlev>
##$CPDPRG6= <mlev>
##$CPDPRG7= <mlev>
##$CPDPRG8= <mlev>
##$CPDPRGB= <>
##$CPDPRGT= <>
##$D= (0..31)
0 1 0 0 0 0 0 0 0 0 0 0.03 2e-05 3e-06 0 0 0 0 0 0 0 0 0 0 0 0 0 0 0 0 
0 0 
##$DATE= 1717417242
##$DBL= (0..7)
120 120 120 11 120 120 24 19 
##$DBP= (0..7)
150 150 150 150 150 150 150 150 
##$DBP07= 0
##$DBPNAM0= <>
##$DBPNAM1= <>
##$DBPNAM2= <>
##$DBPNAM3= <>
##$DBPNAM4= <>
##$DBPNAM5= <>
##$DBPNAM6= <>
##$DBPNAM7= <>
##$DBPOAL= (0..7)
0.5 0.5 0.5 0.5 0.5 0.5 0.5 0.5 
##$DBPOFFS= (0..7)
$$ [...]
##$SUBNAM2= <"">
##$SUBNAM3= <"">
##$SUBNAM4= <"">
##$SUBNAM5= <"">
##$SUBNAM6= <"">
##$SUBNAM7= <"">
##$SUBNAM8= <"">
##$SUBNAM9= <"">
##$SW= 501.771253377433
##$SWIBOX= (0..15)
0 1 3 0 0 0 0 0 0 0 0 0 0 0 0 0 
##$SW_h= 40650.406504065
##$TD= 32768
##$TD0= 1
##$TE= 0
##$TE2= 300
##$TE3= 300
##$TEG= 300
##$TL= (0..7)
0 120 53 12 22 120 120 120 
##$TP= (0..7)
150 150 150 150 150 150 150 150 
##$TP07= 0
##$TPNAME0= <>
##$TPNAME1= <>
##$TPNAME2= <>
##$TPNAME3= <>
##$TPNAME4= <>
##$TPNAME5= <>
##$TPNAME6= <>
##$TPNAME7= <>
##$TPOAL= (0..7)
0.5 0.5 0.5 0.5 0.5 0.5 0.5 0.5 
##$TPOFFS= (0..7)
0 0 0 0 0 0 0 0 
##$TUNHIN= 0
##$TUNHOUT= 0
##$TUNXOUT= 0
##$USERA1= <user>
##$USERA2= <user>
##$USERA3= <user>
##$USERA4= <user>
##$USERA5= <user>
##$V9= 5
##$VALIST= <valist>
##$VCLIST= <CCCCCCCCCCCCCCC>
##$VD= 0
##$VDLIST= <DDDDDDDDDDDDDDD>
##$VPLIST= <PPPPPPPPPPPPPPP>
##$VTLIST= <TTTTTTTTTTTTTTT>
##$WBST= 1024
##$WBSW= 4
##$XGAIN= (0..3)
0 0 0 0 
##$XL= 0
##$YL= 0
##$YMAX_a= 1514
##$YMIN_a= -1772
##$ZGOPTNS= <>
##$ZL1= 120
##$ZL2= 120
##$ZL3= 120
##$ZL4= 120
##$ABSF1= 0
##$ABSF2= 0
##$ABSG= 0
##$ABSL= 0
##$ALPHA= 0
##$AQORDER= 0
##$ASSFAC= 0
##$ASSFACI= 0
##$ASSFACX= 0
##$ASSWID= 0
##$AUNMP= <proc_1d>
##$AZFE= 0.1
##$AZFW= 0.5
##$BCFW= 0
##$BC_mod= 2
##$BYTORDP= 0
##$COROFFS= 0
##$CY= -3
##$DATMOD= 1
##$DC= 0
##$DFILT= <>
##$DTYPP= 0
##$F1P= 0
##$F2P= 0
##$FCOR= 1
##$FTSIZE= 65536
##$FT_mod= 6
##$GAMMA= 0
##$GB= 0
##$INTBC= 1
##$INTSCL= 6.047779e-11
##$ISEN= 30
##$LB= 10
##$LEV0= 0
##$LPBIN= 0
##$MAXI= 10000
##$MC2= 0
##$MEAN= 0
##$ME_mod= 0
##$MI= 50
##$NCOEF= 0
##$NC_proc= -11
##$NLEV= 6
##$NOISF1= 182.463
##$NOISF2= 159.3651
##$NSP= 0
##$NTH_PI= 0
##$NZP= 0
##$OFFSET= 248.5645
##$PC= 4
##$PHC0= -225.0482
##$PHC1= 0
##$PH_mod= 1
##$PKNL= yes
##$PPARMOD= 0
##$PSCAL= 0
##$PSIGN= 0
##$REVERSE= no
##$SF= 81.0140089999694
##$SI= 65536
##$SIGF1= 159.3651
##$SIGF2= -187.1042
##$SINO= 113.3802
##$SIOLD= 16384
##$SREGLST= <1H.CDCl3>
##$SSB= 0
##$STSI= 65536
##$STSR= 0
##$SW_p= 40650.406504065
##$SYMM= 0
##$S_DEV= 0
##$TDeff= 32768
##$TDoff= 0
##$TI= <>
##$TILT= no
##$TM1= 0
##$TM2= 0
##$TOPLEV= 0
##$USERP1= <user>
##$USERP2= <user>
##$USERP3= <user>
##$USERP4= <user>
##$USERP5= <user>
##$WDW= 1
##$XDIM= 65536
##$YMAX_p= 432375981
##$YMIN_p= -116413692
$$ End of Bruker specific parameters
$$ ---------------------------------
##NTUPLES= NMR SPECTRUM
##VAR_NAME=  FREQUENCY,     SPECTRUM/REAL,   SPECTRUM/IMAG
##SYMBOL=    X,             R,               I
##VAR_TYPE=  INDEPENDENT,   DEPENDENT,       DEPENDENT
##VAR_FORM=  AFFN,          ASDF,            ASDF
##VAR_DIM=   65536,         65536,           65536
##UNITS=     HZ,            ARBITRARY UNITS, ARBITRARY UNITS
##FACTOR=    0.620285442955139, 1,           1
##FIRST=     20137.2065510682, 0,            0
##LAST=      -20513.1999529968, 0,           0
##MIN=       -20513.1999529968, -116413692,  0
##MAX=       20137.2065510682, 432375981,    0
$$ Real data points
##PAGE= N=1
##DATA TABLE= (X++(R..R)), XYDATA
$$ [...]
58303d596791k75363l91167m78585n23089n20514m73204l83072k52199q9846Q5417
58293g898413K54120M06465N42792O63111P57470Q07500P97680P26544O10372
58284b332359M79017L68053L11406L35518M53502O58380R18741J182719J392540
58275C767517J504514J505052J414331J273825J122104R73130Q14056O26393M13299
58266A3414221K08821O1691R398O3585K13284M37056P12500J018479J331791J622557
58256A9093383J852596J979158J963529J782411J439269R70622M40373q0434n40621
58247B8900286r27589j266940j604185j978831k402708k850820l267196l581406
58239A1020611l727387l658031l354682k833185k145550j374294o18833K3320
$$ plain form
58303 -4596791 -4872154 -5263321 -5741906 -6264995 -6785509 -7258713 -7641785 -7893984 -7983830 -7898413
58293 -7898413 -7644293 -7237828 -6695036 -6031925 -5274455 -4466955 -3669275 -2942731 -2332359
58284 -2332359 -1853342 -1485289 -1173883 -838365 -384863 273517 1192258 2374977 3767517
58275 3767517 5272031 6777083 8191414 9465239 10587343 11560473 12374529 13000922 13414221
58266 13414221 13623042 13684733 13694131 13757716 13971000 14408056 15120556 16139035 17470826 19093383
58256 19093383 20945979 22925137 24888666 26671077 28110346 29080968 29521341 29440907 28900286
58247 28900286 27972697 26705757 25101572 23122741 20720033 17869213 14602017 11020611
58239 11020611 7293224 3635193 280511 -2552674 -4698224 -6072518 -6691351 -6668031
58231f668031M76889P06839P27625N96702L93060J92950N6479K6197J26397L55769
58221c009124O81103J044735J385012J654652J825596J885071J833279J683439
58213H983763J457293J176128Q56995N18815J88928j02096l35957n18185o74030
58204A1551654q30354r95014j146167j237889j219324j056852p48119l23857J59723
58195D153801O34619J038837J333302J509253J581306J571528J495752J359235
58187A4677633J160349Q96940N71264J92613k21571o45807j049258j402135j683469
58178A2496559j884517k004385k041613j989896j842385j600705j281041r13175
58170a061158n34486j82999J08824L19491M41627M80863M51995L77107K85773
$$ plain form
58231 -6668031 -6191142 -5484303 -4756678 -4159976 -3766916 -3573966 -3517487 -3491290 -3364893 -3009124
58221 -3009124 -2328021 -1283286 101726 1756378 3581974 5467045 7300324 8983763
58213 8983763 10441056 11617184 12474179 12992994 13181922 13079826 12743869 12225684 11551654
58204 11551654 10721300 9726286 8580119 7342230 6122906 5066054 4317935 3994078 4153801
58195 4153801 4788420 5827257 7160559 8669812 10251118 11822646 13318398 14677633
58187 14677633 15837982 16734922 17306186 17498799 17277228 16631421 15582163 14180028 12496559
58178 12496559 10612042 8607657 6566044 4576148 2733763 1133058 -147983 -1061158
58170 -1061158 -1595644 -1778643 -1669819 -1350328 -908701 -427838 24157 401264 687037
58161F87037K10447J72704J69109J71469J43139N6611j00597l27443o06634q98390
58151c22548j143554j282134j276487j122494q43069m71959m0789M22828Q88124
58142e192082J315419J661428J895069K012739K041413K025720K004413J988227
58134I752346J953288J856228J660720J355720R55914M93178J1721m33658p86223
58125A6819234j005280j082989j048377r56519q69546q37832q87239j014354j188843
58116G928255j362489j485107j522564j465923j324840j113870q47835n49952
58108a744325k58740k0335J29735J80401J46253N8950m5311j38180k06450k50074
58098b148076k73726k81293k78678k79426l03150l63941m56216n48750n92215
$$ plain form
58161 687037 897484 1070188 1239297 1410766 1553905 1610516 1509919 1182476 575842 -322548
58151 -322548 -1466102 -2748236 -4024723 -5147217 -5990286 -6462245 -6503034 -6080206 -5192082
58142 -5192082 -3876663 -2215235 -320166 1692573 3733986 5759706 7764119 9752346
58134 9752346 11705634 13561862 15222582 16578302 17534216 18027394 18039115 17605457 16819234
58125 16819234 15813954 14730965 13682588 12726069 11856523 11018691 10131452 9117098 7928255
58116 7928255 6565766 5080659 3558095 2092172 767332 -346538 -1194373 -1744325
58108 -1744325 -2003065 -2023400 -1893665 -1713264 -1567011 -1508061 -1553372 -1691552 -1898002 -2148076
58098 -2148076 -2421802 -2703095 -2981773 -3261199 -3564349 -3928290 -4384506 -4933256 -5525471
58089e525471n36892l51680l6011L78846Q37835J276425J637261J883516K002922
58080A566751K000670J886882J668845J354175R61809N29668J09383k51206n25800
58071I301177p14289q31621q90901q94381q38512p28164n88276m61973l92969
58062B960091m02528m77657n79468o63889o98024o63576n53598l72822j42478
58053a593949R8474L01798M25790M50920L87715K71185J41541K1293r4447k25632
58043A84688l83984n60637p34677q90530j024886j138948j229185j288666j315476
58034h382301j315515j295584j255762j190327j094323r66281q05056o08791l81553
58025a7295493j41422Q0165K48760L38381L37668K52599J08868m9122j68072k02996
$$ plain form
58089 -5525471 -6062363 -6414043 -6450054 -6071208 -5233373 -3956948 -2319687 -436171 1566751
58080 1566751 3567421 5454303 7123148 8477323 9439132 9968800 10078183 9826977 9301177
58071 9301177 8586888 7755267 6864366 5969985 5131473 4403309 3815033 3353060 2960091
58062 2960091 2557563 2079906 1500438 836549 138525 -525051 -1078649 -1451471 -1593949
58053 -1593949 -1495475 -1193677 -767887 -316967 70748 341933 483474 504767 410320 184688
58043 184688 -199296 -759933 -1494610 -2385140 -3410026 -4548974 -5778159 -7066825 -8382301
58034 -8382301 -9697816 -10993400 -12249162 -13439489 -14533812 -15500093 -16305149 -16913940 -17295493
58025 -17295493 -17436915 -17356750 -17107990 -16769609 -16431941 -16179342 -16070474 -16119596 -16287668 -16490664
58015a6490664j32362L8194K85001N81557R09833J260816J625035J981279K293211
58006g648100K517076K614777K563574K358818K013649J560928J055753N69863
57998G606338J72332r6262k39262k97541l26138l69656m48670n58326o74196p62050
57988D006569p90769p46033o38337m98680l62124k48701j54370n7836O2043K09324
57978G81086L63647M86308N37343M94263L60482J59523p5842l07960m93965n92926
57968A711959n83816m79436l20186j50947r01J19592K09434K67501K90059K72457
57958A335716K11814J10337k1458j64898k98754m07072m83310n28638n47591n43688
57948a337542n13470m38517k83596j1639L87216Q73157J361902J757434J990350
$$ plain form
58015 -16490664 -16623026 -16584832 -16299831 -15718274 -14808441 -13547625 -11922590 -9941311 -7648100
58006 -7648100 -5131024 -2516247 47327 2406145 4419794 5980722 7036475 7606338
57998 7606338 7778670 7682408 7443146 7145605 6819467 6449811 6001141 5442815 4768619 4006569
57988 4006569 3215800 2469767 1831430 1332750 970626 721925 567555 509719 571762 781086
57978 781086 1144733 1631041 2168384 2662647 3023129 3182652 3106810 2798850 2304885 1711959
57968 1711959 1128143 648707 328521 177574 176673 296265 505699 773200 1063259 1335716
57958 1335716 1547530 1657867 1636409 1471511 1172757 765685 282375 -246263 -793854 -1337542
57948 -1337542 -1851012 -2289529 -2573125 -2584764 -2197548 -1324391 37511 1794945 3785295
57939C785295K038976J926701J704820J433609J167857R45641P77956O43291M97131
57930A4921277K99067M2522k36342m78829o36720o93874o66427n88725m96868
57921A1465081m17518l65764l51454l87584m92354o82431r62354j316139j704402
57912D785081k068847k344645k476553k431165k200726j800746j265417o42408
57904a0445426J2708O41562J187725J602924J854461J929998J836965J598777
57896B19694J251282Q39095M09851O930l37046o05050p97537r27888j010288j047405
57886a998362j028025r36497p65466n23927k39214M6663K88455M55847N48064
57877d152462N92594O26767O74837P35853P87763Q01665P55996O44894M81026
$$ plain form
57939 3785295 5824271 7750972 9455792 10889401 12057258 13002899 13780855 14424146 14921277
57930 14921277 15220344 15262866 15026524 14547695 13910975 13217101 12550674 11961949 11465081
57921 11465081 11047563 10681799 10330345 9942761 9450407 8767976 7805622 6489483 4785081
57912 4785081 2716234 371589 -2104964 -4536129 -6736855 -8537601 -9803018 -10445426
57904 -10445426 -10432718 -9791156 -8603431 -7000507 -5146046 -3216048 -1379083 219694
57896 219694 1470976 2310071 2719922 2726852 2389806 1784756 987219 59331 -950957 -1998362
57886 -1998362 -3026387 -3962884 -4728350 -5252277 -5491491 -5444828 -5156373 -4700526 -4152462
57877 -4152462 -3559868 -2933101 -2258264 -1522411 -734648 67017 823013 1467907 1948933
57868A948933K94103J23067J217n8487o5925m1350k97M9388R7994J24698R8748
57857B572089j0658k22953n37307r27872j346109j731776k028450k196362k217824
57848h647222k095443j845416j489578j051694n61910o5947L71396O77656P97687
57839a3910471P19390M84016J72320j27957l55702m91875n48865n43320m73502
57830a5075966l18976o3430K77293O45851R63639J169035J247793J235265J190249
57821h729247J159146J153734J154496J133125J075428R88196Q88174P85664O77254
57812B85970N51998M03894K40857Q4594l8553j11671j38181j40656j45725j64853
57802H27674j85465j78185j13518K2009K15126M23172N85014O47532N95390M61651
$$ plain form
57868 1948933 2243036 2366103 2367320 2308833 2242908 2201558 2201261 2250649 2348643 2473341 2572089
57857 2572089 2561431 2338478 1801171 873299 -472810 -2204586 -4233036 -6429398 -8647222
57848 -8647222 -10742665 -12588081 -14077659 -15129353 -15691263 -15757210 -15385814 -14708158 -13910471
57839 -13910471 -13191081 -12707065 -12534745 -12662702 -13018404 -13510279 -14059144 -14602464 -15075966
57830 -15075966 -15394942 -15458372 -15181079 -14535228 -13571589 -12402554 -11154761 -9919496 -8729247
57821 -8729247 -7570101 -6416367 -5261871 -4128746 -3053318 -2065122 -1176948 -391284 285970
57812 285970 837968 1241862 1482719 1567313 1528760 1417089 1278908 1138252 992527 827674
57802 827674 642209 464024 350506 372515 587641 1010813 1595827 2243359 2838749 3300400
57792C300400L08409J92236J41849J61097K45401L91128N90162Q18921J034891
57783G184494J185205J222403J119405Q77426N24103J03706l34673p45299j090298
57774A0046472j344692j503439j584681j622286j648995j680629j710927j717569
57766b766746j672865j553635j348775j064186p23035l59131m444L23772O27900
57757h541145R21317J209639J475503J681173J790518J794985J723359J627034
57749C682383J551212J511567J489800J447010J343519J154074Q74614N22203
57741A3576382J29998k62021o18585r18765j160329j358148j536750j716790j899085
57732D235907k056727k145476k129185k001487j786240j519540j233262r53955
$$ plain form
57792 3300400 3608809 3801045 3942894 4103991 4349392 4740520 5330682 6149603 7184494
57783 7184494 8369699 9592102 10711507 11588933 12113036 12216742 11882069 11136770 10046472
57774 10046472 8701780 7198341 5613660 3991374 2342379 661750 -1049177 -2766746
57766 -2766746 -4439611 -5993246 -7342021 -8406207 -9129242 -9488373 -9492817 -9169045 -8541145
57757 -8541145 -7619828 -6410189 -4934686 -3253513 -1462995 331990 2055349 3682383
57749 3682383 5233595 6745162 8234962 9681972 11025491 12179565 13054179 13576382
57741 13576382 13706380 13444359 12825774 11907009 10746680 9388532 7851782 6134992 4235907
57732 4235907 2179180 33704 -2095481 -4096968 -5883208 -7402748 -8636010 -9589965
57724i589965p09254n24944m10951l52243l16206k67973j78315k4050K05448M91662
57714a1676791P76476R75530J011955Q48923N03342L9218m52062q78706j176784
57705a0028899j329087j363790j333223j286435j251870j235836j230053j219008
57697b0278201j184706j112173r95991q42345o62116m59774k29485L4559L19226
57688b5411006N80811P55396P91710O87798N04215L39524K81092L61998N48517
57679b0559945P60019R05451R17550P72833M94147J39219k18602n11818o97543
57670a7998689p66924p39873o48123n18456l66517k00881l0066J33058K71317
57661b0865154L69167M23457M50894M82395N45569O49453P84093R32602J082556
$$ plain form
57724 -9589965 -10299219 -10824163 -11235114 -11587357 -11903563 -12171536 -12349851 -12373901 -12168453 -11676791
57714 -11676791 -10900315 -9924785 -8912830 -8063907 -7560565 -7521347 -7973409 -8852115 -10028899
57705 -10028899 -11357986 -12721776 -14054999 -15341434 -16593304 -17829140 -19059193 -20278201
57697 -20278201 -21462907 -22575080 -23571071 -24413416 -25075532 -25535306 -25764791 -25730232 -25411006
57688 -25411006 -24830195 -24074799 -23283089 -22595291 -22091076 -21751552 -21470460 -21108462 -20559945
57679 -20559945 -19799926 -18894475 -17976925 -17204092 -16709945 -16570726 -16789328 -17301146 -17998689
57670 -17998689 -18765613 -19505486 -20153609 -20672065 -21038582 -21239463 -21269529 -21136471 -20865154
57661 -20865154 -20495987 -20072530 -19621636 -19139241 -18593672 -17944219 -17160126 -16227524 -15144968
57652a5144968J227396J359404J461897J507172J462382J301289J016675O27709
57644e181044J79248k67373o50292r25206j077598j122333j091639j020285r36245
57635a2092767q57383p89144p21233o27848m76779k45960O1371M12533P55489
57626a4581721J037923J224896J306217J292235J205025J072449R25169P90611
57618e727196O82468N94173N05773M01904K87276J87611J35469J50020K21932
57609b560570L12210L67854L47878K45092R0119o4527j70036k01759j64650q4024
57599a882413Q930Q5800J20588Q7553l3331k42711n10071p75599r68292j031012
57589e140558r38460p00078l51246N8091M72108Q36255J104843J247518J252900
$$ plain form
57652 -15144968 -13917572 -12558168 -11096271 -9589099 -8126717 -6825428 -5808753 -5181044
57644 -5181044 -5001796 -5269169 -5919461 -6844667 -7922265 -9044598 -10136237 -11156522 -12092767
57635 -12092767 -12950150 -13739294 -14460527 -15088375 -15565154 -15811114 -15749743 -15337210 -14581721
57626 -14581721 -13543798 -12318902 -11012685 -9720450 -8515425 -7442976 -6517807 -5727196
57618 -5727196 -5044728 -4450555 -3944782 -3542878 -3255602 -3067991 -2932522 -2782502 -2560570
57609 -2560570 -2248360 -1880506 -1532628 -1287536 -1197417 -1261944 -1431980 -1633739 -1798389 -1882413
57599 -1882413 -1873483 -1787683 -1667095 -1579542 -1612873 -1855584 -2365655 -3141254 -4109546 -5140558
57589 -5140558 -6079018 -6779096 -7130342 -7072251 -6600143 -5763888 -4659045 -3411527 -2158627
57580b158627J130278R09665O36395L57929J08273r9762k70140m12133n29964
57571c28086o18865o69744o81677o75171o94321p90283r92468j285930j612019
57562h348564j893659k068009k104396k000241j768624j434770j041266o45677
57554b1305206l01067l1327J77737L63930N61907P81400J001461J182383J288128
57545a6280654J305352J246516J136352R93946Q23906O19566L71438P4019k69511
57536i979070o42050j008114j316480j513970j564342j459246j214286q57493
57528a9555051m23552M2937M85846Q48407J093486J218419J252907J241726J223473
57519a2571402J216226J215675J205454J173796J125672J081063J060338J069180
$$ plain form
57580 -2158627 -1028349 -118684 517711 875640 983913 884151 614011 201878 -328086
57571 -328086 -946951 -1616695 -2298372 -2973543 -3667864 -4458147 -5450615 -6736545 -8348564
57562 -8348564 -10242223 -12310232 -14414628 -16414869 -18183493 -19618263 -20659529 -21305206
57554 -21305206 -21606273 -21637600 -21459863 -21095933 -20534026 -19752626 -18751165 -17568782 -16280654
57545 -16280654 -14975302 -13728786 -12592434 -11598488 -10774582 -10155016 -9783578 -9709559 -9979070
57536 -9979070 -10621120 -11629234 -12945714 -14459684 -16024026 -17483272 -18697558 -19555051
57528 -19555051 -19978603 -19935666 -19449820 -18601413 -17507927 -16289508 -15036601 -13794875 -12571402
57519 -12571402 -11355176 -10139501 -8934047 -7760251 -6634579 -5553516 -4493178 -3423998
57511c423998J096248J124834J147451J170977J208667J264672J321138J336632
57503F246621J259392J050187P03328K55392k21758o40121r19894j011120r05925
57494E816102o38594k75232J03473M22572O30997P11465O80046N78629M63644
57485H493102L90290L92512M66693N70838O43424O32853N21820L34092J21597
57476A2567221n9376j69006j93734j47355o8216j1095l0357j59787m01257p26958
57466A0600080j088018j422787j667531j773924j727364j553929j310637j065472
57458a009582q78178p88822q14218r46940j153423j375852j547034j617198j575587
57449a1706834j449589j283280j113638r58715q17619o75851n12943l11492o5288
$$ plain form
57511 -3423998 -2327750 -1202916 -55465 1115512 2324179 3588851 4909989 6246621
57503 6246621 7506013 8556200 9259528 9514920 9293162 8653041 7733147 6722027 5816102
57494 5816102 5177508 4902276 5005749 5428321 6059318 6770783 7450829 8029458 8493102
57485 8493102 8883392 9275904 9742597 10313435 10956859 11589712 12111532 12445624 12567221
57476 12567221 12507845 12338839 12145105 11997750 11929534 11918439 11888082 11728295 11327038 10600080
57466 10600080 9512062 8089275 6421744 4647820 2920456 1366527 55890 -1009582
57458 -1009582 -1887760 -2676582 -3490800 -4437740 -5591163 -6967015 -8514049 -10131247 -11706834
57449 -11706834 -13156423 -14439703 -15553341 -16512056 -17329675 -18005526 -18518469 -18829961 -18895249
57440a8895249K15841N06175P71978R87298J148291J271916J377104J465425J519322
57431i631899J516365J442786J295693J079199Q03704M89263J68117j16957l18851
57422c272580l97237l33347j42211J25990L98771O03413O89117O41554M85646
57413a200884K75112P1316p9779j60208j75913j42656p5526J1676J03049J81308
57403a192505K32695K51388K42427K24176K26257K76650L82600N21674O53414
57394A818776P41580P66790P22187O03848M10062J49226j55395m71390p68299
57385C817385j024098j223906j356858j417340j409528j348660j255814j149447
57377f368266j039294r25173q00573o59911n05997l51500k11276r1608J2820J11118
$$ plain form
57440 -18895249 -18679408 -18173233 -17401255 -16413957 -15265666 -13993750 -12616646 -11151221 -9631899
57431 -9631899 -8115534 -6672748 -5377055 -4297856 -3494152 -3004889 -2836772 -2953729 -3272580
57422 -3272580 -3669817 -4003164 -4145375 -4019385 -3620614 -3017201 -2328084 -1686530 -1200884
57413 -1200884 -925772 -854456 -934235 -1094443 -1270356 -1413012 -1488538 -1476862 -1373813 -1192505
57403 -1192505 -959810 -708422 -465995 -241819 -15562 261088 643688 1165362 1818776
57394 1818776 2560356 3327146 4049333 4653181 5063243 5212469 5057074 4585684 3817385
57385 3817385 2793287 1569381 212523 -1204817 -2614345 -3963005 -5218819 -6368266
57377 -6368266 -7407560 -8332733 -9133306 -9793217 -10299214 -10650714 -10861990 -10953598 -10940778 -10829660
57367a0829660K06895K98806L90972N01257O56303Q73949J145339J430174J670277
57358c655688J815130J846206J787380J695250J632571J637041J701701J778067
57350A0237658J799469J710131J484946J134943P02534K51053j50880m49063o20549
57341A6100242o77938o57946o01752n39360m84336m36376l86225l21912k38064
57332A1756333j45879p5392o3606j32893k73174m39773n67884n94775m79128k12367
57322H771462J77790O31182J068216J411853J610783J651444J552670J349126
57314A8224526J075500P58645M17283O6641k74614n80231q21362r81098j069405
57305A6815885j126530j210102j371356j631556j969468k326226k626183k804417
$$ plain form
57367 -10829660 -10622765 -10323959 -9932987 -9431730 -8775427 -7901478 -6756139 -5325965 -3655688
57358 -3655688 -1840558 5648 1793028 3488278 5120849 6757890 8459591 10237658
57350 10237658 12037127 13747258 15232204 16367147 17069681 17320734 17169854 16720791 16100242
57341 16100242 15422304 14764358 14162606 13623246 13138910 12702534 12316309 11994397 11756333
57332 11756333 11610454 11535062 11471456 11338563 11065389 10625616 10057732 9462957 8983829 8771462
57322 8771462 8949252 9580434 10648650 12060503 13671286 15322730 16875400 18224526
57314 18224526 19300026 20058671 20475954 20542595 20267981 19687750 18866388 17885290 16815885
57305 16815885 15689355 14479253 13107897 11476341 9506873 7180647 4554464 1750047
57297A750047k828440k705150k471241k172937j846199j508437j164960q23009
57289a3770326n01713k31095m1310N0817M9378k3936j40625k73377l95530m78275
57279a5755992m95909m38183l17229j61419k999J29750K14931K40271K07800J33885
57269a6245094M2456m2111r6569r7322k2967J36548L68863O34367Q74209J031224
57259a3416396J074094J009896Q77154P26439O03411N42429N66878O88506R03766
57250f423823J190634J509322J807802K031762K137412K102746J932373J654944
57242G943172J317430R79287P03899N43666N22338O25082Q03097R89040J114218
57233A5541229J122744R82489O91842K78947k07357p11020j181770j584462j901807
$$ plain form
57297 1750047 -1078393 -3783543 -6254784 -8427721 -10273920 -11782357 -12947317 -13770326
57289 -13770326 -14272039 -14503134 -14544444 -14493627 -14444249 -14468185 -14608810 -14882187 -15277717 -15755992
57279 -15755992 -16251901 -16690084 -17007313 -17168732 -17171731 -17041981 -16827050 -16586779 -16378979 -16245094
57269 -16245094 -16202638 -16244749 -16341318 -16438640 -16461607 -16325059 -15956196 -15321829 -14447620 -13416396
57259 -13416396 -12342302 -11332406 -10455252 -9728813 -9125402 -8582973 -8016095 -7327589 -6423823
57250 -6423823 -5233189 -3723867 -1916065 115697 2253109 4355855 6288228 7943172
57242 7943172 9260602 10239889 10943788 11487454 12009792 12634874 13437971 14427011 15541229
57233 15541229 16663973 17646462 18338304 18617251 18409894 17698874 16517104 14932642 13030835
57224A3030835k128523k260395k287521k198330j990712j680408j301027q97823
57216a713904n19679k10881k302R6488R9574L6852o3340j91394l59466n84871
57206c412923q64564j160281j405705j530888j489404j275465r25436n04964q7786
57197a2657416K65961N25267O93902Q05105R07601J048577J258796J540940J861168
57188c750099K149387K316830K290112K045459J622509J109678O10479K08123
57180H602478n7061j90789k31162k28416k29428k70951l77062n54185p82628j010651
57170D670145j159684j145191r07869m40993K00744R15770J586251K111520K433200
57161H263893K545955K491869K340249K159763J994588J854981J723889J571836
$$ plain form
57224 13030835 10902312 8641917 6354396 4156066 2165354 484946 -816081 -1713904
57216 -1713904 -2233583 -2444464 -2446766 -2350278 -2250704 -2213852 -2277192 -2468586 -2828052 -3412923
57206 -3412923 -4277487 -5437768 -6843473 -8374361 -9863765 -11139230 -12064666 -12569630 -12657416
57197 -12657416 -12391455 -11866188 -11172286 -10367181 -9459580 -8411003 -7152207 -5611267 -3750099
57188 -3750099 -1600712 716118 3006230 5051689 6674198 7783876 8394355 8602478
57180 8602478 8545417 8354628 8123466 7895050 7665622 7394671 7017609 6463424 5680796 4670145
57170 4670145 3510461 2365270 1457401 1016408 1217152 2132922 3719173 5830693 8263893
57161 8263893 10809848 13301717 15641966 17801729 19796317 21651298 23375187 24947023
57153B4947023J371094J106589P83554M28196P7434k36400m93007o80491p92284
57144B6511708q33360q26378q02925p83354p65134p30290o60892n47449l89829
57135B0172097j99775o315J44585K02549J33348o3964l53776o77280r74351j200341
57125A7176777j330520j357345j289697j154949r96652q63048p90913p94314q64972
57116G734367r82297j123695j266111j379827j425823j365411j177675q72146
57108a858618m89149q9897K59250N05122O24081O28962N62109M76953M15687L92172
57098A426672L88196L66635K94988J64679n494j81189l28679m24639m56496m17903
57088H26770l05711j21314J25818M16232P22045J011460J255017J431467J529963
$$ plain form
57153 24947023 26318117 27424706 28208260 28636456 28713890 28477490 27984483 27303992 26511708
57144 26511708 25678348 24851970 24049045 23265691 22500557 21770267 21109375 20561926 20172097
57135 20172097 19972322 19966007 20110592 20313141 20446489 20382525 20028749 19351469 18377118 17176777
57125 17176777 15846257 14488912 13199215 12044266 11047614 10184566 9393653 8599339 7734367
57116 7734367 6752070 5628375 4362264 2982437 1556614 191203 -986472 -1858618
57108 -1858618 -2347767 -2437664 -2178414 -1673292 -1049211 -420249 141860 618813 1034500 1426672
57098 1426672 1814868 2181503 2476491 2641170 2635676 2454487 2125808 1701169 1244673 826770
57088 826770 521059 399745 525563 941795 1663840 2675300 3930317 5361784 6891747
57079F891747J547304J483631J341494J128456Q59656N58919K60366R050j46086
57070A3934537j70210o3084J32657L43236M89940N16357M04601J75559j23056
57061A5640537m31649o89713q43691q57200p24017m75656j74147J09932L23632
57052A1878028M49046N04877N32135N69510O29303O87832O97762O13791M12701
57043A6974985R6876l11612p73777j233786j627500j902672k037567k043139j948456
57034E193352j781135j553538j259475q83305m18986J12410O61497J168709J586455
57025B825984J886200K047001K041337J837094J419154Q15197J04691n98823j183821
57016A1194014j575624j753266j744317j605606j401191j184600r87560q16535
$$ plain form
57079 6891747 8439051 9922682 11264176 12392632 13252288 13811207 14071573 14080623 13934537
57070 13934537 13764327 13701243 13833900 14177136 14667076 15183433 15588034 15763593 15640537
57061 15640537 15208888 14519175 13675484 12818284 12094267 11618611 11444464 11554396 11878028
57052 11878028 12327074 12831951 13364086 13933596 14562899 15250731 15948493 16562284 16974985
57043 16974985 17071861 16760249 15986472 14752686 13125186 11222514 9184947 7141808 5193352
57034 5193352 3412217 1858679 599204 -284101 -703087 -590677 70820 1239529 2825984
57025 2825984 4712184 6759185 8800522 10637616 12056770 12871967 12976658 12377835 11194014
57016 11194014 9618390 7865124 6120807 4515201 3114010 1929410 941850 125315
57008A25315o58185m91360k98875p4302J74631M22917O28898P45239P38673O06207
56998A919158L77589J05902j45068l13357l52647k45054n082L29052P10873J097688
56988C479054J453696J745642J937385J991213J880038J604944J203919P40971
56980A6036862K80763j32380m75642p32378q78774q87613p46388m73445j18578
56971A1872427K51971N76161Q12413R46706R90723R73512R29458Q85374Q51278
56962A9090023Q21059P84699P42620P07617O91085O88353O80509O52780O12291
56953B5471036N89657O23508P37651R22661J132096J298494J362700J299467J124533
56944C4561803Q81769O19830L69006J27305j36350m60675q64431j331884j820345
$$ plain form
57008 125315 -532870 -1024230 -1323105 -1397407 -1222776 -799859 -170961 574278 1312951 1919158
56998 1919158 2296747 2402649 2257581 1944224 1591577 1346523 1341441 1670493 2381366 3479054
56988 3479054 4932750 6678392 8615777 10606990 12487028 14091972 15295891 16036862
56980 16036862 16317625 16185245 15709603 14977225 14098451 13210838 12464450 11991005 11872427
56971 11872427 12124398 12700559 13512972 14459678 15450401 16423913 17353371 18238745 19090023
56962 19090023 19911082 20695781 21438401 22146018 22837103 23525456 24205965 24858745 25471036
56953 25471036 26060693 26684201 27421852 28344513 29476609 30775103 32137803 33437270 34561803
56944 34561803 35443572 36063402 36432408 36559713 36423363 35962688 35098257 33766373 31946028
56935C1946028k280683k674178k976706l173129l250126l195072l004768k699763
56927H691603k331174j967673j666049j445623j285438j143285r78580p64455
56919b890674m90414j65259J76910M75944O60327O77439N24933K61253j7423k23174
56909a010138l16741l18848k91964l09032m24811o56783r79019j330895j636943
56900g275174j828878j862990j731133j463499j120331p74817m95469l33726l14994
56891a7201011m31588o42594q85053j090972j200229j167872r72654o28804j91368
56882b4412145K56447O33149Q90072J023977J063959J045571R94504R29901Q75740
56873a6698825Q61715R09823J020104J168911J320607J443931J524011J564096
$$ plain form
56935 31946028 29665345 26991167 24014461 20841332 17591206 14396134 11391366 8691603
56927 8691603 6360429 4392756 2726707 1281084 -4354 -1147639 -2126219 -2890674
56919 -2890674 -3381088 -3546347 -3369437 -2893493 -2233166 -1555727 -1030794 -769541 -786964 -1010138
56909 -1010138 -1326879 -1645727 -1937691 -2246723 -2671534 -3328317 -4307336 -5638231 -7275174
56900 -7275174 -9104052 -10967042 -12698175 -14161674 -15282005 -16056822 -16552291 -16886017 -17201011
56891 -17201011 -17632599 -18275193 -19160246 -20251218 -21451447 -22619319 -23591973 -24220777 -24412145
56882 -24412145 -24155698 -23522549 -22632477 -21608500 -20544541 -19498970 -18504466 -17574565 -16698825
56873 -16698825 -15837110 -14927287 -13907183 -12738272 -11417665 -9973734 -8449723 -6885627
56865f885627J576061J566420J529124J450771J322648J149380R49287P48791
56857C406855N75633M54854M08296M53343N94824Q11451J049272J234193J300054
56848A0288775J213624R80891O35892K25796j97587n81875q81624j071124j154305
56839I458463j161466j131570j090501j039221r58511q25985o34348m00673j63365
56830B052823K9786J36694J35351L4501j24539k79122l66984l49014k24703l6444
56820A008349J40665K26770J76423P455k02145l49876l54640j88047J19096M91668
56810A075718Q38484J083715J188867J156071J013999P97280N31725K32147q8693
56801G829313m09310o98195r24859j072851j141436j134973j053276q95529o75292
$$ plain form
56865 -6885627 -5309566 -3743146 -2214022 -763251 559397 1708777 2658064 3406855
56857 3406855 3982488 4437342 4845638 5298981 5893805 6705256 7754528 8988721 10288775
56848 10288775 11502399 12483290 13119182 13344978 13147391 12565516 11683892 10612768 9458463
56839 9458463 8296997 7165427 6074926 5035705 4077194 3251209 2616861 2216188 2052823
56830 2052823 2082609 2219303 2354654 2389155 2264616 1985494 1618510 1269496 1044793 1008349
56820 1008349 1149014 1375784 1552207 1559662 1357517 1007641 653001 464954 584050 1075718
56810 1075718 1914202 2997917 4186784 5342855 6356854 7154134 7685859 7918006 7829313
56801 7829313 7420003 6721808 5796949 4724098 3582662 2447689 1394413 498884 -176408
56792a76408m31124k19778r3957p9476j66780l19095m87303o21484o78730o32508
56782c906643m82925k59176q177K24870M11938N47626O48024P47664Q92943J126933
56772e6923J466323J881839K297870K618067K765083K709699K470572K088198
56764A8240728J596465J014554L62381l17537r53288j460611j774384j875234
56756A4833074j795331j600477j358742j112331q67035o04407l08588J1205L20117
56747G517485N80004P75697R22419J048652J170126J275419J331312J301155J164471
56738A7086740R28517O27277L09048J9660k10272l70739m71967n39113o00203
56729A6778948o70132p41402p91494q03118p80835p50329p41982p72658q37768
$$ plain form
56792 -176408 -607532 -827310 -921267 -1000743 -1167523 -1486618 -1973921 -2595405 -3274135 -3906643
56782 -3906643 -4389568 -4648744 -4656921 -4432051 -4020113 -3472487 -2824463 -2076799 -1183856 -56923
56772 -56923 1409400 3291239 5589109 8207176 10972259 13681958 16152530 18240728
56764 18240728 19837193 20851747 21214128 20896591 19943303 18482692 16708308 14833074
56756 14833074 13037743 11437266 10078524 8966193 8099158 7494751 7186163 7197368 7517485
56747 7517485 8097489 8873186 9795605 10844257 12014383 13289802 14621114 15922269 17086740
56738 17086740 18015257 18642534 18951582 18971242 18760970 18390231 17918264 17379151 16778948
56729 16778948 16108816 15367414 14575920 13772802 12991967 12241638 11499656 10726998 9889230
56720I889230r15389r76599r96415r63386q86173p92324p14718o69808o42854
56711B331564n94370m85662l04141o9754J78028L98096N58584O41970O51263O16573
56701C922151N92522O39493P95008J052657J363884J662777J897632K049100K125797
56692A6101021K144857K113739K026062J872678J658068J408120J162012R53810
56684B9440367P96845O79232N68688M21797J97378j25821n34502r81130j401676
56675B9061178j738746j955228k035298j980514j807787j547932j240239r23072
56667A5832362o25860l67324j58703n712R4393J56254K02390K50556L01526L37295
56657A6017177L31081K62933J33600l0112j84753k93169l45895l62144l68642
$$ plain form
56720 9889230 8973841 7997242 7000827 6037441 5151268 4358944 3644226 2974418 2331564
56711 2331564 1737194 1251532 947391 877637 1055665 1453761 2012345 2654315 3305578 3922151
56701 3922151 4514673 5154166 5949174 7001831 8365715 10028492 11926124 13975224 16101021
56692 16101021 18245878 20359617 22385679 24258357 25916425 27324545 28486557 29440367
56684 29440367 30237212 30916444 31485132 31906929 32104307 31978486 31443984 30462854 29061178
56675 29061178 27322432 25367204 23331906 21351392 19543605 17995673 16755434 15832362
56667 15832362 15206502 14839178 14680475 14674763 14769156 14925410 15127800 15378356 15679882 16017177
56657 16017177 16348258 16611191 16744791 16714679 16529926 16236757 15890862 15528718 15160076
56648A5160076l76161l74148l42961k67098j38398M7002K89409N82161R07594
56639A5487476J235537J526042J737368J837009J809481J655801J386792J017597
56631B7693103N67600O3013m63232r75624j440817j829846k118527k288380k327924
56622A6879366k232104k000234j636969j159390o06090l9145M67324Q49634J077483
56613A1599875J164059J155800J107798J062319J044527J072624J166649J344976
56605B0718627J612214J949454K313154K642102K869196K934057K793205K428376
56597D0260385J856502J139383L81163k97377q01403j097645j220257j243963
56589C8976788j242427j256598j287940j313924j310004j262843j170832j039185
$$ plain form
56648 15160076 14783915 14409767 14066806 13799708 13661310 13708312 13997721 14579882 15487476
56639 15487476 16723013 18249055 19986423 21823432 23632913 25288714 26675506 27693103
56631 27693103 28260703 28323716 27860484 26884860 25444043 23614197 21495670 19207290 16879366
56622 16879366 14647262 12647028 11010059 9850669 9244579 9205434 9672758 10522392 11599875
56613 11599875 12763934 13919734 15027532 16089851 17134378 18207002 19373651 20718627
56605 20718627 22330841 24280295 26593449 29235551 32104747 35038804 37832009 40260385
56597 40260385 42116887 43256270 43637433 43340056 42538653 41441008 40220751 38976788
56589 38976788 37734361 36477763 35189823 33875899 32565895 31303052 30132220 29093035
56581B9093035q78133p06357n54518m61524m60910n64277p54792r96790j252503
56572B2463231j490971j685869j813069j856322j814416j697441j512258j252021
56564I340864r03232m67157K2065M99422Q92379J150287J260741J245347J142728
56555A4183444R92055Q25036O66901N42020M77067M95052O01875P77450R83048
56546B0543948J181697J355506J507066J647143J780240J896994J975052J985976
56538C3873622J904647J717585J427247J050932O14392J43232l41494q18494j256993
56529C8314676j616050j859483j976101j986574j930137j842612j741778j625578
56521B3736363j479083j285395j037185p43245m24782j04612J99595M71061O85288
$$ plain form
56581 29093035 28214902 27508545 26954027 26492503 26031593 25467316 24712524 23715734 22463231
56572 22463231 20972260 19286391 17473322 15617000 13802584 12105143 10592885 9340864
56564 9340864 8437632 7970475 7992540 8491962 9384341 10534628 11795369 13040716 14183444
56555 14183444 15175499 16000535 16667436 17209456 17686523 18181575 18783450 19560900 20543948
56546 20543948 21725645 23081151 24588217 26235360 28015600 29912594 31887646 33873622
56538 33873622 35778269 37495854 38923101 39974033 40588425 40731657 40390163 39571669 38314676
56529 38314676 36698626 34839143 32863042 30876468 28946331 27103719 25361941 23736363
56521 23736363 22257280 20971885 19934700 19191455 18766673 18662061 18861656 19332717 20018005
56512B0018005Q10138Q18355P02132M77072J74927j64449m94471p61517r12880
56503B0667312r13372p59269m79784j28189K29837N29693P26825Q16480Q39196
56494B1528729Q62935R51956J142484J435606J802913K196869K563050K852947
56486C5337489L032560L083418K999531K786863K465647K069043J634003J189913
56478E4598467P54779L41564l4016l54562o10592q07185r58245j072324j143642
56469E0714244j157598j107094j007029q95596q20172q16414q94137j038384j222554
56460D1755266j423259j628436j835168k037494k210396k304027k260374k046359
56452B6009753j679299j224473p68090l85701j22033J5094N0283K8380j951l907
$$ plain form
56512 20018005 20828143 21646498 22348630 22825702 23000629 22836180 22341709 21580192 20667312
56503 20667312 19753940 18994671 18514887 18386698 18616535 19146228 19873053 20689533 21528729
56494 21528729 22391664 23343620 24486104 25921710 27724623 29921492 32484542 35337489
56486 35337489 38370049 41453467 44452998 47239861 49705508 51774551 53408554 54598467
56478 54598467 55353246 55694810 55660794 55306232 54695640 53888455 52930210 51857886 50714244
56469 50714244 49556646 48449552 47442523 46546927 45726755 44910341 44016204 42977820 41755266
56460 41755266 40332007 38703571 36868403 34830909 32620513 30316486 28056112 26009753
56452 26009753 24330454 23105981 22337891 21952190 21830157 21845251 21895534 21923914 21921963 21918056
56442B1918056L6478J06697J74364K04041J75983R4090k1395j48150k71532l85964
56432B1882668m90631n82867o52674o83218o59172n77325m51094l06741j76248
56423A7302698r1423p9383j58669l36610o07077r45804j305200j618287j819305
56414A0340940j873170j792988j630838j448189j287566j162939j069486r99616
56406i23852r51239r23877r10574q97357q73152q39843q10621p97569q00942q07988
56396i537014p97297p42391o16825m05421j16947K14076N42188Q34398J087177
56387i538056J326033J586741J888222K213703K512433K719872K782231K671489
56379H162668K386708J946354J381161P36000P9751m91205q71680r86187q23442
$$ plain form
56442 21918056 21954534 22061231 22235595 22439636 22615619 22709709 22688314 22540164 22268632 21882668
56432 21882668 21392037 20809170 20156496 19473278 18814106 18236781 17785687 17478946 17302698
56423 17302698 17211275 17131892 16973223 16636613 16029536 15083732 13778532 12160245 10340940
56414 10340940 8467770 6674782 5043944 3595755 2308189 1145250 75764 -923852
56406 -923852 -1875091 -2798968 -3709542 -4606899 -5480051 -6319894 -7130515 -7928084 -8729026 -9537014
56396 -9537014 -10334311 -11076702 -11693527 -12098948 -12215895 -12001819 -11459631 -10625233 -9538056
56387 -9538056 -8212023 -6625282 -4737060 -2523357 -10924 2708948 5491179 8162668
56379 8162668 10549376 12495730 13876891 14612891 14692642 14201437 13329757 12343570 11520128
56370A1520128m42804M9709N37769R23637J141803J161162R83673O43915K06405
56361A6725397k46166o34444r03973j035395j041011r53673q13869o57612n08417
56352I930837l77268k70027j95692j68747k04222l08825m73027o68414q52279
56343F412336r77622j004499r09479o91422l71809J1694M15913Q01540J137208
56334D823860J399533J572805J649672J631159J524845J342928J102743Q28458
56326A5876003N48690K87149N2435j61972l64220n47812o87623p51910p19573
56317A3531167n89514l78329j12531J77324M59071P01985Q83966J000060J064693
56308A6737892J102742J133380J157375J157013J109751J006808Q63033P10094
$$ plain form
56370 11520128 11077324 11127033 11664802 12588439 13730242 14891404 15875077 16518992 16725397
56361 16725397 16479231 15844787 14940814 13905419 12864408 11910735 11096866 10439254 9930837
56352 9930837 9553569 9283542 9087850 8919103 8714881 8406056 7933029 7264615 6412336
56343 6412336 5434714 4430215 3520736 2829314 2457505 2469199 2885112 3686652 4823860
56334 4823860 6223393 7796198 9445870 11077029 12601874 13944802 15047545 15876003
56326 15876003 16424693 16711842 16764277 16602305 16238085 15690273 15002650 14250740 13531167
56317 13531167 12941653 12563324 12450793 12628117 13087188 13789173 14673139 15673199 16737892
56308 16737892 17840634 18974014 20131389 21288402 22398153 23404961 24267994 24978088
56300B4978088N79361M89945M49608M60486N17666O01508O75688O97686O35823
56291C0085859M82495K58124N122k26262l94439m77225m73392l98401k78490j43649
56281B8439742k0025P4668J30390J42030J09065L6863o4935j88471l34457n13972
56271B7810898p41968j024912j350456j685991j985100k196021k271627k185413
56263A4369410j949675j619841j274593r84259p91330p12149p47498q87320j107941
56254D294804j369116j616970j795411j864305j814656j667737j456366j204171
56246h493928r20280o09253k81508M5603L51823O15196Q10548R11598R00265P79383
56236e890553N79996L54733J56461J3774p9129j50082k25043l12134m02690m81549
$$ plain form
56300 24978088 25557449 26047394 26497002 26957488 27475154 28076662 28752350 29450036 30085859
56291 30085859 30568354 30826478 30831600 30605338 30210899 29733674 29260282 28861881 28583391 28439742
56281 28439742 28419717 28494385 28624775 28766805 28875870 28912733 28847798 28659327 28324870 27810898
56271 27810898 27068930 26044018 24693562 23007571 21022471 18826450 16554823 14369410
56263 14369410 12419735 10799894 9525301 8541042 7749712 7037563 6290065 5402745 4294804
56254 4294804 2925688 1308718 -486693 -2350998 -4165654 -5833391 -7289757 -8493928
56246 -8493928 -9414208 -10023461 -10304969 -10259366 -9907543 -9292347 -8481799 -7570201 -6669936 -5890553
56236 -5890553 -5310557 -4955824 -4799363 -4785589 -4864718 -5014800 -5239843 -5551977 -5954667 -6436216
56226f436216n34551n50069n19046m35928k98588j06533J39803M37396P79200
56217g524532J154921J551438J949717K320007K620273K800039K807869K601569
56209A0281301K162687J514799P37000m1904o77372j061325j164107j038978p87736
56200I924365n14057k94254j72040j62884k55300m11483n75850o91597p16457
56191F130443o29537m29292j28895K45126O51627J037367J347022J535445J573912
56182A1333218J450381J171925P71808L11634j31100m85292p03191p63476o65654
56173A2290253m25191p2061L50923P92055J195200J504023J669895J666798J507191
56164B0479086J244187R51731O93617N03260L84402L22150K89607K50362J68400
$$ plain form
56226 -6436216 -6970767 -7520836 -8039882 -8475810 -8774398 -8880931 -8741128 -8303732 -7524532
56217 -7524532 -6369611 -4818173 -2868456 -548449 2071824 4871863 7679732 10281301
56209 10281301 12443988 13958787 14695787 14653883 13976511 12915186 11751079 10712101 9924365
56200 9924365 9410308 9116054 8944014 8781130 8525830 8114347 7538497 6846900 6130443
56191 6130443 5500906 5071614 4942719 5187845 5839472 6876839 8223861 9759306 11333218
56182 11333218 12783599 13955524 14727332 15038966 14907866 14422574 13719383 12955907 12290253
56173 12290253 11865062 11793001 12143924 12935979 14131179 15635202 17305097 18971895 20479086
56164 20479086 21723273 22675004 23368621 23871881 24256283 24578433 24868040 25118402 25286802
56155B5286802K7814j51710l19941m22345m31044l59744k53208j59819j06602
56146B3110203r0926q8021o4832N295J27786K76982M01227M45097L76163J99582
56136B4698556m5260l00509n10775o43576p01278p15479p24357p48350p83271
56127A9525701q15678q45438q94409r93348j158537j376562j606772j796740j899283
56118H138934j882217j729291j437460j018210n05020M1461N42730R27894J160643
56109D239464J248881J231111J151176J039006R07018P59256O03235M55676L39376
56100A1974199K73340K61046K83762L06171K95485K43280J73106J26219J35456
56091A4072064K05782L12604M15707M78880M84673M37061L52061K45182J26825
$$ plain form
56155 25286802 25314616 25162906 24842965 24420620 23989576 23629832 23376624 23216805 23110203
56146 23110203 23019277 22931256 22866424 22871719 22999505 23276487 23677714 24122811 24498974 24698556
56136 24698556 24653296 24352787 23842012 23198436 22497158 21781679 21057322 20308972 19525701
56127 19525701 18710023 17864585 16970176 15976828 14818291 13441729 11834957 10038217 8138934
56118 8138934 6256717 4527426 3089966 2071756 1566736 1608197 2150927 3078821 4239464
56109 4239464 5488345 6719456 7870632 8909638 9816656 10575912 11179147 11634823 11974199
56100 11974199 12247539 12508585 12792347 13098518 13394003 13637283 13810389 13936608 14072064
56091 14072064 14277846 14590450 15006157 15485037 15969710 16406771 16758832 17004014 17130839
56082A7130839Q123r1198j43053j21184j4481J65379L86970O11970Q11227R74598
56072A9719190J107953J219393J305033J345936J319853J220020J067611R09071
56064B9214060P99691P82085Q68811J035340J226258J373331J418755J333973
56056C8052304J126494Q33004N02968J80905j03815l35358n02027n88972n80563
56047C8584940m71536k78532m2954J78702L33555L91476L55178K55535J33627
56038C9439991J9231q0574j75403k75544l82476m94313o15979p57454r18300j075777
56028C4683402j193394j246691j245936j237543j282328j423418j661188j948171
56020B3444733k207085k363030k372533k233793j975158j633803j241480q24442
$$ plain form
56082 17130839 17138962 17047764 16904711 16783527 16769046 16934425 17321395 17933365 18744592 19719190
56072 19719190 20827143 22046536 23351569 24697505 26017358 27237378 28304989 29214060
56064 29214060 30013751 30795836 31664647 32699987 33926245 35299576 36718331 38052304
56056 38052304 39178798 40011802 40514770 40695675 40591860 40256502 39754475 39165503 38584940
56047 38584940 38113404 37834872 37791918 37970620 38304175 38695651 39050829 39306364 39439991
56038 39439991 39459222 39378648 39203245 38927701 38545225 38050912 37434933 36677479 35759179 34683402
56028 34683402 33490008 32243317 30997381 29759838 28477510 27054092 25392904 23444733
56020 23444733 21237648 18874618 16502085 14268292 12293134 10659331 9417851 8593409
56012H593409m09809k6234L03463N68558P67639R00513R65333R64567R11731Q29380
56002A4368550P38901O52198N72515N01219M42655M04496L97182M33515N23857
55993A9035088O64828Q29332R69477J035145R98364Q69396O94983N37550M44297
55984B6078460M23925M46441M64683M39394L50781J96319j3161k51555m74033
55975B7661254o21462o36994m89768j93271J94054N88587R10880J108599J164028
55966B9685907J087727R05430O46511L40642K2954k61383m63406n46278m98168
55957C0919936l32859q2192K10862M97851P34436Q92688R66670R65964R04106
55948C5677462P93652O50821N01938L82431L27100L58653M82629O90193R62840
$$ plain form
56012 8593409 8183600 8157366 8460829 9029387 9797026 10697539 11662872 12627439 13539170 14368550
56002 14368550 15107451 15759649 16332164 16833383 17276038 17680534 18077716 18511231 19035088
55993 19035088 19699916 20529248 21498725 22533870 23532234 24401630 25096613 25634163 26078460
55984 26078460 26502385 26948826 27413509 27852903 28203684 28400003 28386842 28135287 27661254
55975 27661254 27039792 26402798 25913030 25719759 25913813 26502400 27413280 28521879 29685907
55966 29685907 30773634 31679064 32325575 32666217 32689171 32427788 31964382 31418104 30919936
55957 30919936 30587077 30504885 30715747 31213598 31948034 32840722 33807392 34773356 35677462
55948 35677462 36471114 37121935 37623873 38006304 38333404 38692057 39174686 39864879 40827719
55939D0827719J272589J579814J838026K010264K087768K095305K077654K077679
55931E5866818K120427K207672K317553K404982K405624K248476J876879J270681
55923G2719112M59820m76792j425955k262527k873999l183757l167969k859125
55915E6928808k334431j696792j058007n24219j76372m5458r5531k29793l22942
55906E0445263k67812j6284M04582R09199J392555J768616J990319K050923J976359
55897F0653720J813634J614709J419160J244877J092142R55509Q32238P20727
55889G0346716O12279M87147L23587J15732j16431l38198n25469o82300q35764
55880F9387299j013364j220059j428285j585104j633634j539661j310068r92812
$$ plain form
55939 40827719 42100308 43680122 45518148 47528412 49616180 51711485 53789139 55866818
55931 55866818 57987245 60194917 62512470 64917452 67323076 69571552 71448431 72719112
55923 72719112 73178932 72702140 71276185 69013658 66139659 62955902 59787933 56928808
55915 56928808 54594377 52897585 51839578 51315359 51138987 51093529 50997998 50768205 50445263
55906 50445263 50177451 50161167 50565749 51474948 52867503 54636119 56626438 58677361 60653720
55897 60653720 62467354 64082063 65501223 66746100 67838242 68793751 69625989 70346716
55889 70346716 70958995 71446142 71769729 71885461 71769030 71430832 70905363 70223063 69387299
55880 69387299 68373935 67153876 65725591 64140487 62506853 60967192 59657124 58664312
55872E8664312o58888l75785j84032q5272m5838j3463O1675K11631M45490P51877
55862E8771707J104580J468723J807395K089696K299795K443294K545140K636932
55854G5167262K739381K850139K943392K979554K919108K735647K425447K011611
55846I6771541J541673J080250P00280M74409M63850P02123J177534J824859K535377
55837A07271896L185185L671337L940215L994806L877983L644059L339249L002320
55829A35927050K676443K413151K260332K244141K359702K575635K846514L124725
55821A56427693L366642L533370L591254L517474L309390K989463K599229K184424
55813A81518939J779710J401501J054010P46959N12732M05673M78020P48846J190414
$$ plain form
55872 58664312 58005424 57629639 57445607 57360335 57314497 57301034 57362709 57574340 58019830 58771707
55862 58771707 59876287 61345010 63152405 65242101 67541896 69985190 72530330 75167262
55854 75167262 77906643 80756782 83700174 86679728 89598836 92334483 94759930 96771541
55846 96771541 98313214 99393464 100093744 100568153 101032003 101734126 102911660 104736519 107271896
55837 107271896 110457081 114128418 118068633 122063439 125941422 129585481 132924730 135927050
55829 135927050 138603493 141016644 143276976 145521117 147880819 150456454 153302968 156427693
55821 156427693 159794335 163327705 166918959 170436433 173745823 176735286 179334515 181518939
55813 181518939 183298649 184700150 185754160 186501119 187013851 187419524 187897544 188646390 189836804
55804A89836804J740060K323667K873223L334897L675141L888540M001509M063730
55796B15737571M127443M224787M356467M497682M615790M687924M709503M691913
55788B51649080M653038M606695M557112M501278M436093M363611M290900M227139
55780B87284946M182246M166817M189294M248999M330712M409101M464023M495618
55772C21771756M524738M575769M655995M749984M834240M899875M965226N068839
55764C60046422N246579N506518N816844O114056O325529O392194O280643N984109
55756D07712894N517830M913008M210612L455324K689670J948367J254383O20033
55748D32322121N3860m32465q25726j123552j349361j556334j811561k164250
$$ plain form
55804 189836804 191576864 193900531 196773754 200108651 203783792 207672332 211673841 215737571
55796 215737571 219865014 224089801 228446268 232943950 237559740 242247664 246957167 251649080
55788 251649080 256302118 260908813 265465925 269967203 274403296 278766907 283057807 287284946
55780 287284946 291467192 295634009 299823303 304072302 308403014 312812115 317276138 321771756
55772 321771756 326296494 330872263 335528258 340278242 345112482 350012357 354977583 360046422
55764 360046422 365293001 370799519 376616363 382730419 389055948 395448142 401728785 407712894
55756 407712894 413230724 418143732 422354344 425809668 428499338 430447705 431702088 432322121
55748 432322121 432375981 431943516 431117790 429994238 428644877 427088543 425276982 423112732
55740D23112732k614950l107255l551635l868814m024763m036909l954544l833803
55732C94120059l723612l662878l679484l785400l970491m201426m430150m611503
55724C62055115m722806m773874m799945m841608m924587n049718n194748n323851
55716C22423978n399760n393503n288661n083262m795428m470720m178191l986852
55708B83827601l934870m015836m192120m420294m666983m909596n132098n324114
55700B47231690n480951n599201n669607n674123n590713n402976n109168m726816
55692B03978135m290552l841754l412791l015645k645246k296555j980329j722907
55684A80772356j552144j486050j535096j710582k023136k466996l003702l562648
$$ plain form
55740 423112732 420497782 417390527 413838892 409970078 405945315 401908406 397953862 394120059
55732 394120059 390396447 386733569 383054085 379268685 375298194 371096768 366666618 362055115
55724 362055115 357332309 352558435 347758490 342916882 337992295 332942577 327747829 322423978
55716 322423978 317024218 311630715 306342054 301258792 296463364 291992644 287814453 283827601
55708 283827601 279892731 275876895 271684775 267264481 262597498 257687902 252555804 247231690
55700 247231690 241750739 236151538 230481931 224807808 219217095 213814119 208704951 203978135
55692 203978135 199687583 195845829 192433038 189417393 186772147 184475592 182495263 180772356
55684 180772356 179220212 177734162 176199066 174488484 172465348 169998352 166994650 163432002
55676A63432002m062455m439375m664119m739730m689310m546750m353753m156012
55668A27780498l994085l894216l865390l899783l970241m027731m009414l859640
55660I6259998l551011l091396k516877j880347j240500o49202j39478K76777
55652H3467964N98251Q21819R41472R57565Q83699P44628N71371M00065K70013
55643H9656847K12978K37184L20348M20289M95356N18831M79291L71885J90650
55634I2903659p2256m21118q49402j335419j843824k332252k759303l089857l297765
55625G6902463l369338l309353l145424k924176k697454k504868k361866k258426
55617E4331558k166832k053014j886148j644738j321167r26765m94308p1757K93908
$$ plain form
55676 163432002 159369547 154930172 150266053 145526323 140837013 136290263 131936510 127780498
55668 127780498 123786413 119892197 116026807 112127024 108156783 104129052 100119638 96259998
55660 96259998 92708987 89617591 87100714 85220367 83979867 83330665 83191187 83467964
55652 83467964 84066215 84888034 85829506 86787071 87670770 88415398 88986769 89386834 89656847
55643 89656847 89869825 90107009 90427357 90847646 91343002 91861833 92341124 92713009 92903659
55634 92903659 92831403 92410285 91560883 90225464 88381640 86049388 83290085 80200228 76902463
55625 76902463 73533125 70223772 67078348 64154172 61456718 58951850 56589984 54331558
55617 54331558 52164726 50111712 48225564 46580826 45259659 44332894 43838586 43766829 44060737
55608D4060737N73866P63636Q74624R18419Q94887P90952N90785K92079q1820
55599D9678165m83282q55201j148768j333345j397314j346046j200559r94001
55591D0919649p63145n38002l35409j58548j01J52577L09654M70167O18841P33380
55581D1409063P98295Q14548P97215P63107P17477O49332N39741L78337J74727
55572D7041842m6989k67334m85881p15967r64036j212240j418603j535029j533224
55563C8862539j424497j259591j104233j003983r61916r42017q90854p61681n31336
55554B9982431k07208J76748N72079R27592J195508J336924J333168J197759R75797
55545C7490798P27252N05037L39493K31239J51258N1676j11285l52434o47602
$$ plain form
55608 44060737 44634603 45398239 46272863 47191282 48086169 48877121 49467906 49759985 49678165
55599 49678165 49194883 48339682 47190914 45857569 44460255 43114209 41913650 40919649
55591 40919649 40156504 39618502 39283093 39124545 39124444 39277021 39586675 40056842 40675683 41409063
55581 41409063 42207358 43021906 43819121 44582228 45299705 45949037 46488778 46867115 47041842
55572 47041842 46994853 46727519 46241638 45525671 44561635 43349395 41930792 40395763 38862539
55563 38862539 37438042 36178451 35074218 34070235 33108319 32166302 31275448 30513767 29982431
55554 29982431 29775223 29951971 30524050 31451642 32647150 33984074 35317242 36515001 37490798
55545 37490798 38218050 38723087 39062580 39293819 39445077 39496753 39385468 39033034 38385432
55536C8385432r45522j191921j348896j399520j340373j173681r09338n75539
55528B9500642k24662P8397K82258L70679L62903K94012J92594P2368n9611j89274
55518C0680306k91028l39033l27047k79704k41774k49229l02947l66241l88585
55509B7894718l37183k13284m4888J33886K99829M45059N70899O77734P56031
55500C0182801P83516P33593N93918L82331J44546o7734k21033l08184l39748
55491C1884006l33561l12952l08966l55746m77091o73500r20194j177785j407487
55482B5916724j580791j680486j698351j635750j506470j335679j151988r76635
55474A4350574q16498o64592n07245l34005j44655N0626K37147M03131N45008
$$ plain form
55536 38385432 37439910 36247989 34899093 33499573 32159200 30985519 30076181 29500642
55528 29500642 29275980 29354377 29636635 30007314 30370217 30664229 30856823 30929191 30869580 30680306
55518 30680306 30389278 30050245 29723198 29443494 29201720 28952491 28649544 28283303 27894718
55509 27894718 27557535 27344251 27299363 27433249 27733078 28178137 28749036 29426770 30182801
55500 30182801 30966317 31699910 32293828 32676159 32820705 32752971 32531938 32223754 31884006
55491 31884006 31550445 31237493 30928527 30572781 30095690 29422190 28501996 27324211 25916724
55482 25916724 24335933 22655447 20957096 19321346 17814876 16479197 15327209 14350574
55474 14350574 13534076 12869484 12362239 12028234 11883579 11934205 12171352 12574483 13119491
55465A3119491O69007P87485R09408J029851J127497J174350J151666J061595
55457B1030350R28603P91280O88425O44499O59817P08883P47041P24406O04946
55448B7528250L84102R4057k09934m75905o78220q23172r34635j030655j108725
55439B2745163j150625j139324j068546r35976p33523m53105j06085K64943N96651
55430A8019573Q29828R30066Q94585P46826N23743K61199j4829k86072n33853
55421B1371066p36805q79197r61241r99296j014898j023220j029816j033267j025619
55412A2667707r89450q99012p30650m77283j56327J94806N33233Q27443J066714
55403A2037181J256553J404250J508820J564758J571289J530793J435399J260338
$$ plain form
55465 13119491 13788498 14575983 15485391 16515242 17642739 18817089 19968755 21030350
55457 21030350 21958953 22750233 23438658 24083157 24742974 25451857 26198898 26923304 27528250
55448 27528250 27912352 28006409 27796475 27320570 26642350 25819178 24884543 23853888 22745163
55439 22745163 21594538 20455214 19386668 18450692 17717169 17264064 17157979 17422922 18019573
55430 18019573 18849401 19779467 20674052 21420878 21944621 22205820 22190991 21904919 21371066
55421 21371066 20634261 19755064 18793823 17794527 16779629 15756409 14726593 13693326 12667707
55412 12667707 11678257 10779245 10048595 9571312 9414985 9609791 10143024 10970467 12037181
55403 12037181 13293734 14697984 16206804 17771562 19342851 20873644 22309043 23569381
55395B3569381R79132N91442J38926l04834o61724q74277r15925p87165n07319
55386B1227637j10596L52873Q18335J216690J491310J611113J571232J382684
55378B9561278J061133O24340R8635m74860j043162j552419j957421k223077k321267
55369B1773180k230996j944397j474502q60370j68197N12917J083952J459346
55361A8150933J593972J499298J237025Q92621N45172K49531L2772j04301j86261
55352B3910762k56974l61132n18527p08068q75146r59733r28072p89054n87458
55343A7926598l80487k12109r8608l1329O476K0468j350p6357k06971l72054n38170
55332A6036107o77950p77232q28676q26160p71028o83552o03534n73298o13071
$$ plain form
55395 23569381 24548513 25139955 25278881 24974047 24312323 23438046 22522121 21734956 21227637
55386 21227637 21117041 21469914 22288249 23504939 24996249 26607362 28178594 29561278
55378 29561278 30622411 31246751 31345386 30870526 29827364 28274945 26317524 24094447 21773180
55369 21773180 19542184 17597787 16123285 15262915 15094718 15607635 16691587 18150933
55361 18150933 19744905 21244203 22481228 23373849 23919021 24168552 24201324 24097023 23910762
55352 23910762 23653788 23292656 22774129 22066061 21190915 20231182 19303110 18514056 17926598
55343 17926598 17546111 17334002 17235394 17204065 17210541 17231009 17229659 17153302 16946331 16574277 16036107
55332 16036107 15358157 14580925 13752249 12926089 12155061 11471509 10867975 10294677 9681606
55323I681606p06242q05383q56441q27335p24019n83725m49152l41105k49052
55314D139152j45235r492J54270L18050M40839M83565M25951K82508J07850j8073
55304F179385k1182J35749M38387Q27145J218862J533980J719093J757870J668956
55295A5458245J494590J284423J078562Q95254P29166N60872L70738J49275r8741
55286B1922384l54798n91136p79133q98849r45263r29332q74872q11439p63213
55277A4974349p38828p30663p25101p12735o85944o25638m93475k43031J53590
55268A0172524O80540J270721J821615K227325K410959K341981K034806J538147
55260B4498618R25667K87654k83525p14983r72612j068855j057467j017787j029687
$$ plain form
55323 9681606 8975364 8169981 7313540 6486205 5762186 5178461 4729309 4388204 4139152
55314 4139152 3993917 3984425 4138695 4456745 4897584 5381149 5807100 6089608 6197458 6179385
55304 6179385 6158203 6293952 6732339 7559484 8778346 10312326 12031419 13789289 15458245
55295 15458245 16952835 18237258 19315820 20211074 20940240 21501112 21871850 22021125 21922384
55286 21922384 21567586 20976450 20197317 19298468 18353205 17423873 16549001 15737562 14974349
55277 14974349 14235521 13504858 12779757 12067022 11381078 10755440 10261965 10018934 10172524
55268 10172524 10853064 12123785 13945400 16172725 18583684 20925665 22960471 24498618
55260 24498618 25424285 25711939 25428414 24713431 23740819 22671964 21614497 20596710 19567023
55251A9567023j143230j355560j610786j827109j936559j912867j771819j548517
55243F460576j271303r50939n89654k00552J77323M80126O40507O20748M38216
55234E805048J64745j01193k71727k95767j66898Q1929L90711O89818R20619J053313
55224H270598J094086J078275J053741J062924J129013J246463J377215J459271
55216A7771586J431392J262792R67393N93843K03670j45032m04724n43546n50847
55207B0586527m38617k37481Q083K44295M18297M96839M84444M26295L88520M23861
55197B2801063N42231P05184Q48300R15971Q86038P73331O17169M62890L43144
55188B8895321K62996J95736R4897q0821l41797o54722r50842j153095j209692
$$ plain form
55251 19567023 18423793 17068233 15457447 13630338 11693779 9780912 8009093 6460576
55243 6460576 5189273 4238334 3648680 3448128 3625451 4105577 4746084 5366832 5805048
55234 5805048 5969793 5868600 5596873 5301106 5134208 5216137 5606848 6296666 7217285 8270598
55224 8270598 9364684 10442959 11496700 12559624 13688637 14935100 16312315 17771586
55216 17771586 19202978 20465770 21433163 22027006 22230676 22085644 21680920 21137374 20586527
55207 20586527 20147910 19910429 19918512 20162807 20581104 21077943 21562387 21988682 22377202 22801063
55197 22801063 23343294 24048478 24896778 25812749 26698787 27472118 28089287 28552177 28895321
55188 28895321 29158317 29354053 29448950 29368129 29026332 28371610 27420768 26267673 25057981
55179B5057981j117284r22033o98379n15558m07270l58787l17830k22773l3076
55170B0464991K51117N85049Q90123J076770J073703Q52973M39302j00487o81336
55161B4852205j224095j669741j982433k147493k169840k072651j893177j674377
55153A0018398j453166j246737j042522q02371m86658q7542L51597P45601J000511
55144F997111J050868Q83257N37373Q7304l84667q07705j130705j324634j383925
55135D524277j324719j176985r74008p45661n16936l08995j39866k2003M5594
55126f39302Q6550J45453K68023M72995P36723J002675J209116J317088J323258
55117E922579J253161J143144J026232R29797Q77548Q83197R37125J002590J033187
$$ plain form
55179 25057981 23940697 23018664 22320285 21804727 21397457 21038670 20720840 20498067 20464991
55170 20464991 20716108 21301157 22191280 23268050 24341753 25194726 25634028 25533541 24852205
55161 24852205 23628110 21958369 19975936 17828443 15658603 13585952 11692775 10018398
55153 10018398 8565232 7318495 6275973 5473602 4986944 4899402 5250999 5996600 6997111
55144 6997111 8047979 8931236 9468609 9555913 9171246 8363541 7232836 5908202 4524277
55135 4524277 3199558 2022573 1048565 302904 -214032 -523027 -662893 -684896 -639302
55126 -639302 -552752 -407299 -139276 333719 1070442 2073117 3282233 4599321 5922579
55117 5922579 7175740 8318884 9345116 10274913 11152461 12035658 12972783 13975373 15008560
55108A5008560J001621R16532Q14039P32851O94248P00468P45903Q24445R23760
55099B2362427J014141J046726R66680P33802L39673j84337p69751j325284j761682
55090B2422395k020178k091821k015827j855723j667453j480004j297836j115434
55082H878119r28327p36484n47432l82854k81801k91914m48799p53056j157815
55073C349637j577050j915110k104130k128893k026979j867478j722030j641850
55065a1633883j648254j735175j875468k025221k129267k132579j991912j676624
55057b6848383j158862m07668O00546J855810L282217M714694N910300O614982
55049e436364O667855O079059N022223L746701K474019J339827L94128l64849
$$ plain form
55108 15008560 16010181 16926713 17740752 18473603 19167851 19868319 20614222 21438667 22362427
55099 22362427 23376568 24423294 25389974 26123776 26463449 26279112 25509361 24184077 22422395
55090 22422395 20402217 18310396 16294569 14438846 12771393 11291389 9993553 8878119
55082 8878119 7949792 7213308 6665876 6283022 6001221 5709307 5260508 4507452 3349637
55073 3349637 1772587 -142523 -2246653 -4375546 -6402525 -8270003 -9992033 -11633883
55065 -11633883 -13282137 -15017312 -16892780 -18918001 -21047268 -23179847 -25171759 -26848383
55057 -26848383 -28007245 -28414913 -27814367 -25958557 -22676340 -17961646 -12051346 -5436364
55049 -5436364 1231491 7310550 12332773 16079474 18553493 19893320 20287448 19922599
55041A9922599r51983j370817j612420j672965j572789j361851j110780q94942
55033I374052p76184p85618r15448j125955j362166j568224j695172j707792j594438
55024b156945j375199j100862q39445o52894n71898n81409o27849o46359n91828
55015i144688m54828k56208l0095J90006L75558N03399N61131N57666N28790N28007
55005f641262O04442P79243J031961J302472J509378J580928J486618J252474
54997B906254R50173O66506M71480M00661M55174O12822Q41076J105088J368032
54988I777266J586930J712321J699160J526213J210044Q00321L57613p0538m59892
54979A8139438q03845j100249j339824j501126j555086j479268j274976r74969
$$ plain form
55041 19922599 18970616 17599799 15987379 14314414 12741625 11379774 10268994 9374052
55033 9374052 8597868 7812250 6896802 5770847 4408681 2840457 1145285 -562507 -2156945
55024 -2156945 -3532144 -4633006 -5472451 -6125345 -6697243 -7278652 -7906501 -8552860 -9144688
55015 -9144688 -9599516 -9855724 -9885819 -9695813 -9320255 -8816856 -8255725 -7698059 -7169269 -6641262
55005 -6641262 -6036820 -5257577 -4225616 -2923144 -1413766 167162 1653780 2906254
54997 2906254 3856427 4522933 4994413 5395074 5850248 6463070 7304146 8409234 9777266
54988 9777266 11364196 13076517 14775677 16301890 17511934 18312255 18669868 18599330 18139438
54979 18139438 17335593 16235344 14895520 13394394 11839308 10360040 9085064 8110095
54971H110095o34366l09711l9581J62494L01638L88691M29714M23313L65229K55272
54961I452788J01374q1689k77904m76236o72493q64461j043874j192644j287284
54952C657577j308005j246375j109825r24448p33907n88417n23300n39148o00003
54943c915851o53759o60693o09851n15080l99873k86146j92789j36833j27432
54934g498307j53053j74879j39175o072K24811N11737P92993J016281J155050
54925d270614J205009J169244J046219Q30644N27250J66700j91575m76579o34350
54916f28052o50516n54670m06712k72630j99372j98828k48829l10438l50207l53759
54906d174013l25616k80049k30811j84486j39212q9023l1426K7208P3771R7703
$$ plain form
54971 8110095 7475729 7166018 7126437 7288931 7590569 7979260 8408974 8832287 9197516 9452788
54961 9452788 9554162 9472473 9194569 8718333 8045840 7181379 6137505 4944861 3657577
54952 3657577 2349572 1103197 -6628 -931076 -1664983 -2253400 -2776700 -3315848 -3915851
54943 -3915851 -4569610 -5230303 -5840154 -6355234 -6755107 -7041253 -7234042 -7370875 -7498307
54934 -7498307 -7651360 -7826239 -7965414 -7971486 -7746675 -7234938 -6441945 -5425664 -4270614
54925 -4270614 -3065605 -1896361 -850142 -19498 507752 674452 482877 6298 -628052
54916 -628052 -1278568 -1833238 -2239950 -2512580 -2711952 -2910780 -3159609 -3470047 -3820254 -4174013
54906 -4174013 -4499629 -4779678 -5010489 -5194975 -5334187 -5423210 -5454636 -5427428 -5353657 -5255954
54896e255954J00543R7864J11418J55884K26443K92526L03345K09225o944l06551
54886d072201n99546p77855p59417n19889j00599M06066Q86332J238841J400171
54877b898097J354865J132256P96037M28208J07585j10191k00812j66359k7493
54868D15999J78947M01571N85269O91776P18594P03869P13064Q12554J040822
54859F262465J390183J807903K215540K535370K710941K715164K547071K222679
54851B4407316J766594J209511N92045l1056n94516j036664j317568j429944j395530
54842B2170188j249311j022621p36849m10503o9611K52094N25482P37406Q86871
54833B1083146R68513R61500Q37250N80103K03113k52317p30268j177408j554730
$$ plain form
54896 -5255954 -5155411 -5057547 -4946129 -4790245 -4563802 -4271276 -3967931 -3758706 -3765650 -4072201
54886 -4072201 -4671747 -5449602 -6209019 -6728908 -6829507 -6423441 -5537109 -4298268 -2898097
54877 -2898097 -1543232 -410976 385061 813269 920854 810663 609851 443492 415999
54868 415999 594946 996517 1581786 2273562 2992156 3696025 4409089 5221643 6262465
54859 6262465 7652648 9460551 11676091 14211461 16922402 19637566 22184637 24407316
54851 24407316 26173910 27383421 27975466 27944410 27349894 26313230 24995662 23565718 22170188
54842 22170188 20920877 19898256 19161407 18750904 18681293 18933387 19458869 20196275 21083146
54833 21083146 22051659 23013159 23850409 24430512 24633625 24381308 23651040 22473632 20918902
54824B0918902j840169k023491k099142k063172j916195j670122j355011j021631
54816F929969p34016n50060m98866n71110p30794r38515j166679j396676j606326
54807a263073j764689j842678j831396j750769j638650j528059j431076j340182
54799a4390572j241167j123980r85853q30527o66933n04951l47610j86407o485
54790b0284485K02060M37659O89684R41854J168847J331557J384134J295608J070834
54781a1762248P51916L97750N8173k38600m80787o60310p65173p81811p03725
54772a4184815n39439l14685o7429J62131L42224M55425M96662M65273L58493
54763a2826160J73362q3105l83860o81251r18149j044926j033584q84054o22666
$$ plain form
54824 20918902 19078733 17055242 14956100 12892928 10976733 9306611 7951600 6929969
54816 6929969 6195953 5645893 5147027 4575917 3845123 2906608 1739929 343253 -1263073
54807 -1263073 -3027762 -4870440 -6701836 -8452605 -10091255 -11619314 -13050390 -14390572
54799 -14390572 -15631739 -16755719 -17741572 -18572099 -19239032 -19743983 -20091593 -20278000 -20284485
54790 -20284485 -20082425 -19644766 -18955082 -18013228 -16844381 -15512824 -14128690 -12833082 -11762248
54781 -11762248 -11010332 -10612582 -10554409 -10793009 -11273796 -11934106 -12699279 -13481090 -14184815
54772 -14184815 -14724254 -15038939 -15106368 -14944237 -14602013 -14146588 -13649926 -13184653 -12826160
54763 -12826160 -12652798 -12735903 -13119763 -13801014 -14719163 -15764089 -16797673 -17681727 -18304393
54754a8304393k95633M0395L29905N31398O28235O32275N77036N02567M39707
54745a4918508M02226L90184L99673M29848M81945N53623O36140P17001P83088
54736a0124780Q19050Q03213P08919N15140K20774j47503n39499q95378j162140
54727i802204j306924j324496j237912j091044r32447p94187o75391n42017l46918
54718a8053540o0426L07047P03627J054332J286824J352983J241353R79319O24240
54709a0564241K45521r5506l59038n28730o03736n87436m80519k82256L292L62767
54699a2889882P72640J198228J592116J899438K075343K105885K015398J853661
54691F22827J673158J511294J383876J287307J205099J114766R92948Q20496N90568
$$ plain form
54754 -18304393 -18600026 -18559631 -18229726 -17698328 -17070093 -16437818 -15860782 -15358215 -14918508
54745 -14918508 -14516282 -14126098 -13726425 -13296577 -12814632 -12261009 -11624869 -10907868 -10124780
54736 -10124780 -9305730 -8502517 -7793598 -7278458 -7057684 -7205187 -7744686 -8640064 -9802204
54727 -9802204 -11109128 -12433624 -13671536 -14762580 -15695027 -16489214 -17164605 -17706622 -18053540
54718 -18053540 -18113966 -17806919 -17103292 -16048960 -14762136 -13409153 -12167800 -11188481 -10564241
54709 -10564241 -10318720 -10414226 -10773264 -11301994 -11905730 -12493166 -12973685 -13255941 -13252649 -12889882
54699 -12889882 -12117242 -10919014 -9326898 -7427460 -5352117 -3246232 -1230834 622827
54691 622827 2295985 3807279 5191155 6478462 7683561 8798327 9791275 10611771 11202339
54682A1202339L16387K9258k36074m57696o31206p63115q64250r49083j035895
54673F610665j142485j280304j452271j654073j874714k095041k286815k415254
54665g590292k445299k349774k116906j755556j297741p96338l13535J00352M26350
54656a8138739O78197Q82027J051561J180385J255154J273734J251582J213460
54648i352639J178422J147007J097478R95596Q15167N55956K44972p8431l78062
54639c774534o24093p87697q40308p62216n52500k31747J61987N79125R65551
54630e866432J272239J465338J531079J473401J307665J054390P34123L65045
54622C336848l2583m24051p49484r30665r01468o46472k19918K71233P10046J012267
$$ plain form
54682 11202339 11518726 11547984 11311910 10854214 10223008 9459893 8595643 7646560 6610665
54673 6610665 5468180 4187876 2735605 1081532 -793182 -2888223 -5175038 -7590292
54665 -7590292 -10035591 -12385365 -14502271 -16257827 -17555568 -18351906 -18665441 -18565089 -18138739
54656 -18138739 -17460542 -16578515 -15526954 -14346569 -13091415 -11817681 -10566099 -9352639
54648 -9352639 -8174217 -7027210 -5929732 -4934136 -4118969 -3563013 -3318041 -3396472 -3774534
54639 -3774534 -4398627 -5186324 -6026632 -6788848 -7341348 -7573095 -7411108 -6831983 -5866432
54630 -5866432 -4594193 -3128855 -1597776 -124375 1183290 2237680 2971803 3336848
54622 3336848 3304265 2880214 2130730 1200065 298597 -347875 -567793 -296560 413486 1425753
54612A425753J148693J143880J057573R56769Q87613Q58252Q40474P88473O65102
54603I772582M63784K15954k0870j89183k56804k27204j32170j5123Q5105J44538
54593I840609J56840J30151Q1939L4145O491O379K1084K1783j9353j10323k32872
54582I936873l53229m42457m92487n16724n35090n55924n70083n61930n27636
54573E381313m86279m75121n30329o64044q54245j057758j238140j385273j510593
54564b820469j625412j724477j788228j798164j750927j662620j564181j491710
54556a6226188j473941j518627j603313j678040j681923j565333j305963r14250
54548b7967578m31593P7203N40938R07674J165748J344255J491579J648013J830667
$$ plain form
54612 1425753 2574446 3718326 4775899 5732668 6620281 7478533 8319007 9107480 9772582
54603 9772582 10236366 10452320 10431450 10242267 9985463 9758259 9626089 9610966 9696071 9840609
54593 9840609 9997449 10127600 10209539 10243684 10250175 10256554 10277638 10299421 10280068 10169745 9936873
54582 9936873 9583644 9141187 8648700 8131976 7596886 7040962 6470879 5908949 5381313
54573 5381313 4895034 4419913 3889584 3225540 2371295 1313537 75397 -1309876 -2820469
54564 -2820469 -4445881 -6170358 -7958586 -9756750 -11507677 -13170297 -14734478 -16226188
54556 -16226188 -17700129 -19218756 -20822069 -22500109 -24182032 -25747365 -27053328 -27967578
54548 -27967578 -28399171 -28321968 -27781030 -26873356 -25707608 -24363353 -22871774 -21223761 -19393094
54539a9393094K034952K242452K423763K535586K522114K329149J927389J331552
54531b046137O03911j59896q57553j409307j776229j957116j968384j825539j540973
54522a2937223j134115o39115j03045M20422Q77009J218868J413610J450402J338520
54513h094667J100672P67823L78954j7188l64597o11174p26173p14372o17125
54504h897847m98360m21984m29776n28071o90407q76466j054994j211921j337278
54495a5947104j405180j368014j172016p83404k09317M95278J235863J898904
54487a7254990K379264K606812K564162K289686J864352J386298R41698N81943
54479b640775L14752J12448o5150k42437m08649n19787n22823l87862j26671K14939
$$ plain form
54539 -19393094 -17358142 -15115690 -12691927 -10156341 -7634227 -5305078 -3377689 -2046137
54531 -2046137 -1442226 -1602122 -2459675 -3868982 -5645211 -7602327 -9570711 -11396250 -12937223
54522 -12937223 -14071338 -14710453 -14813498 -14393076 -13516067 -12297199 -10883589 -9433187 -8094667
54513 -8094667 -6993995 -6226172 -5847218 -5864406 -6229003 -6840177 -7566350 -8280722 -8897847
54504 -8897847 -9396207 -9818191 -10247967 -10776038 -11466445 -12342911 -13397905 -14609826 -15947104
54495 -15947104 -17352284 -18720298 -19892314 -20675718 -20885035 -20389757 -19153894 -17254990
54487 -17254990 -14875726 -12268914 -9704752 -7415066 -5550714 -4164416 -3222718 -2640775
54479 -2640775 -2326023 -2213575 -2278725 -2521162 -2929811 -3449598 -3972421 -4360283 -4486954 -4272015
54469d272015N83133R38142J256174J515794J688200J744195J671329J483420
54461F608372J212520Q90173N34060J49872k56209o67597j058495j402738j680984
54452D328974j881337j995679k016110j934925j750336j476103j145761q01691
54444h672968m73332j64062J38290M36279P07889R15742J029224J037906R47365
54435d097667P66980N04362J71209k06810n87437r21837j172621j328437j405724
54426h277982j437756j459633j497295j560853j639163j698744j694957j594655
54418b0861038j394498j119033q01757m68723j38240J69384M26989O07559O98638
54409b2880719P14635O97515P00972P64631Q95549J069979J251057J407186J521904
$$ plain form
54469 -4272015 -3688882 -2750740 -1494566 21228 1709428 3453623 5124952 6608372
54461 6608372 7820892 8711065 9245125 9394997 9138788 8471191 7412696 6009958 4328974
54452 4328974 2447637 451958 -1564152 -3499077 -5249413 -6725516 -7871277 -8672968
54444 -8672968 -9146300 -9310362 -9172072 -8735793 -8027904 -7112162 -6082938 -5045032 -4097667
54435 -4097667 -3330687 -2826325 -2655116 -2861926 -3449363 -4371200 -5543821 -6872258 -8277982
54426 -8277982 -9715738 -11175371 -12672666 -14233519 -15872682 -17571426 -19266383 -20861038
54418 -20861038 -22255536 -23374569 -24176326 -24645049 -24783289 -24613905 -24186916 -23579357 -22880719
54409 -22880719 -22166084 -21468569 -20767597 -20002966 -19107417 -18037438 -16786381 -15379195 -13857291
54400a3857291J596335J646265J693063J751624J823726J900871J970143K014978
54392E39714K011751J930212J742797J439082J036013N75366J07444l29352p18861
54383H334166j061178j357731j600357j771035j850134j826956j706484j508133
54375d347842j257160r74989o75316l66961n8907K36608N03494P22572Q73343
54366e345158R36918Q99853P57739N17022J94677j82312n76344r40828j229472
54357d967905j411199j479248j446131j331130j155235r47658p51659o16047n73519
54348a4679731o20850p15938p95775q06298p27101n77058m00100k43889j45063
54339a9711803j24257j85245l13880m78084o31757p23457p09445n69062l15937
$$ plain form
54400 -13857291 -12260956 -10614691 -8921628 -7170004 -5346278 -3445407 -1475264 539714
54392 539714 2551465 4481677 6224474 7663556 8699569 9274935 9382379 9053027 8334166
54383 8334166 7272988 5915257 4314900 2543865 693731 -1133225 -2839709 -4347842
54375 -4347842 -5605002 -6579991 -7255307 -7622268 -7681175 -7444567 -6941073 -6218501 -5345158
54366 -5345158 -4408240 -3508387 -2750648 -2233626 -2038949 -2221261 -2797605 -3738433 -4967905
54357 -4967905 -6379104 -7858352 -9304483 -10635613 -11790848 -12738506 -13490165 -14106212 -14679731
54348 -14679731 -15300581 -16016519 -16812294 -17618592 -18345693 -18922751 -19322851 -19566740 -19711803
54339 -19711803 -19836060 -20021305 -20335185 -20813269 -21445026 -22168483 -22877928 -23446990 -23762927
54330b3762927M366L33254O24177Q56754J031749J155618J230731J258375J246897
54321a6021006J212350J167996J111728J024178Q81931O76423M22195J45826j35283
54312i513662m23945p32262j058842j376032j638919j807277j862220j807329
54304b0220488j657677j427663j126978p66741l69621K5856L71871O25912P66718
54295b3778811Q06123P91740P95322Q87360J109485J460816J904358K384911K845560
54286a0793136L237216L522963L679119L692973L559210L279431K866095K345986
54278A5389857J757625J143318N41338j8983n21037r63714j358169j716003k036451
54269A2217781k303947k497212k599254k599912k495177k291247k011708j697741
$$ plain form
54330 -23762927 -23758561 -23425307 -22801130 -21944376 -20912627 -19757009 -18526278 -17267903 -16021006
54321 -16021006 -14808656 -13640660 -12528932 -11504754 -10622823 -9946400 -9524205 -9378379 -9513662
54312 -9513662 -9937607 -10669869 -11728711 -13104743 -14743662 -16550939 -18413159 -20220488
54304 -20220488 -21878165 -23305828 -24432806 -25199547 -25569168 -25543312 -25171441 -24545529 -23778811
54295 -23778811 -22972688 -22180948 -21385626 -20498266 -19388781 -17927965 -16023607 -13638696 -10793136
54286 -10793136 -7555920 -4032957 -353838 3339135 6898345 10177776 13043871 15389857
54278 15389857 17147482 18290800 18832138 18813155 18292118 17328404 15970235 14254232 12217781
54269 12217781 9913834 7416622 4817368 2217456 -277721 -2568968 -4580676 -6278417
54261f278417j395952j140283r40182p83241o51299n39122m60805m37337m75604
54252a3102242n57801o50477p24494p69334p92080q03459q01665p66500o69799
54243a9637851m94925k48941M2856L53718O67292R74594J261363J499917J655682
54234a3926295J705630J654586J536195J397511J277681J192013J127017J048679
54226b986983R22735P36878N08226K69243M5850j51389l17955m41997n02200m78811
54216b396403l68980j95181R82J78240L14416M08146M63519M76469M39009L54675
54206c25108K44815J36554M3975l9777j32754k44377l59562m39198m39468l38455
54196a893355j50678Q1964L15870N28422P22092R09625J093948J259600J383886
$$ plain form
54261 -6278417 -7674369 -8814652 -9754834 -10538075 -11189374 -11728496 -12189301 -12626638 -13102242
54252 -13102242 -13660043 -14310520 -15035014 -15804348 -16596428 -17399887 -18201552 -18968052 -19637851
54243 -19637851 -20132776 -20381717 -20338861 -19985143 -19317851 -18343257 -17081894 -15581977 -13926295
54234 -13926295 -12220665 -10566079 -9029884 -7632373 -6354692 -5162679 -4035662 -2986983
54226 -2986983 -2064248 -1327370 -819144 -549901 -504051 -655440 -973395 -1415392 -1917592 -2396403
54216 -2396403 -2765383 -2960564 -2959582 -2781342 -2466926 -2058780 -1595261 -1118792 -679783 -325108
54206 -325108 -80293 56261 100236 60459 -72295 -316672 -676234 -1115432 -1554900 -1893355
54196 -1893355 -2044033 -1962069 -1646199 -1117777 -395685 513940 1607888 2867488 4251374
54187D251374J460177J513965J594540J743038J958078K185726K344065K366930
54179A9417893K237749J993925J704445J438438J240909J121740J057097R99999
54171C1212195Q95191O93036L61144j04204o69945j272799j846501k354476k800229
54162B4113412l205051l574104l881388m081666m132048m005350l693665l208788
54154e668648k581419j857229j090593l38574L45726R21944J370197J692369J906135
54145e300092K035883K103976K123890K097273K016572J870884J650511J350342
54137I949239R76182N53822J32180k28455m80881o13480o54258o51968o47233
54128H335148o54979o69572o84103p04377p46680q24629r37680j069138j194107
$$ plain form
54187 4251374 5711551 7225516 8820056 10563094 12521172 14706898 17050963 19417893
54179 19417893 21655642 23649567 25354012 26792450 28033359 29155099 30212196 31212195
54171 31212195 32107386 32800422 33161566 33057362 32387417 31114618 29268117 26913641 24113412
54162 24113412 20908361 17334257 13452869 9371203 5239155 1233805 -2459860 -5668648
54154 -5668648 -8250067 -10107296 -11197889 -11536463 -11190737 -10268793 -8898596 -7206227 -5300092
54145 -5300092 -3264209 -1160233 963657 3060930 5077502 6948386 8598897 9949239
54137 9949239 10925421 11479243 11611423 11382968 10902087 10288607 9634349 8982381 8335148
54128 8335148 7680169 7010597 6326494 5622117 4875437 4050808 3113128 2043990 849883
54119H49883j292492j358517j398465j417475j407363j348153j222591j030257
54111i625430p89558n28833k76712n8532J03126J89246J87727R6067p7982l15270
54101a1096151n82665q34252j022127j114237j108137j030707r22533q14222p07155
54092a9232186n71870l68627p8177K79190O49185R67007J182862J278939J274432
54083a4619245J216631J159351J138348J156989J188002J187941J118406R67250
54075e486327P58445N40028L54110K09700P8252q6260l17494o13978r34194j213166
54065f710884j394525j460025j435416j366503j282825j177500j019123p85175
54057a6631976m88793j77008R6787L02498M42288N35654N96248O18714N82573
$$ plain form
54119 849883 -442609 -1801126 -3199591 -4617066 -6024429 -7372582 -8595173 -9625430
54111 -9625430 -10414988 -10943821 -11220533 -11279065 -11175939 -10986693 -10798966 -10702899 -10780881 -11096151
54101 -11096151 -11678816 -12513068 -13535195 -14649432 -15757569 -16788276 -17710809 -18525031 -19232186
54092 -19232186 -19804056 -20172683 -20250860 -19971670 -19322485 -18355478 -17172616 -15893677 -14619245
54083 -14619245 -13402614 -12243263 -11104915 -9947926 -8759924 -7571983 -6453577 -5486327
54075 -5486327 -4727882 -4187854 -3833744 -3624044 -3545792 -3632052 -3949546 -4563524 -5497718 -6710884
54065 -6710884 -8105409 -9565434 -11000850 -12367353 -13650178 -14827678 -15846801 -16631976
54057 -16631976 -17120769 -17297777 -17200990 -16898492 -16456204 -15920550 -15324302 -14705588 -14123015
54048a4123015M67051K64902j3493l45403p02499j052583j358800j584464j705912
54039b0154216j724713j668333j577716j490485j428959j395631j374766j339342
54031c2154161j262821j131349r49218p33809n04214k72094l9735J97147M46998
54022c6403256P21162J029642J371708J727042K056858K318049K482221K546160
54014b2150414K525939K438495K284431K046485J707995J279035Q08960L72934
54006h686140M1040j48373j95779j29788R544J84046L64773N34148O84053Q11048
53996f531428R10238R69823R69866Q89171P19840M80752K17487j6185j85274k90174
53986a865884l60437m30902n18596o15999p01250p53522p62295p27864o57099
$$ plain form
54048 -14123015 -13655964 -13391062 -13404555 -13749958 -14452457 -15505040 -16863840 -18448304 -20154216
54039 -20154216 -21878929 -23547262 -25124978 -26615463 -28044422 -29440053 -30814819 -32154161
54031 -32154161 -33416982 -34548331 -35497549 -36231358 -36735572 -37007666 -37047401 -36850254 -36403256
54022 -36403256 -35682094 -34652452 -33280744 -31553702 -29496844 -27178795 -24696574 -22150414
54014 -22150414 -19624475 -17185980 -14901549 -12855064 -11147069 -9868034 -9059074 -8686140
54006 -8686140 -8645100 -8793473 -8989252 -9119040 -9109496 -8925450 -8560677 -8026529 -7342476 -6531428
53996 -6531428 -5621190 -4651367 -3681501 -2792330 -2072490 -1591738 -1374251 -1390436 -1575710 -1865884
53986 -1865884 -2226321 -2657223 -3175819 -3791818 -4493068 -5246590 -6008885 -6736749 -7393848
53977g393848n59185m43638l20124j97738q2888K1501J12443J82056K18557K14826
53967h248038J76788J23140P6656N3181N2864N6971L5923l0250j31604k27625
53957h061994k70742k34769j24059M0769K42686M74761P31493R98039J249760
53948d954056J461709J617121J705844J716305J633268J447634J170254Q36139
53940F634218M95190J98495r494r2055k1752K11844N90754J062646J548394J962531
53930A2580771K236131K329783K232446J951931J505466R14986K08028n76421
53922B3383121j381026k129776k739746l141165l295269l202275k899491k452199
53914B142174j938098j427968r70866n92202l04154j18064m8224j03531k71902
$$ plain form
53977 -7393848 -7953033 -8396671 -8716795 -8914533 -8997421 -8975920 -8863477 -8681421 -8462864 -8248038
53967 -8248038 -8071250 -7948110 -7871454 -7818273 -7765409 -7708438 -7672515 -7702765 -7834369 -8061994
53957 -8061994 -8332736 -8567505 -8691564 -8650795 -8408109 -7933348 -7201855 -6203816 -4954056
53948 -4954056 -3492347 -1875226 -169382 1546923 3180191 4627825 5798079 6634218
53940 6634218 7129408 7327903 7318409 7226354 7204602 7416446 8007200 9069846 10618240 12580771
53930 12580771 14816902 17146685 19379131 21331062 22836528 23751514 23959542 23383121
53922 23383121 22002095 19872319 17132573 13991408 10696139 7493864 4594373 2142174
53914 2142174 204076 -1223892 -2194758 -2786960 -3091114 -3209178 -3257402 -3360933 -3632835
53905c632835n08052p36687q75379q66437o97435l98012j9057L89401P90503J162368
53895e391622J492585J768810J970785K070374K041385J873053J578499J194108
53887H597977P71806L68120L2459k04125l37487l92190m12168m40965n00738n83966
53877F898723o65325p26259p73622q37150r46541j104226j272185j380750j354576
53868b161911j143553p45296k08746L82862R40060J391422J695555J842168J845633
53859C838194J732309J525571J238918Q83542M82442P5382k91387n81909p82018
53850H121044r00485r60303r83287r76099r28217q24078o58034m38903j83100
53841A268538R3391L76187O48206Q86564J065629J167042J191543J162383J112656
$$ plain form
53905 -3632835 -4140887 -4877574 -5752953 -6619390 -7316825 -7714837 -7733894 -7344493 -6553990 -5391622
53895 -5391622 -3899037 -2130227 -159442 1910932 3952317 5825370 7403869 8597977
53887 8597977 9369783 9737903 9770362 9566237 9228750 8836560 8424392 7983427 7482689 6898723
53877 6898723 6233398 5507139 4733517 3896367 2949826 1845600 573415 -807335 -2161911
53868 -2161911 -3305464 -4050760 -4259506 -3876644 -2936584 -1545162 150393 1992561 3838194
53859 3838194 5570503 7096074 8334992 9218534 9700976 9776358 9484971 8903062 8121044
53850 8121044 7220559 6260256 5276969 4300870 3372653 2548575 1890541 1451638 1268538
53841 1268538 1361929 1738116 2386322 3272886 4338515 5505557 6697100 7859483 8972139
53832H972139J061875R99526Q90045O95735L99912J6131m16031q40662j197579
53823A0581091j438790j545699j535006j445330j312461j151216r55076p10047
53815D87466m11049p0277K87460O38709R72120J283831J560020J764654J847594
53806H360528J769075J522400J140887O87982K36979j52146m50355o63327q18954
53797A1633069r46175j057952j147039j192915j171538j061951q51878n47279
53789C656342j82855J78772M67116O34114O73706O16444N04231L64188J99398
53780G111456N99k32065m73805o76130p81566p43697n45760k12997J87292N62583
53770D195910Q24738R18534Q34490O00679K61132j43636n81938j023351j431291
$$ plain form
53832 8972139 10034014 11033540 11923585 12619320 13019232 13035363 12619332 11778670 10581091
53823 10581091 9142301 7596602 6061596 4616266 3303805 2152589 1197513 487466
53815 487466 76417 6140 293600 932309 1904429 3188260 4748280 6512934 8360528
53806 8360528 10129603 11652003 12792890 13480872 13717851 13565705 13115350 12452023 11633069
53797 11633069 10686894 9628942 8481903 7288988 6117450 5055499 4203621 3656342
53789 3656342 3473487 3652259 4119375 4753489 5427195 6043639 6547870 6912058 7111456
53780 7111456 7112055 6879990 6406185 5730055 4948489 4204792 3659032 3446035 3633327 4195910
53770 4195910 5020648 5939182 6773672 7374351 7635483 7491847 6909909 5886558 4455267
53761D455267j765452j989751k074852j994326j725152j259799o22663J22671
53753f854057Q82274J553742K053620K341606K432068K386027K284578K194524
53745I274382K142409K111127K061186J962686J816260J650299J499518J380701
53737B3898568J279313J153477R54190O52588K58702j80026n98577r38854j165395
53728B5313986j268066j255807j148620r73091p61847n53181l87143k97876l03645
53719A8364710l96189n34252o50489o76517n76082l65507j07287J18295K45049
53710A5421731K38612R4011j78946n66108j043559j562195k042348k392965k547574
53701E420659k493029k272362j962065j638863j352787j116554r12123p08357
$$ plain form
53761 4455267 2689815 700064 -1374788 -3369114 -5094266 -6354065 -6976728 -6854057
53753 -6854057 -5971783 -4418041 -2364421 -22815 2409253 4795280 7079858 9274382
53745 9274382 11416791 13527918 15589104 17551790 19368050 21018349 22517867 23898568
53737 23898568 25177881 26331358 27285548 27938136 28196838 28016812 27418235 26479381 25313986
53728 25313986 24045920 22790113 21641493 20668402 19906555 19353374 18966231 18668355 18364710
53719 18364710 17968521 17434269 16783780 16107263 15531181 15165674 15058387 15176682 15421731
53710 15421731 15660343 15754354 15575408 15009300 13965741 12403546 10361198 7968233 5420659
53701 5420659 2927630 655268 -1306797 -2945660 -4298447 -5415001 -6327124 -7035481
53693g035481m80699k25155L8369K75048M53020N60266O09266O26964O39164O60896
53683c878342O94834P31497P47766P09286N83067L56309M8799k89860n95215q05673
53673a697532q76592p89012n52704k03334K04491O05968R36878J147560J216521
53664g756J155363J000476P96834N84703L95459K53941J79702J81805K49544L49311
53654E139382M36773M80662M80693M64071M62935M90739N34126N62973N49717
53645I602071M85231L81093K56462J19944l7780k34211m78001p59963j057878
53636H276968j348225j613799j841201k011353k094131k056928j883597j587181
53628f159447j204139p76883l41566P2699M42378P54322J013428J245125J489838
$$ plain form
53693 -7035481 -7516180 -7741335 -7702966 -7427918 -6974898 -6414632 -5805366 -5178402 -4539238 -3878342
53683 -3878342 -3183508 -2452011 -1704245 -994959 -411892 -55583 -6784 -296644 -891859 -1697532
53673 -1697532 -2574124 -3363136 -3915840 -4119174 -3914683 -3308715 -2371837 -1224277 -7756
53664 -7756 1147607 2148083 2944917 3529620 3925079 4179020 4358722 4540527 4790071 5139382
53654 5139382 5576155 6056817 6537510 7001581 7464516 7955255 8489381 9052354 9602071
53645 9602071 10087302 10468395 10724857 10844801 10807021 10572810 10094809 9334846 8276968
53636 8276968 6928743 5314944 3473743 1462390 -631741 -2688669 -4572266 -6159447
53628 -6159447 -7363586 -8140469 -8482035 -8409336 -7966958 -7212636 -6199208 -4954083 -3464245
53619c464245J790041K170105K614692L061312L420110L612896L604864L407986
53611B0217761L059865K600495K065458J494946R41832M62813R3412j73939l87745
53602C0374898o08953q75923j186872j507404j792067k004407k128115k169904
53594A8101253k155626k119652k089623k073085k053609j999611j882786j698074
53586B029187j474235j265446j123505j065423j059582j043120r60081p94311
53578f756516n77025l67815k22370j63236j67003j75209j25011J7818K44477N14997
53568g776893P83809J018474J201234J319872J361885J319202J198881J028386
53560A454850Q47714O91209N70584M70305L57390J98256k6581l14498o39796r59196
$$ plain form
53619 -3464245 -1674204 495901 3110593 6171905 9592015 13204911 16809775 20217761
53611 20217761 23277626 25878121 27943579 29438525 30380357 30843170 30936582 30762643 30374898
53602 30374898 29765945 28890022 27703150 26195746 24403679 22399272 20271157 18101253
53594 18101253 15945627 13825975 11736352 9663267 7609658 5610047 3727261 2029187
53586 2029187 554952 -710494 -1833999 -2899422 -3959004 -5002124 -5962205 -6756516
53578 -6756516 -7333541 -7701356 -7923726 -8086962 -8253965 -8429174 -8554185 -8536367 -8291890 -7776893
53568 -7776893 -6993084 -5974610 -4773376 -3453504 -2091619 -772417 426464 1454850
53560 1454850 2302564 2993773 3564357 4034662 4392052 4590308 4563727 4249229 3609433 2650237
53550B650237j223589j394069j457202j432034j362670j298110j272014j297717
53542h087168j380176j528382j750777k036482k342824k604007k755037k753912
53534b5238765k591220k286756j877389j402687q96486l88328R1330N12087Q51853
53525c3226361J103659J274082J376020J422439J423334J384630J309315J201926
53517b2730956J073779R43636Q31889P53258P14700P19478P71610Q74451J023724
53508a5024431J200911J372261J494207J523926J434119J228063R45726O52141
53500e173077M10210K52590J70054J23662P3162L925o4534r3031m9692O7718K25192
53489d053821L62298M13150L31446J10762k08746n50987q27873r67890r39836
$$ plain form
53550 2650237 1426648 32579 -1424623 -2856657 -4219327 -5517437 -6789451 -8087168
53542 -8087168 -9467344 -10995726 -12746503 -14782985 -17125809 -19729816 -22484853 -25238765
53534 -25238765 -27829985 -30116741 -31994130 -33396817 -34293303 -34681631 -34590301 -34078214 -33226361
53525 -33226361 -32122702 -30848620 -29472600 -28050161 -26626827 -25242197 -23932882 -22730956
53517 -22730956 -21657177 -20713541 -19881652 -19128394 -18413694 -17694216 -16922606 -16048155 -15024431
53508 -15024431 -13823520 -12451259 -10957052 -9433126 -7999007 -6770944 -5825218 -5173077
53500 -5173077 -4762867 -4510277 -4340223 -4216561 -4143399 -4139474 -4204008 -4297039 -4346731 -4279013 -4053821
53489 -4053821 -3691523 -3278373 -2946927 -2836165 -3044911 -3595898 -4423771 -5391661 -6331497
53480f331497p62844m97473k21121O48J34790J87319J95203K06566K57317L57046
53470f474046M92551O43924P98571R52973J104424J241964J342938J375782J307346
53461B786427J113401P90100L60994j26705o17624j066927j449029j750439j954815
53452a914617k035751j966083j738378j381078r56718n40126j88278P9977K82115
53443a0358937M50478O06412P46496Q47238Q81289Q32405P01198N02996K62943
53434d527482J0147k29482m39165o10946p39408q16626q33931p87242o79340n18319
53424a0171794l16751r3449J26022L13555M46291N13654N19687M79352M11882
53415g771551L37286K78407K62238L12385M35210O12594Q09376R88909J124233
$$ plain form
53480 -6331497 -7094341 -7591814 -7812935 -7812287 -7677497 -7490178 -7294975 -7088409 -6831092 -6474046
53470 -6474046 -5981495 -5337571 -4539000 -3586027 -2481603 -1239639 103299 1479081 2786427
53461 2786427 3899828 4689928 5050922 4924217 4306593 3239666 1790637 40198 -1914617
53452 -1914617 -3950368 -5916451 -7654829 -9035907 -9992625 -10532751 -10721029 -10641052 -10358937
53443 -10358937 -9908459 -9302047 -8555551 -7708313 -6827024 -5994619 -5293421 -4790425 -4527482
53434 -4527482 -4517335 -4746817 -5185982 -5796928 -6536336 -7352962 -8186893 -8974135 -9653475 -10171794
53424 -10171794 -10488545 -10581994 -10455972 -10142417 -9696126 -9182472 -8662785 -8183433 -7771551
53415 -7771551 -7434265 -7155858 -6893620 -6581235 -6146025 -5533431 -4724055 -3735146 -2610913
53406b610913J200975J216700J179703J104941J006771Q93286P65916O21428M52221
53397E831028K46963k713k89637n82389q31200r88876j034299r82340q73124p48700
53387b55287o33674n31218m32292l26810k08479p3689Q1081K60546M69527P07918
53377i42377R62452J202146J385330J477630J469072J378152J240778J092063
53369I265246R51482Q18757O81874N31082L67672K00757L7034j25165k92111m66481
53359A1970147o42979q10914r60818j089482j198128j283066j326252j296741
53351C361767j165648r24408n93306k16893J48059M46448O38005P06083O57935
53342C058042N18221L22930J16584n3388j50231j62825j09253k5391N1067Q9039
$$ plain form
53406 -2610913 -1409938 -193238 986465 2091406 3098177 3991463 4757379 5378807 5831028
53397 5831028 6077991 6075278 5785641 5203252 4372052 3383176 2348877 1366537 493413 -255287
53387 -255287 -888961 -1420179 -1852471 -2179281 -2387760 -2461449 -2380368 -2119822 -1650295 -942377
53377 -942377 20075 1222221 2607551 4085181 5554253 6932405 8173183 9265246
53369 9265246 10216728 11035485 11717359 12248441 12616113 12816870 12853904 12728739 12436628 11970147
53359 11970147 11327168 10516254 9555436 8465954 7267826 5984760 4658508 3361767
53351 3361767 2196119 1271711 678405 461512 609571 1056019 1694024 2400107 3058042
53342 3058042 3576263 3899193 4015777 3962389 3812158 3649333 3540080 3514689 3565756 3654795
53332C654795O4294l9730k24713m68885p27608r47157j083605j113781j033200
53323a919590q47865n69642k17150J82370N93019R71797J273600J462664J526370
53314B455573J480120J357687J195082J019780Q47417O81176N13628L34616J42044
53305A0027123n4183k37731l92025m99940n42530n05742l93554k36544q8236j0031
53295G066607m9677k20875m95122q14190j117373j364706j541826j650461j699440
53286a887063j703596j684089j661200j641634j611461j542530j408810j202274
53278a4342657r39650o57275l96675j88546m4395M0974Q2977J05223J40279K24449
53268a5975296L85149O31098R53100J330113J730917K112143K421663K611124
$$ plain form
53332 3654795 3719089 3679359 3454646 2985761 2258153 1310996 227391 -886390 -1919590
53323 -1919590 -2767455 -3337097 -3554247 -3371877 -2778858 -1807061 -533461 929203 2455573
53314 2455573 3935693 5293380 6488462 7508242 8355659 9036835 9550463 9885079 10027123
53305 10027123 9972940 9735209 9343184 8843244 8300714 7794972 7401418 7164874 7076638 7066607
53295 7066607 7016930 6796055 6300933 5486743 4369370 3004664 1462838 -187623 -1887063
53286 -1887063 -3590659 -5274748 -6935948 -8577582 -10189043 -11731573 -13140383 -14342657
53278 -14342657 -15282307 -15939582 -16336257 -16524803 -16569198 -16528224 -16445247 -16340024 -16199745 -15975296
53268 -15975296 -15590147 -14959049 -14005949 -12675836 -10944919 -8832776 -6411113 -3799989
53260c799989K651109K540276K304499J986035J627017J255874Q85060N19984
53252I969865J71010j39564l79515n18594n47025m89922m05307l63823m21226
53243F875899n97250q68054j173784j438460j593044j590478j410189j059612
53235b854972n76704k6289N15479R80250J316838J490468J483985J306393R99585
53226D635033O31731K78010r40j73154k38407k21501j60111r2848n1312n6242
53216D550259j16011k26016l68367n12663o20269o53761n89343m26721j92357
53207H44751O4497K82386M03886L93489K49112K76l06907o30446r48124j259186
53197i06266j569495j868615k116293k252390k226689k027006j684376j253882
$$ plain form
53260 -3799989 -1148880 1391396 3695895 5681930 7308947 8564821 9449881 9969865
53252 9969865 10140875 10001311 9621796 9103202 8556177 8066255 7660948 7297125 6875899
53243 6875899 6278649 5410595 4236811 2798351 1205307 -385171 -1795360 -2854972
53235 -2854972 -3431676 -3457965 -2942486 -1962236 -645398 845070 2329055 3635448 4635033
53226 4635033 5266764 5544774 5543834 5370680 5132273 4910772 4750661 4657813 4606501 4550259
53216 4550259 4434248 4208232 3839865 3327202 2706933 2053172 1463829 1037108 844751
53207 844751 909248 1191634 1595520 1989009 2238121 2238397 1931490 1301044 352920 -906266
53197 -906266 -2475761 -4344376 -6460669 -8713059 -10939748 -12966754 -14651130 -15905012
$$ [...]
##END NTUPLES=NMR SPECTRUM
##END=
