##TITLE=31Pdec_DE-58_Ac6_1d
 
 64 sc
 4.6.2024
##JCAMPDX= 6.0         $$ Bruker NMR JCAMP-DX V2.0
##DATA TYPE= NMR SPECTRUM
##DATA CLASS= NTUPLES
##ORIGIN= UXNMR, Bruker Analytische Messtechnik GmbH
##OWNER= root
$$ XWIN-NMR		Version 3.5
$$ Tue Jun  4 13:51:15 2024 Russian Standard Time (UT+4h)  she@DPX200
##.OBSERVE FREQUENCY= 81.013821
##.OBSERVE NUCLEUS= ^31P
##.ACQUISITION MODE= SIMULTANEOUS
##.ACQUISITION SCHEME= undefined
##.AVERAGES= 64
##.DIGITISER RES= 16
##SPECTROMETER/DATA SYSTEM= spect
##.PULSE SEQUENCE= zgpg30
##.SOLVENT NAME= CDCl3
##.SHIFT REFERENCE= (INTERNAL, CDCl3, 0, 248.564)
##AUDIT TRAIL= $$ (NUMBER, WHEN, WHO, WHERE, WHAT)
$$ ##TITLE= Audit trail, XWIN-NMR		Version 3.5
$$ ##JCAMPDX= 5.01
$$ ##ORIGIN= Bruker BioSpin GmbH
$$ ##OWNER= she
$$ F:/spectra/data/she/nmr/P31/1/pdata/1/auditp.txt
$$ ##AUDIT TRAIL=  $$ (NUMBER, WHEN, WHO, WHERE, WHAT)
(   1,<2024-06-04 13:50:22.34 +0400>,<she>,<DPX200>,
      <continue with go, POWCHK disabled, PULCHK disabled
       configuration hash MD5:
       00 E9 B6 7A A2 85 ED C7 34 08 36 98 17 FE 4E 26
       data hash MD5: 32K
       A6 80 89 F1 2E 05 D8 8A 8F 62 99 FB 5A F1 F7 F4>)
(   2,<2024-06-04 13:50:24.15 +0400>,<she>,<DPX200>,
      <Start of raw data processing
       efp BC_mod = 2 LB = 10 FT_mod = 6 PKNL = 1 PHC0 = -179.3659 PHC1 = 0 SI = 64K 
       data hash MD5: 64K
       10 0A 8E 2D A0 A2 4E AB EA 9C 2F FA A2 57 D7 47>)
(   3,<2024-06-04 13:50:40.37 +0400>,<she>,<DPX200>,
      <pk PHC0 = -7.983661 PHC1 = 0 
       data hash MD5: 64K
       38 5D 19 64 5C D7 FE 77 20 7F 2F 74 C7 4D EA 63>)
(   4,<2024-06-04 13:50:45.35 +0400>,<she>,<DPX200>,
      <abs ABSG = 5 
       data hash MD5: 64K
       C1 CD A5 CE 9A 1C C3 BB C5 25 08 62 5E 11 B1 8A>)
$$ ##END=
$$ 
$$ hash MD5
$$ E8 32 75 6C E7 ED B9 38 62 08 86 A6 CA F4 1E 48
##$RELAX= 
##$RELAX= 
##$RELAX= 
##$RELAX= 
##$RELAX= 
##$RELAX= 
##$RELAX= 
##$RELAX= 
##$RELAX= 
$$ Bruker specific parameters
$$ --------------------------
##$DU= <F:/spectra>
##$EXPNO= 1
##$NAME= <P31>
##$PROCNO= 1
##$TYPE= <nmr>
##$USER= <she>
##$AMP= (0..31)
100 100 100 100 100 100 100 100 100 100 100 100 100 100 100 100 100 100 
100 100 100 100 100 100 100 100 100 100 100 100 100 100 
##$AQSEQ= 0
##$AQ_mod= 1
##$AUNM= <au_zg>
##$AUTOPOS= <>
##$BF1= 81.014009
##$BF2= 200.13
##$BF3= 200.13
##$BF4= 200.13
##$BF5= 200.13
##$BF6= 200.13
##$BF7= 200.13
##$BF8= 200.13
##$BYTORDA= 1
##$CFDGTYP= 0
##$CFRGTYP= 5
##$CHEMSTR= <none>
##$CNST= (0..31)
1 1 145 1 1 1 1 1 1 1 1 1 1 1 1 1 1 1 1 1 1 1 1 1 1 1 1 1 1 1 1 1 
##$CPDPRG= <waltz16>
##$CPDPRG1= <>
##$CPDPRG2= <waltz16>
##$CPDPRG3= <>
##$CPDPRG4= <mlev>
##$CPDPRG5= <mlev>
##$CPDPRG6= <mlev>
##$CPDPRG7= <mlev>
##$CPDPRG8= <mlev>
##$CPDPRGB= <>
##$CPDPRGT= <>
##$D= (0..31)
0 1 0 0 0 0 0 0 0 0 0 0.03 2e-05 3e-06 0 0 0 0 0 0 0 0 0 0 0 0 0 0 0 0 
0 0 
##$DATE= 1717494547
##$DBL= (0..7)
120 120 120 11 120 120 24 19 
##$DBP= (0..7)
150 150 150 150 150 150 150 150 
##$DBP07= 0
##$DBPNAM0= <>
##$DBPNAM1= <>
##$DBPNAM2= <>
$$ [...]
##$SUBNAM3= <"">
##$SUBNAM4= <"">
##$SUBNAM5= <"">
##$SUBNAM6= <"">
##$SUBNAM7= <"">
##$SUBNAM8= <"">
##$SUBNAM9= <"">
##$SW= 501.771253377433
##$SWIBOX= (0..15)
0 1 3 0 0 0 0 0 0 0 0 0 0 0 0 0 
##$SW_h= 40650.406504065
##$TD= 32768
##$TD0= 1
##$TE= 0
##$TE2= 300
##$TE3= 300
##$TEG= 300
##$TL= (0..7)
0 120 53 12 22 120 120 120 
##$TP= (0..7)
150 150 150 150 150 150 150 150 
##$TP07= 0
##$TPNAME0= <>
##$TPNAME1= <>
##$TPNAME2= <>
##$TPNAME3= <>
##$TPNAME4= <>
##$TPNAME5= <>
##$TPNAME6= <>
##$TPNAME7= <>
##$TPOAL= (0..7)
0.5 0.5 0.5 0.5 0.5 0.5 0.5 0.5 
##$TPOFFS= (0..7)
0 0 0 0 0 0 0 0 
##$TUNHIN= 0
##$TUNHOUT= 0
##$TUNXOUT= 0
##$USERA1= <user>
##$USERA2= <user>
##$USERA3= <user>
##$USERA4= <user>
##$USERA5= <user>
##$V9= 5
##$VALIST= <valist>
##$VCLIST= <CCCCCCCCCCCCCCC>
##$VD= 0
##$VDLIST= <DDDDDDDDDDDDDDD>
##$VPLIST= <PPPPPPPPPPPPPPP>
##$VTLIST= <TTTTTTTTTTTTTTT>
##$WBST= 1024
##$WBSW= 4
##$XGAIN= (0..3)
0 0 0 0 
##$XL= 0
##$YL= 0
##$YMAX_a= 5133
##$YMIN_a= -4724
##$ZGOPTNS= <>
##$ZL1= 120
##$ZL2= 120
##$ZL3= 120
##$ZL4= 120
##$ABSF1= 248.5645
##$ABSF2= -253.2056
##$ABSG= 5
##$ABSL= 3
##$ALPHA= 0
##$AQORDER= 0
##$ASSFAC= 0
##$ASSFACI= 0
##$ASSFACX= 0
##$ASSWID= 0
##$AUNMP= <proc_1d>
##$AZFE= 0.1
##$AZFW= 0.5
##$BCFW= 0
##$BC_mod= 2
##$BYTORDP= 0
##$COROFFS= 0
##$CY= -3
##$DATMOD= 1
##$DC= 0
##$DFILT= <>
##$DTYPP= 0
##$F1P= 0
##$F2P= 0
##$FCOR= 1
##$FTSIZE= 65536
##$FT_mod= 6
##$GAMMA= 0
##$GB= 0
##$INTBC= 1
##$INTSCL= 6.047779e-11
##$ISEN= 30
##$LB= 10
##$LEV0= 0
##$LPBIN= 0
##$MAXI= 10000
##$MC2= 0
##$MEAN= 0
##$ME_mod= 0
##$MI= 50
##$NCOEF= 0
##$NC_proc= -10
##$NLEV= 6
##$NOISF1= 182.463
##$NOISF2= 159.3651
##$NSP= 0
##$NTH_PI= 0
##$NZP= 0
##$OFFSET= 248.5645
##$PC= 4
##$PHC0= -187.3496
##$PHC1= 0
##$PH_mod= 1
##$PKNL= yes
##$PPARMOD= 0
##$PSCAL= 0
##$PSIGN= 0
##$REVERSE= no
##$SF= 81.0140089999694
##$SI= 65536
##$SIGF1= 159.3651
##$SIGF2= -187.1042
##$SINO= 113.3802
##$SIOLD= 16384
##$SREGLST= <1H.CDCl3>
##$SSB= 0
##$STSI= 65536
##$STSR= 0
##$SW_p= 40650.406504065
##$SYMM= 0
##$S_DEV= 0
##$TDeff= 32768
##$TDoff= 0
##$TI= <>
##$TILT= no
##$TM1= 0
##$TM2= 0
##$TOPLEV= 0
##$USERP1= <user>
##$USERP2= <user>
##$USERP3= <user>
##$USERP4= <user>
##$USERP5= <user>
##$WDW= 1
##$XDIM= 65536
##$YMAX_p= 306406168
##$YMIN_p= -64791325
$$ End of Bruker specific parameters
$$ ---------------------------------
##NTUPLES= NMR SPECTRUM
##VAR_NAME=  FREQUENCY,     SPECTRUM/REAL,   SPECTRUM/IMAG
##SYMBOL=    X,             R,               I
##VAR_TYPE=  INDEPENDENT,   DEPENDENT,       DEPENDENT
##VAR_FORM=  AFFN,          ASDF,            ASDF
##VAR_DIM=   65536,         65536,           65536
##UNITS=     HZ,            ARBITRARY UNITS, ARBITRARY UNITS
##FACTOR=    0.620285442955139, 1,           1
##FIRST=     20137.2065510682, 0,            0
##LAST=      -20513.1999529968, 0,           0
##MIN=       -20513.1999529968, -64791325,   0
##MAX=       20137.2065510682, 306406168,    0
$$ Real data points
##PAGE= N=1
##DATA TABLE= (X++(R..R)), XYDATA
$$ [...]
13064B5889173j451613j779303j928427j893549j710186j443860j169661r50530
13056A3562044q23097p94696q49002r54973j074245j164789j183503j094099q82553
13047D741087n70910k14838J19010L81821N58153O61254P16583P45319P53681
13038G891160P30283O53650N08401L00511N9796j72781l62677m92036n59885n78745
13028G977677n72741n74614o16110p13103q55108j008242j130582j189464j170499
13019A47214j076328r20301p21117n00812k84788j00728K6504Q3969P9427M3483
13009c223477K1938O0939J90816M13969P00634R95316J234430J370003J388226
13000C152794J312234J187534J060298R62090R06385Q91976R06342R28602R35763
$$ y = [25889173, 24437560, 22658257, 20729830, 18836281, 17126095, 15682235, 14512574, 13562044, 12738947, 11944251, 11095249, 10140276, 9066031, 7901242, 6717739, 5623640, 4741087, 4170177, 3955339, 4074349, 4456170, 5014323, 5675577, 6392160, 7137479, 7891160, 8621443, 9275093, 9783494, 10084005, 10143801, 9971020, 9608343, 9116307, 8556422, 7977677, 7404936, 6830322, 6214212, 5501109, 4646001, 3637759, 2507177, 1317713, 147214, -929114, -1849415, -2570532, -3071344, -3356132, -3456860, -3430356, -3346387, -3266960, -3223477, -3201539, -3140600, -2949784, -2535815, -1835181, -839865, 394565, 1764568, 3152794, 4465028, 5652562, 6712860, 7674950, 8581335, 9473311, 10379653, 11308255, 12244018]
12991A2244018R11783Q53486P68525O67302N54675M26289K71948Q5080j27329
12982A6655777l42610n30823o66763p36038p33432o59609n21075l32573j19267
12973A2013587Q3005K31864K89650K38918R2126j12777l28451n15381o51135p29538
12963A0611868p53225p25740o49313n29520l81382k29435j00462j3731K5618K7580
12953G282258J2161l32J408J6427L5077M5052L6430O118l8354p9247r5496p2417
12941G149085p791Q8453J99125L06487L98202M69839N22632N58816N77441N71248
12931A0833537N24879M18175K37743q342k85145n42136p34958q44141q81665q85031
12921G832916r02836r76594j124597j334031j564575j761400j871648j857961
$$ y = [12244018, 13155801, 14009287, 14777812, 15445114, 15999789, 16426078, 16698026, 16783106, 16655777, 16313167, 15782344, 15115581, 14379543, 13646111, 12986502, 12465427, 12132854, 12013587, 12096592, 12328456, 12618106, 12857024, 12949150, 12836373, 12507922, 11992541, 11341406, 10611868, 9858643, 9132903, 8483590, 7954070, 7572688, 7343253, 7242791, 7229060, 7254678, 7282258, 7294419, 7294087, 7295495, 7311922, 7346999, 7392051, 7428481, 7434599, 7396245, 7316998, 7221502, 7149085, 7141294, 7229747, 7428872, 7735359, 8133561, 8603400, 9126032, 9684848, 10262289, 10833537, 11358416, 11776591, 12014334, 12005992, 11720847, 11178711, 10443753, 9599612, 8717947, 7832916, 6930080, 5953486, 4828889, 3494858, 1930283, 168883, -1702765, -3560726]
12913c560726j704419j414233j003409m97285O6811O35854J146156J541052J792434
12904b997765J910412J932582J900308J838891J753895J642204J505978J357367
12896A0843872J210990J071736R29883P68895N79761L69827J59875k6196j70193
12887A5738450k62304l00051k88042k39652j77482j29214j20034j65920k70057
12878A3785694m20436n88178p31534q09754q01105p11858n69695m08440k55739
12869H488955j27990k9962M3492J04422J69351K59102L97749O05543Q86389J218294
12859A2015345J555048J839962K024914K085809K027654J878124J674649J451805
12851B6553310J232365J021631Q06655N63991K75382n7205m07415p33655r95097
$$ y = [-3560726, -5265145, -6679378, -7682787, -8180072, -8113261, -7477407, -6331251, -4790199, -2997765, -1087353, 845229, 2745537, 4584428, 6338323, 7980527, 9486505, 10843872, 12054862, 13126598, 14056481, 14825376, 15405137, 15774964, 15934839, 15908643, 15738450, 15476146, 15176095, 14888053, 14648401, 14470919, 14341705, 14221671, 14055751, 13785694, 13365258, 12777080, 12045546, 11235792, 10434687, 9722829, 9153134, 8744694, 8488955, 8360965, 8331003, 8374495, 8478917, 8648268, 8907370, 9305119, 9910662, 10797051, 12015345, 13570393, 15410355, 17435269, 19521078, 21548732, 23426856, 25101505, 26553310, 27785675, 28807306, 29613961, 30177952, 30453334, 30396129, 29988714, 29255059, 28259962]
12842B8259962j165233j236614j216104j115747r47349p24908m70405k14245J2878
12833B1182235J90278L10633L74174L80333L25402K07987L5755j74557m04650
12824B2427590o42146q80347j111275j321020j494323j625043j722361j806611
12816A1824464j898679k011679k149139k306828k474061k633609k761744k829623
12808g240898k807065k669869k409037k036149j580691j082616n87259j44226
12800b0557810J95932L91779M24200L04819P5306k01380m54186o17142o38798
12791b1077280m88561j63804L02262Q39606J354462J752958J964182J956028J744470
12782a1815677J395159J010423O98568N36460N44601O86875Q91409J079011J186206
$$ y = [28259962, 27094729, 25858115, 24642011, 23526264, 22578915, 21854007, 21383602, 21169357, 21182235, 21372513, 21683146, 22057320, 22437653, 22763055, 22971042, 23006797, 22832240, 22427590, 21785444, 20905097, 19793822, 18472802, 16978479, 15353436, 13631075, 11824464, 9925785, 7914106, 5764967, 3458139, 984078, -1649531, -4411275, -7240898, -10047963, -12717832, -15126869, -17163018, -18743709, -19826325, -20413584, -20557810, -20361878, -19970099, -19545899, -19241080, -19165774, -19367154, -19821340, -20438482, -21077280, -21565841, -21729645, -21427383, -20587777, -19233315, -17480357, -15516175, -13560147, -11815677, -10420518, -9410095, -8711527, -8175067, -7630466, -6943591, -6052182, -4973171, -3786965]
12773c786965J177411J047979Q22189N47494K83181Q3343k0325k7964L0865J09455
12763B66663J60793J53814Q4353k3045j23916j70395j29137P044K19368M75274
12753I20816P45710J016721J288358J563738J838620K099804K330973K517614
12745A4322354K645724K697813K653990K500639K240924J898243J508432J104578
12737C1572697P04210L08134q7700m76165q31626j117074j300153j367013j326651
12728B6078659j205282j034858q41944o43385m51591k84079j65955j18712j42444
12719B1190409k08439k72723l02657k96087k78931k85641l38740m39333n69558
12710A8198300p01922q11092q84081r24477r49164r80836j040173j137925j266544
$$ y = [-3786965, -2609554, -1561575, -739386, -191892, 91289, 174632, 154307, 126343, 157208, 266663, 427456, 581270, 665623, 642578, 518662, 348267, 219130, 226174, 445542, 920816, 1666526, 2683247, 3971605, 5535343, 7373963, 9473767, 11804740, 14322354, 16968078, 19665891, 22319881, 24820520, 27061444, 28959687, 30468119, 31572697, 32276907, 32585041, 32497341, 32021176, 31189550, 30072476, 28772323, 27405310, 26078659, 24873377, 23838519, 22996575, 22353190, 21901599, 21617520, 21451565, 21332853, 21190409, 20981970, 20709247, 20406590, 20110503, 19831572, 19545931, 19207191, 18767858, 18198300, 17496378, 16685286, 15801205, 14876728, 13927564, 12946728, 11906555, 10768630, 9502086]
12701I502086j396037j480975j478543j367454j156079q77130n75783k99277r0453
12692G80355J7441P397j14463l15947n43165p31657q21100p70312n68946k40804
12682c301201J65455N94942J002908J358096J634873J807261J854887J775882
12674F893103J592218J340658J057608P70978N01903K67994Q1095n7789j59880
12665A2287888k45053l36492m54105o04136p67461q96728r30648q20276n51323
12656F681666j49834L27967Q12102J234522J543484J715939J761969J714996J611235
12647A7254046J471938J300218J091478Q46427N77361L06450N9206j44134k95533
12638B2467457l99203m62699m86111m60171l76440k39560o8771J12900K90130
$$ y = [9502086, 8106049, 6625074, 5146531, 3779077, 2622998, 1745868, 1170085, 870808, 780355, 797796, 805193, 690730, 374783, -168382, -900039, -1721139, -2491451, -3060397, -3301201, -3135746, -2540804, -1537896, -179800, 1455073, 3262334, 5117221, 6893103, 8485321, 9825979, 10883587, 11654565, 12156468, 12424462, 12505557, 12447768, 12287888, 12042835, 11706343, 11252238, 10648102, 9880641, 8983913, 8053265, 7232989, 6681666, 6531832, 6859799, 7671901, 8906423, 10449907, 12165846, 13927815, 15642811, 17254046, 18725984, 20026202, 21117680, 21964107, 22541468, 22847918, 22907124, 22762990, 22467457, 22068254, 21605555, 21119444, 20659273, 20282833, 20043273, 19974502, 20087402, 20377532]
12629B0377532M55339N98075O96749P24037O63514N23826L38348J50456m969j12944
12619B4409963j79048k22718k67583l30148m07949m73416m83232m04794k44140
12610B1396935n1436J04737J75853J54782O7085n3742j83898l09925m19993m98274
12600B0382124n27835m99138m17471l03352j84917q7321k6244p803l0956q7757
12590A8209330j61649k27209k54072k15286r8795Q1580K82566M41711N00675M31183
12580A8990034K49863J3819k00923l28046l34409k29733o0864J05127K02209J84990
12570A8592067M1683k03028m96011p71465r69513j053079j019309r01041p54849
12561A2465455o38377n87326o04427o64840p31754p71455p61379o91681n63906
$$ y = [20377532, 20832871, 21430946, 22127695, 22851732, 23515246, 24039072, 24377420, 24527876, 24522907, 24409963, 24230915, 24008197, 23740614, 23410466, 23002517, 22529101, 22045869, 21641075, 21396935, 21345499, 21450236, 21626089, 21780871, 21847956, 21794214, 21610316, 21300391, 20880398, 20382124, 19854289, 19355151, 18937680, 18634328, 18449411, 18362090, 18335846, 18328043, 18297087, 18209330, 18047681, 17820472, 17566400, 17351114, 17252319, 17333899, 17616465, 18058176, 18558851, 18990034, 19239897, 19253716, 19052793, 18724747, 18390338, 18160605, 18099741, 18204868, 18407077, 18592067, 18633750, 18430722, 17934711, 17163246, 16193733, 15140654, 14121345, 13220304, 12465455, 11827078, 11239752, 10635325, 9970485, 9238731, 8467276, 7705897, 7014216, 6450310]
12552F450310l88738j83180L1833K32175L90554M79788M82337M03108K76760J60858
12542H335805J14453J72036L27871N40613P55284R28508J041611J096292J100284
12533A4412757J055880R59148Q07794O09775L85352J60186m6978k34034m14301
12524A7695579o02680p98357r78422j108991j165007j142502j055430r24275p69293
12515I150622o13065m85347m20487m45002n62594p47220r50641j122089j229957
12506B574220j272703j271553j249232j210007j136601j006021q09941n62314
12498e944152k90492k1917K20713M15705N40691N80815N43060M64786M06939M32561
12488b651291N80895Q49331J189715J518908J741299J778756J597790J219767
$$ y = [6450310, 6061572, 5878392, 5910225, 6142400, 6532954, 7012742, 7495079, 7898187, 8174947, 8335805, 8450258, 8622294, 8950165, 9490778, 10246062, 11174570, 12216181, 13312473, 14412757, 15468637, 16427785, 17235579, 17845354, 18230706, 18390892, 18343914, 18109880, 17695579, 17092899, 16294542, 15316120, 14207129, 13042122, 11899620, 10844190, 9919915, 9150622, 8537557, 8052210, 7631723, 7186721, 6624127, 5876907, 4926266, 3804177, 2574220, 1301517, 29964, -1219268, -2429275, -3565876, -4571897, -5381838, -5944152, -6234644, -6256561, -6035848, -5620143, -5079452, -4498637, -3955577, -3490791, -3083852, -2651291, -2070396, -1221065, -31350, 1487558, 3228857, 5007613, 6605403, 7825170]
12480G825170P08382J43736m01129q73827j248796j527719j731284j882966j993956
12471i82389k058940k062376j987195j819685j551221j180709p19566j96494L43694
12462a2214881Q50099J279163J601439J798434J857817J775966J565352J255810
12454b30801Q84952M85196P7697l24240p07815j055945j347570j561525j680555
12445e460606j693579j597345j398946j116823p76025l98370M889M30841Q74659
12436a1131305J319614J734347K078073K310608K403763K350827K170234J901006
12428E137167J591672J288280J026723Q30437P10615O66098O82713P34695P90906
12419A3459306Q25986Q31989Q22322Q22540Q52274R11337R80657J035551J058650
$$ y = [7825170, 8533552, 8677288, 8276159, 7402332, 6153536, 4625817, 2894533, 1011567, -982389, -3041329, -5103705, -7090900, -8910585, -10461806, -11642515, -12362081, -12558575, -12214881, -11364782, -10085619, -8484180, -6685746, -4827929, -3051963, -1486611, -230801, 654151, 1139347, 1217044, 892804, 184989, -870956, -2218526, -3780051, -5460606, -7154185, -8751530, -10150476, -11267299, -12043324, -12441694, -12436805, -12005964, -11131305, -9811691, -8077344, -5999271, -3688663, -1284900, 1065927, 3236161, 5137167, 6728839, 8017119, 9043842, 9874279, 10584894, 11250992, 11933705, 12668400, 13459306, 14285292, 15117281, 15939603, 16762143, 17614417, 18525754, 19506411, 20541962, 21600612]
12410B1600612J042258R81561Q67817O88918M36712J14753k59250o56692j042921
12401B3773768j380858j634685j775391j786159j664208j420232j080079o88653
12393A2343503l09043j0708J49440J42080l1162l44074p53810j204593j629325
12384H352308j957189k132121k135587j998421j791069j596485j480453j472382
12376f211399j560672j700654j831357j895741j857455j708384j466532j168355
12368a9400549q59139n81643l62948k04628q4861K5403J43179K66379L82332M80035
12358b0196440N54567O05789O40670O78874P50501Q80457J070711J297488J526643
12349a2190740J733217J908618K052286K158365K209311K179112K041011J775300
$$ y = [21600612, 22642870, 23624431, 24492248, 25181166, 25617878, 25732631, 25473381, 24816689, 23773768, 22392910, 20758225, 18982834, 17196675, 15532467, 14112235, 13032156, 12343503, 12034460, 12023752, 12173192, 12315272, 12284110, 11940036, 11186226, 9981633, 8352308, 6395119, 4262998, 2127411, 128990, -1662079, -3258564, -4739017, -6211399, -7772071, -9472725, -11304082, -13199823, -15057278, -16765662, -18232194, -19400549, -20259688, -20841331, -21204279, -21408907, -21493768, -21468365, -21325186, -21058807, -20676475, -20196440, -19641873, -19036084, -18395414, -17716540, -16966039, -16085582, -15014871, -13717383, -12190740, -10457523, -8548905, -6496619, -4338254, -2128943, 50169, 2091180, 3866480]
12341C866480J378202Q72917L16754k05750o06605q23679q38697o75962l87835
12332B895825l8528L08320N99828Q03915R16203R58295R65930R71701R89974J010058
12322A0381521J000188R20833P41535M53666P4938l53058p71260j114251j327408
12313A0006704j385227j299920j113702q80629o50668m62667l42179k97434l13563
12304C260715l52653l65981l15865j95539l4328J15422K00803J86433O1265j62166
12294B398106m49624p48601r98723j149592j177059j087531r08912o75702m16984
12285e214622j51145J12338L65868N95497P76986Q78766Q69619P28064M52428
12276e86201O9935l61216p63113j060996j206358j187934j026502p59807m28190
$$ y = [3866480, 5244682, 6117599, 6434353, 6228603, 5621998, 4798319, 3959622, 3283660, 2895825, 2857297, 3165617, 3765445, 4569360, 5485563, 6443858, 7409788, 8381489, 9371463, 10381521, 11381709, 12302542, 13044077, 13497743, 13572681, 13219623, 12448363, 11334112, 10006704, 8621477, 7321557, 6207855, 5327226, 4676558, 4213891, 3871712, 3574278, 3260715, 2908062, 2542081, 2226216, 2030677, 1996349, 2111771, 2312574, 2499007, 2560272, 2398106, 1948482, 1199881, 201158, -948434, -2125493, -3213024, -4121936, -4797638, -5214622, -5365767, -5253429, -4887561, -4292064, -3515078, -2636312, -1766693, -1038629, -586201, -516266, -877482, -1640595, -2701591, -3907949, -5095883, -6122385, -6882192, -7310382]
12267g310382o8984K80222N77342P80028Q59741Q16181O79523M96951L12311J52225
12257b424842K5050p1523j42943j94799k31866k55940k64392k54381k31791k15621
12247d263048k29246k82774l62053m35794m75672m72498m37245l90613l52294
12238g701237l35426l43554l67563l85019l65177k78121j03469J64121N12770
12229i202675R15029J333978J732087K078480K351102K533963K613011K575800
12221F930775K418033K153629J819137J465220J138732Q67134O54123M85224L36785
12212A8268792J83991P236k03024m43406o97272r38296j138868j280679j360833
12203A2397641j389081j380117j349512j316014j303641j335921j423771j556631
$$ y = [-7310382, -7379366, -7099144, -6521802, -5741774, -4882033, -4065852, -3386329, -2889378, -2577067, -2424842, -2399792, -2471315, -2614258, -2809057, -3040923, -3296863, -3561255, -3815636, -4047427, -4263048, -4492294, -4775068, -5137121, -5572915, -6048587, -6521085, -6958330, -7348943, -7701237, -8036663, -8380217, -8747780, -9132799, -9497976, -9776097, -9879566, -9715445, -9202675, -8287646, -6953668, -5221581, -3143101, -791999, 1741964, 4354975, 6930775, 9348808, 11502437, 13321574, 14786794, 15925526, 16792660, 17446783, 17932007, 18268792, 18452783, 18460019, 18256995, 17813589, 17116317, 16178021, 15039153, 13758474, 12397641, 11008560, 9628443, 8278931, 6962917, 5659276, 4323355, 2899584, 1342953]
12195A342953j704478j828919j895388j881323j780610j604817j378330j126557
12187a1857469q64625n97082l28625p3076J50846L33084M81267O17402P66852
12178a1371426R48001J165936J409875J654782J867498K015149K072985K030981
12170A793781J898757J705472J490928J289936J118705R71515Q28405O67652M75680
12161A2240831K50625o9k64839n32331p92847j037965j260727j457269j628297
12152E517112j778782j915776k044208k160034k243220k258616k170861j967606
12144a1021991j674020j345879j045411q16661o73963o05782n87790n97316o22056
12135a8990869o59422p08562p60964p94541p74077o61244m34909j12145K48081
$$ y = [1342953, -361525, -2190444, -4085832, -5967155, -7747765, -9352582, -10730912, -11857469, -12722094, -13319176, -13647801, -13720877, -13570031, -13236947, -12755680, -12138278, -11371426, -10423425, -9257489, -7847614, -6192832, -4325334, -2310185, -237200, 1793781, 3692538, 5398010, 6888938, 8178874, 9297579, 10269094, 11097499, 11765151, 12240831, 12491456, 12491387, 12226548, 11694217, 10901370, 9863405, 8602678, 7145409, 5517112, 3738330, 1822554, -221654, -2381688, -4624908, -6883524, -9054385, -11021991, -12696011, -14041890, -15087301, -15903962, -16577925, -17183707, -17771497, -18368813, -18990869, -19650291, -20358853, -21119817, -21914358, -22688435, -23349679, -23784588, -23896733, -23648652]
12126b3648652N68039P88017Q90459Q96627Q45071P72362P06775O70123O77663
12117a6833516P33239Q25487R32388J034681J130358J240029J398920J639876
12109g898538J976033K389959K831930L227301L491639L550844L362005K928611
12101A5859784K302679J569314Q18692J20545m83987r72322j326967j534360j597292
12092A4756086j547406j443659j354877j335969j409851j561674j745492j899794
12084B457364j967030j911515j730216j452314j127353q07078n29389l11600j54130
12075g533261m9092J3887M7480O7472Q8012J11511J22251R2928L468j39415k94661
12064g469420l96740l78766j98623J43473O03309J105834J565617J906893K079331
$$ y = [-23648652, -23080613, -22292596, -21402137, -20505510, -19660439, -18888077, -18181302, -17511179, -16833516, -16100277, -15274790, -14342402, -13307721, -12177363, -10937334, -9538414, -7898538, -5922505, -3532546, -700616, 2526685, 6018324, 9569168, 12931173, 15859784, 18162463, 19731777, 20550469, 20671014, 20187027, 19214705, 17887738, 16353378, 14756086, 13208680, 11765021, 10410144, 9074175, 7664324, 6102650, 4357158, 2457364, 490334, -1421181, -3151397, -4603711, -5731064, -6538142, -7067531, -7379131, -7533261, -7582353, -7568466, -7520986, -7453514, -7365502, -7253991, -7131740, -7038812, -7035344, -7174759, -7469420, -7866160, -8244926, -8443549, -8300076, -7696767, -6590933, -5025316, -3118423, -1039092]
12055a039092K066712J885007J569857J161162O94728K03345k79828p22342j097277
12046D442272j386843j582964j686510j706204j656362j553931j416356j259267
12038g806165j090873r04169o75332l75498P927M54958R13813J318630J613606
12029f543103J771499J798297J722095J572551J364619J097957P70152L90274
12021C944341j8323m24158p93630j092337j284776j336778j221527r28033m70368
12012c625589J06527P30771J320124J805713K151463K359132K456722K476664
12004I781527K436372K333101K156600J909914J621133J334792J088370Q92524
11996B3554333P30245N72900L97516J92924m3746l10977o02890r08352j211911
$$ y = [-1039092, 1027620, 2912627, 4482484, 5643646, 6338374, 6541719, 6261891, 5539549, 4442272, 3055429, 1472465, -214045, -1920249, -3576611, -5130542, -6546898, -7806165, -8897038, -9801207, -10476539, -10852037, -10844110, -10389152, -9475339, -8156709, -6543103, -4771604, -2973307, -1251212, 321339, 1685958, 2783915, 3554067, 3944341, 3926018, 3501860, 2708230, 1615893, 331117, -1005661, -2227188, -3155221, -3625589, -3519062, -2788291, -1468167, 337546, 2489009, 4848141, 7304863, 9781527, 12217899, 14551000, 16707600, 18617514, 20238647, 21573439, 22661809, 23554333, 24284578, 24857478, 25254994, 25447918, 25404172, 25093195, 24490305, 23581953, 22370042]
11987B2370042j494964j735725j910599j999905j996068j908711j762865j590767
11979G970438j420570j266832j127411r87722q28071o28333l69143l4283L81405
11970A689478Q60876J358692J807562K138065K302446K289191K120767J838641
11962A6405718J486348J098542O96887K91367j13532n10263q84080j218127j503422
11953A5749438j744044j953562k148316k343440k550544k773802l006583l233676
11945d004529l437748l602038l705518l717150l598983l319368k867934k263022
11937c0516290j549342p90327n9969N65755J021204J267289J304679J175261R50637
11928b6631103P14461N44954M98265N93605Q07519J084650J361540J589276J742917
$$ y = [22370042, 20875078, 19139353, 17228754, 15228849, 13232781, 11324070, 9561205, 7970438, 6549868, 5283036, 4155625, 3167903, 2339832, 1711499, 1342356, 1308073, 1689478, 2550354, 3909046, 5716608, 7854673, 10157119, 12446310, 14567077, 16405718, 17892066, 18990608, 19687495, 19978862, 19865330, 19355067, 18470987, 17252860, 15749438, 14005394, 12051832, 9903516, 7560076, 5009532, 2235730, -770853, -4004529, -7442277, -11044315, -14749833, -18466983, -22065966, -25385334, -28253268, -30516290, -32065632, -32855959, -32915928, -32350173, -31328969, -30061680, -28757001, -27581740, -26631103, -25916642, -25371688, -24873423, -24279818, -23472299, -22387649, -21026109, -19436833, -17693916]
11919a7693916J817112J815891J744431J606073J404356J147334Q50713N36717
11911f771289K28144n9341l20288n52535p43779q64801q80722p75164n67651l08692
11901a1616118n6475J46788K84420L59843L84293L65879L04965J97626M5189j36996
11891i720586l19690m70710n68681o08140n92726n24852m02228k22590R949K82327
11881a3137927N73165Q54325J093007J254438J304879J216539R77090O01408J36482
11872e126594l48242p81881j112073j313015j380582j322386j152251q92770n80846
11863a4010640k67082m699J67521K38877K30240J85610J54707J72722K44975L42456
11853a2545313M10755L91579K51145K401k94037n54555p09034p27499o24662m45677
$$ y = [-17693916, -15876804, -14060913, -12316482, -10710409, -9306053, -8158719, -7308006, -6771289, -6543145, -6602486, -6922774, -7475309, -8219088, -9083889, -9964611, -10739775, -11307426, -11616118, -11672593, -11525805, -11241385, -10881542, -10497249, -10131370, -9826405, -9628779, -9583590, -9720586, -10040276, -10510986, -11079667, -11687807, -12280533, -12805385, -13207613, -13430203, -13420254, -13137927, -12564762, -11710437, -10617430, -9362992, -8058113, -6841574, -5864484, -5263076, -5126594, -5474836, -6256717, -7368790, -8681805, -10062387, -11384773, -12537024, -13429794, -14010640, -14277722, -14282421, -14114900, -13876023, -13645783, -13460173, -13305466, -13132744, -12887769, -12545313, -12134558, -11742979, -11491834, -11489433, -11783470, -12338025, -13047059, -13774558, -14399220, -14844897]
11843a4844897k44276o3915P1361J55362J93647K01132K04559K41838L50866N50534
11833a3183789Q25602J125560J378895J516309J493565J306715R95444O32594
11825c909105L01012O4726n2055o5592j1754Q2728K17264M11496O81328J014750
11815a265202J365258J668172J868961J945250J910192J797906J641854J459126
11807A2391517J248804J003097P21932M20308J24769j36795l45240m96148o00709
11798A4331535o82054p68595q86518j052353j266287j508932j745778j939252
11790D481766k061466k099560k052820j927825j736925j498792j236641r73068
11782i105331p24935n01836l07836j43045k391J27104K65997M35169O43449Q77921
$$ y = [-14844897, -15089173, -15153088, -15081727, -14926365, -14732718, -14531586, -14327027, -14085189, -13734323, -13183789, -12358187, -11232627, -9853732, -8337423, -6843858, -5537143, -4541699, -3909105, -3608093, -3543367, -3595422, -3661014, -3672768, -3590040, -3372776, -2961280, -2279952, -1265202, 100056, 1768228, 3637189, 5582439, 7492631, 9290537, 10932391, 12391517, 13640321, 14643418, 15365350, 15785658, 15910427, 15773632, 15428392, 14932244, 14331535, 13649481, 12880886, 11994368, 10942015, 9675728, 8166796, 6421018, 4481766, 2420300, 320740, -1732080, -3659905, -5396830, -6895622, -8132263, -9105331, -9830266, -10332102, -10639938, -10782983, -10785374, -10658270, -10392273, -9957104, -9313655, -8435734]
11772h435734J104616J280035J366391J342755J209170R85362P05840M12757J47979
11763A19171n4612j76383k18799k01607j53299j00516o4718o5559j21884k45276
11753a283482m31271o56079q80702j060660j160371j168163j101759r96429q82105
11744i621021p66153o32789m56554k19889P3678L96185P03687R52672J115430
11735h454754J187181J184063J134934J069426J004958R37620Q43075O90366M64057
11726F0926J82321j02693l25538m36964m23627l08613j36875M4750K04931L35335
11716i06047M43407N35442O05396O40954O39998O17739N94142N73122N35419M54022
11706D733594L18602J47344k1641j48151k02465j69553n0455J37115L62507N90597
$$ y = [-8435734, -7331118, -6051083, -4684692, -3341937, -2132767, -1147405, -441565, -28808, 119171, 64559, -111824, -330623, -532230, -685529, -786045, -850763, -916322, -1038206, -1283482, -1714753, -2370832, -3251534, -4312194, -5472565, -6640728, -7742487, -8738916, -9621021, -10387174, -11019963, -11476517, -11696406, -11622728, -11226543, -10522856, -9570184, -8454754, -7267573, -6083510, -4948576, -3879150, -2874192, -1936572, -1093497, -403131, 60926, 243247, 140554, -184984, -621948, -1045575, -1354188, -1491063, -1446313, -1241382, -906047, -462640, 72802, 678198, 1319152, 1959150, 2576889, 3171031, 3744153, 4279572, 4733594, 5052196, 5199540, 5177899, 5029748, 4827283, 4657730, 4607275, 4744390, 5106897, 5697494]
11696E697494P89540R33806J004679R91110Q90779P10908M70387K01717n3446
11687A1636974k58424l98029m85041n51008o26747p24054q28971r10274r37123
11678E917303q93824p83750o24215m39220k54170r3435J9644O2574J8380j13999
11668B815288l11687n32421p31167q76967r59179r83080r61840r10415q41683
11659d293151p63126o74190n66558m28951k54372m5609J82983M06516N93166P11497
11649e131795P39871O72482N19776L07277P5911j21657k35526k39537j44432O774
11639c550856J57711K60588K91207K51201J56888K1782j54509l81914o63053r77251
11629d588206j278704j511629j632025j620862j482329j234662r04690n27442
$$ y = [5697494, 6487034, 7420840, 8425519, 9416629, 10307408, 11018316, 11488703, 11690420, 11636974, 11378550, 10980521, 10495480, 9944472, 9317725, 8593671, 7764700, 6854426, 5917303, 5023479, 4239729, 3615514, 3176294, 2922124, 2828689, 2848333, 2910907, 2929287, 2815288, 2503601, 1971180, 1240013, 363046, -596133, -1579213, -2541053, -3451468, -4293151, -5056277, -5730467, -6297025, -6725976, -6980348, -7025957, -6842974, -6436458, -5843292, -5131795, -4391924, -3719442, -3199666, -2892389, -2816478, -2938135, -3173661, -3413198, -3557630, -3550856, -3393145, -3132557, -2841350, -2590149, -2433261, -2411479, -2565988, -2947902, -3610955, -4588206, -5866910, -7378539, -9010564, -10631426, -12113755, -13348417, -14253107, -14780549]
11621a4780549j43368K10129N06998P34080Q86949R65415R71108R06317P74459
11612h968462N83532L51746J11299r4374k21796k43599j61044m686J77397L36156
11602h133831M34353M52681L90719K64417J00936o8112k13524l14195l60152l51676
11592g798384k95235j99056p0577Q4078K59019M46204O32863Q01138R31235J006753
11582d201962J019322R70128Q67856P25567N60132L94388K56301J70439J46231
11573I08402J73279K28007K85931L32113L66935M05270M66171N56139O58864P42655
11563E123766P81205P70833P31637O94021O80775O94425P15051P08249O38289
11554A1538251M80658K31106r0307m43514p82829j075098j309595j493577j639385
$$ y = [-14780549, -14923917, -14713788, -14206790, -13472710, -12585761, -11620346, -10649238, -9742921, -8968462, -8384930, -8033184, -7921885, -8016259, -8238055, -8481654, -8642698, -8647384, -8469987, -8133831, -7699478, -7246797, -6856078, -6591661, -6490725, -6558837, -6772361, -7086556, -7446708, -7798384, -8093619, -8292675, -8363252, -8279174, -8020155, -7573951, -6941088, -6139950, -5208715, -4201962, -3182640, -2212512, -1344656, -619089, -58957, 335431, 591732, 762171, 908402, 1081681, 1309688, 1595619, 1927732, 2294667, 2699937, 3166108, 3722247, 4381111, 5123766, 5904971, 6675804, 7407441, 8101462, 8782237, 9476662, 10191713, 10899962, 11538251, 12018909, 12250015, 12159708, 11716194, 10933365, 9858267, 8548672, 7055095, 5415710]
11545E415710j753075j829014j849282j787230j616076j320646r06914m04983
11537f051510J35009O52129J086747J392146J541616J529850J372166J105032
11529B763185P85167M79885K47104J15204P6910J01539J55977K20174K89117L62398
11519E596660M29258M60340M15720K68282K8254k49356m81964n92537n41159l39588
11509D993910m2706K77724N61651P75822R10790R69575R61247R02727Q21416P51150
11499A1883306P21779P47882Q21065R09106R65615R50630Q52860O98081N35673
11490A9085997M12022L48538L35695L41639L27207K60069J24219p6301l18495
11481B0840590n65680p77212r20959r81733r59445q60182o91280m65746k09015
$$ y = [5415710, 3662635, 1833621, -15661, -1802891, -3418967, -4739613, -5646527, -6051510, -5916501, -5264372, -4177625, -2785479, -1243863, 285987, 1658153, 2763185, 3548352, 4028237, 4275341, 4390545, 4467455, 4568994, 4724971, 4945145, 5234262, 5596660, 6025918, 6486258, 6901978, 7170260, 7198514, 6949158, 6467194, 5874657, 5333498, 4993910, 4951204, 5228928, 5790579, 6566401, 7477191, 8446766, 9408013, 10310740, 11132156, 11883306, 12605085, 13352967, 14174032, 15083138, 16048753, 16999383, 17852243, 18550324, 19085997, 19498019, 19846557, 20182252, 20523891, 20851098, 21111167, 21235386, 21159085, 20840590, 20274910, 19497698, 18576739, 17595006, 16635561, 15775379, 15084099, 14618353, 14409338]
11472A4409338M1828K46198L68111L81415K75965O5938k07138m84505p11421q57032
11462A3528697r20552r21603q83599q21573p39257o32531m94551l20652j11837
11453G682542J25212L81768O49953R20692J178554J399337J553250J611384J552184
11444A7054876J366542J060184O51885J68820l56873q88209j383212j799455k103836
11435A3770722k282098k340864k299960k180783j999803j770493j507890j228762
11427a839931r47805o76682m28559k22665q1359j8635k7581p7328j25224j38741
11417d584510j12130o5469k7948j9057l9303p2475r6053r5895p8454p1086j07746
11406e370126k10670l82097o08288q65769j122680j339693j478335j515236j452208
$$ y = [14409338, 14451166, 14697364, 15065475, 15446890, 15722855, 15788793, 15581655, 15097150, 14385729, 13528697, 12608145, 11686542, 10802943, 9981370, 9242113, 8609582, 8115031, 7794379, 7682542, 7807754, 8189522, 8839475, 9760167, 10938721, 12338058, 13891308, 15502692, 17054876, 18421418, 19481602, 20133487, 20302307, 19945434, 19057225, 17674013, 15874558, 13770722, 11488624, 9147760, 6847800, 4667017, 2667214, 896721, -611169, -1839931, -2787736, -3464418, -3892977, -4115642, -4197001, -4215636, -4243217, -4320545, -4445769, -4584510, -4696640, -4762109, -4790057, -4809114, -4848417, -4920892, -5016945, -5112840, -5191294, -5262380, -5370126, -5580796, -5962893, -6571181, -7436950, -8559630, -9899323, -11377658, -12892894, -14345102]
11397a4345102j314717j140583r66056q15027o94506n98505n20011m64660m55849
11388b1315016n25924o99149r78030j339936j742257k130881k448858k644523
11380c3824574k678567k529680k198566j709032j104029m36629K40165Q79832
11372d3361080J443122J895772K207989K359559K349255K200508J955575J660327
11364b7288973J351456J054272P86666N60078L77947K40022J54148J43546K37526
11355b2383312M49270P58510J114012J454013J728829J910648J988853J961832
11347a1017345J836255J633115J390168J153619R63032Q39224P80580P66830P67781
11338h86741P55009P12201O37553N36008M08686K50864O2213j39880l17482m24298
$$ y = [-14345102, -15659819, -16800402, -17766458, -18581485, -19275991, -19874496, -20394507, -20859167, -21315016, -21840940, -22540089, -23518119, -24858055, -26600312, -28731193, -31180051, -33824574, -36503141, -39032821, -41231387, -42940419, -44044448, -44481077, -44240912, -43361080, -41917958, -40022186, -37814197, -35454638, -33105383, -30904875, -28949300, -27288973, -25937517, -24883245, -24096579, -23536501, -23158554, -22918532, -22764384, -22620838, -22383312, -21934042, -21175532, -20061520, -18607507, -16878678, -14968030, -12979177, -11017345, -9181090, -7547975, -6157807, -5004188, -4041156, -3201932, -2421352, -1654522, -886741, -131732, 580469, 1218022, 1754030, 2162716, 2413580, 2475793, 2335913, 2018431, 1594133]
11328A594133m24232l03669p3029K37341N81237R01690J141403J257846J235797
11319F148517J090793Q63106O05550L67886J81114M8480n0274j43309k50346l75180
11309H486337n07686o30475p27157p90679q26925q48259q60092q52820q08375
11300A633869p16991n90294m60650l67473l38679l77422m61258n54462o25791
11291b859151o60460o59819o31551n78652m95114l70777k01208N783K32241M57800
11281e760908O65312Q41021R73048J051930J071805J029577R24299P60590N54280
11272B110954L33148J29040l4183j49388k27404k90498l60419m46591n42713o35082
11262a13136p15089p83323q41778q84520q99461q81361q42834q11015q10852q48164
$$ y = [1594133, 1169901, 866232, 793203, 1030544, 1611781, 2513471, 3654874, 4912720, 6148517, 7239310, 8102416, 8707966, 9075852, 9256966, 9305446, 9255172, 9111863, 8861517, 8486337, 7978651, 7348176, 6621019, 5830340, 5003415, 4155156, 3295064, 2442244, 1633869, 916878, 326584, -134066, -501539, -840218, -1217640, -1678898, -2233360, -2859151, -3519611, -4179430, -4810981, -5389633, -5884747, -6255524, -6456732, -6450949, -6218708, -5760908, -5095596, -4254575, -3281527, -2229597, -1157792, -128215, 796084, 1556674, 2110954, 2444102, 2573142, 2538959, 2389571, 2162167, 1871669, 1511250, 1064659, 521946, -113136, -828225, -1611548, -2453326, -3337846, -4237307, -5118668, -5961502, -6772517, -7583369, -8431533]
11252h431533r05651r54224r70243r45586q85021p96782o86966n61907m32364
11243a5570277l11406k06077j11533j5460Q8894J90590K59430K57652J59260l3674
11233a5292601k87563n49278p66984r08578r69458r68623r37764r08923r04443
11224b2494215r30679r75777j011785j001481r09247p12634m09675j8774M27400
11215b8036867Q89662J328612J709319K004907K198636K284057K264929K157166
11207a3199579J991766J813479J670244J595779J595915J649443J723289J789238
11199F29574J828856J826718J764933J628844J418615J153340Q62691N74706L09846
11190A1998123Q1658j02146k40817l40745m12922m70537n28956o04833p09870
$$ y = [-8431533, -9337184, -10291408, -11261651, -12207237, -13092258, -13889040, -14576006, -15137913, -15570277, -15881683, -16087760, -16199293, -16214753, -16125859, -15935269, -15675839, -15418187, -15258927, -15292601, -15580164, -16129442, -16896426, -17805004, -18774462, -19743085, -20680849, -21589772, -22494215, -23424894, -24400671, -25412456, -26413937, -27323184, -28035818, -28445493, -28464267, -28036867, -27147205, -25818593, -24109274, -22104367, -19905731, -17621674, -15356745, -13199579, -11207813, -9394334, -7724090, -6128311, -4532396, -2882953, -1159664, 629574, 2458430, 4285148, 6050081, 7678925, 9097540, 10250880, 11113571, 11688277, 11998123, 12079781, 11977635, 11736818, 11396073, 10983151, 10512614, 9983658, 9378825, 8668955]
11181H668955q41411r78635j090189j148227j137377j053141q95990o71031l94157
11172D58797r5663J86300M19581N89637P02033P75847Q31633Q79542R14430R21423
11162F583560Q87245Q07299O84392N24615L37203J36873n7994k32549l81729n09408
11152H779507o21420p18475p93938q37376q40714q02188p25537o17012m85336
11143B337511l45683k22743j47294j46005k29280l83594n73332p53481q87484
11134a351385r58905r68489r19948q07785o18858l47930j5738L25318O05880P68559
11124d289281P93446P04152N52679L95783K77000K19975K30935L05623M35500
11115c74188O08852Q07219J003553J167548J274774J310697J266009J129952Q91023
$$ y = [8668955, 7827544, 6848909, 5758720, 4610493, 3473116, 2419975, 1523985, 852954, 458797, 363134, 549434, 969015, 1558652, 2260685, 3036532, 3868165, 4747707, 5662137, 6583560, 7470805, 8278104, 8962496, 9487111, 9824314, 9961187, 9903193, 9670644, 9288915, 8779507, 8158087, 7439612, 6645674, 5808298, 4967584, 4165396, 3439859, 2822847, 2337511, 1991828, 1769085, 1621791, 1475786, 1246506, 862912, 289580, -463901, -1351385, -2310290, -3278779, -4198727, -5006512, -5625370, -5973300, -5989038, -5663720, -5057840, -4289281, -3495835, -2791683, -2239004, -1843221, -1566221, -1346246, -1115311, -809688, -374188, 234664, 1041883, 2045436, 3212984, 4487758, 5798455, 7064464, 8194416, 9085439]
11106I085439N46971J16652l56518q13827j198257j468405j602275j593527j448342
11097A267911j186767q44737m71155j18891J67733L65449M79760N41959N93746
11088G95008O66836P70008Q90168J003547J087821J128816J121533J068629R79191
11079I511557Q67428P48977O34591N25988M19125L13512K18703J50327J17316
11070A3507524J09582R4959K8155j31365m00091p58978j156224j522783j792331
11061G978448j917037j876074j677582j354369r53055n20201r3028L00030O33329
11052E20461Q83023J035341J095176J082200J014274Q93793P11872M67598J84175
11043G887913r2685l12492m40880m71823m26422l39112k37327j25584J5376K13138
$$ y = [9085439, 9632410, 9749062, 9392544, 8578717, 7380460, 5912055, 4309780, 2716253, 1267911, 81144, -763593, -1234748, -1353639, -1185906, -820457, -340697, 201262, 795008, 1461844, 2231852, 3122020, 4125567, 5213388, 6342204, 7463737, 8532366, 9511557, 10378985, 11127962, 11762553, 12288541, 12707666, 13021178, 13239881, 13390208, 13507524, 13617106, 13712065, 13740220, 13608855, 13208764, 12449786, 11293562, 9770779, 7978448, 6061411, 4185337, 2507755, 1153386, 200331, -319870, -412898, -112868, 520461, 1403484, 2438825, 3534001, 4616201, 5630475, 6524268, 7236140, 7703738, 7887913, 7795228, 7482736, 7041856, 6570033, 6143611, 5804499, 5567172, 5441588, 5456964, 5670102]
11033E670102M82490Q12770J169633J505767J771198J919181J910966J723166
11025A6965273J355838Q35714K12313m50136j082432j622586k029611k291681
11017A1892692k420980k437639k355184k177956j910159j568398j189537q27967
11009b995128n39586l57151k70946k29460j62797j6691K20612N11352P84162R65774
10999b089859J012468R23740P31391M74926J83212j25324m29109o92754q71398
10990h82707r28536q55307o78948m55895k52689j22131q4517j23602k00522k77266
10980d862120l33986l70585l96907m22761m53129m85691n08841n03952m54216
10971h792188l53580k06899k2192J94138M32441O72004Q81663J030895J102256
$$ y = [5670102, 6152592, 6965362, 8134995, 9640762, 11411960, 13331141, 15242107, 16965273, 18321111, 19156825, 19369138, 18919002, 17836570, 16213984, 14184373, 11892692, 9471712, 7034073, 4678889, 2500933, 590774, -977624, -2167161, -2995128, -3534714, -3891865, -4162811, -4392271, -4555068, -4571759, -4351147, -3839795, -3055633, -2089859, -1077391, -153651, 577740, 1052666, 1235878, 1110554, 681445, -11309, -882707, -1811243, -2666550, -3345498, -3801393, -4054082, -4176213, -4260730, -4384332, -4584854, -4862120, -5196106, -5566691, -5963598, -6386359, -6839488, -7325179, -7834020, -8337972, -8792188, -9145768, -9352667, -9374859, -9180721, -8748280, -8076276, -7194613, -6163718, -5061462]
10962e061462J096554J030046R28447Q21472P38943P06822P40669Q36473R65937
10953B803901J084964J154242J157260J101276J003121Q75324P23741N53098L70430
10944A0827357J83484j665j81404l56382n34511p28729r44697j165598j350125
10935E747730j451348j445514j350455j222068j132433j140496j267125j485835
10927d747544j736599j956820k109451k189232k206087k162037k040427j815376
10919b0963573j475526j045850n90194j89110R3799K35457K55353K01390J31628
10910b3346626R8913J39029K62058M49243O59112Q43781R68707J023488J016246
10901a7886049R58200Q53009O98168M93127K45148l0235l12668n82382q25191
$$ y = [-5061462, -3964908, -2934862, -2006415, -1184943, -446000, 260822, 1001491, 1837964, 2803901, 3888865, 5043107, 6200367, 7301643, 8304764, 9180088, 9903829, 10456927, 10827357, 11010841, 11009176, 10827772, 10471390, 9936879, 9208150, 8263453, 7097855, 5747730, 4296382, 2850868, 1500413, 278345, -854088, -1994584, -3261709, -4747544, -6484143, -8440963, -10550414, -12739646, -14945733, -17107770, -19148197, -20963573, -22439099, -23484949, -24075143, -24264253, -24170454, -23934997, -23679644, -23478254, -23346626, -23247713, -23108684, -22846626, -22397383, -21738271, -20894490, -19925783, -18902295, -17886049, -16927849, -16074840, -15376672, -14883545, -14638397, -14668632, -14981300, -15563682, -16388873]
10892a6388873j034496j210041j355145j472595j558472j598356j573160j473179
10884b7664317j307163j095790q55211n85882k75474Q6894M92898R03087J251302
10875b9049656J469545J521773J424597J240525J047924R04730Q24469P76717
10867a9839376P12119N96898M34785K63672J32368P3467Q6131J35144J65532J25442
10857a7113818j3964k50078n52381q73111j160327j370158j474696j463293j338784
10848b5610610j113465q08092m52692q5063K55108N33635P25542Q14346P92556
10839b4948735O67903M69955K46765M9395q4945j39984j18021l5660Q0301K01057
10829b3611969L08163M01533M95637O07391P45847R08799J083240J245689J363836
$$ y = [-16388873, -17423369, -18633410, -19988555, -21461150, -23019622, -24617978, -26191138, -27664317, -28971480, -30067270, -30922481, -31508363, -31783837, -31696943, -31204045, -30300958, -29049656, -27580111, -26058338, -24633741, -23393216, -22345292, -21440562, -20616093, -19839376, -19127257, -18530359, -18095574, -17831902, -17699534, -17626067, -17539936, -17404792, -17239260, -17113818, -17127782, -17377860, -17930241, -18803352, -19963679, -21333837, -22808533, -24271826, -25610610, -26724075, -27532167, -27984859, -28069922, -27814814, -27281179, -26555637, -25741291, -24948735, -24280832, -23810877, -23564112, -23514717, -23599662, -23739646, -23857667, -23893327, -23813026, -23611969, -23303806, -22902273, -22406636, -21799245, -21053398, -20144599, -19061359, -17815670, -16451834]
10820a6451834J403722J342810J183587R59801P29391N54135M74495M93513N79263
10811h731117O82726P59238P83819P57966P07626O71044O79939P45161Q56345
10802b087253R92702J133308J260791J362111J430674J467280J476401J460433
10794H496447J417808J346140J245497J117543R61382P71845N45705K95155N8889
10785A6256411j01989j27703P287K71540N79658Q22921R13040Q14989N50962J78586
10775B0165702k35814o31627r58317j182189j296923j325742j307265j273997
10767A1953828j239048j196405j128635j015812q45211o21103l69031j28968O0519
10758E470134J77381K21512K09285J63086J02602M0556j8015p4392j32950j96803
$$ y = [-16451834, -15048112, -13705302, -12521715, -11561914, -10832523, -10278388, -9803893, -9310380, -8731117, -8048391, -7289153, -6505334, -5747368, -5039742, -4368698, -3688759, -2943598, -2087253, -1094551, 38757, 1299548, 2661659, 4092333, 5559613, 7036014, 8496447, 9914255, 11260395, 12505892, 13623435, 14584817, 15356662, 15902367, 16197522, 16256411, 16154422, 16026719, 16034006, 16305546, 16885204, 17708125, 18621165, 19436154, 19987116, 20165702, 19929888, 19298261, 18339944, 17157755, 15860832, 14535090, 13227825, 11953828, 10714780, 9518375, 8389740, 7373928, 6528717, 5907614, 5538583, 5409615, 5470134, 5647515, 5869027, 6078312, 6241398, 6344000, 6384556, 6366541, 6292149, 6159199, 5962396]
10748E962396k65070l34837m06831m88548n88256p01514q02012q49017q10323
10739G15988o84035n01433l09211j46790l5765J5501K258q0457k33446m45293
10729a702683o86073r07329j051645j071805r52361p20904m39847j81634p33Q3818
10719g631196R0313O3935N9667J23077K73733M97276P50997R82050J150739J247735
10709b391674J296049J335997J400705J495832J595017J653080J628465J502133
10701I515604J282905R96866O66560K92527j48878o85347j315860j988302k607494
10692F008581l072949l322035l349600l194980k912844k551195k144975j717193
10684a6257190j279487q34399l84275N7204M61619P94812J031479J165109J208087
$$ y = [5962396, 5697326, 5362489, 4955658, 4467110, 3878854, 3177340, 2375328, 1526311, 715988, 31953, -469480, -778691, -925481, -961246, -945745, -943487, -1023944, -1257390, -1702683, -2388756, -3296085, -4347730, -5419535, -6371896, -7092800, -7532647, -7714281, -7715014, -7631196, -7540883, -7476948, -7417281, -7294204, -7020471, -6523195, -5772198, -4790148, -3639409, -2391674, -1095625, 240372, 1641077, 3136909, 4731926, 6385006, 8013471, 9515604, 10798509, 11795375, 12461935, 12754462, 12605584, 11920237, 10604377, 8616075, 6008581, 2935632, -386403, -3736003, -6930983, -9843827, -12395022, -14539997, -16257190, -17536677, -18371076, -18755351, -18698147, -18236528, -17441716, -16410237, -15245128, -14037041]
10675a4037041J182730J107651R87520Q14300N80233K91928k6758l44095o32005
10666a0075537q70123j042649j134964j135367j041097q63863o29938l73186j24118
10657a7290842R8880K91007M55322N94774P08001P91298Q43463Q67758Q68270
10648a1772069Q44216P88616O94183N62301M08012K57023J36752O6384N0241P6442
10638g887899J21521J59730J72445J51413R3730n625j54530l54715n89713q20751
10628i114394r96221j070618j021648q55181n96893k80017O0270L85341O54023
10619a2835338Q33431R14984R22561R03633R06576R57774J052467J162744J252921
10610c928247J289519J243764J095011Q40009N00873J21655k45974n58285p88818
$$ y = [-14037041, -12854311, -11746660, -10759140, -9944840, -9364607, -9072679, -9099437, -9443532, -10075537, -10945660, -11988309, -13123273, -14258640, -15299737, -16163600, -16793538, -17166724, -17290842, -17191962, -16900955, -16445633, -15850859, -15142858, -14351560, -13508097, -12640339, -11772069, -10927853, -10139237, -9445054, -8882753, -8474741, -8217718, -8080966, -8014582, -7964341, -7887899, -7766378, -7606648, -7434203, -7282790, -7189060, -7194685, -7349215, -7703930, -8293643, -9114394, -10110615, -11181233, -12202881, -13058062, -13654955, -13934972, -13874702, -13489361, -12835338, -12001907, -11086923, -10164362, -9260729, -8354153, -7396379, -6343912, -5181168, -3928247, -2638728, -1394964, -299953, 540056, 1040929, 1162584, 916610, 358325, -430493]
10601d30493r31222r97350j011066r99356r84965r83736j006143j059984j150663
10592i554978j276574j421276j549237j611730j562514j376587j064351o75178
10584b0092425k85497K8461K22416L03141L23943L59260M70970O81093R63095
10575a7025543J256553J497232J644623J691610J654379J553472J400064J195300
10567e132310R40120O44762L28374J0065k97528n83631q27916r95481j047438
10558f960983r63117p58798m88377k23362k3858Q3143J08655R0728P4843R4815
10548h966311J62321K68605L94984N24734O49887P69556Q80387R66165R96882
10539c352790R40824P80829N23487J99340j41393m38094o37578p15635o88180
$$ y = [-430493, -1361715, -2359065, -3370131, -4369487, -5354452, -6338188, -7344331, -8404315, -9554978, -10831552, -12252828, -13802065, -15413795, -16976309, -18352896, -19417247, -20092425, -20377922, -20349461, -20127045, -19823904, -19499961, -19140701, -18669731, -17988638, -17025543, -15768990, -14271758, -12627135, -10935525, -9281146, -7727674, -6327610, -5132310, -4192190, -3547428, -3219054, -3208989, -3506517, -4090148, -4918064, -5913545, -6960983, -7924100, -8682898, -9171275, -9394637, -9418495, -9335352, -9226697, -9135969, -9061126, -8966311, -8803990, -8535385, -8140401, -7615667, -6965780, -6196224, -5315837, -4349672, -3352790, -2411966, -1631137, -1107650, -908310, -1049703, -1487797, -2125375, -2841010, -3529190]
10530c529190o02753n14738m61378m47149m49249m39932m07800l60273l09429
10521g521891k60446k14425j77525j62919j83100k39507l16563l84621m11515
10512i872512l73936k57760m9040K70379P14935J283199J953053K687088L445960
10503a98634M205722M969667N765103O630459P609513Q757409J0144786J1850473
10495E9734498J3947594J6484299J9448952K2717877K5997703K8773701L0293298
10488B17397922K9671341K6202879J9801684J1263228K069114o210543j2517585
10481B87678040j6532785j8500166j8905694j8248072j6948668j5334237j3642200
10474A69566218j2036520j0624177r460777q549705p848061p284133o782197o287486
$$ y = [-3529190, -4131943, -4646681, -5108059, -5555208, -6004457, -6444389, -6852189, -7212462, -7521891, -7782337, -7996762, -8174287, -8337206, -8520306, -8759813, -9076376, -9460997, -9872512, -10246448, -10504208, -10553248, -10282869, -9567934, -8284735, -6331682, -3644594, -198634, 4007088, 8976755, 14741858, 21372317, 28981830, 37739239, 47884025, 59734498, 73682092, 90166391, 109615343, 132333220, 158330923, 187104624, 217397922, 247069263, 273272142, 293073826, 304337054, 306406168, 300195625, 287678040, 271145255, 252645089, 233739395, 215491323, 198542655, 183208418, 169566218, 157529698, 146905521, 137444744, 128895039, 121046978, 113762845, 106980648, 100693162]
10466A00693162n779868n266479m760378m267634l794299l359676k995953k732441
10458F7736434k578694k518614k516809k532086k530898k494622k419581k314359
10450D7830771k197777k095574k032303k019332k044252k068470k037976j905888
10442C1429199j656292j315525r44480o16101l87571k77212k56776k65718k42044
10433B5467480j52046k143J70847L21501M16538M45335M18557L59839K97672K60710
10423B8004290K74347L54815N00483O84609Q55946R51061R14924P20014L75287
10414C3635776p6673n71034j037059j415280j668693j782978j759299j609779
10406B3714981j361577j063913p85619n95715n34284n93692p26995q79246j017426
$$ y = [100693162, 94913294, 89646815, 84886437, 80618803, 76824504, 73464828, 70468875, 67736434, 65157740, 62639126, 60122317, 57590231, 55059333, 52564711, 50145130, 47830771, 45632994, 43537420, 41505117, 39485785, 37441533, 35373063, 33335087, 31429199, 29772907, 28457382, 27512902, 26896801, 26509230, 26232018, 25975242, 25709524, 25467480, 25315434, 25313291, 25484138, 25805639, 26222177, 26667512, 27086069, 27445908, 27743580, 28004290, 28278637, 28633452, 29133935, 29818544, 30674490, 31625551, 32540475, 33260489, 33635776, 33559103, 32988069, 31951010, 30535730, 28867037, 27084059, 25324760, 23714981, 22353404, 21289491, 20503872, 19908157, 19373873, 18780181, 18053186, 17173940, 16156514]
10397A6156514j137620j250520j362372j464336j531741j531612j437893j248818
10389E191602r94878p29518n06523l56066k71646k15020j37438n166J85541M09663
10379B570551O24675P83725Q47493P93925O23378L58033L8177k82575n44822o95534
10369E117026p02106n62297l05247J8362L53968O59855R12349J097559J199606
10360G789075J198191J078926Q48491N43099K23367m3572k06917k49892j94683
10351A0986085r2311k58M2897L2060j0144n4212q2183r0238p7890l6849N0147
10340A0667104J99390M11370O61037R01765J082981J170313J154648J046652Q65765
10331A8161025O34707L81562J42295m3523j43074j39696l6521J43939L61347N62654
$$ y = [16156514, 15018894, 13768374, 12406002, 10941666, 9409925, 7878313, 6440420, 5191602, 4196724, 3467206, 2960683, 2604617, 2332971, 2117951, 1980513, 1975347, 2160888, 2570551, 3195226, 3978951, 4826444, 5620369, 6243747, 6601780, 6639957, 6357382, 5812560, 5117026, 4414920, 3852623, 3547376, 3565738, 3919706, 4579561, 5491910, 6589469, 7789075, 8987266, 10066192, 10914683, 11457782, 11681149, 11637577, 11430660, 11180768, 10986085, 10893774, 10893516, 10936413, 10968473, 10958329, 10904117, 10821934, 10731696, 10653806, 10616957, 10667104, 10866494, 11277864, 11938901, 12840666, 13923647, 15093960, 16248608, 17295260, 18161025, 18795732, 19177294, 19319589, 19276066, 19132992, 18993296, 18956775, 19100714, 19462061, 20024715]
10321B0024715O95288P25425O50568M97941L10599J29715j9699j35672k36437
10312B2642443l48269m89379o58642q36276r96138j120379j204177j247365j244509
10303A4497309j187792j081739r52427q37475p62828p25239o93575o28001n06247
10294G121986l42212j83718q7273q4554j63736k78742l79128m40091m74423n21185
10284D166924o20501p91049j022761j285632j545500j776028j961440k091747
10276f927734k156703k143897k041433j841883j545643j164577p25480k69044
10268a8816394J58877N20677P98208R97088J143433J274074J423076J609351J829894
10259i061716K059796K257983K377292K376270K228080J924294J477238R24735
$$ y = [20024715, 20720003, 21445428, 22095996, 22593937, 22904536, 23034251, 23014552, 22878880, 22642443, 22294174, 21804795, 21146153, 20309877, 19313739, 18193360, 16989183, 15741818, 14497309, 13309517, 12227778, 11275351, 10437876, 9675048, 8949809, 8256234, 7628233, 7121986, 6779774, 6596056, 6508783, 6424229, 6260493, 5981751, 5602623, 5162532, 4688109, 4166924, 3546423, 2755374, 1732613, 446981, -1098519, -2874547, -4835987, -6927734, -9084437, -11228334, -13269767, -15111650, -16657293, -17821870, -18547350, -18816394, -18657517, -18136840, -17338632, -16341544, -15198111, -13924037, -12500961, -10891610, -9061716, -7001920, -4743937, -2366645, 9625, 2237705, 4161999, 5639237, 6563972]
10251F563972L33200k11129o26411q64732r29625q70717p58229o51124n75547
10242A409658n23427m69130l91840k89564j77653p5542P263P6491J48499K41721
10232d3524L69330N33676P21914R05506J046140J106623J062527R11663O78506
10223G292361M08944J53812n0605j91812k75048l10612l06619k69527k05453j17099
10213F128342q09J47813L19645M81755N85081N89258M86635L06764R8937r3640
10203I049781k52164l85222n17440o71149q52304j049321j243630j421808j579969
10194A076774j718972j835306j914561j933451j870958j720374j490511j194431
10186a2601790q38648m26964K2576M64783Q33892J068815J142094J075635R34661
$$ y = [6563972, 6897172, 6686043, 6059632, 5194900, 4265275, 3394558, 2636329, 1985205, 1409658, 886231, 417101, 25261, -264303, -441956, -517498, -510235, -433744, -285245, -43524, 325806, 859482, 1581396, 2486902, 3533042, 4639665, 5702192, 6613855, 7292361, 7701305, 7855117, 7804512, 7612700, 7337652, 7027040, 6720421, 6450894, 6245441, 6128342, 6127533, 6275346, 6594991, 7076746, 7661827, 8251085, 8737720, 9044484, 9143421, 9049781, 8797617, 8412395, 7894955, 7223806, 6371502, 5322181, 4078551, 2656743, 1076774, -642198, -2477504, -4392065, -6325516, -8196474, -9916848, -11407359, -12601790, -13440438, -13867402, -13844826, -13380043, -12546151, -11477336, -10335242, -9259607, -8324946]
10177h324946Q02112P44124P82229Q86522R94373J044272J004398Q80182P00886
10168d85848M98595K93858R3257j04203k98237m80683o33478p32279p56696p04995
10158c310709o04131n02967m47410m54330n05327n63400n94972n80264n12474
10149h075984l96449k50950j08952j0904P638p0638k35333m47806o51610p88847
10139a1029835q13462o97716m35658m6773M23295R10252J346511J678409J878741
10130f786236J950624J921141J826651J696483J544043J369672J171483R54639
10122E648500P31716N14699L06996J04144r6373k84875m38229n28614n36224m59740
10112D962000l21594j65115m1006J2398j7583j20236k73473m51241o21731p46966
$$ y = [-8324946, -7522834, -6778710, -5996481, -5109959, -4115586, -3071314, -2066916, -1186734, -485848, 12747, 306605, 399862, 295659, -2578, -483261, -1116739, -1849018, -2605714, -3310709, -3914840, -4417807, -4865217, -5319547, -5824874, -6388274, -6983246, -7563510, -8075984, -8472433, -8723383, -8832335, -8843239, -8835601, -8906239, -9141572, -9589378, -10240988, -11029835, -11843297, -12541013, -12976671, -13023444, -12600149, -11689897, -10343386, -8664977, -6786236, -4835612, -2914471, -1087820, 608663, 2152706, 3522378, 4693861, 5648500, 6380216, 6894915, 7201911, 7306055, 7209682, 6924807, 6486578, 5957964, 5421740, 4962000, 4640406, 4475291, 4434285, 4446683, 4429100, 4308864, 4035391, 3584150, 2962419, 2215453]
10102B215453p93788p50332o31835m68516k85324q9692J24197L58791N96389P94515
10092A069858Q98041Q61332O67361L34815q6987n30024r21805j199152j319569
10083b26130j268871j064355p52456l99593p7169J54180K55612K14674M5397k14812
10073c333523n13366p97213j029606j198752j311206j375081j388112j341164
10065a2288023j231684j071487q79918o69211m36251j68092J43192M87485Q34754
10056a5279235J146113J390593J556157J648102J678140J653968J576886J447336
10048c181940J272086J066684Q52005O49470M79517L62181L14424L42362M34134
10039B590923N60848O86399P79612Q21353Q04474P29690O02513M34539K47745
$$ y = [2215453, 1421665, 671333, 39498, -429018, -714342, -804034, -679837, -321046, 275343, 1069858, 1967899, 2829231, 3496592, 3831407, 3744420, 3214396, 2292591, 1093439, -226130, -1495001, -2559356, -3311812, -3711405, -3788574, -3634394, -3378782, -3164108, -3118711, -3333523, -3846889, -4644102, -5673708, -6872460, -8183666, -9558747, -10946859, -12288023, -13519707, -14591194, -15471112, -16140323, -16576574, -16744666, -16601474, -16113989, -15279235, -14133122, -12742529, -11186372, -9538270, -7860130, -6206162, -4629276, -3181940, -1909854, -843170, 8835, 658305, 1137822, 1500003, 1814427, 2156789, 2590923, 3151771, 3838170, 4617782, 5439135, 6243609, 6973299, 7575812, 8010351, 8258096]
10030H258096P5778m3784q5789n2952K2188R3113J22645R6346J7884j04203k62112
10019H137210m41683o12977p31636p53325o52319m32535j24501K28807N86452
10010E203493R14813J185572J376979J482134J514639J501021J464418J414083
10002A6057152J347573J258122J137643R75516P60252M87837J71641j56150m57503
9993B1582083p09409r16171j101406j286195j471994j639684j759910j804109
9985A0893205j752655j602000j369535j091557q13253n75304m02703k98559k43887
9976B743752k04459j44842m6377P8803J87634K24170J47795m5123l18772o13017
9966B009564q64826j025996j073645j013007q72463o92379n11445l54388k24159
$$ y = [8258096, 8333874, 8290090, 8204301, 8151349, 8173537, 8266650, 8389295, 8485641, 8503525, 8399322, 8137210, 7695527, 7082550, 6350914, 5597589, 4945270, 4512735, 4388234, 4617041, 5203493, 6118306, 7303878, 8680857, 10162991, 11677630, 13178651, 14643069, 16057152, 17404725, 18662847, 19800490, 20776006, 21536258, 22024095, 22195736, 22039586, 21582083, 20872674, 19956503, 18855097, 17568902, 16096908, 14457224, 12697314, 10893205, 9140550, 7538550, 6169015, 5077458, 4264205, 3688901, 3286198, 2987639, 2743752, 2539293, 2394451, 2348074, 2426877, 2614511, 2838681, 2986476, 2941353, 2622581, 2009564, 1144738, 118742, -954903, -1967910, -2840373, -3532752, -4044197, -4398585, -4622744]
9957d622744j01921M2327K30842M60483O98113Q93469J001696J000695Q93312
9948D96272O96663M29794J08802k50111o25553r89581j312255j570136j753167
9939d769272j864101j910510j896796j823827j694857j519435j310321j077941
9931a7867060q29923n76929l38247j40629j0622L3624j3641j44754l37002n51508
9921b0776691p39078q56061q82500q29714p32158o30750n58573n33775n57720
9912b7097020o15701o80059p16859o95616n97798m17481j51496K13602P03955
9903c0054473J343204K127946L010300L898455M675036N227067N478426N412485
9895A118446N072925M541323L904897L232730K569147J939797J361684Q51954
$$ y = [-4622744, -4724665, -4682338, -4451496, -3991013, -3292900, -2399431, -1397735, -397040, 496272, 1192935, 1622729, 1731531, 1481420, 855867, -133714, -1445969, -3016105, -4769272, -6633373, -8543883, -10440679, -12264506, -13959363, -15478798, -16789119, -17867060, -18696983, -19273912, -19612159, -19752788, -19763410, -19729786, -19743427, -19888181, -20225183, -20776691, -21515769, -22371830, -23254330, -24084044, -24816202, -25446952, -26005525, -26539300, -27097020, -27712721, -28392780, -29109639, -29805255, -30403053, -30820534, -30972030, -30758428, -30054473, -28711269, -26583323, -23573023, -19674568, -14999532, -9772465, -4294039, 1118446, 6191371, 10732694, 14637591, 17870321, 20439468, 22379265, 23740949, 24592903]
9887B4592903M33115J31358l4479o9282j2251O8314R5922J1933k05301n33841
9877B4478391r13594j261655j495144j555590j425336j128508p17491k53975K05425
9868A5932523O14573R36665J141539J205101J112503Q65305M90014M1200m08000
9859B1931423p86905j048875j182184j208886j177484j151488j190694j326883
9851A2858024j545855j788673j973246k025196j904204j615975j206077p39693
9843E9105k78599J33099M71668P30494R16400J045661J137211J203147J240368
9834F658554J229429J144964R74852P36093M74196K43910Q3322k588m0406p1329
9824A1430997j29298k26759l54820m93034o17448p01803p17878o42286m67770
$$ y = [24592903, 25026018, 25157376, 25122897, 25053615, 25041364, 25109678, 25205600, 25217533, 25012232, 24478391, 23564797, 22303142, 20807998, 19252408, 17827072, 16698564, 15981073, 15727098, 15932523, 16547096, 17483761, 18625300, 19830401, 20942904, 21808209, 22298223, 22339423, 21931423, 21144518, 20095643, 18913459, 17704573, 16527089, 15375601, 14184907, 12858024, 11312169, 9523496, 7550250, 5525054, 3620850, 2004875, 798798, 59105, -219494, -86395, 385273, 1115767, 2032167, 3077828, 4215039, 5418186, 6658554, 7887983, 9032947, 10007799, 10743892, 11218088, 11461998, 11545320, 11542732, 11502326, 11430997, 11301699, 11074940, 10720120, 10227086, 9609638, 8907835, 8189957, 7547671, 7079901]
9815G079901k10983Q7588L69997N72328O41044N50114L10147l6321m31125q20136
9805H112554j167532j458849j692685j868191j977822k008818j947964j783194
9797e792501j502803j098674n77007K8421O51127J203157J601654J799341J802719
9788a884566J667708J475113J299510J187624J154654J194402J290367J418141
9780H802953J541706J615399J598467J474356J258385R85341O86323L74165M8867
9771A8385962k84552o04952q82756j099045j257382j377099j474737j550166j588089
9762H267184j571543j495019j367431j205378j025405q42410o72183n30531m26370
9753h69086l55337l01762k48959j90230j33172r4744q9399j16631j56805j80555
$$ y = [7079901, 6868918, 6956506, 7326503, 7898831, 8539875, 9089989, 9400136, 9363815, 8932690, 8112554, 6945022, 5486173, 3793488, 1925297, -52525, -2061343, -4009307, -5792501, -7295304, -8393978, -8970985, -8942564, -8291437, -7088280, -5486626, -3687285, -1884566, -216858, 1258255, 2557765, 3745389, 4900043, 6094445, 7384812, 8802953, 10344659, 11960058, 13558525, 15032881, 16291266, 17276607, 17962930, 18337095, 18385962, 18101410, 17496458, 16613702, 15514657, 14257275, 12880176, 11405439, 9855273, 8267184, 6695641, 5200622, 3833191, 2627813, 1602408, 759998, 87815, -442716, -869086, -1224423, -1526185, -1775144, -1965374, -2098546, -2193290, -2282689, -2399320, -2556125, -2736680]
9743b736680j66651j14882m4474J9163N8069O7595N4017K7888l320m0362r2425
9732b972062j71632k85040m29094n89100p42678q65117r35557r42798q87642p79167
9722i599887o26565m32980j97071P8153L76135O65121R06651J069689J142392
9713f618362J135971J080686J017105R84591J007595J083653J180943J250745
9705B122927J249421J156244R76785P33481M53320J60389j25217l84214n93597
9696E749539p25739p56101o77650n10766k97561q3176J01334K43062L41390M02771
9686C787103M40015M70872N11691N69735O40504P11558P69391Q06069Q24447Q40752
9676A0372137Q82418R80147J156166J413095J728216K056180K340203K527904
$$ y = [-2736680, -2903331, -3018213, -3062687, -3043524, -2985455, -2917860, -2863843, -2835955, -2839275, -2879637, -2972062, -3143694, -3428734, -3857828, -4446928, -5189606, -6054723, -6990280, -7933078, -8820720, -9599887, -10226452, -10659432, -10856503, -10778350, -10402215, -9737094, -8830443, -7760754, -6618362, -5482391, -4401705, -3384600, -2400009, -1392414, -308761, 872182, 2122927, 3372348, 4528592, 5505377, 6238858, 6692178, 6852567, 6727350, 6343136, 5749539, 5023800, 4267699, 3590049, 3079283, 2781722, 2698546, 2799880, 3042942, 3384332, 3787103, 4227118, 4697990, 5209681, 5779416, 6419920, 7131478, 7900869, 8706938, 9531385, 10372137, 11254555, 12234702, 13390868, 14803963, 16532179, 18588359, 20928562, 23456466]
9668B3456466K585330K502501K288487J961557J544330J068258N80083J37318
9660C6124330k11051m47123n92687o96172q05383r42088j092984j222097j296625
9651B8818120j308724j277754j232430j188291j138883j066237r59833q27885
9643A9818083o93977n85029n20947n10192n48739o20034o97551p51597p58027
9634A4131990p04819n94078m38991k56186n7439J51979L64930N61705P09516P76145
9624A4644752P48088O40436M93830L61713K92966L14701M21437N76528P26313
9615A9220764Q20058Q25772P35222N58958L18252M0864k39024m82913o57019p45517
9605B0395417p59653p36208p25081p70748q95224j089928j320174j539208j704309
$$ y = [23456466, 26041796, 28544297, 30832784, 32794341, 34338671, 35406929, 35987012, 36124330, 35913279, 35466156, 34873469, 34177297, 33371914, 32429826, 31336842, 30114745, 28818120, 27509396, 26231642, 24999212, 23810921, 22672038, 21605801, 20645968, 19818083, 19124106, 18539077, 18018130, 17507938, 16959199, 16339165, 15641614, 14890017, 14131990, 13427171, 12833093, 12394102, 12137916, 12080477, 12232456, 12597386, 13159091, 13868607, 14644752, 15392840, 16033276, 16527106, 16888819, 17181785, 17496486, 17917923, 18494451, 19220764, 20040822, 20866594, 21601816, 22160774, 22479026, 22519890, 22280866, 21797953, 21140934, 20395417, 19635764, 18899556, 18174475, 17403727, 16508503, 15418575, 14098401, 12559193, 10854884]
9596A0854884j788441j785112j706767j577767j424170j264400j105118r44568
9588g41459p81722o25680m97622m21233m06325m37852m80088m94437m59023l77899
9578e723340k76186j86251j33395j27436j62390k22473k89777l48733l85115l81953
9568h237049l17921j72201O5406L85095P53776J119120J419512J599299J628015
9559a756948J516858J320781J119743R87075R63116J046990J204660J382722J521616
9550I306613J569190J495193J301496J021312P07220M14813J89521N9278L1831
9541A6096467R5301K22356L78695N34194O72174P91595R00719J006257J104888
9532B1802646J181343J211974J170639J035736P98930M73388R5040k88076o34520
$$ y = [10854884, 9066443, 7281331, 5574564, 3996797, 2572627, 1308227, 203109, -741459, -1523181, -2148861, -2646483, -3067716, -3474041, -3911893, -4391981, -4886418, -5345441, -5723340, -5999526, -6185777, -6319172, -6446608, -6608998, -6831471, -7121248, -7469981, -7855096, -8237049, -8554970, -8727171, -8661765, -8276670, -7522894, -6403774, -4984262, -3384963, -1756948, -240090, 1080691, 2200434, 3187509, 4150625, 5197615, 6402275, 7784997, 9306613, 10875803, 12370996, 13672492, 14693804, 15401024, 15815837, 16005358, 16064636, 16096467, 16191768, 16414124, 16792819, 17327013, 17999187, 18790782, 19691501, 20697758, 21802646, 22983989, 24195963, 25366602, 26402338, 27201268, 27674656, 27769696, 27481620, 26847100]
9523B6847100r24184j159000j350657j506724j626532j708220j758013j790712
9515A5023058j818885j839142j827652j750000j579436j312165r71617o00760
9507C323401k47503M9566K69384M09284M81006N04305M98984M77011M38762L75728
9497F579928K76554J31589o3816l03527n62797p96083r47095r69017q45502o02213
9487A898021l02516k7272J52839J99213J12552p2447k97866m96076o07513n99496
9477d0561m75818k69464k3097K29115M67737O83112Q68085J015629J121108J183784
9467D759630J204398J181555J111532R92426Q29118O34971M28440K25739L3822
9458A1401631j50669l34058n14622o76573p93714q40382q03930o93818n43281
$$ y = [26847100, 25922916, 24763916, 23413259, 21906535, 20280003, 18571783, 16813770, 15023058, 13204173, 11365031, 9537379, 7787379, 6207943, 4895778, 3924161, 3323401, 3075898, 3125464, 3394848, 3804132, 4285138, 4789443, 5288427, 5765438, 6204200, 6579928, 6856482, 6988071, 6924255, 6620728, 6057931, 5261848, 4314753, 3345736, 2500234, 1898021, 1595505, 1568233, 1721072, 1920285, 2032837, 1960390, 1662524, 1166448, 558935, -40561, -516379, -785843, -808940, -579825, -112088, 571024, 1439109, 2454738, 3575846, 4759630, 5964028, 7145583, 8257115, 9249541, 10078659, 10713630, 11142070, 11367809, 11401631, 11250962, 10916904, 10402282, 9725709, 8931995, 8091613, 7287683, 6593865, 6050584]
9449F050584m00499l10457k95274l43635m15758m61711m43151l46649j82922K2723
9439B873251K38378M28163N56124N97430N51149M41911L06866J79307Q2599L5256
9429F290434N5551J55892L29757N43654P44365Q80268R23957Q80729P77082O38954
9419A2220643M77875K95530R9685q5893k27812k99913k96627k34455j43571n6083
9409A1749379L622K3123m06o6022j71971l11925m68091o09297o99344p13063o50607
9398H085398n39185m18341l17190k40035j71071r3679r024N8289O9362j1145j97323
9387F216056m73456p99525j127235j415978j640286j789028j861606j863975j803933
9378f558966j685793j506975j258711r31024n20547l8206M88015J018135J509803
$$ y = [6050584, 5650085, 5339628, 5044354, 4700719, 4284961, 3823250, 3380099, 3033450, 2850528, 2873251, 3111629, 3539792, 4095916, 4693346, 5244495, 5686406, 5993272, 6172579, 6255178, 6290434, 6345985, 6501877, 6831634, 7375288, 8119653, 8999921, 9923878, 10804607, 11581689, 12220643, 12698518, 12994048, 13093733, 13007840, 12780028, 12480115, 12183488, 11949033, 11805462, 11749379, 11753001, 11776124, 11775718, 11709696, 11537725, 11225800, 10757709, 10148412, 9449068, 8736005, 8085398, 7546213, 7127872, 6810682, 6570647, 6399576, 6305897, 6296873, 6355162, 6424524, 6413379, 6216056, 5742600, 4943075, 3815840, 2399862, 759576, -1029452, -2891058, -4755033, -6558966, -8244759, -9751734, -11010445, -11941469, -12462016, -12500222, -12012207, -10994072, -9484269]
9369i484269J924680K227783K384854K366158K158953J781469J287843P58190
9361E405661K76751r1795l17276m05854l92002l26228k61030k35813k64927l35906
9351C051581m21350m98672n65667o41742p53036r10659j097291j272907j395601
9342d505344j440868j405892j301012j141100r43874p30893n25050l45752k06205
9333a2545990j12113n7793k1483L1631J33932K95124M92457O80974Q18863Q91799
9323i392599R19765R41317R85673J051875J108702J114114J040212Q88219O86214
9314f56508M73069K79505J17602j6262j30035k26251l00232l44005l50264l14119
9304a467500k34810j18587J9840J59878K79958L60150L81088L23575J74364o2579
$$ y = [-9484269, -7559589, -5331806, -2946952, -580794, 1578159, 3359628, 4647471, 5405661, 5682412, 5590617, 5273341, 4867487, 4475485, 4149257, 3888227, 3652414, 3387487, 3051581, 2630231, 2131559, 1565892, 924150, 171114, -739545, -1836836, -3109743, -4505344, -5946212, -7352104, -8653116, -9794216, -10738090, -11468983, -11994033, -12339785, -12545990, -12658103, -12715896, -12737379, -12705748, -12571816, -12276692, -11784235, -11103261, -10284398, -9392599, -8472834, -7531517, -6545844, -5493969, -4385267, -3271153, -2230941, -1342722, -656508, -183439, 96066, 213668, 197406, 67371, -158880, -459112, -803117, -1153381, -1467500, -1702310, -1820897, -1801057, -1641179, -1361221, -1001071, -619983, -296408, -122044, -184623]
9294a84623l57957o61314r17306j083275j136804j072937q99974o39548l26279
9285g280017L31L09293N85974Q27835J033384J194270J294761J316043J242093
9276E23967J065867P94293M49840O7868l09274o40826q98287j073946j180470
9267a200968j239311j265514j260511j217504j132803j012768q72005p27040n91979
9258a0520403m77633l89952l24650k62207j71908k7033J78792M27464O86642R23671
9248i957217J113097J238714J295747J292182J243526J162943J057722R37656
9240f15630Q25955P58498P68874Q69992J044203J246610J420656J520436J528449
9231I368043J456430J328254J158670R43962O68223L16949j11339n99495j113713
$$ y = [-184623, -542580, -1203894, -2121200, -3204475, -4341279, -5414216, -6314190, -6953738, -7280017, -7279686, -6970393, -6384419, -5556584, -4523200, -3328930, -2034169, -718126, 523967, 1589834, 2384127, 2833967, 2901835, 2592561, 1951735, 1053448, -20498, -1200968, -2440279, -3705793, -4966304, -6183808, -7316611, -8329379, -9201384, -9928424, -10520403, -10998036, -11387988, -11712638, -11974845, -12146753, -12173786, -11994994, -11567530, -10880888, -9957217, -8844120, -7605406, -6309659, -5017477, -3773951, -2611008, -1553286, -615630, 210325, 968823, 1737697, 2607689, 3651892, 4898502, 6319158, 7839594, 9368043, 10824473, 12152727, 13311397, 14255359, 14923582, 15240531, 15129192, 14529697, 13415984]
9222A3415984j613160k062726k440006k731337k921938k991616k922290k711518
9214f978607k379084j959213j485225r81855m73019M590M00276O67864P91609
9205a2392664P98280P44959O91011O72969O95857P40892P79956P87447P46813
9196e734480O54244N21513L76120K54649J88190J86166K29953K83037L11233K97464
9186b431911K41808J52136L6598r7960k45312l98881n48643o77440p62779p86019
9176e518403p41456o37618m92429l29545j76978o2473l445J638k7942o6155r2582
9165h147388r8286q4878o1295m0718l5263m7638o6348p3344o2503n3526q5949
9154h857136j94738l85560o27920q69717j061893j177146j213124j182144j098222
$$ y = [13415984, 11802824, 9740098, 7300092, 4568755, 1646817, -1344799, -4267089, -6978607, -9357691, -11316904, -12802129, -13783984, -14257003, -14252413, -13852137, -13184273, -12392664, -11594384, -10849425, -10158414, -9485445, -8789588, -8048696, -7268740, -6481293, -5734480, -5080236, -4558723, -4182603, -3927954, -3739764, -3553598, -3323645, -3040608, -2729375, -2431911, -2190103, -2037967, -2001369, -2099329, -2344641, -2743522, -3292165, -3969605, -4732384, -5518403, -6259859, -6897477, -7389906, -7719451, -7896429, -7958902, -7962347, -7960709, -7988651, -8054806, -8147388, -8245674, -8330552, -8391847, -8432565, -8467828, -8515466, -8581814, -8655158, -8717661, -8771187, -8857136, -9051874, -9437434, -10065354, -10935071, -11996964, -13174110, -14387234, -15569378, -16667600]
9145a6667600r71117q07750o14277l94362j46561J33564M45333P73532J084579
9136a7164659J332619J474227J484551J366626J150821Q87374O35470M49206L61411
9127h022354L71647M47212N39573O07752O34913O29312O11811N99883N97364N92499
9117b390388N61866M77816L18662P8816k26431n64647q95659j180797j389002
9108e209764j500383j508034j417502j244210j010437p43262m72904k30467m4541
9099a3381504O3558Q5794L2889o4535j62307k15618j93172q6043R2157L12527
9089a3516254N41380P50283R22874J055750J152300J213353J232591J200913J114316
9080d332494R76280P93036N69435L11622L3392k41534m84148o67801p74364p96941
$$ y = [-16667600, -17638717, -18446467, -19060744, -19455106, -19601667, -19468103, -19022770, -18249238, -17164659, -15832040, -14357813, -12873262, -11506636, -10355815, -9468441, -8832971, -8383765, -8022354, -7650707, -7203495, -6663922, -6056170, -5421257, -4791945, -4180134, -3580251, -2982887, -2390388, -1828522, -1350706, -1032044, -953228, -1179659, -1744306, -2639965, -3820762, -5209764, -6710147, -8218181, -9635683, -10879893, -11890330, -12633592, -13106496, -13336963, -13381504, -13317946, -13232152, -13199263, -13263798, -13426105, -13641723, -13834895, -13920938, -13828781, -13516254, -12974874, -12224591, -11301717, -10245967, -9093667, -7880314, -6647723, -5446810, -4332494, -3356214, -2563178, -1993743, -1682121, -1648729, -1890263, -2374411, -3042212, -3816576, -4613517]
9070d613517p39138o11616m28864k09135K3530K40804M18633N48434O40950P16768
9060d013151P88476Q48217Q70979Q30533P14097N25688K81870J0042k49649m48142
9050A58960n42537n13654l71892j47940J22082M06407O80011R23450J121223J260035
9040C096145J326868J307660J188361R59824O25536K08129k49519o89161j045484
9031F728359j256653j277947j096848p42740k83671J91234N97272Q77166J012309
9022D748481J018405R29941P84375O15199M53217L27155K56861K42838K62997
9013I639469K83142K75856K34619J73031J10163N2641j4028j18356k83498n07303
9003I845736p55066r70476j099024j111537j017104q60231p02582n96442n63342
$$ y = [-4613517, -5352655, -5964271, -6393135, -6602270, -6578740, -6337936, -5919303, -5370869, -4729919, -4013151, -3224675, -2376458, -1505479, -674946, 39151, 564839, 846709, 856751, 607102, 158960, -383577, -897231, -1269123, -1417063, -1294981, -888574, -208563, 714887, 1836110, 3096145, 4423013, 5730673, 6919034, 7878858, 8504394, 8712523, 8463004, 7773843, 6728359, 5471706, 4193759, 3096911, 2354171, 2070500, 2261734, 2859006, 3736172, 4748481, 5766886, 6696827, 7481202, 8096401, 8549618, 8876773, 9133634, 9376472, 9639469, 9922611, 10198467, 10433086, 10606117, 10716280, 10768921, 10754893, 10636537, 10353039, 9845736, 9090670, 8120194, 7021170, 5909633, 4892529, 4032298, 3329716, 2733274, 2169932]
8994B169932n90395o44771o93831p17031p06209o60156n80113m68379l29514j72086
8984c392553q225J50609K99303M41516N85979P37781Q89100J015702J084040J066917
8974B870169R57772P73934N48917L22315J33102J4388j3715M9736J87557L73511
8964F217686N82551P94727R93014J161904J291517J382690J443948J479179J477181
8955A6824397J415979J281062J082777Q57953O53850N04981M17269L68879L26687
8946B3733834K66978J86503R9069K4050k3884l9989l0266q132J2932K7768M3604
8935B4292467P6578J41407K38630L46572M25062M31841L43131J65446o8519l16440
8925B6076175n44449p36139q88878j003241j076101j103116j086809j041692r92140
$$ y = [2169932, 1579537, 934766, 240935, -476096, -1182305, -1842461, -2422574, -2890953, -3220467, -3392553, -3400778, -3250169, -2950866, -2509350, -1923371, -1185590, -296490, 719212, 1803252, 2870169, 3827941, 4601875, 5150792, 5473107, 5606209, 5620597, 5606882, 5656618, 5844175, 6217686, 6800237, 7594964, 8587978, 9749882, 11041399, 12424089, 13868037, 15347216, 16824397, 18240376, 19521438, 20604215, 21462168, 22116018, 22620999, 23038268, 23407147, 23733834, 24000812, 24187315, 24286384, 24310434, 24286550, 24246561, 24216295, 24208163, 24221095, 24248863, 24292467, 24369045, 24510452, 24749082, 25095654, 25520716, 25952557, 26295688, 26461134, 26392615, 26076175, 25531726, 24795587, 23906709, 22903468, 21827367, 20724251, 19637442, 18595750, 17603610]
8916A7603610r64871r79904j042620j139289j238916j302951j300511j222342
8908H412206j085369r24392p76692o70458o22316o38732p14342q28385r46570
8899A204950j030298j047079r76241q10944n60603k53320O6571L49225N54889
8890b502850O65863O88063O44454N68965N04882N00433N93140P88115J047643
8881C498708J303101J482186J534553J444542J229904R31111N97650K77166Q799
8872A2307720j83407k99576l70326m51196o02365q60709j216855j609712j945736
8863D767838k137881k144601j985777j727281j447095j204933j029233r21105
8855g830068q66077q43870q32080q06442p43137o25012m47966k22579L0185K86856
$$ y = [17603610, 16638739, 15658835, 14616215, 13476926, 12238010, 10935059, 9634548, 8412206, 7326837, 6402445, 5625753, 4955295, 4332979, 3694247, 2979905, 2151520, 1204950, 174652, -872427, -1848668, -2659612, -3220215, -3473535, -3406964, -3057739, -2502850, -1836987, -1148924, -504470, 64495, 569377, 1069810, 1662950, 2451065, 3498708, 4801809, 6283995, 7818548, 9263090, 10492994, 11424105, 12021755, 12298921, 12307720, 12124313, 11824737, 11454411, 11003215, 10400850, 9540141, 8323286, 6713574, 4767838, 2629957, 485356, -1500421, -3227702, -4674797, -5879730, -6908963, -7830068, -8696145, -9540015, -10372095, -11178537, -11921674, -12546686, -12994652, -13217231, -13187046, -12900190]
8845a2900190N29056P47459R40229J107856J249270J362347J446757J504433J536422
8836b476361J539230J504046J418997J272740J059097P82821M64246J37868j57879
8827E544805l95084n65681o79797p55992q11004q53433q80993q80703q33146p20025
8817a831053n30342k61702Q0011M76403Q88764J256997J514294J612855J543621
8808D749848J335662J036916O91856L30732k7075l64313o61734r02387j080614
8799E108891j207621j306344j395487j472903j512522j480203j358256j160630
8791e785075r28582p11693n47255m47283l94750l47629k50813n5860K56836O64089
8781h548015J103010J490518J749505J830213J720859J447012J061240O25403
$$ y = [-12900190, -12371134, -11623675, -10683446, -9575590, -8326320, -6963973, -5517216, -4012783, -2476361, -937131, 566915, 1985912, 3258652, 4317749, 5100570, 5564816, 5702684, 5544805, 5149721, 4584040, 3904243, 3148251, 2337247, 1483814, 602821, -277882, -1111028, -1831053, -2361395, -2623097, -2543086, -2066683, -1177919, 79078, 1593372, 3206227, 4749848, 6085510, 7122426, 7814282, 8145014, 8117939, 7753626, 7091892, 6189505, 5108891, 3901270, 2594926, 1199439, -273464, -1785986, -3266189, -4624445, -5785075, -6713657, -7425350, -7972605, -8419888, -8814638, -9162267, -9413080, -9468940, -9212104, -8548015, -7445005, -5954487, -4204982, -2374769, -653910, 793102, 1854342, 2479745]
8773B479745J91220k11948n75616q99377j177298j393197j525710j556583j476358
8764f145122j287042j003851o56087k85560N8370L27555M88618N38535N11897
8755g452687M67741M57472M94301N48164N70634N29768M28918L00031J82427J04013
8745c369218P3373Q0690J02655J09170P1201l1768k06052m39478o98718r32444
8735e240589j085152j119116j031992q57367o47102m47294k82114j52136m3831
8726a0906693N8299J64495K79078M01891N26623O36741P05483P04292O16302M46461
8716f367028K22328j4577k22593l73354m59338m92618m96384m94673n05350n37767
8706i741354n92923o63087p29839p62809p23719n78237l12120N7428M82868Q99669
$$ y = [2479745, 2670965, 2459017, 1883401, 984024, -193274, -1586471, -3112181, -4668764, -6145122, -7432164, -8436015, -9092102, -9377662, -9319292, -8991737, -8503119, -7964584, -7452687, -6984946, -6527474, -6033173, -5485009, -4914375, -4384607, -3955689, -3655658, -3473231, -3369218, -3295845, -3215155, -3112500, -3003330, -2932129, -2963897, -3169949, -3609427, -4308145, -5240589, -6325741, -7444857, -8476849, -9334216, -9981318, -10428612, -10710726, -10862862, -10906693, -10848394, -10683899, -10404821, -10002930, -9476307, -8839566, -8134083, -7429791, -6813489, -6367028, -6144700, -6159277, -6381870, -6755224, -7214562, -7707180, -8203564, -8698237, -9203587, -9741354, -10334277, -10997364, -11727203, -12490012, -13213731, -13791968, -14104088, -14046660, -13563792, -12664123]
8696a2664123J244154J467568J544168J475672J293070J051840Q16409O37247
8688c133995N32953M90084M81572M89752N16096N71338O56385P50770Q16542Q12707
8678B984204P10546N05018K21067q8939l61991n53177o60207p23612p97600r10201
8668C25108j041798j137302j141299j030284q21986n60144k87752k6040K28757
8659e492740M90179P60076J017879J228191J358334J391181J326886J177876R63175
8650D221037P03517M17098J17615j84164m76549p43150r60619j101178j143051
8641H50556j085058r52815p87476o24240m79160l54133k51315j80672j54545j76568
8631d195426k35400l07293l64811l86571l63034k95217j87865m3740J33733L30264
$$ y = [-12664123, -11419969, -9952401, -8408233, -6932561, -5639491, -4587651, -3771242, -3133995, -2601042, -2110958, -1629386, -1139634, -623538, -52200, 604185, 1354955, 2171497, 2984204, 3694750, 4199768, 4420835, 4331896, 3969905, 3416728, 2756521, 2032909, 1235309, 325108, -716690, -1853992, -2995291, -4025575, -4847561, -5407705, -5695457, -5721497, -5492740, -5002561, -4242485, -3224606, -1996415, -638081, 753100, 2079986, 3257862, 4221037, 4924554, 5341652, 5459267, 5275103, 4798554, 4055404, 3094785, 1993607, 850556, -234502, -1187317, -1974793, -2599033, -3078193, -3432326, -3683641, -3864313, -4018858, -4195426, -4430826, -4738119, -5102930, -5489501, -5852535, -6147752, -6335617, -6379357, -6245624, -5915360]
8621e915360N13463O39805O75079O13992M83586L28525J90486R5938N7143Q0287
8611b237056J70933L31129N50547Q00142J036354J216044J313490J328477J280434
8602E790494J193074J080126R41369P70799N69996L56275J58967N345r5216j58397
8592A0612832k17774l07481m45984o30488q41853j052896j234800j361980j417285
8583C102291j396470j309434j177031j023277q64076o97741n05730k66731K4789
8574d113410L49945O71808R48542J142907J227271J189597J040542Q13846N54305
8565C825353K98704O2126j62209l90945o33650q79439j094450j233295j258700
8556a466505j157022r41211o44057l09752J3745K85171M82679O10785O94766P65476
$$ y = [-5915360, -5401897, -4762092, -4087013, -3473021, -2989435, -2660910, -2470424, -2374486, -2317343, -2237056, -2066123, -1734994, -1184447, -384305, 652049, 1868093, 3181583, 4510060, 5790494, 6983568, 8063694, 9005063, 9775862, 10345858, 10702133, 10861100, 10866445, 10771229, 10612832, 10395058, 10087577, 9641593, 9011105, 8169252, 7116356, 5881556, 4519576, 3102291, 1705821, 396387, -780644, -1803921, -2667997, -3365738, -3871468, -4138199, -4113410, -3763465, -3091657, -2143115, -1000208, 227063, 1416660, 2457202, 3271048, 3825353, 4124057, 4186183, 4023974, 3633029, 2999379, 2119940, 1025490, -207805, -1466505, -2623527, -3564738, -4208795, -4518547, -4504802, -4219631, -3736952, -3126167, -2431401, -1665925]
8546a665925Q43864R32315J015153J067774J070198J016654R14475P74824O04610
8537F573942M05343J76641p9908l56877o36879q91975j091236j213532j255465
8528A630054j227441j141968j005016q16641n77482k94069J9932L44637O55443
8519b412551R26143J134359J267206J324067J315791J261933J187639J119963
8511G124550J082799J090560J143060J225155J312243J378056J399478J357723
8503A7113624J240711J050017Q08162N57933L49648K21204J80921K02385K34571
8494B1959176K22367J26702o4415l34882o44823r37722j151949j236863j168237
8485A6769354r55906o40674k82572N5862L27490N14630O32912P21072Q19992R51704
$$ y = [-1665925, -822061, 110254, 1125407, 2193181, 3263379, 4280033, 5194508, 5969332, 6573942, 6979285, 7155926, 7076018, 6719141, 6082262, 5190287, 4099051, 2885519, 1630054, 402613, -739355, -1744371, -2561012, -3138494, -3432563, -3412631, -3067994, -2412551, -1486408, -352049, 915157, 2239224, 3555015, 4816948, 6004587, 7124550, 8207349, 9297909, 10440969, 11666124, 12978367, 14356423, 15755901, 17113624, 18354335, 19404352, 20212514, 20770447, 21120095, 21341299, 21522220, 21724605, 21959176, 22181543, 22308245, 22243830, 21908948, 21264125, 20326403, 19174454, 17937591, 16769354, 15813448, 15172774, 14890202, 14946064, 15273554, 15788184, 16421096, 17142168, 17962160, 18913864]
8475A8913864J110175J268429J395349J469646J482130J428175J300881J094423
8467B9463072Q16656M99055J92111n3216k05024k58392k30641j51770n6779J9487
8457C0034559M7149O695j06207k79570m90259p13340r28051j114808j248104j296305
8447B3911759j232928j051585p73224m41787j12754J59335L31543L80901L09399
8438B1480659J42893p8404l14887n39033p35846q94891j004620j055569j047689
8429A5952613r92568r07258q04509o86381n44923l68788j51154J05288L86171
8420A1988491O63741Q96850J037602J045452R01882O18113K34997j83165n62548
8411A6641415q41757r92444j024156r69777q64046p31191n85857m39258l00867
$$ y = [18913864, 20024039, 21292468, 22687817, 24157463, 25639593, 27067768, 28368649, 29463072, 30279728, 30778783, 30970894, 30917678, 30712654, 30454262, 30223621, 30071851, 30015072, 30034559, 30081708, 30088403, 29982196, 29702626, 29212367, 28499027, 27570976, 26456168, 25208064, 23911759, 22678831, 21627246, 20854022, 20412235, 20299481, 20458816, 20790359, 21171260, 21480659, 21623552, 21545148, 21230261, 20691228, 19955382, 19060491, 18055871, 17000302, 15952613, 14960045, 14052787, 13248278, 12561897, 12016974, 11648186, 11497032, 11602320, 11988491, 12652232, 13549082, 14586684, 15632136, 16534018, 17152131, 17387128, 17203963, 16641415, 15799658, 14807214, 13783058, 12813281, 11949235, 11218044, 10632187, 10192929, 9892062]
8402I892062j73871n0607Q4280K41940M17004N86008P19534P99644Q30220Q34061
8392A4180275Q39689Q66092R12719R57476R61499Q78810O70155L18958j57095
8383B0428578p06062j254265j724662k052651k195386k134744j875447j440516
8375G044845q66371j98742N10366J203910J819022K288222K549476K566245K346890
8366A9263863J948346J458463R66998N41586K18261M366j13674j61992j69735
8357B3956482j58384j34709r2925k4824O9989J80275K85181L57895L69544K94642
8347B5103166J18037j59042n15898r13396j301299j633247j884474k060953k190703
8338A4562191k300765k395514k452123k435858k322779k112931j826274j487404
$$ y = [9892062, 9718191, 9667584, 9751864, 9993804, 10410808, 10996816, 11716350, 12515994, 13346214, 14180275, 15019964, 15886056, 16798775, 17756251, 18717750, 19596560, 20266715, 20585673, 20428578, 19722516, 18468251, 16743589, 14690938, 12495552, 10360808, 8485361, 7044845, 6178474, 5979732, 6490098, 7694008, 9513030, 11801252, 14350728, 16916973, 19263863, 21212209, 22670672, 23637670, 24179256, 24397517, 24401883, 24288209, 24126217, 23956482, 23798098, 23663389, 23570464, 23545640, 23615629, 23795904, 24081085, 24438980, 24808524, 25103166, 25221203, 25062161, 24546263, 23632867, 22331568, 20698321, 18813847, 16752894, 14562191, 12261426, 9865912, 7413789, 4977931, 2655152, 542221, -1284053, -2771457]
8330b771457j111717p01698k53384K32550P41697J243890J699612K071188K331599
8321C482280K466606K472693K356733K139122J855037J548207J258343J010223
8313A8589244Q11067O55831N34233M33884L38766K26413O8386j63340m85060q89479
8303B0119945j339524j772851k117834k315640k338782k197642j933176j600652
8295D503844j251740r21246o23175l57894j25503O5451K01949K79141L08601L13652
8285B393080L16220L26549L41769L50589L38928K94888K13831J02118k4219j47876
8275D505877k61956l76339n11596o81748q77301j062196j188307j216685j129986
8266b800237r30695o33546k62904J44653N41197Q77189J115520J241031J261806
$$ y = [-2771457, -3883174, -4584872, -4838256, -4605706, -3864009, -2620119, -920507, 1150681, 3482280, 5948886, 8421579, 10778312, 12917434, 14772471, 16320678, 17579021, 18589244, 19400311, 20056142, 20590375, 21024259, 21363025, 21589438, 21657824, 21494484, 21009424, 20119945, 18780421, 17007570, 14889736, 12574096, 10235314, 8037672, 6104496, 4503844, 3252104, 2330858, 1707683, 1349789, 1224286, 1289737, 1491686, 1770827, 2079428, 2393080, 2709300, 3035849, 3377618, 3728207, 4067135, 4362023, 4575854, 4677972, 4653753, 4505877, 4243921, 3867582, 3355986, 2674238, 1796937, 734741, -453566, -1670251, -2800237, -3730932, -4364478, -4627382, -4482729, -3941532, -3064343, -1948823, -707792, 554014]
8257E54014J204257J104471R96396Q98441Q04076O83762N00979K35553r9929m61525
8247F420495p90670j032835j147851j113912r31806o28624k53402J37232M95377
8238A154004P90971J012316J161820J249210J283557J267182J194778J056766
8230A0170604Q43900N53044J95893j93140n59320q44858j012302j057782j006432
8221G089607q97129p69421o57411n86145n66725n93153o45273o95857p16502o81326
8211B80665n72809l91203j60919P4309K68445L93847M53925M79895N12645N79962
8201A918762O82576P95950Q83659R12451Q62122P29271N26860K81774L2001j76965
8191G448461k99514l03034j82389L3759K90968N27712O94446P64795P37790O34215
$$ y = [554014, 1758271, 2862742, 3859138, 4757579, 5561655, 6245417, 6746396, 6981949, 6882020, 6420495, 5629825, 4596990, 3449139, 2335227, 1403421, 774797, 521395, 658627, 1154004, 1944975, 2957291, 4119111, 5368321, 6651878, 7919060, 9113838, 10170604, 11014504, 11567548, 11763441, 11570301, 11010981, 10166123, 9153821, 8096039, 7089607, 6192478, 5423057, 4765646, 4179501, 3612776, 3019623, 2374350, 1678493, 961991, 280665, -292144, -683347, -844266, -769957, -501512, -107665, 346260, 826155, 1338800, 1918762, 2601338, 3397288, 4280947, 5193398, 6055520, 6784791, 7311651, 7593425, 7625426, 7448461, 7148947, 6845913, 6663524, 6697283, 6988251, 7515963, 8210409, 8975204, 9712994, 10347209]
8181A0347209M89231L41738K22637J47080J14672J15736J37518J66080J85006
8172A2266907J74952J16831j050j74736l80803n82267p42862q40453q70331q38530
8162H127658p54033o27537m75286l19648j80716o3370M7585J75426L29180M90381
8152F749640O23256P01816P31295P45828P84623Q65500R75250J081905J157424
8143A4416537J192751J195906J179087J147014J092188R94877Q27511N68099K21756
8134B2835726j63321n02724p08250p29008n76804l20681n3700J49265K59174K92994
8124B0482671K92115K96704L30006L94474M74870N44979N77247N53098M69365
8115B4415529L37919J79586J5620j40293k86718m33154n91798p66021r42651j093705
$$ y = [10347209, 10836440, 11178178, 11400815, 11547895, 11662567, 11778303, 11915821, 12081901, 12266907, 12441859, 12558690, 12557640, 12382904, 12002101, 11419834, 10676972, 9836519, 8966188, 8127658, 7373625, 6746088, 6270802, 5951154, 5770438, 5707068, 5754653, 5930079, 6259259, 6749640, 7372896, 8074712, 8806007, 9551835, 10336458, 11201958, 12177208, 13259113, 14416537, 15609288, 16805194, 17984281, 19131295, 20223483, 21218360, 22045871, 22613970, 22835726, 22672405, 22169681, 21461431, 20732423, 20155619, 19834938, 19781238, 19930503, 20189677, 20482671, 20774786, 21071490, 21401496, 21795970, 22270840, 22815819, 23393066, 23946164, 24415529, 24753448, 24933034, 24948654, 24808361, 24521643, 24088489, 23496691, 22730670, 21788019, 20694314]
8105B0694314j186848j198450j123081r77135p95935o22898m91888m11717l65291
8096A3521071l26305k79901k29368j84760j46632j00349k4145R7279K63257M56366
8086A3046513O49343Q14689R30247R78418R43138Q10688N75386K46750j45037
8077A8850135n47896q95550j126825j209500j153083j000372q03439o00047m03474
8068A1109949k08680r019J87293L52010M47158M43515L34550J38365j09851l67686
8058A2317604n93276p51459q20586p99410p08879n83819m56907l45535k50678
8049G007055j65998q7221j4646M9299J00927J31000J18736L2766j54500m43719
8039F573699p93084j125109j354162j418082j297211j015254o25253j88415K43771
$$ y = [20694314, 19507466, 18309016, 17185935, 16208800, 15412865, 14789967, 14298079, 13886362, 13521071, 13194766, 12914865, 12685497, 12500737, 12354105, 12253756, 12229611, 12326890, 12590147, 13046513, 13695856, 14510545, 15440792, 16419210, 17362348, 18173036, 18748422, 18995172, 18850135, 18302239, 17406689, 16279864, 15070364, 13917281, 12916909, 12113470, 11513423, 11109949, 10901269, 10892250, 11079543, 11431553, 11878711, 12322226, 12656776, 12795141, 12685290, 12317604, 11724328, 10972869, 10152283, 9352873, 8643994, 8060175, 7603268, 7257733, 7007055, 6841057, 6753836, 6739190, 6788489, 6889416, 7020416, 7139152, 7171918, 7017418, 6573699, 5780615, 4655506, 3301344, 1883262, 586051, -429203, -1054456, -1242871, -999100]
8030i99100O34740R56323J182787J295612J294840J203544J059305Q99415P49710
8021H277176O20270N05646L88103K45129O1324j59803l92036n95792p36706q01300
8011G412011p99540p54974o92707o34218n98791o04301o61521p64050q83241r76791
8001D1877j009296r71639q84924p86737p10134o68342o50974o30712n76919m71518
7991g319318l19792j48864P653J30391K26248L22509M47437O12228Q06355J005024
7981d230129J178802J299676J345907J307649J188963J002396P61344M79766J80452
7972D514826r8161l06696m00287l55452j79467R1441M04093P06366R63388J163342
7962F503393J309603J405461J443923J411512J302759J131819R30031P31701N60435
$$ y = [-999100, -364360, 591963, 1774750, 3070362, 4365202, 5568746, 6628051, 7527466, 8277176, 8897446, 9403092, 9791195, 10036324, 10097648, 9937845, 9545809, 8950017, 8213311, 7412011, 6612471, 5857497, 5164790, 4530572, 3931781, 3327480, 2665959, 1901909, 1018668, 41877, -967419, -1939058, -2823982, -3610719, -4320853, -4989195, -5640169, -6270881, -6847800, -7319318, -7639110, -7787974, -7780321, -7649930, -7423682, -7101173, -6653736, -6041508, -5235153, -4230129, -3051327, -1751651, -405744, 901905, 2090868, 3093264, 3854608, 4334374, 4514826, 4416665, 4109969, 3709682, 3354230, 3174763, 3266204, 3670297, 4376663, 5340051, 6503393, 7812996, 9218457, 10662380, 12073892, 13376651, 14508470, 15438501, 16170202, 16730637]
7953A6730637M24348L17620K22930J16417k0260j84920l49664m72634n19187m78342
7943A5786945l67662k28776j16471q1595j50831l12817n20109p07543q17449q19610
7933A1664082p19349n54392l84014k72699k69952l92281o16866q92106j157834
7924F404589j360933j459244j420270j224988q76997m07193J32719O83604J189305
7915A660592J600670J877751J994906J947261J753240J450473J086824P09945
7907A4081662L58535N8132j77337l41133m31472m53131m19194l49393k66598j94389
7897A1865682j54280j59475k07787k81376l56000m12781m43621m48850m31769
7888H969743l93599l30225k32947r5223P8032K66290M37882N58607N98483N36645
$$ y = [16730637, 17154985, 17472605, 17695535, 17811952, 17791692, 17606772, 17257108, 16784474, 16265287, 15786945, 15419283, 15190507, 15074036, 14992441, 14841610, 14528793, 14008684, 13301141, 12483692, 11664082, 10944733, 10390341, 10006327, 9733628, 9463676, 9071395, 8454529, 7562423, 6404589, 5043656, 3584412, 2164142, 939154, 62157, -345036, -212317, 471287, 1660592, 3261262, 5139013, 7133919, 9081180, 10834420, 12284893, 13371717, 14081662, 14440197, 14498329, 14320992, 13979859, 13548387, 13095256, 12676062, 12326669, 12060071, 11865682, 11711402, 11551927, 11344140, 11062764, 10706764, 10293983, 9850362, 9401512, 8969743, 8576144, 8245919, 8012972, 7917749, 7995781, 8262071, 8699953, 9258560, 9857043, 10393688]
7878A0393688L68109J11877j86100m61410o50249p11123o39245m66787k48854
7869G509906m2216J12418J97027K12611J72027R5112O276o8309j04899q6219m127
7858G999607J38800L29267N46763P70807R87233J187851J363743J499883J577488
7849A6401442J581191J501603J329971J053269O59998J55031m29945j040494j614545
7840A9597521k097402k450744k657027k720384k662102k510801k293398k033102
7832A72561j753587j482548j248674j072343r55574q78252q04692o98584n39017
$$ y = [10393688, 10761797, 10873674, 10687574, 10226164, 9575915, 8864792, 8225547, 7758760, 7509906, 7467690, 7580108, 7777135, 7989746, 8161773, 8256885, 8263161, 8194852, 8089953, 8003734, 7999607, 8138407, 8467674, 9014437, 9785244, 10772477, 11960328, 13324071, 14823954, 16401442, 17982633, 19484236, 20814207, 21867476, 22527474, 22682505, 22252560, 21212066, 19597521, 17500119, 15049375, 12392348, 9671964, 7009862, 4499061, 2205663, 172561, -1581026, -3063574, -4312248, -5384591, -6340165, -7218417, -8023109, -8721693, -9260710]
$$ [...]
##END NTUPLES=NMR SPECTRUM
##END=
