##TITLE=31Pdec_DE-57rm_100m
 
 64 sc
 7.5.2024
##JCAMPDX= 6.0         $$ Bruker NMR JCAMP-DX V2.0
##DATA TYPE= NMR SPECTRUM
##DATA CLASS= NTUPLES
##ORIGIN= UXNMR, Bruker Analytische Messtechnik GmbH
##OWNER= root
$$ XWIN-NMR		Version 3.5
$$ Tue May  7 16:12:18 2024 Russian Standard Time (UT+4h)  she@DPX200
##.OBSERVE FREQUENCY= 81.013821
##.OBSERVE NUCLEUS= ^31P
##.ACQUISITION MODE= SIMULTANEOUS
##.ACQUISITION SCHEME= undefined
##.AVERAGES= 64
##.DIGITISER RES= 16
##SPECTROMETER/DATA SYSTEM= spect
##.PULSE SEQUENCE= zgpg30
##.SOLVENT NAME= CDCl3
##.SHIFT REFERENCE= (INTERNAL, CDCl3, 0, 248.564)
##AUDIT TRAIL= $$ (NUMBER, WHEN, WHO, WHERE, WHAT)
$$ ##TITLE= Audit trail, XWIN-NMR		Version 3.5
$$ ##JCAMPDX= 5.01
$$ ##ORIGIN= Bruker BioSpin GmbH
$$ ##OWNER= she
$$ F:/spectra/data/she/nmr/P31/1/pdata/1/auditp.txt
$$ ##AUDIT TRAIL=  $$ (NUMBER, WHEN, WHO, WHERE, WHAT)
(   1,<2024-05-07 16:10:48.26 +0400>,<she>,<DPX200>,
      <continue with go, POWCHK disabled, PULCHK disabled
       configuration hash MD5:
       00 E9 B6 7A A2 85 ED C7 34 08 36 98 17 FE 4E 26
       data hash MD5: 32K
       02 69 B9 B4 86 1C C8 39 3E 3B 0E C7 3B 3E 0F D0>)
(   2,<2024-05-07 16:10:50.70 +0400>,<she>,<DPX200>,
      <Start of raw data processing
       efp BC_mod = 2 LB = 10 FT_mod = 6 PKNL = 1 PHC0 = -13247.07 PHC1 = 132.0835 SI = 64K 
       data hash MD5: 64K
       09 8E 6E 29 A4 7D 39 D2 86 7E A2 AC DD E7 EF 3F>)
(   3,<2024-05-07 16:11:03.20 +0400>,<she>,<DPX200>,
      <pk PHC0 = -16.77989 PHC1 = 0 
       data hash MD5: 64K
       F0 03 65 0D 29 82 E6 91 AE 79 3E 85 2E E6 F9 31>)
(   4,<2024-05-07 16:11:34.78 +0400>,<she>,<DPX200>,
      <pk PHC0 = 211.7433 PHC1 = -560.4 
       data hash MD5: 64K
       E3 3F 25 29 98 25 DD 4E 48 31 2E 33 5E 2D 14 A0>)
(   5,<2024-05-07 16:11:38.23 +0400>,<she>,<DPX200>,
      <abs ABSG = 5 
       data hash MD5: 64K
       9E BA FC 07 24 51 F6 95 C2 C2 5A 5E 3B 2C AF 9D>)
$$ ##END=
$$ 
$$ hash MD5
$$ BF BD FC B8 14 D6 79 4A 7F 11 71 97 B8 ED 47 4D
##$RELAX= 
##$RELAX= 
##$RELAX= 
##$RELAX= 
##$RELAX= 
##$RELAX= 
##$RELAX= 
##$RELAX= 
##$RELAX= 
$$ Bruker specific parameters
$$ --------------------------
##$DU= <F:/spectra>
##$EXPNO= 1
##$NAME= <P31>
##$PROCNO= 1
##$TYPE= <nmr>
##$USER= <she>
##$AMP= (0..31)
100 100 100 100 100 100 100 100 100 100 100 100 100 100 100 100 100 100 
100 100 100 100 100 100 100 100 100 100 100 100 100 100 
##$AQSEQ= 0
##$AQ_mod= 1
##$AUNM= <au_zg>
##$AUTOPOS= <>
##$BF1= 81.014009
##$BF2= 200.13
##$BF3= 200.13
##$BF4= 200.13
##$BF5= 200.13
##$BF6= 200.13
##$BF7= 200.13
##$BF8= 200.13
##$BYTORDA= 1
##$CFDGTYP= 0
##$CFRGTYP= 5
##$CHEMSTR= <none>
##$CNST= (0..31)
1 1 145 1 1 1 1 1 1 1 1 1 1 1 1 1 1 1 1 1 1 1 1 1 1 1 1 1 1 1 1 1 
##$CPDPRG= <waltz16>
##$CPDPRG1= <>
##$CPDPRG2= <waltz16>
##$CPDPRG3= <>
##$CPDPRG4= <mlev>
##$CPDPRG5= <mlev>
##$CPDPRG6= <mlev>
##$CPDPRG7= <mlev>
##$CPDPRG8= <mlev>
##$CPDPRGB= <>
##$CPDPRGT= <>
##$D= (0..31)
$$ [...]
##$SUBNAM3= <"">
##$SUBNAM4= <"">
##$SUBNAM5= <"">
##$SUBNAM6= <"">
##$SUBNAM7= <"">
##$SUBNAM8= <"">
##$SUBNAM9= <"">
##$SW= 501.771253377433
##$SWIBOX= (0..15)
0 1 3 0 0 0 0 0 0 0 0 0 0 0 0 0 
##$SW_h= 40650.406504065
##$TD= 32768
##$TD0= 1
##$TE= 0
##$TE2= 300
##$TE3= 300
##$TEG= 300
##$TL= (0..7)
0 120 53 12 22 120 120 120 
##$TP= (0..7)
150 150 150 150 150 150 150 150 
##$TP07= 0
##$TPNAME0= <>
##$TPNAME1= <>
##$TPNAME2= <>
##$TPNAME3= <>
##$TPNAME4= <>
##$TPNAME5= <>
##$TPNAME6= <>
##$TPNAME7= <>
##$TPOAL= (0..7)
0.5 0.5 0.5 0.5 0.5 0.5 0.5 0.5 
##$TPOFFS= (0..7)
0 0 0 0 0 0 0 0 
##$TUNHIN= 0
##$TUNHOUT= 0
##$TUNXOUT= 0
##$USERA1= <user>
##$USERA2= <user>
##$USERA3= <user>
##$USERA4= <user>
##$USERA5= <user>
##$V9= 5
##$VALIST= <valist>
##$VCLIST= <CCCCCCCCCCCCCCC>
##$VD= 0
##$VDLIST= <DDDDDDDDDDDDDDD>
##$VPLIST= <PPPPPPPPPPPPPPP>
##$VTLIST= <TTTTTTTTTTTTTTT>
##$WBST= 1024
##$WBSW= 4
##$XGAIN= (0..3)
0 0 0 0 
##$XL= 0
##$YL= 0
##$YMAX_a= 12905
##$YMIN_a= -8967
##$ZGOPTNS= <>
##$ZL1= 120
##$ZL2= 120
##$ZL3= 120
##$ZL4= 120
##$ABSF1= 248.5645
##$ABSF2= -253.2056
##$ABSG= 5
##$ABSL= 3
##$ALPHA= 0
##$AQORDER= 0
##$ASSFAC= 0
##$ASSFACI= 0
##$ASSFACX= 0
##$ASSWID= 0
##$AUNMP= <proc_1d>
##$AZFE= 0.1
##$AZFW= 0.5
##$BCFW= 0
##$BC_mod= 2
##$BYTORDP= 0
##$COROFFS= 0
##$CY= -3
##$DATMOD= 1
##$DC= 0
##$DFILT= <>
##$DTYPP= 0
##$F1P= 0
##$F2P= 0
##$FCOR= 1
##$FTSIZE= 65536
##$FT_mod= 6
##$GAMMA= 0
##$GB= 0
##$INTBC= 1
##$INTSCL= 6.047779e-11
##$ISEN= 30
##$LB= 10
##$LEV0= 0
##$LPBIN= 0
##$MAXI= 10000
##$MC2= 0
##$MEAN= 0
##$ME_mod= 0
##$MI= 50
##$NCOEF= 0
##$NC_proc= -10
##$NLEV= 6
##$NOISF1= 182.463
##$NOISF2= 159.3651
##$NSP= 0
##$NTH_PI= 0
##$NZP= 0
##$OFFSET= 248.5645
##$PC= 4
##$PHC0= -13052.11
##$PHC1= -428.3165
##$PH_mod= 1
##$PKNL= yes
##$PPARMOD= 0
##$PSCAL= 0
##$PSIGN= 0
##$REVERSE= no
##$SF= 81.0140089999694
##$SI= 65536
##$SIGF1= 159.3651
##$SIGF2= -187.1042
##$SINO= 113.3802
##$SIOLD= 16384
##$SREGLST= <1H.CDCl3>
##$SSB= 0
##$STSI= 65536
##$STSR= 0
##$SW_p= 40650.406504065
##$SYMM= 0
##$S_DEV= 0
##$TDeff= 32768
##$TDoff= 0
##$TI= <>
##$TILT= no
##$TM1= 0
##$TM2= 0
##$TOPLEV= 0
##$USERP1= <user>
##$USERP2= <user>
##$USERP3= <user>
##$USERP4= <user>
##$USERP5= <user>
##$WDW= 1
##$XDIM= 65536
##$YMAX_p= 580465954
##$YMIN_p= -79989635
$$ End of Bruker specific parameters
$$ ---------------------------------
##NTUPLES= NMR SPECTRUM
##VAR_NAME=  FREQUENCY,     SPECTRUM/REAL,   SPECTRUM/IMAG
##SYMBOL=    X,             R,               I
##VAR_TYPE=  INDEPENDENT,   DEPENDENT,       DEPENDENT
##VAR_FORM=  AFFN,          ASDF,            ASDF
##VAR_DIM=   65536,         65536,           65536
##UNITS=     HZ,            ARBITRARY UNITS, ARBITRARY UNITS
##FACTOR=    0.620285442955139, 1,           1
##FIRST=     20137.2065510682, 0,            0
##LAST=      -20513.1999529968, 0,           0
##MIN=       -20513.1999529968, -79989635,   0
##MAX=       20137.2065510682, 580465954,    0
$$ Real data points
##PAGE= N=1
##DATA TABLE= (X++(R..R)), XYDATA
$$ [...]
43401C460443L4696K8094R6817K08833L21223L96508M19370M02175L74789L66782
43391F109730L94343M56834N40389O24988O93053P36520P58517P68924P77650
43382A1860948P90208Q07083Q25050Q37660Q34071P99487P21156N97948M43878
43373A8517489K78975J13911n7147k49340m74174p32339j014039j301028j567571
43364A3514737j783140j919171j957382j895355j746877j537507j297755j056702
43356C20848q37453o54252n12057m10150l48376l29730l54345m09355m66589m94710
43346d496169m78530m29943l81207l65545l98867m72824n60055o26092o42175
43337h851407n93873m80816l07959p7597K06670N25159Q32523J068132J182661
$$ y = [3460443, 3495139, 3523233, 3620050, 3828883, 4150106, 4546614, 4965984, 5368159, 5742948, 6109730, 6504073, 6960907, 7501296, 8126284, 8819337, 9555857, 10314374, 11083298, 11860948, 12651156, 13458239, 14283289, 15120949, 15955020, 16754507, 17475663, 18073611, 18517489, 18796464, 18910375, 18853228, 18603888, 18129714, 17397375, 16383336, 15082308, 13514737, 11731597, 9812426, 7855044, 5959689, 4212812, 2675305, 1377550, 320848, -516605, -1170857, -1682914, -2093064, -2441440, -2771170, -3125515, -3534870, -4001459, -4496169, -4974699, -5404642, -5785849, -6151394, -6550261, -7023085, -7583140, -8209232, -8851407, -9445280, -9926096, -10234055, -10311652, -10104982, -9579823, -8747300, -7679168, -6496507]
43328f496507J161530J028807Q31112O13973M04657K08595J7286j80234l89061
43319b799842o03824q06472r68310j059458j062948r84171q48579o89608n35146
43310a0358358l99887k85819j88473j03964l2999J8674M2033K9137j9280q6524
43300a1385460j40789j47717q8250L0164J75578L03590L71262L47814K22038P055
43290a0304715k60724n32816p67398r43834j062100j129084j144583j097370r71096
43281a8213720p54728m53159r4065K75022O01499Q46902R98594J068136J080610
43272a4644909J062954J037266J021181J032314J089719J206827J379710J581716
43264e233222J771440J909122J970602J952413J868851J743678J598149J439970
$$ y = [-6496507, -5334977, -4306170, -3475058, -2861085, -2456428, -2247833, -2230547, -2410781, -2799842, -3403666, -4210138, -5178448, -6237906, -7300854, -8285025, -9133604, -9823212, -10358358, -10758245, -11044064, -11232537, -11336501, -11369500, -11350826, -11308793, -11279656, -11298936, -11385460, -11526249, -11673966, -11762216, -11732052, -11556474, -11252884, -10881622, -10533808, -10311770, -10304715, -10565439, -11098255, -11865653, -12809487, -13871587, -15000671, -16145254, -17242624, -18213720, -18968448, -19421607, -19515672, -19240650, -18639151, -17792249, -16793655, -15725519, -14644909, -13581955, -12544689, -11523508, -10491194, -9401475, -8194648, -6814938, -5233222, -3461782, -1552660, 417942, 2370355, 4239206, 5982884, 7581033, 9021003]
43256I021003J261596J052196Q15021N74038L62444K04158J06377O8018R0925
43247A3555776J79301L28326N15200P01467Q43392R02632Q54291O93027M35100
43238A9008512J12107k42412o03581r53422j269185j516416j658026j674048j575248
43229I628281j400011j199824j024869r14636q91107r53023j073894j206085j291032
43220c26200j274581j124716q44307m70715o1888L22280O33998Q45144R50520
43211a350465R66815R25205Q58568P88327P17645O35278N29022L99925K65376
43202D735696J47327N5689j8489r5323j91695l10096m35093n37315n83780n50789
43192B216132m33239k46579k3665J89830L41992L85630K91769N9088k85396o93218
$$ y = [9021003, 10282599, 11334795, 12149816, 12723854, 13086298, 13290456, 13396833, 13464851, 13555776, 13735077, 14063403, 14578603, 15280070, 16123462, 17026094, 17880385, 18573412, 19008512, 19120619, 18878207, 18274626, 17321204, 16052019, 14535603, 12877577, 11203529, 9628281, 8228270, 7028446, 6003577, 5088941, 4197834, 3244811, 2170917, 964832, -326200, -1600781, -2725497, -3569804, -4040519, -4102407, -3780127, -3146129, -2300985, -1350465, -383650, 541555, 1400123, 2188450, 2906095, 3541373, 4070395, 4470320, 4735696, 4883023, 4938712, 4920223, 4824900, 4633205, 4323109, 3888016, 3350701, 2766921, 2216132, 1782893, 1536314, 1512649, 1702479, 2044471, 2430101, 2721870, 2780958, 2495562, 1802344]
43182A802344j105019j462691j722360j865620j904134j874026j821067j782170
43174a1734743j770299j768766j737914j633008j426322j122120p55277l74671
43166b2323120k2478K78499N25594P28962R00877J044932J150138J195988J168452
43157a5352156J076101R52434Q40559P70845P47125P49020P45874P11900O35346
43148h122952N20789L86722K59725J65627J19831J21015J51308J82733J87661
43139f027541J50756P8374o95m6996l0581N1873J73121K85724L40330L04123J74263
43128d547249j7877k15044l53617l85520k91392q0803K15018N49914Q67484J108631
43118c150455J225171J195418J033031P82606N02345K41259K2184j60970l32730
$$ y = [1802344, 697325, -765366, -2487726, -4353346, -6257480, -8131506, -9952573, -11734743, -13505042, -15273808, -17011722, -18644730, -20071052, -21193172, -21948449, -22323120, -22345598, -22067099, -21541505, -20812543, -19911666, -18866734, -17716596, -16520608, -15352156, -14276055, -13323621, -12483062, -11712217, -10965092, -10216072, -9470198, -8758298, -8122952, -7602163, -7215441, -6955716, -6790089, -6670258, -6549243, -6397935, -6215202, -6027541, -5876785, -5798411, -5799106, -5846102, -5876683, -5824810, -5651689, -5365965, -5025635, -4721512, -4547249, -4565126, -4780170, -5133787, -5519307, -5810699, -5891502, -5676484, -5126570, -4259086, -3150455, -1925284, -729866, 303165, 1085771, 1588116, 1829375, 1851559, 1690589, 1357859]
43109A357859n21817p51493j034865j370653j739009k102038k412197k624993
43101a1199206k709513k652676k457705k140456j727951j260098p89314l70684
43093b5307603m3168J86562L45213M78690O33759Q45105J127841J471940J840900
43084a8420761K180956K440700K589862K624180K554546K392100K142643J812777
43076C17003J418649R87625N52107J42231k16855n04108p03241q07302q23291
43067C62818p69822o66107n20306l28175q4298K04322N13924Q09744J053547J208080
43057A783727J242851J145962R36631O66503M03856K07971J07546R3876J30443
43048F719366J72532J86066J56972Q9940K282q1407j34242j35081p9031J5883
$$ y = [1357859, 836042, 84549, -950316, -2320969, -4059978, -6162016, -8574213, -11199206, -13908719, -16561395, -19019100, -21159556, -22887507, -24147605, -24936919, -25307603, -25350771, -25164209, -24818996, -24340306, -23706547, -22861442, -21733601, -20261661, -18420761, -16239805, -13799105, -11209243, -8585063, -6030517, -3638417, -1495774, 317003, 1735652, 2723277, 3275384, 3417615, 3200760, 2696652, 1993411, 1186109, 362818, -407004, -1073111, -1593417, -1921592, -2005890, -1801568, -1287644, -477900, 575647, 1783727, 3026578, 4172540, 5109171, 5775674, 6179530, 6387501, 6495047, 6588923, 6719366, 6891898, 7077964, 7234936, 7324876, 7327158, 7245751, 7111509, 6976428, 6897397, 6913280]
43038F913280J12003J65249J42355L3731j44859l63239n93548q20356j036834
43029D407782j232659j387796j480264j501153j462223j388467j302474j214249
43021f561503j123087j025654r20070q02996o65828m96491k86574l9002K27607
43012a1693598M80531O82718Q08792Q57224Q48200Q09144P62004P21542O98618
43003e024825O97698P10224P15913O96558O51249N99019N67614N78363O36139
42994H27952P25958Q15465Q64188Q38606P25935N37648L01077M7161j95835m01146
42984E087009n41383n91747n38453l87568j69406O4908K55932L53998L34498K02771
42974D070559j1292k62623m99373o70740p35644o70601m73587j63383K23080O33244
$$ y = [6913280, 7025283, 7190532, 7332887, 7366618, 7221759, 6858520, 6264972, 5444616, 4407782, 3175123, 1787327, 307063, -1194090, -2656313, -4044780, -5347254, -6561503, -7684590, -8710244, -9630314, -10433310, -11099138, -11595629, -11882203, -11921205, -11693598, -11213067, -10530349, -9721557, -8864333, -8016133, -7206989, -6444985, -5723443, -5024825, -4327127, -3616903, -2900990, -2204432, -1553183, -954164, -386550, 191813, 827952, 1553910, 2369375, 3233563, 4072169, 4798104, 5335752, 5636829, 5683990, 5488155, 5087009, 4545626, 3953879, 3415426, 3027858, 2858452, 2923360, 3179292, 3533290, 3867788, 4070559, 4059267, 3796644, 3297271, 2626531, 1890887, 1220286, 746699, 583316, 806396, 1439640]
42964A439640J002581J264094J367150J300710J106146Q65137O63807N53363N30970
42955A0093598N49334N44837M67089K97475N2406k26870m90832o96388q15658
42946I774991q40743p86553o88879n93026n35037n26013n49935n75664n73651
42937D105490n27131m34605l07148j64649l1986O6545J15496J17078R5079Q8482
42927C122651J35383K56213M47760O91315R67263J264667J580040J906751K221286
42918A2593329K475582K604434K549150K284951J834228J257990O33840L4337
42910B6267841m86805r00326j199679j393282j495136j519109j478072j385143
42902A6410289j255283j107141r63519q47367p73808p43867p44973p57639p64538
$$ y = [1439640, 2442221, 3706315, 5073465, 6374175, 7480321, 8345458, 9009265, 9562628, 10093598, 10642932, 11187769, 11654858, 11952333, 12004739, 11777869, 11287037, 10590649, 9774991, 8934248, 8147695, 7458816, 6865790, 6330753, 5804740, 5254805, 4679141, 4105490, 3578359, 3143754, 2836606, 2671957, 2639971, 2706516, 2822012, 2939090, 3034169, 3122651, 3258034, 3514247, 3962007, 4653322, 5620585, 6885252, 8465292, 10372043, 12593329, 15068911, 17673345, 20222495, 22507446, 24341674, 25599664, 26233504, 26267841, 25781036, 24880710, 23681031, 22287749, 20792613, 19273504, 17795432, 16410289, 15155006, 14047865, 13084346, 12236979, 11463171, 10719304, 9974331, 9216692, 8452154]
42893H452154p58454p46173p45203p73768q40616r41848j065198j195436j316015
42884F9443j408717j456000j446814j382002j274306j142080j000564q55861p03956
42875a0600857n33749l33085r7623J60540M11494O18266P55086Q22077Q48352
42866g949499Q82624R74653J153372J411615J707630J983080K184677K276163
42858D624315K238827K068100J771298J365708Q75332L27411k49303q23311j356053
42849A0842324j797662k089753k179526k039113j677694j140627n00943J49786
42841d33208P11932J094126J233701J112013P55690K22661m19137j107662j787968
42832A382148k401465k877947l143782l145214k871907k366047j713414j022100
$$ y = [8452154, 7693700, 6947527, 6202324, 5428556, 4587940, 3646092, 2580894, 1385458, 69443, -1339274, -2795274, -4242088, -5624090, -6898396, -8040476, -9041040, -9896901, -10600857, -11134606, -11467691, -11565314, -11404774, -10993280, -10375014, -9619928, -8797851, -7949499, -7066875, -6092222, -4938850, -3527235, -1819605, 163475, 2348152, 4624315, 6863142, 8931242, 10702540, 12068248, 12943580, 13270991, 13021688, 12198377, 10842324, 9044662, 6954909, 4775383, 2736270, 1058576, -82051, -582994, -433208, 278724, 1372850, 2606551, 3718564, 4474254, 4696915, 4277778, 3170116, 1382148, -1019317, -3897264, -7041046, -10186260, -13058167, -15424214, -17137628, -18159728]
42824a8159728l96729Q4549L83458N01523M69569L35192J54696j2059j09686j00439
42814a6849654K2884K32320M71894O74540P83957P75113O64408N01509L44561
42805a2378468K33416J78642J71044J99482K60288L52727M68907N88841O83569
42796i241552P22204O80448N51150L54758J41425k1564p1955K8868K88905O86735
42786e880578J173763J677228K109351K385257K445014K271392J896385J393344
42778I471156Q56754L76314J3998k08671l09350l30110l15966k97803k87518k83878
42768H684926k81307k75655k65564k49505k19725j59082m8428J16457L11664M89507
42758H103288O00025O14889N38429M01427K44681J03556J515m7557l5711L6666
$$ y = [-18159728, -18556457, -18471908, -18088450, -17586927, -17117358, -16782166, -16627470, -16639529, -16749215, -16849654, -16826770, -16594450, -16122556, -15448016, -14664059, -13888946, -13224538, -12723029, -12378468, -12145052, -11966410, -11795366, -11595884, -11335596, -10982869, -10513962, -9925121, -9241552, -8519348, -7838900, -7287750, -6932992, -6791567, -6813131, -6885086, -6856218, -6567313, -5880578, -4706815, -3029587, -920236, 1465021, 3910035, 6181427, 8077812, 9471156, 10327910, 10704224, 10718222, 10509551, 10200201, 9870091, 9554125, 9256322, 8968804, 8684926, 8403619, 8127964, 7862400, 7612895, 7393170, 7234088, 7185660, 7302117, 7613781, 8103288, 8703313, 9318202, 9856631, 10258058, 10502739, 10606295, 10607810, 10560253, 10524542, 10561208]
42748A0561208J53614K80719L74254M00281L53094K61307J76596J49980K08620
42739A2919673L46024N28580P09956Q42937Q86354Q11944O13278L11159n1693
42730A7918212m26037p72156j066818j300029j469061j577065j635714j664139
42722H007193j680013j688181j676784j624394j511935j331378j088498q00778
42714c394768m91022j77742J32721M45596P66808J087915J377112J584552J662998
42705B994170J594094J403101J150110R02816P09592N88189N30404N13621N11996
42696A0898093N05580M87068M64966M61075N00391N94729P28907Q62287R48861
42687A6451957R61810R03784P98701O77259N67689M91410M58182M61459M79716
$$ y = [10561208, 10714822, 10995541, 11369795, 11770076, 12123170, 12384477, 12561073, 12711053, 12919673, 13265697, 13794277, 14504233, 15347170, 16233524, 17045468, 17658746, 17969905, 17918212, 17492175, 16720019, 15653201, 14353172, 12884111, 11307046, 9671332, 8007193, 6327180, 4638999, 2962215, 1337821, -174114, -1505492, -2593990, -3394768, -3885790, -4063532, -3930811, -3485215, -2718407, -1630492, -253380, 1331172, 2994170, 4588264, 5991365, 7141475, 8044291, 8753883, 9342072, 9872476, 10386097, 10898093, 11403673, 11890741, 12355707, 12816782, 13317173, 13911902, 14640809, 15503096, 16451957, 17413767, 18317551, 19116252, 19793511, 20361200, 20852610, 21310792, 21772251, 22251967]
42678B2251967M86436M64195M14476L55601L08264K78337K51405K04456J25243
42669B5140380K3856p0693j25333j21448o8935q222L331q5520l00458o35086j056211
42658B2695661j513449j947870k300129k520406k579387k474960k230097j883562
42650E245801j480182j064670o77070l47889r5420P2619J57606J73228J48293
42641B132316J18775J09243J18600J23149R3195Q493j35696l28279n42285p36471
42631I61040q63586q85334p87205n84947l20065m7880J76812L13949L50451L05316
42621a381449K21468J45372J06015J06984J35076J75565K19888K61054K86103
42612B76076K79480K38909J87650J65413K00462K86243L82882M40545M25087L30870
$$ y = [22251967, 22738403, 23202598, 23617074, 23972675, 24280939, 24559276, 24810681, 25015137, 25140380, 25164236, 25093543, 24968210, 24846762, 24777827, 24769605, 24772936, 24687416, 24386958, 23751872, 22695661, 21182212, 19234342, 16934213, 14413807, 11834420, 9359460, 7129363, 5245801, 3765619, 2700949, 2023879, 1675990, 1580570, 1653189, 1810795, 1984023, 2132316, 2251091, 2360334, 2478934, 2602083, 2695278, 2703771, 2568075, 2239796, 1697511, 961040, 97454, -787880, -1575085, -2160032, -2480097, -2527977, -2351165, -2037216, -1686765, -1381449, -1159981, -1014609, -908594, -801610, -666534, -490969, -271081, -10027, 276076, 555556, 794465, 982115, 1147528, 1347990, 1634233, 2017115, 2457660, 2882747, 3213617]
42602C213617J79908J2446j27244k06391k14744j66342r1840k4981J1322J2900
42592B598651p790l1328m0759k5580J8458R0510J87509L10575M71535O91037R84329
42581E247147J342305J723456K066727K319026K458244K495949K461145K380705
42573B2494704K270403K137652J987579J825238J653276J468723J263387J029888
42565C6130850P70294N00175K42847J6998j72256l30968m64687n67673o22491
42556C5503089o10379n23775l71289j72699N0591K82566N13941P39195R52092
42547C6363332J142779J298296J405704J454554J437072J348313J189652R74328
42539D6614030P29579M91891K98498J81311J65273K66575M85468P95945J141834
$$ y = [3213617, 3393525, 3405971, 3278727, 3072336, 2857592, 2691250, 2599410, 2574429, 2585751, 2598651, 2590861, 2559533, 2518774, 2493194, 2511652, 2602162, 2789671, 3100246, 3571781, 4262818, 5247147, 6589452, 8312908, 10379635, 12698661, 15156905, 17652854, 20113999, 22494704, 24765107, 26902759, 28890338, 30715576, 32368852, 33837575, 35100962, 36130850, 36901144, 37401319, 37644166, 37661164, 37488908, 37157940, 36693253, 36125580, 35503089, 34892710, 34368935, 33997646, 33824947, 33875538, 34158104, 34672045, 35411240, 36363332, 37506111, 38804407, 40210111, 41664665, 43101737, 44450050, 45639702, 46614030, 47343609, 47835500, 48133998, 48315309, 48480582, 48747157, 49232625, 50028570, 51170404]
42530E1170404J447365J639917J673553J541521J273088R17872N26091J35146
42522F0324957k31292n55826q22249j019106j146189j214339j236793j219076
42514E2880087j154570j027885q24909n45659k10825J46428M99633Q42088J180748
42505E1785136J518013J840997K127783K360896K533651K647339K707488K723420
42497G0244723K706978K666880K603253K509001K377617K209615K011496J788336
42489H9117899J536459J242427Q90975M78816K5374m28881q37680j167494j406348
42480H9451547j558661j633717j638756j581616j478925j361649j271600j248754
42472G7677869j315274j464645j661799j854889j993843k047395k011075j904413
$$ y = [51170404, 52617769, 54257686, 55931239, 57472760, 58745848, 59663720, 60189811, 60324957, 60093665, 59537839, 58715590, 57696484, 56550295, 55335956, 54099163, 52880087, 51725517, 50697632, 49872723, 49327064, 49116239, 49262667, 49762300, 50604388, 51785136, 53303149, 55144146, 57271929, 59632825, 62166476, 64813815, 67521303, 70244723, 72951701, 75618581, 78221834, 80730835, 83108452, 85318067, 87329563, 89117899, 90654358, 91896785, 92787760, 93266576, 93291950, 92863069, 92025389, 90857895, 89451547, 87892886, 86259169, 84620413, 83038797, 81559872, 80198223, 78926623, 77677869, 76362595, 74897950, 73236151, 71381262, 69387419, 67340024, 65328949, 63424536]
42464F3424536j761715j621806j518177j468585j466905j483398j476472j410722
42456E1216756j271338j067734q25805n73925l30553j00808J16048L14410M75786
42447D7952837N74629N93076N33749M21141K91383J78988J09636J00360J61728
42438E0917527K97347N01960P61882J058138J368834J668989J930604K126750
42430F0632031K239318K265860K221365K133883K034644J944147J859299J750779
42422G7081326J577061J309629R52924N44895J38946k18999n03926p10611q42754
42413G9328491r02383q88518q06360o78768n48307m65622m70321n74434p55186
42404G3238592r59697j121680j185616j127517r60222p19907m43104j50317J53220
$$ y = [63424536, 61662821, 60041015, 58522838, 57054253, 55587348, 54103950, 52627478, 51216756, 49945418, 48877684, 48051879, 47477954, 47147401, 47046593, 47162641, 47477051, 47952837, 48527466, 49120542, 49654291, 50075432, 50366815, 50545803, 50655439, 50755799, 50917527, 51214874, 51716834, 52478716, 53536854, 54905688, 56574677, 58505281, 60632031, 62871349, 65137209, 67358574, 69492457, 71527101, 73471248, 75330547, 77081326, 78658387, 79968016, 80920940, 81465835, 81604781, 81385782, 80881856, 80171245, 79328491, 78426108, 77537590, 76731230, 76052462, 75504155, 75038533, 74568212, 73993778, 73238592, 72278895, 71157215, 69971599, 68844082, 67883860, 67163953, 66720849, 66570532, 66723752]
42395F6723752M62366P55940R92356J118905J087416Q69100M66653p7725o83881
42386G1714882j250239j682362j921724j961557j843406j637048j413406j222503
42378E8782637j084300r92246r23865q52945p60362o40923n03560l65002k41713
42369E2417721j46055q8577q2398j42708k77632m74313o90727q62672r26150q45303
42359D7881186o31695l44816p2381J01078J23263j1254k64817n74539q75759j121025
42349D4209241j286489j365173j356743j265232j105016r03364o91129m88197
42341C5747898k98012j15568O1056K27578L79981N22651O71034Q47239J070603
42332C9114460J346126J655820J958817K202957K343295K358621K258257K076551
$$ y = [66723752, 67186118, 67942058, 68934414, 70053319, 71140735, 72009835, 72476488, 72398763, 71714882, 70464643, 68782281, 66860557, 64899000, 63055594, 61418546, 60005140, 58782637, 57698337, 56706091, 55782226, 54929281, 54168919, 53527996, 53024436, 52659434, 52417721, 52271666, 52183089, 52100691, 51957983, 51680351, 51206038, 50515311, 49652639, 48726489, 47881186, 47249491, 46904675, 46832294, 46933372, 47056635, 47045381, 46780564, 46206025, 45330266, 44209241, 42922752, 41557579, 40200836, 38935604, 37830588, 36927224, 36236095, 35747898, 35449886, 35334318, 35395374, 35622952, 36002933, 36525584, 37196618, 38043857, 39114460, 40460586, 42116406, 44075223, 46278180, 48621475, 50980096, 53238353, 55314904]
42324E5314904J857639J637224J430628J233539J033508Q22753O04509L92588
42316F4327292K07649P0481q431l8149m6343o5753j17808k05719l19827m47475
42306F3355917n79176p08301q26659r19806r66754r47008q52518o96238n09023
42297E6350434l24431j60810j4158J31223K81084M15757M94777M79027L52548
42288E8005451J27022j72099n23246r15037j338863j777707k202030k575734k867577
42279D5760180l061091l157815l171940l119718l011621k853806k657319k445956
42271B2280914k254903k119967k063145k080769k138997k179315k133395j942364
42263E368059j574646j037984l81298L17988R79381J545323J993444K332051K588591
$$ y = [55314904, 57172543, 58809767, 60240395, 61473934, 62507442, 63330195, 63934704, 64327292, 64534941, 64605422, 64596991, 64558842, 64512499, 64446746, 64328938, 64123219, 63803392, 63355917, 62776741, 62068440, 61241781, 60321975, 59355221, 58408213, 57555695, 56859457, 56350434, 56026003, 55865193, 55851035, 55982258, 56263342, 56679099, 57173876, 57652903, 58005451, 58132473, 57960374, 57437128, 56522091, 55183228, 53405521, 51203491, 48627757, 45760180, 42699089, 39541274, 36369334, 33249616, 30237995, 27384189, 24726870, 22280914, 20026011, 17906044, 15842899, 13762130, 11623133, 9443818, 7310423, 5368059, 3793413, 2755429, 2374131, 2692119, 3671500, 5216823, 7210267, 9542318, 12130909]
42254A2130909K799954L003549L224593L462668L687153L847100L891505L789342
42246C9836773L539176L164037K696669K166842J598547J014067M36465j12106
42238E4340470o11736j043391j388723j633527j771089j801407j729342j566595
42230D2794660j335185j064861p83059n05697k36869K3528K71269M93587O70031
42221D0327404P77662P98914P28850N78634L74624J54032m3042j85258k61171
42212D3250649k82554k76648k72360k88609l28541l78448m11239l96978l19157
42203D0296115j86918l1927J10186K19755K98697L59528M09480M43076M46615
42194D2364607M08854L29787K22722J09282J1111n6807q9338r2917q6331r6778
$$ y = [12130909, 14930863, 17934412, 21159005, 24621673, 28308826, 32155926, 36047431, 39836773, 43375949, 46539986, 49236655, 51403497, 53002044, 54016111, 54452576, 54340470, 53728734, 52685343, 51296620, 49663093, 47892004, 46090597, 44361255, 42794660, 41459475, 40394614, 39611555, 39105858, 38868989, 38892517, 39163786, 39657373, 40327404, 41105066, 41903980, 42632830, 43211464, 43586088, 43740120, 43697078, 43511820, 43250649, 42968095, 42691447, 42419087, 42130478, 41801937, 41423489, 41012250, 40615272, 40296115, 40109197, 40077270, 40187456, 40407211, 40705908, 41065436, 41474916, 41917992, 42364607, 42773461, 43103248, 43325970, 43435252, 43446363, 43389556, 43300218, 43207301, 43120970, 43024192]
42184D3024192j48158k47168l78394n13141o24583o97984p31852p33742p14862
42175C8234308o84558o45676n93657n21287m27006l22059k32548j94547k42378
42166C4370592l92582o30124r05683j149365j296165j309385j189344r65964o84175
42157B5847805l90786j23905R7143K78818M50576O49097Q94970J173751J433112
42148C0310581J600845J616267J457963J152521P61859L59316P113k57116m22693
42139C6586656m99530n09222m79181m38631m10550l99513l85294l31763k07975
42130C2924997p539K46009N10025P42770R21449J048406J143070J227005J312678
42121D0068870J400665J482969J548632J589275J602372J590485J558351J511421
$$ y = [43024192, 42876034, 42628866, 42250472, 41737331, 41112748, 40414764, 39682912, 38949170, 38234308, 37549750, 36904074, 36310417, 35789130, 35362124, 35040065, 34807517, 34612970, 34370592, 33978010, 33347886, 32442203, 31292838, 29996673, 28687288, 27497944, 26531980, 25847805, 25457019, 25333114, 25430257, 25709075, 26159651, 26808748, 27703718, 28877469, 30310581, 31911426, 33527693, 34985656, 36138177, 36900036, 37259352, 37266465, 37009349, 36586656, 36087126, 35577904, 35098723, 34660092, 34249542, 33850029, 33464735, 33132972, 32924997, 32917458, 33163467, 33673492, 34416262, 35337711, 36386117, 37529187, 38756192, 40068870, 41469535, 42952504, 44501136, 46090411, 47692783, 49283268, 50841619, 52353040]
42113E2353040J455794J395939J329958J247933J137606R93826Q24471O49020
42105F1387587M91213L69185K87509K36403J99612J65004J29325R4737O3247L5967
42095F3459789J7242J8136N3852J35027K58233M02288N33462O17465O33189N83575
42085F6712258M99354M32404M39265N61111Q09242J161990J573994J994318K385606
42076G6569542K733888L042824L317501L551313L726278L826217L853837L841039
42068A04462439L844268L923128M110742M393058M712350M995698N192611N299041
42060A40933335N353691N411323N513332N674972N892198O156082O462993O818466
42052A88216392P236858P735251Q320862Q979237R673547J0356052J0981736J1514742
$$ y = [52353040, 53808834, 55204773, 56534731, 57782664, 58920270, 59914096, 60738567, 61387587, 61878800, 62247985, 62535494, 62771897, 62971509, 63136513, 63265838, 63360575, 63423822, 63459789, 63477031, 63495167, 63549019, 63684046, 63942279, 64344567, 64878029, 65495494, 66128683, 66712258, 67211612, 67644016, 68083281, 68644392, 69453634, 70615624, 72189618, 74183936, 76569542, 79303430, 82346254, 85663755, 89215068, 92941346, 96767563, 100621400, 104462439, 108306707, 112229835, 116340577, 120733635, 125445985, 130441683, 135634294, 140933335, 146287026, 151698349, 157211681, 162886653, 168778851, 174934933, 181397926, 188216392, 195453250, 203188501, 211509363, 220488600, 230162147, 240518199, 251499935, 263014677]
42044B63014677J1926616J2190492J2275031J2142221J1754224J1089746J0161543
42037C44554550R023447P761778O475070N250674M147000L188045K371339J682800
42029C84454703J108538O38003K60854l6326k70008m58511o25111q07647j066962
42020C83197533j480034k111560k978259m032113n176513o303401p326694q197347
42012C45591612q902474r456312r886898j0221607j0478278j0666263j0792063
42005B75187717j0859945j0865984j0794337j0623627j0340430r949804r476442
41998B02277148q957211q429312p918679p433767o968782o514571o069374n642456
41990A44342996n250684m912170m638801m427731m256323m088307l891880l656625
$$ y = [263014677, 274941293, 287131785, 299406816, 311549037, 323303261, 334393007, 344554550, 353577997, 361339775, 367814845, 373065519, 377212519, 380400564, 382771903, 384454703, 385563241, 386201244, 386462098, 386425772, 386155764, 385697253, 385072142, 384264495, 383197533, 381717499, 379605939, 376627680, 372595567, 367419054, 361115653, 353788959, 345591612, 336689138, 327232826, 317345928, 307124321, 296646043, 285979780, 275187717, 264327772, 253461788, 242667451, 232043824, 221703394, 211753590, 202277148, 193319937, 184890625, 176971946, 169538179, 162569397, 156054826, 149985452, 144342996, 139092312, 134180142, 129541341, 125113610, 120857287, 116768980, 112877100, 109220475]
41982A09220475l393792l119951k841072k552467k251503j946450j651580j375358
41974I0088302j115874q68758o39820m50110l28205k94998l51402m76566o36422
41965H4926147p96784r34137j039527j114476j161954j179133j158007j094091
41957G6448038r96723q93073q21899q19395r04229j070541j292588j535819j764636
41948F6349135j943171k034517k004967j832082j511561j061417n24672L2431
41940E5469179N33622R16993J157862J274165J309978J308633J292784J261912
41932F4525128J205169J119162J019898R43061R31831J016535J196211J434836
41924G3391831J677875J879746K023574K121028K195549K262045K315169K331732
$$ y = [109220475, 105826683, 102706732, 99865660, 97313193, 95061690, 93115240, 91463660, 90088302, 88972428, 88103670, 87463850, 87013740, 86685535, 86390537, 86039135, 85562569, 84926147, 84129363, 83195226, 82155699, 81041223, 79879269, 78700136, 77542129, 76448038, 75451315, 74558242, 73736343, 72916948, 72012719, 70942178, 69649590, 68113771, 66349135, 64405964, 62371447, 60366480, 58534398, 57022837, 55961420, 55436748, 55469179, 56002801, 56919794, 58077656, 59351821, 60661799, 61970432, 63263216, 64525128, 65730297, 66849459, 67869357, 68812418, 69744249, 70760784, 71956995, 73391831, 75069706, 76949452, 78973026, 81094054, 83289603, 85551648, 87866817, 90198549]
41916I0198549K285843K167734J993135J795149J604103J430553J263503J083564
41908A03822133Q80672O65157M66289L18632K41396K20451K05651J31281m8039
41899A06903623l29060o60596r71926j206292j337763j369300j323282j232690
41891I8472714j132886j053812j015320j026236j084388j176857j283673j385347
41883H9314195j468551j525051j547006j525737j456417j344220j205699j062043
41875G8179471r26586p95056o48350m69300k61674n6141J01023J66778J15156
41866G5405321n8556l40129o99887j094336j467250j755475j903693j883712j705876
41857F4496407j413609j065157p14933m02060j44698O2502K45177M36932O61912
$$ y = [90198549, 92484392, 94652126, 96645261, 98440410, 100044513, 101475066, 102738569, 103822133, 104702805, 105367962, 105834251, 106152883, 106394279, 106614730, 106820381, 106951662, 106903623, 106574563, 105913967, 104942041, 103735749, 102397986, 101028686, 99705404, 98472714, 97339828, 96286016, 95270696, 94244460, 93160072, 91983215, 90699542, 89314195, 87845644, 86320593, 84773587, 83247850, 81791433, 80447213, 79241514, 78179471, 77252885, 76457829, 75809479, 75340179, 75078505, 75022364, 75123387, 75290165, 75405321, 75346765, 75006636, 74306749, 73212413, 71745163, 69989688, 68085995, 66202283, 64496407, 63082798, 62017641, 61302708, 60900648, 60755950, 60818452, 61063629, 61500561, 62162473]
41848F2162473R22424J198430J456952J663719J790823J819149J738400J548840
41840G4301210J265761R22293N63913K33588m4270k70055m61975o41837q21876
41831G5046752r96788j142572j223966j209835j088625q73194n91212k68813Q0294
41822F7732041M53765Q49780J254361J635434J948858K154078K230383K184272
41814H0442972K044850J850761J635113J415339J194076R71054P56745N75408
41806I0886318M54564M09831M35663N04989N76013O05652N67466M65228L32051
41797I5237775K14516J51380J56783K13209K78202L06472K77773K10287J46941
41788I7193338J25519J56951K24662K96879L37870L14202K00855j0986l08984
$$ y = [62162473, 63084897, 64283327, 65740279, 67403998, 69194821, 71013970, 72752370, 74301210, 75566971, 76489264, 77053177, 77286765, 77242495, 76972440, 76510465, 75868628, 75046752, 74049964, 72907392, 71683426, 70473591, 69384966, 68511772, 67920560, 67651747, 67732041, 68185806, 69035586, 70289947, 71925381, 73874239, 76028317, 78258700, 80442972, 82487822, 84338583, 85973696, 87389035, 88583111, 89554165, 90310910, 90886318, 91340882, 91750713, 92186376, 92691365, 93267378, 93873030, 94440496, 94905724, 95237775, 95452291, 95603671, 95760454, 95973663, 96251865, 96558337, 96836110, 97046397, 97193338, 97318857, 97475808, 97700470, 97997349, 98335219, 98649421, 98850276, 98839290, 98530306]
41779I8530306o62274j031080j378512j679290j921706k102967k222333k277393
41771H5254751k265314k186224k045532j854650j630731j394949j168587r68922
41763G1739842q07811o92655o25792o00221n96023n83725n35517m38388l02668
41754F6557042j62497o6936o1798j67933l68040o12125q39384j002663j081403
41745F2194263j078636j006995q72940o68837l79210J099M49576R14171J330589
41736F0883080J647024J838908J905523J854977J691324J413416J025876N55039
41728G2815167N8994l78462o72500p69878o69952m20730r4589K38971N29847P52046
41718G1388914R02188R93989J047608J076125J077135J035589R34918P66132N27626
$$ y = [98530306, 97868032, 96836952, 95458440, 93779150, 91857444, 89754477, 87532144, 85254751, 82989437, 80803213, 78757681, 76903031, 75272300, 73877351, 72708764, 71739842, 70932031, 70239376, 69613584, 69013363, 68417340, 67833615, 67298098, 66859710, 66557042, 66394545, 66327609, 66265811, 66097878, 65729838, 65117713, 64278329, 63275666, 62194263, 61115627, 60108632, 59235692, 58566855, 58187645, 58188744, 58638320, 59552491, 60883080, 62530104, 64369012, 66274535, 68129512, 69820836, 71234252, 72260128, 72815167, 72874161, 72495699, 71823199, 71053321, 70383369, 69962639, 69868050, 70107021, 70636868, 71388914, 72291102, 73285091, 74332699, 75408824, 76485959, 77521548, 78456466, 79222598, 79750224]
41709G9750224K19152j59856o02341j082903j556160j968420k274915k451468
41701F9873313k496098k423949k260492k035480j778460j516180j271116j058787
41693E5032751q82539p28896n69753l75386j33664J36778L90415N75712O60951
41684E4106369O49690N77622M93586M35841M17080M26297M44338M60206M76163
41675E8487192N00740N38387N83718O21462O29902N87460M81877L17083J11067
41666F2858888j15113l48324n85032q23901j058168j274880j459356j598052j676902
41657E3919160j678517j582877j371762j033994n70395M89O37075J275892J844547
41648E1439618K282363K555078K652982K576541K325444J901897J322702O25690
$$ y = [79750224, 79969376, 79809520, 79207179, 78124276, 76568116, 74599696, 72324781, 69873313, 67377215, 64953266, 62692774, 60657294, 58878834, 57362654, 56091538, 55032751, 54150212, 53421316, 52851563, 52476177, 52342513, 52479291, 52869706, 53445418, 54106369, 54756059, 55333681, 55827267, 56263108, 56680188, 57106485, 57550823, 58011029, 58487192, 58987932, 59526319, 60110037, 60731499, 61361401, 61948861, 62430738, 62747821, 62858888, 62743775, 62395451, 61810419, 60986518, 59928350, 58653470, 57194114, 55596062, 53919160, 52240643, 50657766, 49286004, 48252010, 47681615, 47682104, 48319179, 49595071, 51439618, 53721981, 56277059, 58930041, 61506582, 63832026, 65733923, 67056625, 67682315]
41640F7682315j36047r05171j626740k250368k735299l061358l238305l302423
41632E0426604l297515l250534l158427k995836k738376k384834j963459j520271
41624B9117352j099258p26944m07745j29295J27056L75701O19842Q49171J041736
41615B9767616J169650J208830J150771J010268Q22550O29595M64572L45279K78624
41606C6847755K67794L13423M10085N46544P12731R05892J126884J367845J602443
41597D4101396J788760J884930J868450J747816J559657J353010J169735J031243
41589E6504997R36317Q67856Q02935P20827O06103M47991K40859j0772k85829
41580F0831284n46260p45797q43407q14644o57425l91267n0126L27978P07566
$$ y = [67682315, 67546268, 66641097, 65014357, 62763989, 60028690, 56967332, 53729027, 50426604, 47129089, 43878555, 40720128, 37724292, 34985916, 32601082, 30637623, 29117352, 28018094, 27291150, 26883405, 26754110, 26881166, 27256867, 27876709, 28725880, 29767616, 30937266, 32146096, 33296867, 34307135, 35129685, 35759280, 36223852, 36569131, 36847755, 37115549, 37428972, 37839057, 38385601, 39098332, 40004224, 41131108, 42498953, 44101396, 45890156, 47775086, 49643536, 51391352, 52951009, 54304019, 55473754, 56504997, 57441314, 58309170, 59112105, 59832932, 60439035, 60887026, 61127885, 61117113, 60831284, 60285024, 59539227, 58695820, 57881176, 57223751, 56832484, 56782358, 57110336, 57817902]
41571E7817902J055456J340118J539516J655021J717002J771008J850639J955767
41563G0702429K051284K086386K021265J845281J579333J267224R65713P36630
41555H3255545O36478P01433R35405J310686J779732K286207K766795L147700
41547I6819981L346082L282681K904387K209310J262046J85941q71147j784250
41539A07355031k488108k985992l329997l586088l800968l983679m107216m127080
41531G8945903m007578l744423l373454k959879k571680k251142k001204j793125
41523E6243418j586942j349991j065568p33905l71263r341L08146N36225O46922
41514E2617701O46435N78046N04123M76299N12949N97730O97194P84447Q55274
$$ y = [57817902, 58873358, 60213476, 61752992, 63408013, 65125015, 66896023, 68746662, 70702429, 72753713, 74840099, 76861364, 78706645, 80285978, 81553202, 82518915, 83255545, 83892023, 84593456, 85528861, 86839547, 88619279, 90905486, 93672281, 96819981, 100166063, 103448744, 106353131, 108562441, 109824487, 110010428, 109139281, 107355031, 104866923, 101880931, 98550934, 94964846, 91163878, 87180199, 83072983, 78945903, 74938325, 71193902, 67820448, 64860569, 62288889, 60037747, 58036543, 56243418, 54656476, 53306485, 52240917, 51507012, 51135749, 51126408, 51434554, 51970779, 52617701, 53264136, 53842182, 54346305, 54822604, 55335553, 55933283, 56630477, 57414924, 58270198]
41505E8270198R29363J036287J193226J387657J577998J714451J767218J742712
41497F9619110J676841J611723J572694J558185J542894J487537J351266J105983
41489H1526233P49033L06910j72843o34908j025990j300642j428835j406396j260711
41480G5351851j043867q14641o18599m76370l84866l29401k97803k86067k92479
41471G0807758l08152l14703k91502k25156j13816L4381K04940L80343N43381
41462G0717474O80828P86226Q59648R03660R17583Q94750Q25437P03247N30137
41453G7818990L18669R3622j07315k38854k62521j63683M1002L12016O05416Q89097
41443G9306439J148740J384235J602706J813273K024113K240260K462330K688300
$$ y = [58270198, 59199561, 60235848, 61429074, 62816731, 64394729, 66109180, 67876398, 69619110, 71295951, 72907674, 74480368, 76038553, 77581447, 79068984, 80420250, 81526233, 82275266, 82582176, 82409333, 81774425, 80748435, 79447793, 78018958, 76612562, 75351851, 74307984, 73493343, 72874744, 72398374, 72013508, 71684107, 71386304, 71100237, 70807758, 70499606, 70184903, 69893401, 69668245, 69554429, 69588810, 69793750, 70174093, 70717474, 71398302, 72184528, 73044176, 73947836, 74865419, 75760169, 76585606, 77288853, 77818990, 78137659, 78231281, 78123966, 77885112, 77622591, 77458908, 77499910, 77811926, 78417342, 79306439, 80455179, 81839414, 83442120, 85255393, 87279506, 89519766, 91982096, 94670396]
41435I4670396K918843L161993L431396L736235M067984M394257M668495M854841
41427A25904440M954348N013329N104308N288907N584246N951768O313624O586798
41419A70701768O715360O683183O503270O196628N778034N255758M639751L949412
41411B16423164L215008K470614J740986J031226L27947l88760j132341j902713
41403B21785131k683772l443652m140783m736419n205379n536407n725864n776215
41395A84536640n702455n535955n315465n068820m800294m495171m139517l741380
41387A45737583l338589k988216k744257k635251k650787k741802k836067k864387
41379A22938227k785940k600672k344947k075258j846667j691891j608433j561216
$$ y = [94670396, 97589239, 100751232, 104182628, 107918863, 111986847, 116381104, 121049599, 125904440, 130858788, 135872117, 140976425, 146265332, 151849578, 157801346, 164114970, 170701768, 177417128, 184100311, 190603581, 196800209, 202578243, 207834001, 212473752, 216423164, 219638172, 222108786, 223849772, 224880998, 225208945, 224820185, 223687844, 221785131, 219101359, 215657707, 211516924, 206780505, 201575126, 196038719, 190312855, 184536640, 178834185, 173298230, 167982765, 162913945, 158113651, 153618480, 149478963, 145737583, 142398994, 139410778, 136666521, 134031270, 131380483, 128638681, 125802614, 122938227, 120152287, 117551615, 115206668, 113131410, 111284743, 109592852, 107984419, 106423203]
41371A06423203j500916j388047j210225r85508p51498n45168l83364k55624j33851
41362I9269002R034J84930L87978O01331Q07609R98951J181992J372568J580168
41353A06393563J792100J971129K071381K062485J945444J750584J520140J285869
41345A20792695J053461Q03315N09427J65434k01045n36617p84587r03541q73648
41336A20024894o97135m01313m1585L04997N59287O65479O09919M24439J74344
41327A21623326o1040k06957k08477m3471K70100O80044J120000J532788J883878
41318A26590191K162265K375522K543904K692375K838947K982531L096176L130967
41310A48412878L032335K764237K329266J772478J166621N88089R5402k82830
$$ y = [106423203, 104922287, 103534240, 102324015, 101338507, 100587009, 100041841, 99658477, 99402853, 99269002, 99278036, 99462966, 99850944, 100452275, 101259884, 102258835, 103440827, 104813395, 106393563, 108185663, 110156792, 112228173, 114290658, 116236102, 117986686, 119506826, 120792695, 121846156, 122649471, 123158898, 123324332, 123123287, 122586670, 121802083, 120898542, 120024894, 119327759, 118926446, 118884861, 119189858, 119749145, 120414624, 121024543, 121448982, 121623326, 121562286, 121355329, 121146852, 121103381, 121373481, 122053525, 123173525, 124706313, 126590191, 128752456, 131127978, 133671882, 136364257, 139203204, 142185735, 145281911, 148412878, 151445213, 154209450, 156538716, 158311194, 159477815, 160065904, 160161306, 159878476]
41302A59878476n48217p21341q24377q68167q51954p73941o42841m81985l24295
41293A53841358k02188j38861j46167k29104l90454o29184r33833j278860j629034
41284A48263673j948656k209205k393635k499535k541269k547530k552075k581327
41276A28990441k645850k740407k851311k965208l073121l168232l242195l286495
41268A05017622l299711l293990l293164l321934l392409l495057l597558l652090
41260G7671709l609627l436591l126912k704592k217495j725850j288077r45564
41252E8617001p10644n64571m68603l83194k84496j71073o2119P744l393j29565
41242E5847087l76476p08513j056783j345859j520419j555160j449322j219487
$$ y = [159878476, 159330259, 158608918, 157784541, 156916374, 156064420, 155290479, 154647638, 154165653, 153841358, 153639170, 153500309, 153354142, 153125038, 152734584, 152105400, 151171567, 149892707, 148263673, 146315017, 144105812, 141712177, 139212642, 136671373, 134123843, 131571768, 128990441, 126344591, 123604184, 120752873, 117787665, 114714544, 111546312, 108304117, 105017622, 101717911, 98423921, 95130757, 91808823, 88416414, 84921357, 81323799, 77671709, 74062082, 70625491, 67498579, 64793987, 62576492, 60850642, 59562565, 58617001, 57906357, 57341786, 56873183, 56489989, 56205493, 56034420, 55972301, 55980045, 55976652, 55847087, 55470611, 54762098, 53705315, 52359456, 50839037, 49283877, 47834555, 46615068]
41234D6615068q98076n31489j69036J55196M34854O87599R37685J197903J462073
41225D9891777J708027J903733K012926K003558J860901J598277J255979Q87412
41217F3122590N41950K54167M1855r0873j50305j52706j26427j12140j55981k95152
41207F2876978n41909q73814j235608j553950j761777j823087j746374j579894
41199E1760565j392154j247823j189462j230540j358899j544975j749111j927320
41191D0120281k039009k056746j972367j794377j539702j227900q81968n32266
41183B8075946k16370K9805J87700K69030L14259L74014M85104O57177Q75052
41174C1051717J109004J324364J489352J582274J594981J528858J386713J168688
$$ y = [46615068, 45716992, 45185503, 45016467, 45171663, 45606517, 46294116, 47231801, 48429704, 49891777, 51599804, 53503537, 55516463, 57520021, 59380922, 60979199, 62235178, 63122590, 63664540, 63918707, 63960562, 63869689, 63719384, 63566678, 63440251, 63328111, 63172130, 62876978, 62335069, 61461255, 60225647, 58671697, 56909920, 55086833, 53340459, 51760565, 50368411, 49120588, 47931126, 46700586, 45341687, 43796712, 42047601, 40120281, 38081272, 36024526, 34052159, 32257782, 30718080, 29490180, 28608212, 28075946, 27859576, 27889381, 28077081, 28346111, 28660370, 29034384, 29519488, 30176665, 31051717, 32160721, 33485085, 34974437, 36556711, 38151692, 39680550, 41067263, 42235951]
41166D2235951Q76054N18752J20464k82058o45897r34563j131981j249170j316129
41157C8191423j361520j393645j396607j343775j217031j017567p63903m83691
41149B9213684k07617L3537K12913L14893L41874L14870K65625K23491K03347
41140C0916617K00753J97170J72598J19034M7974j1139k1195M6394J95196L95167
41130C2258569N88965P12040P16171N83929L29399r652l80613p23798r81892j111984
41120C1981134j096101r45323o96596m04275j27534Q5483K12229K60510K58762
41111B9528289K36839K09809J74632J20184M2109m8393j27545j70369j61309r7827
41101B9706419J1248J47032K80182L73107L88587L03390J21995j15670l38919
$$ y = [42235951, 43112005, 43630757, 43751221, 43469163, 42823266, 41888703, 40756722, 39507552, 38191423, 36829903, 35436258, 34039651, 32695876, 31478845, 30461278, 29697375, 29213684, 29006067, 29039604, 29252517, 29567410, 29909284, 30224154, 30489779, 30713270, 30916617, 31117370, 31314540, 31487138, 31606172, 31654146, 31643007, 31621812, 31668206, 31863402, 32258569, 32847534, 33559574, 34275745, 34859674, 35189073, 35179421, 34798808, 34075010, 33093118, 31981134, 30885033, 29939710, 29243114, 28838839, 28711305, 28796788, 29009017, 29269527, 29528289, 29765128, 29974937, 30149569, 30269753, 30311862, 30263469, 30135924, 29965555, 29804246, 29706419, 29717667, 29864699, 30144881, 30517988, 30906575, 31209965, 31331960, 31216290, 30877371]
41092C0877371m67106m40732k46643P7199M58136Q14465J078493J212192J214013
41083C4577388J114923R64187Q11238O91106O17108N81421N64616N52388N50020
41074D1024395N81863O73754Q32469J040329J268919J497800J721337J940275
41066E0581141K149432K332973K468059K529531K491714K331130K034640J609978
41058F8528598J090125N26691k2901n05654q76821j101387j158987j051789q09098
41049F4618777m82939j35743J73610M00249N19324N29539M54442L39143K39893
41040F6656295K07503K70439M25932O43794Q79978J090912J240833J302005J254238
41031G3971929J089199Q17512M70921R4782k64745n70067p94174r19833r40857
$$ y = [30877371, 30410265, 29969533, 29722890, 29800089, 30258225, 31072690, 32151183, 33363375, 34577388, 35692311, 36656498, 37467736, 38158842, 38775950, 39357371, 39921987, 40474375, 41024395, 41606258, 42280012, 43112481, 44152810, 45421729, 46919529, 48640866, 50581141, 52730573, 55063546, 57531605, 60061136, 62552850, 64883980, 66918620, 68528598, 69618723, 70145414, 70122513, 69616859, 68740038, 67638651, 66479664, 65427875, 64618777, 64135838, 64000095, 64173705, 64573954, 65093278, 65622817, 66077259, 66416402, 66656295, 66863798, 67134237, 67560169, 68203963, 69083941, 70174853, 71415686, 72717691, 73971929, 75061128, 75878640, 76349561, 76444343, 76179598, 75609531, 74815357, 73895524, 72954667]
41022G2954667q64331p09033m99551k60289j2592K25496M37775O06671P10301
41013G2589114P24902O34509M41972J72083j36878m48086p38511j000977j234357
41004G1003771j428395j555626j579578j475121j245708r23820n54853j77178
40996F2063492J87703N30371Q40454J096171J264392J311973J222899J012540
40988F9529995P30592M49727K45019J74605K69446N32380R42732J464028K053426
40979G6391950K668671L267912L804472M225491M480479M535008M379888M031949
40971A07785820L530556K933653K311968J738789J276976R67477Q22204Q22671
40963A22190114R26983J086351J265112J452551J658667J897792K171555K460367
$$ y = [72954667, 72090336, 71381303, 70881752, 70621463, 70608871, 70834367, 71272142, 71878813, 72589114, 73314016, 73948525, 74390497, 74562580, 74425702, 73977616, 73239105, 72238128, 71003771, 69575376, 68019750, 66440172, 64965051, 63719343, 62795523, 62240670, 62063492, 62251195, 62781566, 63622020, 64718191, 65982583, 67294556, 68517455, 69529995, 70260587, 70710314, 70955333, 71129938, 71399384, 71931764, 72874496, 74338524, 76391950, 79060621, 82328533, 86133005, 90358496, 94838975, 99373983, 103753871, 107785820, 111316376, 114250029, 116561997, 118300786, 119577762, 120545239, 121367443, 122190114, 123117097, 124203448, 125468560, 126921111, 128579778, 130477570, 132649125, 135109492]
40955A35109492K726249K925954L030981L046446L018016L020755L134549L417960
40947A59430402L891628M536221N303432O133510O970724P771355Q504148R146855
40939B11688275R682058J0095399J0378649J0537130J0596004J0600208J0608902
40932B84186625J0689122J0909212J1327741J1977383J2851479J3902166J5050550
40925C70894278J6201760J7258226J8129665J8740844J9036873J8983558J8560108
40918D97805312J7745671J6508388J4809459J2626026R980485O956031L688896
40911E80120268L45686k899289n880557q455309j0517465j2008558j2920235j3287474
40903E14497067j3176135j2669994j1861515j0847276r723979q578965p475264
$$ y = [135109492, 137835741, 140761695, 143792676, 146839122, 149857138, 152877893, 156012442, 159430402, 163322030, 167858251, 173161683, 179295193, 186265917, 194037272, 202541420, 211688275, 221370333, 231465732, 241844381, 252381511, 262977515, 273577723, 284186625, 294875747, 305784959, 317112700, 329090083, 341941562, 355843728, 370894278, 387096038, 404354264, 422483929, 441224773, 460261646, 479245204, 497805312, 515550983, 532059371, 546868830, 559494856, 569475341, 576431372, 580120268, 580465954, 577566665, 571686108, 563230799, 552713334, 540704776, 527784541, 514497067, 501320932, 488650938, 476789423, 465942147, 456218168, 447639203, 440163939]
40896D40163939o440201n467435m532673l613980k707730j836772j049343m06739
40888D14109066L7878K59052K64786Q5712k42527o89940j229728j828841k444781
40879D08320677l036565l582651m088769m576241n059973n534555n977147o360492
40871C70104284o665245o887024p038758p148666p253815p390447p582752p831869
40863C12305708q110148q368048q555195q644680q643894q584178q497435q396814
40855B44505316q274066q113373p909711p677527p443594p229896p038458o847361
40847A83971330o620045o323762n948326n515019n069183m659077m311548m017873
40839A41506497l738651l426720l055213k632384k192902j773362j391572j043674
$$ y = [440163939, 433723738, 428256303, 423723630, 420109650, 417401920, 415565148, 414515805, 414109066, 414146944, 414405996, 414670782, 414756494, 414513967, 413824027, 412594299, 410765458, 408320677, 405284112, 401701461, 397612692, 393036451, 387976478, 382441923, 376464776, 370104284, 363439039, 356552015, 349513257, 342364591, 335110776, 327720329, 320137577, 312305708, 304195560, 295827512, 287272317, 278627637, 269983743, 261399565, 252902130, 244505316, 236231250, 228117877, 220208166, 212530639, 205087045, 197857149, 190818691, 183971330, 177351285, 171027523, 165079197, 159564178, 154494995, 149835918, 145524370, 141506497, 137767846, 134341126, 131285913, 128653529, 126460627, 124687265, 123295693, 122252019]
40831A22252019p16708m03249j07499J57526L75608N30862O09305O00835N02447
40822A23801146L21187P5718k03668m77405p03364q47473q93173q43565p15225
40813A19514178n28793l02454n1216K09719M62223O87910Q76232J030928J166792
40804A23065519J297126J422658J532749J618210J683007J742625J809838J881451
40796A36053183J939181J963769J949408J907951J864877J854473J915000K078825
40788A51526667K358516K738966L182078L637283M046329M341437M447787M298640
40780A80577703L857491L133726K183189J095782k2916j071021j968440k670576
40772A85114938l173085l505412l716270l857508l971328m083039m199918m315486
$$ y = [122252019, 121535311, 121132062, 121024563, 121182089, 121557697, 122088559, 122697864, 123298699, 123801146, 124122333, 124198051, 123994383, 123516978, 122813614, 121966141, 121072968, 120229403, 119514178, 118985385, 118682931, 118631715, 118841434, 119303657, 119991567, 120867799, 121898727, 123065519, 124362645, 125785303, 127318052, 128936262, 130619269, 132361894, 134171732, 136053183, 137992364, 139956133, 141905541, 143813492, 145678369, 147532842, 149447842, 151526667, 153885183, 156624149, 159806227, 163443510, 167489839, 171831276, 176279063, 180577703, 184435194, 187568920, 189752109, 190847891, 190824975, 189753954, 187785514, 185114938, 181941853, 178436441, 174720171, 170862663, 166891335, 162808296, 158608378, 154292892]
40764A54292892m416161m486634m513172m486323m402913m264986m076539l843433
40756A19802731l578964l308398l063272k866295k719469k606314k505464k403416
40748I6751139k297894k194025k100265k027084j985712j984281k022750k090188
40740H0048940k165311k218670k216737k130915j950594j691086j385923j065262
40732F5224442p36612l84273J2302M56886R27769J385781J790964K117926K363695
40723G3158880K546295K694318K830903K959073L056548L083295K997300K769754
40715I6096366K393997J889013J299247O88751J26559l32701o61950q61274r48626
40706I9689382r51835r05292q45704q03476p95117q24250q90119r93923j135928
$$ y = [154292892, 149876731, 145390097, 140876925, 136390602, 131987689, 127722703, 123646164, 119802731, 116223767, 112915369, 109852097, 106985802, 104266333, 101660019, 99154555, 96751139, 94453245, 92259220, 90158955, 88131871, 86146159, 84161878, 82139128, 80048940, 77883629, 75664959, 73448222, 71317307, 69366713, 67675627, 66289704, 65224442, 64487830, 64103557, 64115859, 64572745, 65500514, 66886295, 68677259, 70795185, 73158880, 75705175, 78399493, 81230396, 84189469, 87246017, 90329312, 93326612, 96096366, 98490363, 100379376, 101678623, 102367374, 102493933, 102161232, 101499282, 100638008, 99689382, 98737547, 97832255, 96986551, 96183075, 95387958, 94563708, 93673589, 92679666, 91543738]
40697I1543738j307116j486285j649194j783991j899093k014839k144856k282072
40689G6976292k398483k455631k418559k269543k018590j703876j377919j086841
40681F1246850q56183o88216n65536m58189l38590k02543p9999j9882n6050j81478
40671E7800184l51123n08098o10693o43361o11351n29175m11753k70767j14419
40662E3749444N0883K16996L69759M88087N50666N48966M97945M34324L99692
40653E7306762M17680M80671N55613O03872N99790N36050M17371K53136N6848
40644F1227793j49374l32340m52084m72044l70840j51640J54262M92436P99472
40635F0745641J021472J127868J114504R98616Q12357N96912L94139K35778J35638
$$ y = [91543738, 90236622, 88750337, 87101143, 85317152, 83418059, 81403220, 79258364, 76976292, 74577809, 72122178, 69703619, 67434076, 65415486, 63711610, 62333691, 61246850, 60390667, 59702451, 59136915, 58678726, 58340136, 58137593, 58057594, 58037712, 57981662, 57800184, 57449061, 56940963, 56330270, 55686909, 55075558, 54546383, 54134630, 53863863, 53749444, 53800327, 54017323, 54387082, 54875169, 55425835, 55974801, 56472746, 56907070, 57306762, 57724442, 58205113, 58760726, 59364598, 59964388, 60500438, 60917809, 61170945, 61227793, 61078419, 60746079, 60293995, 59821951, 59451111, 59299471, 59453733, 59946169, 60745641, 61767113, 62894981, 64009485, 65008101, 65820458, 66417370, 66811509, 67047287, 67182925]
40626F7182925Q7794O7298L1486p1705k83136o08248j007483j410300j743990
40617F2244641j960971k052901k046799j984883j898766j794918j661037j486021
40609D7358345j276508j058917q68260p31688o54631o15231n69769m67376k68853
40600D0847112L7605M31361Q69156J304845J705155K050964K327788K519202K610879
40591E4704067K599656K497675K328426K118571J889929J654313J413517J165731
40583G0371885R14898O75487M67692L06419J93939J23330Q8894R1439J30548J90683
40573G3555214K36800K27742J39029k1049k11104l70557m41934l94976k41974
40564G2477191l2594J72451L31701M35143M93013N16509N08613M68324L99505
$$ y = [67182925, 67270719, 67338017, 67369503, 67297798, 67014662, 66406414, 65398931, 63988631, 62244641, 60283670, 58230769, 56183970, 54199087, 52300321, 50505403, 48844366, 47358345, 46081837, 45022920, 44154660, 43422972, 42768341, 42153110, 41583341, 41115965, 40847112, 40884717, 41316078, 42185234, 43490079, 45195234, 47246198, 49573986, 52093188, 54704067, 57303723, 59801398, 62129824, 64248395, 66138324, 67792637, 69206154, 70371885, 71286783, 71962270, 72429962, 72736381, 72930320, 73053650, 73142544, 73233983, 73364531, 73555214, 73792014, 74019756, 74158785, 74137736, 73926632, 73556075, 73114141, 72719165, 72477191, 72444597, 72617048, 72948749, 73383892, 73876905, 74393414, 74902027, 75370351, 75769856]
40555G5769856L17037K49081K33500L04720M74948P24872J016056J317851J625977
40546H2033898J957901K332617K755377L217584L704302M196614M666932N076652
40538A09941877N383797N556767N583259N467769N222326M860182M397133L855667
40530A50268777L264268K650968K038382J446158Q96762M14648J6206k99858n50616
40521A60145695p57071r34696j094429j249247j416403j612545j846550k114433
40513A49120321k396902k661017k869952l000540l058030l073999l084975l106784
40505A25868122l124730l105751l019419k850386k597820k271456j892573j496505
40497A05509482j127070q20972n91828m25848k91999j58685o126J70367L63012
$$ y = [75769856, 76086893, 76335974, 76569474, 76874194, 77349142, 78074014, 79090070, 80407921, 82033898, 83991799, 86324416, 89079793, 92297377, 96001679, 100198293, 104865225, 109941877, 115325674, 120882441, 126465700, 131933469, 137155795, 142015977, 146413110, 150268777, 153533045, 156184013, 158222395, 159668553, 160565315, 160979963, 160996169, 160696311, 160145695, 159388624, 158453928, 157359499, 156110252, 154693849, 153081304, 151234754, 149120321, 146723419, 144062402, 141192450, 138191910, 135133880, 132059881, 128974906, 125868122, 122743392, 119637641, 116618222, 113767836, 111170016, 108898560, 107005987, 105509482, 104382412, 103561440, 102969612, 102543764, 102251765, 102093080, 102086954, 102257321, 102620333]
40488A02620333N55187P25626Q55948R40455R91209J032537J087502J165321J257110
40479A11231228J341532J397034J414024J398546J363724J316366J252285J165345
40471A21880084J059866R52083Q58916P85793P24403O59878N79682M79327L64866
40462A28344898K52236J61103J03319P2631M5398m599q6318j81946k55257k70313
40452A28181152k04584m8854J98923N33875R37516J375362J807397K204811K557991
40443A37543589K869990L145225L386074L598196L794372L989177M187903M379393
40435A66893919M538999M640364M669620M634785M565600M503936M489781M549714
40427B03486718M692668M913883N203942N557471N976056O463963P021007P640040
$$ y = [102620333, 103175520, 103901146, 104757094, 105697549, 106688758, 107721295, 108808797, 109974118, 111231228, 112572760, 113969794, 115383818, 116782364, 118146088, 119462454, 120714739, 121880084, 122939950, 123892033, 124750949, 125536742, 126261145, 126921023, 127500705, 127980032, 128344898, 128597134, 128758237, 128861556, 128934187, 128979585, 128974986, 128888668, 128706722, 128451465, 128181152, 127976568, 127927714, 128126637, 128660512, 129598028, 130973390, 132780787, 134985598, 137543589, 140413579, 143558804, 146944878, 150543074, 154337446, 158326623, 162514526, 166893919, 171432918, 176073282, 180742902, 185377687, 189943287, 194447223, 198937004, 203486718, 208179386, 213093269, 218297211, 223854682, 229830738, 236294701, 243315708, 250955748]
40419B50955748Q312287R035866R817792J0663794J1561153J2467394J3314767
40412C26128801J4029018J4551235J4850793J4923648J4776837J4405651J3774894
40405D27440877J2817148J1453414R627477P336040M640529J659059j454055m532984
40397D68987505p423787j0002262j2182747j3917695j5192087j6017532j6428528
40390C77822867j6479861j6242021j5791781j5198354j4511046j3756685j2949213
40383B72893906j2103929j1244777j0400111r592500q831729q115718p437864
40376B05167278o795838o195887n649393n164337m738639m359676m007448l656801
40368A64599259l279368k849797k357496j818251j278289q07223m81702l65751
$$ y = [250955748, 259268035, 268303901, 278121693, 288785487, 300346640, 312814034, 326128801, 340157819, 354709054, 369559847, 384483495, 399260332, 413665983, 427440877, 440258025, 451711439, 461338916, 468674956, 473315485, 474974544, 473520489, 468987505, 461563718, 451561456, 439378709, 425461014, 410268927, 394251395, 377822867, 361343006, 345100985, 329309204, 314110850, 299599804, 285843119, 272893906, 260789977, 249545200, 239145089, 229552589, 220720860, 212605142, 205167278, 198371440, 192175553, 186526160, 181361823, 176623184, 172263508, 168256060, 164599259, 161319891, 158470094, 156112598, 154294347, 153016058, 152208835, 151727133, 151361382]
40360A51361382m95393q72194j463996k207813l014080l776414m388835m765180
40352A30377477m853514m643558m169021l504421k752775k023056j402777r36035
40344A06092320o16934m02042k35304p1215J14949L29320N65655Q10317J047179
40335A07634245J263737J454988J622004J767707J894349K002485K087873K136893
40327A21864281K127048K037086J861563J618229J341185J065162Q13521N97495
40319A33325570M22793K94297K14790J80755J79184J86148J67800Q7133q2234
40310A34976236l41232o59883r86698j268370j468331j573430j586517j513520
40302A25578255j357968j126843q38129n18347j91637J27197M29115P04412R43251
$$ y = [151361382, 150865989, 149993795, 148529799, 146321986, 143307906, 139531492, 135142657, 130377477, 125523963, 120880405, 116711384, 113206963, 110454188, 108431132, 107028355, 106092320, 105475386, 105073344, 104838040, 104766825, 104881774, 105211094, 105776749, 106587066, 107634245, 108897982, 110352970, 111974974, 113742681, 115637030, 117639515, 119727388, 121864281, 123991329, 126028415, 127889978, 129508207, 130849392, 131914554, 132728075, 133325570, 133748363, 134042660, 134257450, 134438205, 134617389, 134803537, 134971337, 135058470, 134976236, 134635004, 133975121, 132988423, 131720053, 130251722, 128678292, 127091775, 125578255, 124220287, 123093444, 122255315, 121736968, 121545331, 121672528, 122101643, 122806055, 123749306]
40293A23749306J142212J307687J452078J587143J719758J851126J978481K098772
40285A36886563K212524K324749K442411K572121K721062K899718L122109L401356
40277A58582613L741939M132839M546640M947445N304577N604100N850869O060016
40269A98771038O242154O389269O469056O433629O240644N875010N357375M735425
40261B46513600M066052L399129K767735K184435J642773J123307O01033N0267
40253B62348331n53109j227528j976834k781223l596391m363846n026341n540258
40245B37282801n882917o056969o090759o029235n915274n771675n596855n376327
40237A90562790n099720m771503m411994m052372l727572l468562l294920l210280
$$ y = [123749306, 124891518, 126199205, 127651283, 129238426, 130958184, 132809310, 134787791, 136886563, 139099087, 141423836, 143866247, 146438368, 149159430, 152059148, 155181257, 158582613, 162324552, 166457391, 171004031, 175951476, 181256053, 186860153, 192711022, 198771038, 205013192, 211402461, 217871517, 224305146, 230545790, 236420800, 241778175, 246513600, 250579652, 253978781, 256746516, 258930951, 260573724, 261697031, 262298064, 262348331, 261795222, 260567694, 258590860, 255809637, 252213246, 247849400, 242823059, 237282801, 231399884, 225342915, 219252156, 213222921, 207307647, 201535972, 195939117, 190562790, 185463070, 180691567, 176279573, 172227201, 168499629, 165031067, 161736147, 158525867]
40229A58525867l203560l256764l355664l496053l679144l897347m120634m295660
40221A29221041m360833m268120l997503l557436k976190k293560j556392q14072
40213A05396935j10370N26159J087744J586299K046339K493743K944164L398061
40205A19369074L847158M287268M724588N168189N615489O043556O411145O665713
40197A62132180O748474O597624O155503N383719M283113K908204J364324k16238
40189A95356903j709123l025411m118749m974093n591551n978264o150757o140850
40181A57668105n996427n773591n523216n277858n045296m812629m559689m274308
40173A16405091l960353l635128l321121l039190k805939k633319k527419k484840
$$ y = [158525867, 155322307, 152065543, 148709879, 145213826, 141534682, 137637335, 133516701, 129221041, 124860208, 120592088, 116594585, 113037149, 110060959, 107767399, 106211007, 105396935, 105286565, 105812724, 106900468, 108486767, 110533106, 113026849, 115971013, 119369074, 123216232, 127503500, 132228088, 137396277, 143011766, 149055322, 155466467, 162132180, 168880654, 175478278, 181633781, 187017500, 191300613, 194208817, 195573141, 195356903, 193647780, 190622369, 186503620, 181529527, 175937976, 169959712, 163808955, 157668105, 151671678, 145898087, 140374871, 135097013, 130051717, 125239088, 120679399, 116405091, 112444738, 108809610, 105488489, 102449299, 99643360, 97010041, 94482622, 91997782]
40165I1997782k487586k500673k478437k380866k192493j931871j644515j381923
40157G4999418j177355j032216r22157q18802p10063o03567n15005m56451m33847
40148F8329955m48129m92620n50830o03270o40521o68376o96904p22392p19320
40139F2787593o51109m93347k53828K4697K83009M74981N89753O52600P06143
40130F4120492P87511R17330J103954J353078J670589K055412K489277K932254
40122G7429897L327120L609534L719470L611315L262372K680064J905688J009632
40114A00555092P4866q24816j637381k327536k862567l206714l331370l230990
40106H3208584k930007k476464j928729j342554p62436k19817K61223O55628R35297
$$ y = [91997782, 89510196, 87009523, 84531086, 82150220, 79957727, 78025856, 76381341, 74999418, 73822063, 72789847, 71867690, 71048888, 70338825, 69735258, 69220253, 68763802, 68329955, 67881826, 67389206, 66838376, 66235106, 65594585, 64926209, 64229305, 63506913, 62787593, 62136484, 61643137, 61389309, 61414006, 61697015, 62171996, 62761749, 63414349, 64120492, 64908003, 65825333, 66929287, 68282365, 69952954, 72008366, 74497643, 77429897, 80757017, 84366551, 88086021, 91697336, 94959708, 97639772, 99545460, 100555092, 100629958, 99805142, 98167761, 95840225, 92977658, 89770944, 86439574, 83208584, 80278577, 77802113, 75873384, 74530830, 73768394, 73548577, 73809800, 74465428, 75400725]
40097G5400725J077936J081889R75350Q10811O44235N09251M02545K92162J44985
40088H1339889m5431k50717m24483n31228n67793n65213n71710o27319p43997
40079G7011998r01674j061698j188297j263975j290924j282221j252151j211334
40071F7559724j165945j119255j075207j042310j033399j059067j119362j200444
40063E8744735j278215j326229j325778j276365j200804j137784j123480j175286
40055D8900794j289470j450330j638275j830040j996243k104138k125739k045895
40047C4420664j866911j609585j309626j007925p37797n16897l48520k28115j47428
40038B6647860r4994n8040k8215n202Q504J8659M4189J07474K14747L41259M33760
$$ y = [75400725, 76478661, 77560550, 78535900, 79346711, 79990946, 80500197, 80902742, 81194904, 81339889, 81294458, 81043741, 80619258, 80088030, 79520237, 78955024, 78383314, 77755995, 77011998, 76110324, 75048626, 73860329, 72596354, 71305430, 70023209, 68771058, 67559724, 66393779, 65274524, 64199317, 63157007, 62123608, 61064541, 59945179, 58744735, 57466520, 56140291, 54814513, 53538148, 52337344, 51199560, 50076080, 48900794, 47611324, 46160994, 44522719, 42692679, 40696436, 38592298, 36466559, 34420664, 32553753, 30944168, 29634542, 28626617, 27888820, 27371923, 27023403, 26795288, 26647860, 26552866, 26494826, 26466611, 26461409, 26469913, 26488572, 26532761, 26640235, 26854982, 27196241, 27630001]
40027B7630001M31368K94039K2997l37549p17088j044407j270987j384616j409213
40018B2214545j389686j367233j357980j348396j309600j218858j072619q84935
40010A2265238o77261m70211k82092j30648l2045M201j9967r1254j89735k94561
40000A0081665l88144m58787n01985n19569n16555m97501m65397m24737l86639
39991E922351l70237l95271m68854n77296o91364p80493q23327q08821p34205
39982B72483o06734m45668k76075j14848L9968K06532M04033O34774Q74960J081445
39972B070870J212738J251448J211393J123778J015803R01736P92335P08140O78227
39963A0966468P22345Q32483R71196J088964J147165J130598J043566Q96759O98158
$$ y = [27630001, 28061369, 28355408, 28378405, 28040856, 27323768, 26279361, 25008374, 23623758, 22214545, 20824859, 19457626, 18099646, 16751250, 15441650, 14222792, 13150173, 12265238, 11587977, 11117766, 10835674, 10705026, 10672981, 10677182, 10657215, 10565961, 10376226, 10081665, 9693521, 9234734, 8732749, 8213180, 7696625, 7199124, 6733727, 6308990, 5922351, 5552114, 5156843, 4687989, 4110693, 3419329, 2638836, 1815509, 1006688, 272483, -334251, -779919, -1055994, -1170842, -1130874, -924342, -520309, 114465, 989425, 2070870, 3283608, 4535056, 5746449, 6870227, 7886030, 8787766, 9580101, 10288241, 10966468, 11688813, 12521296, 13492492, 14581456, 15728621, 16859219, 17902785, 18799544, 19497702]
39954A9497702M54926J80901j01691l69824o07019q00315r30561r71026r01577
39945A5451516p27058m81232k10339N1139K93586N24725P47645R41317J059344
39936A7650643J049783Q83139N70015J58745k82956o90959j021798j258193j402629
39927A5655790j464622j450560j362578j205540r95716p64700n55701m13306l69869
39918G073198m33292n81336p66261r28973j016429r94327q51359n96869k55299
39909F49053J40897N58460R67346J339952J649573J874058K004706K053221K050033
39900A3287299K034264K040767K089800K182866K306075K438446K558829K646440
39892C1584786K677034K623218K464813K205046J879237J545531J261613J064068
$$ y = [19497702, 19952628, 20133529, 20031838, 19662014, 19054995, 18254680, 17324119, 16353093, 15451516, 14724458, 14243226, 14032887, 14084026, 14377612, 14902337, 15649982, 16591299, 17650643, 18700426, 19583565, 20153580, 20312325, 20029369, 19338410, 18316612, 17058419, 15655790, 14191168, 12740608, 11378030, 10172490, 9176774, 8412074, 7856373, 7443067, 7073198, 6639906, 6058570, 5292309, 4363336, 3346907, 2352580, 1501221, 904352, 649053, 789950, 1348410, 2315756, 3655708, 5305281, 7179339, 9184045, 11237266, 13287299, 15321563, 17362330, 19452130, 21634996, 23941071, 26379517, 28938346, 31584786, 34261820, 36885038, 39349851, 41554897, 43434134, 44979665, 46241278, 47305346]
39884D7305346R64487R59878J042583J199328J404163J617600J797228J912509
39876E8203122J951223J912328J792855J583348J278273Q92176M65532N4904k84164
39867F7849597n12080o16980o23443n90341n90225o78037q70314j148548j479552
39858F0740077j834318k193730k542741k861717l122751l294630l354117l295336
39850C8240737l128940k870298k525844k089352j552236r20673k27041M72025
39842B5398378J108816J620762J962801K113675K077181J879894J566720J195257
39834C8923484Q28942N27915L37484K76948L34148M70377O35134P83246Q85257
39825D4002935R27874R08886Q32175P03294N24463K92650O472l20179o50469r33624
$$ y = [47305346, 48269833, 49229711, 50272294, 51471622, 52875785, 54493385, 56290613, 58203122, 60154345, 62066673, 63859528, 65442876, 66721149, 67613325, 68078857, 68133761, 67849597, 67337517, 66720537, 66097094, 65506753, 64916528, 64238491, 63368177, 62219629, 60740077, 58905759, 56712029, 54169288, 51307571, 48184820, 44890190, 41536073, 38240737, 35111797, 32241499, 29715655, 27626303, 26074067, 25153394, 24926353, 25398378, 26507194, 28127956, 30090757, 32204432, 34281613, 36161507, 37728227, 38923484, 39752426, 40280341, 40617825, 40894773, 41228921, 41699298, 42334432, 43117678, 44002935, 44930809, 45839695, 46671870, 47375164, 47899627, 48192277, 48198749, 47878570, 47228101, 46294477]
39815D6294477j126210j209062j187747j079805r02168o68097l92537r8442J82274
39806C9812683M15647N79124O75196P34404Q00612R05948J054726J229253J409129
39797D7616722J583249J745072J881724J971619J991264J921691J750633J476539
39789F1938513J117203P14257L22866j0299k64155m41985n55506o10610o06719
39780F1603565n46436m42508l14318j78890m6967P2289J65045K14076K07469J45819
39770F0879144L9976r8574k65132m60258o81649r17430j146192j342434j482197
39761E4525254j545316j515500j383067j152924q53502n37035k65915r1189l6487
39752D7144319r5458k39577m27435o10970p41617p80850p14031n58976l60289
$$ y = [46294477, 45168267, 43959205, 42771458, 41691653, 40789485, 40121388, 39728851, 39630409, 39812683, 40228330, 40807454, 41482650, 42217054, 43017666, 43923614, 44978340, 46207593, 47616722, 49199971, 50945043, 52826767, 54798386, 56789650, 58711341, 60461974, 61938513, 63055716, 63769973, 64092839, 64082540, 63818385, 63376400, 62820894, 62210284, 61603565, 61057129, 60614621, 60300303, 60121413, 60074446, 60146735, 60311780, 60525856, 60733325, 60879144, 60919120, 60820546, 60555414, 60095156, 59413507, 58496077, 57349885, 56007451, 54525254, 52979938, 51464438, 50081371, 48928447, 48074945, 47537910, 47271995, 47180806, 47144319, 47048861, 46809284, 46381849, 45770879, 45029262, 44248412, 43534381, 42975405, 42615116]
39743D2615116j69587k3320O7835J14324J35130J45526J48071J28637O2460o8525
39733D3155667k57166m66834o46212p51893p63531o85831n41710l62777j80383
39724C8499330j9274J04754J84288K20156K23320K15906K26417K78632L79949
39715D0313478N17080O61481P79859Q43116Q31608P39239N78271L82351K02305
39706D5848788R1440Q4389J81395L50580N49301P49325R45708J143852J339211
39697E1283989J508773J619833J645549J574321J409213J163098Q56858N22507
39689F1584141K05327m2855j80000j89913q6364R6173L15813N31689P07301Q13670
39679F3754982Q33983P67602O31482M58937K94849J85416J63212K33761L71831
$$ y = [42615116, 42445529, 42422209, 42490044, 42604368, 42739498, 42885024, 43033095, 43161732, 43224192, 43155667, 42898501, 42431667, 41785455, 41033562, 40270031, 39584200, 39042490, 38679713, 38499330, 38480056, 38584810, 38769098, 38989254, 39212574, 39428480, 39654897, 39933529, 40313478, 40830558, 41492039, 42271898, 43115014, 43946622, 44685861, 45264132, 45646483, 45848788, 45940228, 46024617, 46206012, 46556592, 47105893, 47855218, 48800926, 49944778, 51283989, 52792762, 54412595, 56058144, 57632465, 59041678, 60204776, 61061634, 61584141, 61789468, 61746613, 61566613, 61376700, 61290336, 61386509, 61702322, 62234011, 62941312, 63754982, 64588965, 65356567, 65988049, 66446986, 66741835, 66927251, 67090463, 67324224, 67696055]
39670F7696055N30730O59956P22014P01733O07200M64305L06248J60142L6340
39661G1884723p2784j83591l08253m46318n84237p02005p84381q30896q56222
39652F7116036q76868q92816q80344q04818o45030m10910j41611J14518L24622
39643F2902779M84588O13116P32818Q53221R66531J055153J101755J095182J032592
39634G0837735R21414P81842O46339N52661N31537N95319P34284R21799J123525
39625G7646455J304720J433955J484807J437172J277954J001453O11849J29571
39617H6327936m01626r15180j335621j600619j676743j559559j264724q25326
39609G6748538k99930K22196O35238Q50215Q29466O02317K54283j04261l76898
$$ y = [67696055, 68226785, 68886741, 69608755, 70310488, 70917688, 71381993, 71688241, 71848383, 71884723, 71811939, 71628348, 71320095, 70873777, 70289540, 69587535, 68803154, 67972258, 67116036, 66239168, 65346352, 64466008, 63661190, 63016160, 62605250, 62463639, 62578157, 62902779, 63387367, 64000483, 64733301, 65586522, 66553053, 67608206, 68709961, 69805143, 70837735, 71759149, 72540991, 73187330, 73739991, 74271528, 74866847, 75601131, 76522930, 77646455, 78951175, 80385130, 81869937, 83307109, 84585063, 85586516, 86198365, 86327936, 85926310, 85011130, 83675509, 82074890, 80398147, 78838588, 77573864, 76748538, 76448608, 76670804, 77306042, 78156257, 78985723, 79588040, 79842323, 79738062, 79361164]
39600G9361164n12440n16268m38061l44515k92940l17756m29977o21302q66578
39591G5021327j126520j355786j515509j583772j558874j455982j299086j109374
39583F4016424q94599o48389l63321m8622K62753N23313O89159P35605O63760
39574F4936083M96389K66211N457k54723m77144o16573o30751m96709k18155J79911
39564F3189996O60545J180002J690464K146916K519921K807804L038078L251828
39556H0485554L475832L699117L872487L935359L853112L638114L339475L010883
39548A09309933K682313K355642K022439J684316J357090J056675P80791N03472
39540A21752671J87974j91392o34534j117121j603766k061569k467004k806790
$$ y = [79361164, 78848724, 78332456, 77894395, 77549880, 77256940, 76939184, 76509207, 75887905, 75021327, 73894807, 72539021, 71023512, 69439740, 67880866, 66424884, 65125798, 64016424, 63121825, 62473436, 62110115, 62061493, 62324246, 62847559, 63536718, 64272323, 64936083, 65432472, 65698683, 65704140, 65449417, 64972273, 64355700, 63724949, 63228240, 63010085, 63189996, 63850541, 65030543, 66721007, 68867923, 71387844, 74195648, 77233726, 80485554, 83961386, 87660503, 91532990, 95468349, 99321461, 102959575, 106299050, 109309933, 111992246, 114347888, 116370327, 118054643, 119411733, 120468408, 121249199, 121752671, 121940645, 121749253, 121114719, 119997598, 118393832, 116332263, 113865259, 111058469]
39532A11058469l074775l265586l368115l365631l245411l011431k690110k325268
39524H6712142j966060j653105j406888j223343j080724r55582q38274p38210
39516G6849956o76369o71630p30379q44719r96032j156756j288950j346806j289163
39507F7849152j097155p84690l95338J0255L69302O30797P66748P77345O87881
39498F8814297N39292L76254K35310J34996P2014K6722k3678r1299j70830k43742
39488F9669336k90785l05118k98593k98683l38858m46004o27967q65465j113051
39479F5084812j309633j393997j320311j071086o64500j51100M01081R25422J369162
39470F1869850J696071J883945J922614J814514J577487J247412Q75646N17757
$$ y = [111058469, 107983694, 104718108, 101349993, 97984362, 94738951, 91727520, 89037410, 86712142, 84746082, 83092977, 81686089, 80462746, 79382022, 78426440, 77588166, 76849956, 76173587, 75501957, 74771578, 73926859, 72930827, 71774071, 70485121, 69138315, 67849152, 66751997, 65967307, 65571969, 65582224, 65951526, 66582323, 67349071, 68126416, 68814297, 69353589, 69729843, 69965153, 70100149, 70172163, 70198885, 70175207, 70083908, 69913078, 69669336, 69378551, 69073433, 68774840, 68476157, 68137299, 67691295, 67063328, 66197863, 65084812, 63775179, 62381182, 61060871, 59989785, 59325285, 59174185, 59575266, 60500688, 61869850, 63565921, 65449866, 67372480, 69186994, 70764481, 72011893, 72887539, 73405296]
39462G3405296K18027N91j27012j64544j16252K153J56399K98814L87143M05476
39452G4466091L72326L29515L17984L54219M20109M71626M61417L63053J85460
39443G7741800k6879k06014k81703k07730J5886L37782O73193R36327J069777
39434H0052439J058176R24112P12327M71728K44318O4319l8059l7434P7776K93339
39424H3823041N63313Q17955R87702J034646R71980Q54365P43058O71631O36852
39415I1104543O16085N91305N60167N30551N08395M90240M64523M18151L42280
39406I5626240K34749J00475m8688j95467l20362m04881m33557l96132k90615
39397I3871762j23753R4536L60398O81263J071719J541533K082412K661870L230759
$$ y = [73405296, 73623323, 73623914, 73496902, 73332358, 73216106, 73218259, 73374658, 73673472, 74060615, 74466091, 74838417, 75167932, 75485916, 75840135, 76260244, 76731870, 77193287, 77556340, 77741800, 77714921, 77508907, 77227204, 77019474, 77035360, 77373142, 78046335, 78982662, 80052439, 81110615, 82034727, 82747054, 83218782, 83463100, 83527419, 83489360, 83451926, 83529702, 83823041, 84386354, 85204309, 86192011, 87226657, 88198637, 89053002, 89796060, 90467691, 91104543, 91720628, 92311933, 92872100, 93402651, 93911046, 94401286, 94865809, 95283960, 95626240, 95860989, 95961464, 95912776, 95717309, 95396947, 94992066, 94558509, 94162377, 93871762, 93748009, 93842545, 94202943, 94884206, 95955925, 97497458, 99579870, 102241740, 105472499]
39388A05472499L742749M172636M518124M783967M965556N049995N033960M939472
39380A42678958M810625M692218M605800M538379M448949M288128M021818L648669
39372A77733544L203695K746202K338434K025307J822807J716455J667815J626687
39364A94880946J545153J387606J132762P70898L03380k53357q65064j484536
39356A97417788k063756k567766k985316l332971l649421l979057m350532m761425
39348A69727544n177166n543649n805435n920865n869427n652526n291765m826936
39340A25639775m311052l799716l337920k951970k649794k425504k263656k144544
39332A01755619k052551j983355j942640j936784j964665k017308k082468k148188
$$ y = [105472499, 109215248, 113387884, 117906008, 122689975, 127655531, 132705526, 137739486, 142678958, 147489583, 152181801, 156787601, 161325980, 165774929, 170063057, 174084875, 177733544, 180937239, 183683441, 186021875, 188047182, 189869989, 191586444, 193254259, 194880946, 196426099, 197813705, 198946467, 199717365, 200020745, 199767388, 198902324, 197417788, 195354032, 192786266, 189800950, 186467979, 182818558, 178839501, 174488969, 169727544, 164550378, 159006729, 153201294, 147280429, 141411002, 135758476, 130466711, 125639775, 121328723, 117529007, 114191087, 111239117, 108589323, 106163819, 103900163, 101755619, 99703068, 97719713, 95777073, 93840289, 91875624, 89858316, 87775848, 85627660]
39324H5627660k204779k248266k283817k323744k379119k451566k531821k604331
39316F6600217k652277k660529k618991k528096k402368k265674k137530k019465
39308D7315287j892983j731901j519062j254071r47867o11841k51579J31640N35087
39299C9772710R49208J355490J729713K050677K310138K516583K688944K843536
39291E6216999K982178L088263L133080L089875K948585K722278K441207K139869
39283G8762334J847329J585883J373441J223314J141290J124922J166313J253665
39275H9478491J367885J477410J537697J497766J311033R47386M05565k76673
39267I7746560j021232j723726k281879k627125k744055k667389k458479k174867
$$ y = [85627660, 83422881, 81174615, 78890798, 76567054, 74187935, 71736369, 69204548, 66600217, 63947940, 61287411, 58668420, 56140324, 53737956, 51472282, 49334752, 47315287, 45422304, 43690403, 42171341, 40917270, 39969403, 39357562, 39105983, 39237623, 39772710, 40721918, 42077408, 43807121, 45857798, 48167936, 50684519, 53373463, 56216999, 59199177, 62287440, 65420520, 68510395, 71458980, 74181258, 76622465, 78762334, 80609663, 82195546, 83568987, 84792301, 85933591, 87058513, 88224826, 89478491, 90846376, 92323786, 93861483, 95359249, 96670282, 97617668, 98023233, 97746560, 96725328, 95001602, 92719723, 90092598, 87348543, 84681154, 82222675, 80047808]
39259H0047808j849953j492016j098380o71949k28942K04276N99902R36197J200732
39250G7647675J390497J510942J574039J593470J576885J519948J408757J232352
39242H9454565R98310P40768N14760L78828L73713N05554P40625J014803J254891
39233I5976817J402984J433248J354557J199007J002820P89511N64554L23834
39225A04047332O8783j83637m04283n67485o69995p40249q27987r75205j184856
39216I8562418j409831j571889j597386j444731j109125o11026J4661P18583J430623
39207I2982297K060041K511311K712855K645014K351646J928329J491837J143004
39199A09826334R37104Q73012R05052R69723J011137R92149Q91256O96087M03527
$$ y = [80047808, 78197855, 76705839, 75607459, 74935510, 74706568, 74910844, 75510746, 76446943, 77647675, 79038172, 80549114, 82123153, 83716623, 85293508, 86813456, 88222213, 89454565, 90452875, 91193643, 91708403, 92087231, 92460944, 92966498, 93707123, 94721926, 95976817, 97379801, 98813049, 100167606, 101366613, 102369433, 103158944, 103723498, 104047332, 104116115, 103932478, 103528195, 102960710, 102290715, 101550466, 100722479, 99747274, 98562418, 97152587, 95580698, 93983312, 92538581, 91429456, 90818430, 90833091, 91551674, 92982297, 95042338, 97553649, 100266504, 102911518, 105263164, 107191493, 108683330, 109826334, 110763438, 111636450, 112541502, 113511225, 114522362, 115514511, 116405767, 117101854, 117505381]
39190A17505381K7114l95692q04481j127497j300212j284137j080074p31367l14095
39181A10494940Q4921L93996N73526O17336N43562L85305J84519j5388j80601
39172A13082116k95939l63876l93260l86441l35217k29063o9087J24456L18859
39163A11452548M84949O08856O91208P39332P63507P79982Q12874Q88170J023038
39154A18244464J218626J459832J719692J966102K171748K326366K445023K564091
39146A34115944K722927K940265L200411L459729L670375L805741L870750L891481
39138A61677623L893566L885446L856633L789596L676038L528256L380387L279905
39130A90967450L273775L395445L656665M044387M521951N036216N532366N972731
$$ y = [117505381, 117532495, 117136803, 116332322, 115204825, 113904613, 112620476, 111540402, 110809035, 110494940, 110579861, 110973857, 111547383, 112164719, 112708281, 113093586, 113278105, 113262717, 113082116, 112786177, 112422301, 112029041, 111642600, 111307383, 111078320, 111009233, 111133689, 111452548, 111937497, 112546353, 113237561, 113976893, 114740400, 115520382, 116333256, 117221426, 118244464, 119463090, 120922922, 122642614, 124608716, 126780464, 129106830, 131551853, 134115944, 136838871, 139779136, 142979547, 146439276, 150109651, 153915392, 157786142, 161677623, 165571189, 169456635, 173313268, 177102864, 180778902, 184307158, 187687545, 190967450, 194241225, 197636670, 201293335, 205337722, 209859673, 214895889, 220428255, 226400986]
39122B26400986O349496O682818P005889P346985P718042Q112561Q510755Q889017
39114B87016549R230453R531566R800479J0046333J0265829J0435334J0513571
39107C56840114J0452511J0208726R748980R050795Q103876O915401N514214L946412
39099D20781029K262694N08412j272631l023120m662104o094079p234187q031104
39091C93234910q472643q575915q375537p918252p261342o469243n608350m742670
39083C35810958l929656l213867k620719k155658j809512j564008j392725j260168
39075C17864645j125170r50447p14496m21198j04660J72847L32431K99635K8482
39066C15382069m83462j198935k062479l025200m055460n130023o216263p261762
$$ y = [226400986, 232750482, 239433300, 246439189, 253786174, 261504216, 269616777, 278127532, 287016549, 296247002, 305778568, 315579047, 325625380, 335891209, 346326543, 356840114, 367292625, 377501351, 387250331, 396301126, 404405002, 411320403, 416834617, 420781029, 423043723, 423552135, 422279504, 419256384, 414594280, 408500201, 401266014, 393234910, 384762267, 376186352, 367810815, 359892563, 352631221, 346161978, 340553628, 335810958, 331881302, 328667435, 326046716, 323891058, 322081546, 320517538, 319124813, 317864645, 316739475, 315789028, 315074532, 314653334, 314548674, 314721521, 315053952, 315353587, 315382069, 314898607, 313699672, 311637193, 308611993, 304556533, 299426510, 293210247, 285948485]
39058B85948485q199334q963565r509198r823099r925627r862581r692708r475720
39050B10496653r261439r079619q933673q804012q661081q479674q245292p951723
39042A41080140p596886p183420o723445o241459n770158n340317m971476m669265
39034I2583714m427995m232311m055610l861374l614111l297114k924123k533564
39026F3637512k166978j846556j568520j316734j084673q87248p53230p05073
39018E3308500p41890q37121r51058j047850j104631j108205j047247r12325p05666
39009D4852507m49115j78941O9957K77973M44560N82941P09563Q31718R39563
39000D8080726J010019J021581R67143Q52626O84109M58839J71282j70425n32820
$$ y = [285948485, 277749151, 268785586, 259276388, 249453289, 239527662, 229665081, 219972373, 210496653, 201235214, 192155595, 183221922, 174417910, 165756829, 157277155, 149031863, 141080140, 133483254, 126299834, 119576389, 113334930, 107564772, 102224455, 97252979, 92583714, 88155719, 83923408, 79867798, 76006424, 72392313, 69095199, 66171076, 63637512, 61470534, 59623978, 58055458, 56738724, 55654051, 54766803, 54013573, 53308500, 52566610, 51729489, 50778431, 49730581, 48625950, 47517745, 46470498, 45558173, 44852507, 44403392, 44224451, 44294408, 44572381, 45016941, 45599882, 46309445, 47141163, 48080726, 49090745, 50112326, 51079469, 51932095, 52616204, 53075043, 53246325, 53075900, 52543080]
38991E2543080q61062j095903j192497j131564r21352n92675j89023K45650O76026
38982D7480680J077262J432251J730594J970263K156320K293865K380830K408313
38974F2930378K369215K268926K130765J992149J892220J857294J892471J983222
38966G9316640K103382K224433K323890K390925K425333K429762K403012K342831
38958I7960208K255689K162456K093023K073657K115152K207384K322276K423944
38950A15613789K480329K469365K378968K206880J963894J675632J376337J096915
38942A31262109Q56740O64936N26786M46869M26375M59692N35832O43475P73364
38933A36596178R15422J055567J178503J275132J346551J399430J436132J447752
$$ y = [52543080, 51682018, 50586115, 49393618, 48262054, 47340702, 46748027, 46559004, 46804654, 47480680, 48557942, 49990193, 51720787, 53691050, 55847370, 58141235, 60522065, 62930378, 65299593, 67568519, 69699284, 71691433, 73583653, 75440947, 77333418, 79316640, 81420022, 83644455, 85968345, 88359270, 90784603, 93214365, 95617377, 97960208, 100215897, 102378353, 104471376, 106545033, 108660185, 110867569, 113189845, 115613789, 118094118, 120563483, 122942451, 125149331, 127113225, 128788857, 130165194, 131262109, 132118849, 132783785, 133310571, 133757440, 134183815, 134643507, 135179339, 135822814, 136596178, 137511600, 138567167, 139745670, 141020802, 142367353, 143766783, 145202915, 146650667]
38925A46650667J415459J319863J152993R25468O63694L98539J52793o5644k62229
38916A52351603m47547o26612p92419r29278j023981j075347j094547j098513
38908A45263359j104258j126851j176826j254533j346565j431096j489989j517000
38900A34816241j513997j480051j406181j282335j109765r07466p09033n54330
38892A25853083m79111n02125o13537p74701r34321j050905j104661j093662j025181
38883A18274879r14321p88685o87581o49261o93091q10111r69287j135374j287494
38874A10339674j428841j582901j777014k020670k291393k539532k711097k773898
38866I3214328k730101k610296k458204k318571k233058k239534k367591k628095
$$ y = [146650667, 148066126, 149385989, 150538982, 151464450, 152128144, 152526683, 152679476, 152613832, 152351603, 151904056, 151277444, 150485025, 149555747, 148531766, 147456419, 146361872, 145263359, 144159101, 143032250, 141855424, 140600891, 139254326, 137823230, 136333241, 134816241, 133302244, 131822193, 130416012, 129133677, 128023912, 127116446, 126407413, 125853083, 125373972, 124871847, 124258310, 123483609, 122549288, 121498383, 120393722, 119300060, 118274879, 117360558, 116571873, 115884292, 115235031, 114541940, 113731829, 112762542, 111627168, 110339674, 108910833, 107327932, 105550918, 103530248, 101238855, 98699323, 95988226, 93214328, 90484227, 87873931, 85415727, 83097156, 80864098, 78624564, 76256973, 73628878]
38858G3628878l001928l436123l852096m164245m303201m237147l983874l606672
38850D3043592l191583k813478k507014k258427k023021j757351j445989j108554
38842B5938175p88243n33994l85814l64410m64927o58290r02194j155359j385853
38833A9299091j571696j699434j764218j768832j719827j624131j489882j328943
38825F332128j155683r81916q14652o62210n45412n02234n76225p91573j131322
38816h29099j536161j926916k236358k430194k506761k480099k360500k145554
38808a8451642j825727j398704q82654l20894K24189O86249J013507J182355J199423
38799a8573898J093324R04511O80223M72893L34814L06067M01378O05451Q80525
$$ y = [73628878, 70626950, 67190827, 63338731, 59174486, 54871285, 50634138, 46650264, 43043592, 39852009, 37038531, 34531517, 32273090, 30250069, 28492718, 27046729, 25938175, 25149932, 24615938, 24230124, 23865714, 23400787, 22742497, 21840303, 20684944, 19299091, 17727395, 16027961, 14263743, 12494911, 10775084, 9150953, 7661071, 6332128, 5176445, 4194529, 3379877, 2717667, 2172255, 1670021, 1093796, 302223, -829099, -2365260, -4292176, -6528534, -8958728, -11465489, -13945588, -16306088, -18451642, -20277369, -21676073, -22558727, -22879621, -22655432, -21969183, -20955676, -19773321, -18573898, -17480574, -16576063, -15895840, -15422947, -15088133, -14782066, -14380688, -13775237, -12894712]
38790a2894712J181131J467357J711696J900125K029276K100606K114361K068771
38782A678611J966709J823670J667285J525927J414186J325877J239215J130526
38774A3772006R87579Q14216O24930M37028K68540J40866P7712R6340J97186L60224
38764A7776627N49986P26134Q55979R24083R32630Q91312Q05307O72533M91990
38755B4626581K74400M5348j62352l23836m37306n28859o40473q05559j026518
38746B1021426j268016j469947j573105j544824j391302j150172q69425n88151
38738A1166484l31728j20588J9538N7731k9660k42653n48725q87376j185820j379241
38728F517962j429980j341023j157650r52425p97301p36368p73238q76990j000014
$$ y = [-12894712, -11713581, -10246224, -8534528, -6634403, -4605127, -2504521, -390160, 1678611, 3645320, 5468990, 7136275, 8662202, 10076388, 11402265, 12641480, 13772006, 14759585, 15573801, 16198731, 16635759, 16904299, 17045165, 17122877, 17219217, 17416403, 17776627, 18326613, 19052747, 19908726, 20832809, 21765439, 22656751, 23462058, 24134591, 24626581, 24900981, 24946329, 24783977, 24460141, 24022835, 23493976, 22853503, 22047944, 21021426, 19753410, 18283463, 16710358, 15165534, 13774232, 12624060, 11754635, 11166484, 10834756, 10714168, 10733706, 10791437, 10761777, 10519124, 9970399, 9083023, 7897203, 6517962, 5087982, 3746959, 2589309, 1636884, 839583, 103215, -670023, -1547013, -2547027]
38719b547027j097347j139598j116465j033047r04141p49371n87005m24768k53110
38710i851879m9415K06869N19866Q74436J243117J592917J888304K095780K193406
38701G13401K179088K069644J891748J672755J436030J198965R72627P65709N92293
38692A3492260M75459M38942M90237O08685P49392Q60660R02384Q53959P10380
38683A9582358M75085J58982k13183n97636r36950j176897j286099j266833j150042
38674A3588785r76407p74272n48954k91834k819K91697N40513O89134P06682O01817
38664A3824342M20850K32438J07000R6037K14388M30978O75484Q62416R22943
38655A7786876Q29266O01499K96924j2031k62295m18694m80570m76205m49080
$$ y = [-2547027, -3644374, -4783972, -5900437, -6933484, -7837625, -8586996, -9174001, -9598769, -9851879, -9901294, -9694425, -9174559, -8300123, -7057006, -5464089, -3575785, -1480005, 713401, 2892489, 4962133, 6853881, 8526636, 9962666, 11161631, 12134258, 12899967, 13492260, 13967719, 14406661, 14896898, 15505583, 16254975, 17115635, 18018019, 18871978, 19582358, 20057443, 20216425, 20003242, 19405606, 18468656, 17291759, 16005660, 14738827, 13588785, 12612378, 11838106, 11289152, 10997318, 10994499, 11286196, 11826709, 12515843, 13222525, 13824342, 14245192, 14477630, 14584630, 14680667, 14895055, 15326033, 16001517, 16863933, 17786876, 18616142, 19217641, 19514565, 19502534, 19240239, 18821545, 18340975, 17864770, 17415690]
38646A7415690m40527m72903n39416o07377o35433n95931m89972l47627k14150
38637A3072354j29759j14124j64256k64519l96666n39230o59613p13100o57503
38628I433584m75938j91183J39196M44554O67941P84445Q03035P53410O67620
38619A3026664N67291M60414L44374K10064M5670j57968l99156o57349q92535
38610A2547469j057768j122267j092128j013697r54970r74972j097672j302043
38602C931952j530054j707448j768986j678900j438830j081426o54778k06236
38594f134706K28199O27385R82598J290652J545059J730020J822823J805454J678394
38585E575878J465995J209009R50406P24453N52589M41669L80870L41499K87156
$$ y = [17415690, 16975163, 16502260, 15962844, 15355467, 14720034, 14124103, 13634131, 13286504, 13072354, 12942595, 12828471, 12664215, 12399696, 12003030, 11463800, 10804187, 10091087, 9433584, 8957646, 8766463, 8905659, 9350213, 10018154, 10802599, 11605634, 12359044, 13026664, 13593955, 14054369, 14398743, 14608807, 14654477, 14496509, 14097353, 13440004, 12547469, 11489701, 10367434, 9275306, 8261609, 7306639, 6331667, 5233995, 3931952, 2401898, 694450, -1074536, -2753436, -4192266, -5273692, -5928470, -6134706, -5906507, -5279122, -4296524, -3005872, -1460813, 269207, 2092030, 3897484, 5575878, 7041873, 8250882, 9201288, 9925741, 10478330, 10919999, 11300869, 11642368, 11929524]
38576A1929524J94083O9425m7672j06088p1812N2543K28014L95978N00751N09362
38566A3654108M22786K73841J11074k3658j11063j56729j82766k15203k70642
38557A3501748l45594m15188m45575m13526l19156j83510l5724R9174K05533K77288
38547A1925470L17582L38659L58318L90270M32763M65044M56772L84142K40990
38538A5310010M0407j88618m04992n62669o24680n78180m37898k32793J3362K90332
38528A2624281N92638R04996J198136J439042J605095J690014J699872J645592
38520B3399666J538067J387461J205343J006181Q03999O04761M02175J84039n4517
38511C0477175l02353n33842p15764q13914q00720o66177m27606j30835J58990
$$ y = [11929524, 12123607, 12193032, 12145360, 12039272, 11967460, 12020003, 12248017, 12643995, 13144746, 13654108, 14076894, 14350735, 14461809, 14438151, 14327088, 14170359, 13987593, 13772390, 13501748, 13156154, 12740966, 12295391, 11881865, 11562709, 11379199, 11343475, 11442649, 11648182, 11925470, 12243052, 12581711, 12940029, 13330299, 13763062, 14228106, 14684878, 15069020, 15310010, 15350417, 15161799, 14756807, 14194138, 13569458, 12991278, 12553380, 12320587, 12333949, 12624281, 13216919, 14121915, 15320051, 16759093, 18364188, 20054202, 21754074, 23399666, 24937733, 26325194, 27530537, 28536718, 29340717, 29945478, 30347653, 30531692, 30477175, 30174822, 29640980, 28925216, 28111302, 27310582, 26644405, 26216799, 26085964, 26244954]
38502B6244954L72740M54417L76539J48569j86148n63510r15044j182063j325413
38493B3425041j329423j198950r51881o12833k11554K15408O23909R65725J197190
38484B2122632J290190J238895J057534P72711M18590L7543l20597o07738p92617
38475B5217143q72138q71978q36479q12494q32992r06260j014222j119653j179939
38466A6770988j164337j069378r23960p78858o85718o78000p62954r23346j123119
38457H661318j314277j446262j478326j392337j201242r47481o88441m73844l28047
$$ y = [26244954, 26617694, 27072111, 27448650, 27597219, 27411071, 26847561, 25932517, 24750454, 23425041, 22095618, 20896668, 19944787, 19331954, 19120400, 19335808, 19959717, 20925442, 22122632, 23412822, 24651717, 25709251, 26481962, 26900552, 26938095, 26617498, 26009760, 25217143, 24345005, 23473027, 22636548, 21824054, 20991062, 20084802, 19070580, 17950927, 16770988, 15606651, 14537273, 13613313, 12834455, 12148737, 11470737, 10707783, 9784437, 8661318, 7347041, 5900779, 4422453, 3030116, 1828874, 881393, 192952, -280892, -608939]
$$ [...]
##END NTUPLES=NMR SPECTRUM
##END=
