##TITLE=31Pdec_DE-57k_d6
 DMSO-d6, 64 sc
 4.7.2024
##JCAMPDX= 6.0         $$ Bruker NMR JCAMP-DX V2.0
##DATA TYPE= NMR SPECTRUM
##DATA CLASS= NTUPLES
##ORIGIN= UXNMR, Bruker Analytische Messtechnik GmbH
##OWNER= root
$$ XWIN-NMR		Version 3.5
$$ Thu Jul  4 14:18:22 2024 Russian Standard Time (UT+4h)  she@DPX200
##.OBSERVE FREQUENCY= 81.013821
##.OBSERVE NUCLEUS= ^31P
##.ACQUISITION MODE= SIMULTANEOUS
##.ACQUISITION SCHEME= undefined
##.AVERAGES= 64
##.DIGITISER RES= 17
##SPECTROMETER/DATA SYSTEM= spect
##.PULSE SEQUENCE= zgpg30
##.SOLVENT NAME= DMSO
##.SHIFT REFERENCE= (INTERNAL, DMSO, 0, 198.062)
##AUDIT TRAIL= $$ (NUMBER, WHEN, WHO, WHERE, WHAT)
$$ ##TITLE= Audit trail, XWIN-NMR		Version 3.5
$$ ##JCAMPDX= 5.01
$$ ##ORIGIN= Bruker BioSpin GmbH
$$ ##OWNER= she
$$ F:/spectra/data/she/nmr/P31/2/pdata/1/auditp.txt
$$ ##AUDIT TRAIL=  $$ (NUMBER, WHEN, WHO, WHERE, WHAT)
(   1,<2024-07-04 14:17:08.40 +0400>,<she>,<DPX200>,
      <created by zg, POWCHK disabled, PULCHK disabled
       configuration hash MD5:
       00 E9 B6 7A A2 85 ED C7 34 08 36 98 17 FE 4E 26
       data hash MD5: 32K
       30 6A E6 F8 08 AD 00 2F 3E 61 19 B6 BF C3 F6 FA>)
(   2,<2024-07-04 14:17:10.81 +0400>,<she>,<DPX200>,
      <Start of raw data processing
       efp BC_mod = 2 LB = 1.5 FT_mod = 6 PKNL = 1 PHC0 = 3124.453 PHC1 = -778.9137 SI = 64K 
       data hash MD5: 64K
       C4 00 4F 47 F7 A8 39 1C 78 48 1A 47 DD 07 06 F1>)
(   3,<2024-07-04 14:17:47.60 +0400>,<she>,<DPX200>,
      <pk PHC0 = 155.9936 PHC1 = 0 
       data hash MD5: 64K
       8F 44 F3 72 1B 6E F5 F0 7A 69 2E EF 13 D0 63 C6>)
$$ ##END=
$$ 
$$ hash MD5
$$ 16 AC A5 57 F4 BF 9E 9B 4F 8C 21 38 BF B2 FF B1
##$RELAX= 
##$RELAX= 
##$RELAX= 
##$RELAX= 
##$RELAX= 
##$RELAX= 
##$RELAX= 
##$RELAX= 
$$ Bruker specific parameters
$$ --------------------------
##$DU= <F:/spectra>
##$EXPNO= 2
##$NAME= <P31>
##$PROCNO= 1
##$TYPE= <nmr>
##$USER= <she>
##$AMP= (0..31)
100 100 100 100 100 100 100 100 100 100 100 100 100 100 100 100 100 100 
100 100 100 100 100 100 100 100 100 100 100 100 100 100 
##$AQSEQ= 0
##$AQ_mod= 1
##$AUNM= <au_zg>
##$AUTOPOS= <>
##$BF1= 81.014009
##$BF2= 200.13
##$BF3= 200.13
##$BF4= 200.13
##$BF5= 200.13
##$BF6= 200.13
##$BF7= 200.13
##$BF8= 200.13
##$BYTORDA= 1
##$CFDGTYP= 0
##$CFRGTYP= 5
##$CHEMSTR= <none>
##$CNST= (0..31)
1 1 145 1 1 1 1 1 1 1 1 1 1 1 1 1 1 1 1 1 1 1 1 1 1 1 1 1 1 1 1 1 
##$CPDPRG= <waltz16>
##$CPDPRG1= <>
##$CPDPRG2= <waltz16>
##$CPDPRG3= <>
##$CPDPRG4= <mlev>
##$CPDPRG5= <mlev>
##$CPDPRG6= <mlev>
##$CPDPRG7= <mlev>
##$CPDPRG8= <mlev>
##$CPDPRGB= <>
##$CPDPRGT= <>
##$D= (0..31)
0 1 0 0 0 0 0 0 0 0.06 0 0.03 2e-05 3e-06 0 0 0.0002 0 0 0 0 0 0 0 0 0 
0 0 0 0 0 0 
##$DATE= 1720088227
##$DBL= (0..7)
120 120 120 11 120 120 24 19 
##$DBP= (0..7)
150 150 150 150 150 150 150 150 
##$DBP07= 0
##$DBPNAM0= <>
##$DBPNAM1= <>
##$DBPNAM2= <>
##$DBPNAM3= <>
##$DBPNAM4= <>
##$DBPNAM5= <>
##$DBPNAM6= <>
##$DBPNAM7= <>
##$DBPOAL= (0..7)
0.5 0.5 0.5 0.5 0.5 0.5 0.5 0.5 
##$DBPOFFS= (0..7)
$$ [...]
##$SUBNAM3= <"">
##$SUBNAM4= <"">
##$SUBNAM5= <"">
##$SUBNAM6= <"">
##$SUBNAM7= <"">
##$SUBNAM8= <"">
##$SUBNAM9= <"">
##$SW= 400.765351723535
##$SWIBOX= (0..15)
0 1 3 0 0 0 0 0 0 0 0 0 0 0 0 0 
##$SW_h= 32467.5324675325
##$TD= 32768
##$TD0= 1
##$TE= 0
##$TE2= 300
##$TE3= 300
##$TEG= 300
##$TL= (0..7)
0 120 53 12 22 120 120 120 
##$TP= (0..7)
150 150 150 150 150 150 150 150 
##$TP07= 0
##$TPNAME0= <>
##$TPNAME1= <>
##$TPNAME2= <>
##$TPNAME3= <>
##$TPNAME4= <>
##$TPNAME5= <>
##$TPNAME6= <>
##$TPNAME7= <>
##$TPOAL= (0..7)
0.5 0.5 0.5 0.5 0.5 0.5 0.5 0.5 
##$TPOFFS= (0..7)
0 0 0 0 0 0 0 0 
##$TUNHIN= 0
##$TUNHOUT= 0
##$TUNXOUT= 0
##$USERA1= <user>
##$USERA2= <user>
##$USERA3= <user>
##$USERA4= <user>
##$USERA5= <user>
##$V9= 5
##$VALIST= <valist>
##$VCLIST= <CCCCCCCCCCCCCCC>
##$VD= 0
##$VDLIST= <DDDDDDDDDDDDDDD>
##$VPLIST= <PPPPPPPPPPPPPPP>
##$VTLIST= <TTTTTTTTTTTTTTT>
##$WBST= 1024
##$WBSW= 4
##$XGAIN= (0..3)
0 0 0 0 
##$XL= 0
##$YL= 0
##$YMAX_a= 2957
##$YMIN_a= -2937
##$ZGOPTNS= <>
##$ZL1= 120
##$ZL2= 120
##$ZL3= 120
##$ZL4= 120
##$ABSF1= 0
##$ABSF2= 0
##$ABSG= 0
##$ABSL= 0
##$ALPHA= 0
##$AQORDER= 0
##$ASSFAC= 0
##$ASSFACI= 0
##$ASSFACX= 0
##$ASSWID= 0
##$AUNMP= <proc_1d>
##$AZFE= 0.1
##$AZFW= 0.5
##$BCFW= 0
##$BC_mod= 2
##$BYTORDP= 0
##$COROFFS= 0
##$CY= -3
##$DATMOD= 1
##$DC= 0
##$DFILT= <>
##$DTYPP= 0
##$F1P= 0
##$F2P= 0
##$FCOR= 1
##$FTSIZE= 65536
##$FT_mod= 6
##$GAMMA= 0
##$GB= 0
##$INTBC= 1
##$INTSCL= 9.790993e-09
##$ISEN= 30
##$LB= 1.5
##$LEV0= 0
##$LPBIN= 0
##$MAXI= 10000
##$MC2= 0
##$MEAN= 0
##$ME_mod= 0
##$MI= 50
##$NCOEF= 0
##$NC_proc= -10
##$NLEV= 6
##$NOISF1= 182.463
##$NOISF2= 159.3651
##$NSP= 0
##$NTH_PI= 0
##$NZP= 0
##$OFFSET= 198.0616
##$PC= 4
##$PHC0= 3280.447
##$PHC1= -778.9137
##$PH_mod= 1
##$PKNL= yes
##$PPARMOD= 0
##$PSCAL= 0
##$PSIGN= 0
##$REVERSE= no
##$SF= 81.0140089999434
##$SI= 65536
##$SIGF1= 159.3651
##$SIGF2= -187.1042
##$SINO= 113.3802
##$SIOLD= 16384
##$SREGLST= <1H.CDCl3>
##$SSB= 0
##$STSI= 65536
##$STSR= 0
##$SW_p= 32467.5324675325
##$SYMM= 0
##$S_DEV= 0
##$TDeff= 32768
##$TDoff= 0
##$TI= <>
##$TILT= no
##$TM1= 0
##$TM2= 0
##$TOPLEV= 0
##$USERP1= <user>
##$USERP2= <user>
##$USERP3= <user>
##$USERP4= <user>
##$USERP5= <user>
##$WDW= 1
##$XDIM= 65536
##$YMAX_p= 368031926
##$YMIN_p= -89546561
$$ End of Bruker specific parameters
$$ ---------------------------------
##NTUPLES= NMR SPECTRUM
##VAR_NAME=  FREQUENCY,     SPECTRUM/REAL,   SPECTRUM/IMAG
##SYMBOL=    X,             R,               I
##VAR_TYPE=  INDEPENDENT,   DEPENDENT,       DEPENDENT
##VAR_FORM=  AFFN,          ASDF,            ASDF
##VAR_DIM=   65536,         65536,           65536
##UNITS=     HZ,            ARBITRARY UNITS, ARBITRARY UNITS
##FACTOR=    0.49542278885378, 1,            1
##FIRST=     16045.7642231865, 0,            0
##LAST=      -16421.768244346, 0,            0
##MIN=       -16421.768244346, -89546561,    0
##MAX=       16045.7642231865, 368031926,    0
$$ Real data points
##PAGE= N=1
##DATA TABLE= (X++(R..R)), XYDATA
$$ [...]
##PAGE= N=2
##DATA TABLE= (X++(I..I)), XYDATA
6493G677592o378144l794146o812519p566626K42286R560513Q983633K57312m509278
6484b339377k083334j144782l903840o0388J3141717J9390416N435165j5554627
6476A2880950j9668791o147305K509874n744876j6620299j2710540K560348J3452887
6468b9487752J3448818P862311K428873j63741K884289J1005672J6182888J1253496
6460C5414854O25929n480066n710454p267658j1631991j1378631l699149L351044
6452e776122L459356J726912M032833M698066m059952j4885069j1268531Q009797
6444a4062710K3274986J8565372J598372r275546r775211r600850j2392486j0382628
6436b2050701n95716P033356M089121l757076o757453n963035q327046j2311320
$$ plain form
6493 7677592 1299448 -2494698 -9307217 -16873843 -16631557 -7071044 1912589 2169901 -2339377
6484 -2339377 -4422711 -5567493 -9471333 -9531721 3609996 23000412 28435577 12880950
6476 12880950 -6787841 -12935146 -10425272 -16170148 -32790447 -45500987 -42940639 -29487752
6468 -29487752 -16038934 -8176623 -5747750 -5911491 -3027202 7978470 24161358 35414854
6460 35414854 36040783 30560717 24850263 17582605 5950614 -5428017 -9127166 -5776122
6452 -5776122 -2316766 -589854 3442979 8141045 4081093 -10803976 -22072507 -14062710
6444 -14062710 9212276 27777648 29376020 20100474 10325263 724413 -11668073 -22050701
6436 -22050701 -22646417 -15613061 -11523940 -15281016 -22038469 -28001504 -36328550 -48639870
6428d8639870r771607m74089O198933N059813J351169J274789M757705R937115
6420c0306042J6030542J8224183R053116r037276k0804889j6032470l839015j10553
6412c6822404n955291r540044n957092k197756j873112J387781J0081462J4246964
6404c6629492O054647n224584m573463O346004J0836400J887163p272784l168930
6396c1745039P435443P487688m888859j3211269n728827R464723J7329802J4787234
6388I30896Q822530K608945n427141j1613221q543943J649486O674826J257629
6380c639993m860599k594391K028861j292590q995393r012604j057258K435666
6372b6988301l125591o794187q30894M922005j886365j4301222j3156091N022268
$$ plain form
6428 -48639870 -58411477 -58885566 -52686633 -47626820 -46275651 -45000862 -40243157 -30306042
6420 -30306042 -14275500 3948683 13001799 3964523 -16840366 -32872836 -36711851 -36822404
6412 -36822404 -42777695 -52317739 -58274831 -60472587 -62345699 -60957918 -50876456 -36629492
6404 -36629492 -30574845 -35799429 -40372892 -34026888 -23190488 -21303325 -28576109 -31745039
6396 -31745039 -24309596 -16821908 -21710767 -34922036 -40650863 -31186140 -13856338 930896
6388 930896 9753426 12362371 6935230 -4677991 -13221934 -11572448 -4897622 -3639993
6380 -3639993 -8500592 -11094983 -9066122 -10358712 -19354105 -28366709 -29423967 -26988301
6372 -26988301 -30113892 -36908079 -37738973 -32816968 -34703333 -49004555 -62160646 -57138378
6364e7138378K0500946J5855986q00028p274614L023333J4183182J1292119k76034
6356f33488n605183k092013M63143j541366p2893Q191862J2165490J759178j4654561
6347b019831j9176531p789281N564009Q096518J770284m198540n646691l724273
6339b7124336O56084O462546R695671O446846j511367p512763o846865j413011
6331b1147195K678928J695944j826480k448514J275898N684037Q304982J1147973
6323E365573J5082052J5645992R602077J943391k55309J428087o66296q516894
6315C9628673j6673002k1065440k1408090j5735872k350399J1881343J5446096
6308a0276691P314718j044433j684694J508147L843114P658263J2804385J0413120
$$ plain form
6364 -57138378 -36637432 -20781446 -21581474 -28856088 -25832755 -11649573 -357454 -633488
6356 -633488 -6238671 -8330684 -7867541 -9408907 -9481800 -1289938 10875552 12634730 -2019831
6347 -2019831 -21196362 -28985643 -23421634 -15325116 -13554832 -17753372 -23400063 -27124336
6339 -27124336 -26468252 -20005706 -10310035 -3863189 -5374556 -12887319 -19734184 -21147195
6331 -21147195 -18468267 -16772323 -18598803 -21047317 -19771419 -14087382 -5782400 5365573
6323 5365573 20447625 36093617 45695694 47639085 47383776 48811863 48145567 39628673
6315 39628673 22955671 1890231 -19517859 -35253731 -37604130 -25722787 -10276691
6308 -10276691 -2961973 -4006406 -5691100 -4182953 -339839 7318424 20122809 30535929
6300C0535929m203209k0275705k3015533j1161514M528555J4598973J5525692
6293F533188P718659k710797n835901P71877Q348232J0478923J1265297J2702158
6285D9271636O553680r080056j8312444r929093J40837r218309k7985766k6705584
6277d5265099j897606J8089377J5917348O254819N185571N201057m274377j3692487
6269a4481397r850380N27205K900244j199574n78037M508306N025712K64990l268423
6260a6151354m430463n242436k401701N705497J0441991N106174j847015n15360
6252i334667J984207n590607j5001885r263885P058504J1477483j798810j3215736
6244c3685396q104957M884982J2142951J3273977J2470147Q030452K49012l483856
$$ plain form
6300 30535929 26332720 6057015 -16958518 -28120032 -23591477 -8992504 6533188
6293 6533188 14251847 11541050 5705149 6477026 14825258 25304181 36569478 49271636
6285 49271636 55825316 46745260 28432816 18503723 18644560 9426251 -18559515 -45265099
6277 -45265099 -47162705 -29073328 -13155980 -6901161 -1715590 3485467 -788910 -14481397
6269 -14481397 -24331777 -23804572 -20904328 -22103902 -22681939 -18173633 -13147921 -12882931 -16151354
6260 -16151354 -20581817 -25824253 -28225954 -22520457 -12078466 -6972292 -8819307 -9334667
6252 -9334667 -7350460 -12941067 -27942952 -37206837 -30148333 -18670850 -20469660 -33685396
6244 -33685396 -41790353 -36905371 -24762420 -11488443 981704 9012156 9261168 5777312
6236E777312m37893K035728m0020l63475M383764P217867M108622J268967J297739
6227B5248611l691046j5463193k0778524j1067174K416911N998071L112208K666957
6219a1557179J543104m929021q201271j255897M075366l639828j0198818L806444
6211c0357100K5410148K3329579j972290j5715915k337237J1718598K946795j2057244
6203I65334p025051J0129416J2235249k537279j0496888j813734O985651K224783
6195A0667481p441735p927317p2569N881427O105413N087255O835812R958392
6187B9094159R589941K385674q700739j5549656j3582955p232498l285277k235181
6179i516532j121142p82050l271242n298771k374487K456698K219747k834790
$$ plain form
6236 5777312 5339419 7375147 7335127 6971652 11355416 18573283 22681905 23950872 25248611
6227 25248611 21557565 6094372 -14684152 -25751326 -23334415 -17336344 -14224136 -11557179
6219 -11557179 -10014075 -14943096 -23144367 -24400264 -20324898 -23964726 -34163544 -30357100
6211 -30357100 -4946952 18382627 16410337 694422 -1642815 10075783 13022578 965334
6203 965334 -6059717 4069699 16304948 13767669 3270781 1457047 8442698 10667481
6195 10667481 3225746 -4701571 -4774140 1107287 7212700 12299955 19135767 29094159
6187 29094159 38684100 41069774 32369035 16819379 3236424 -3996074 -7281351 -9516532
6179 -9516532 -10637674 -11419724 -14690966 -19989737 -22364224 -19907526 -17687779 -20522569
6171b0522569n663208l051303J966372O682268R136920M507128p665563j4356687
6163b8966642j749851K1230729K8331253J1136787p316057n048259P415835M642259
6155B9676054j4518899k5754686j5324265K199979O890581j223457q214373o979624
6147c3248690j809602K149038M541675O329281P326841P467945O649907L670022
6139C076417j527806n251407l285807K982428O890325M196538k030690n961848
6131i11850o179532n378815m470500j653956K023496J614765l847141p192456
6123b5995989k415120N424411O823557K061035j32417K477118K659768k218252
6115a1315889m681145q32229J798529k049921m804090N7108L813502l425298j2590029
$$ plain form
6171 -20522569 -26185777 -29237080 -27270708 -20588440 -11451520 -6944392 -14609955 -28966642
6163 -28966642 -30716493 -9485764 18845489 29982276 22666219 17617960 25033795 29676054
6155 29676054 15157155 -10597531 -25921796 -23721817 -16831236 -18054693 -26269066 -33248690
6147 -33248690 -35058292 -32909254 -28367579 -22038298 -14711457 -7243512 -593605 3076417
6139 3076417 1548611 -3702796 -6988603 -4006175 2884150 7080688 5049998 -911850
6131 -911850 -7091382 -12470197 -16940697 -18594653 -16571157 -14956392 -18803533 -25995989
6123 -25995989 -28411109 -22986698 -16163141 -14102106 -14234523 -11757405 -9097637 -11315889
6115 -11315889 -15997034 -16829263 -15030734 -17080655 -21884745 -21827637 -18014135 -21439433 -34029462
6106c4029462p402025Q194100J4379109P022886L396897J1480876J5585682M130851
6098B2758914p744757j075965J5082251J5682718l042495j9142442j7170518o227750
6090h80044j846197n147005p350480m404802R44442N196899N577905P2665q405258
6081a6241875j1472258m384918O445579J0251332N608591K280349P600432J5132568
6073A5219800J1941553l475369j7164346j7455800j0406963r035663j1475854
6066d1852642l436821J6261145K8159333J8398503n34318p495554j043163M493502
6058A2949985L552817K434423J648629n721687j6750320j7654166m854949Q371894
6050a6023374J2065993J1538969J2023672O838843p848235j9548838j5298289
$$ plain form
6106 -34029462 -41431487 -33237387 -18858278 -11835392 -8438495 3042381 18628063 22758914
6098 22758914 15014157 13938192 29020443 44703161 41660666 22518224 5347706 -880044
6090 -880044 -2726241 -7873246 -15223726 -19628528 -18684086 -13487187 -7909282 -7836617 -16241875
6081 -16241875 -27714133 -32099051 -25653472 -15402140 -9793549 -7513200 87232 15219800
6073 15219800 27161353 23685984 6521638 -10934162 -21341125 -30376788 -41852642
6066 -41852642 -45289463 -29028318 -868985 17529518 16995200 9499646 8456483 12949985
6058 12949985 16502802 18937225 20585854 14864167 -1886153 -19540319 -24395268 -16023374
6050 -16023374 -3957381 7581588 19605260 26444103 18595868 -952970 -16251259
6043a6251259k368162J810815m696174p506882R81137J1495263J2919665O703654
6035C088057K097178L594773P141098O027499j293325q755140r391414m636197
6027b127471k385322m501832l633513L269398O915544n34817j0772723r597924
6019b3368660K288026J0704010Q561190K988414J258363J377942J95927Q84873
6011D890085O599403J3133350J3307437N259388o456803j4967188j5425591r371577
6003c031496m962801p831038j1840456n669760J0260095K1061609J5269872o26100
5995A2629925j0337170o419390L828536Q587979L446859o221440j2034312j0726713
5987a7245726n209498J487591R215341J5553387J3415629L19934j3651920j5385682
$$ plain form
6043 -16251259 -18619421 -16808606 -21504780 -29011662 -28030525 -16535262 -3615597 3088057
6035 3088057 5185235 8780008 15921106 21948605 20655280 11900140 2508726 -2127471
6027 -2127471 -4512793 -9014625 -12648138 -9378740 -2463196 -2998013 -13770736 -23368660
6019 -23368660 -21080634 -10376624 -1815434 1172980 2431343 3809285 4005212 4890085
6011 4890085 11489488 24622838 37930275 43189663 36732860 21765672 6340081 -3031496
6003 -3031496 -7994297 -15825335 -27665791 -33335551 -23075456 -2013847 13256025 12629925
5995 12629925 2292755 -4126635 -298099 8289880 11736739 5515299 -6519013 -17245726
5987 -17245726 -22455224 -20967633 -11752292 3801095 17216724 17536658 3884738 -11500944
5979a1500944m726451O846580J1852949J2086182R549736L253285l849783o014327
5971A7497227n244027r100286j4699555q492598J1010651K3817703J3296547r533900
5963A8551762j9834240j0608355K868962O547066K124410j715900j354884P89226
5955b631953M77843m125923q484399m883040N517571R792984P97619q866447l002387
5946a5408132J2298287J4814243j543525j7430263j6164792n580532k165394n868942
5938c7049050m146107N907051J3690025J2022998O086604L291094L038837R37118
5930C778570k198639j167786M723191P994523J304088j1042229j4175482O65048
5922a0118716K2674901L1003848J8452656r16557j0405963r615414r033267j2243506
$$ plain form
5979 -11500944 -16227395 -9380815 2472134 14558316 24108052 27361337 23511554 17497227
5971 17497227 12253200 3152914 -11546641 -20039239 -9028588 14789115 28085662 18551762
5963 18551762 -1282478 -11890833 -9021871 -2474805 -350395 -2066295 -3421179 -2631953
5955 -2631953 -2154110 -6280033 -14764432 -19647472 -14129901 -4336917 -3539298 -12405745 -15408132
5946 -15408132 -3109845 11704398 10160873 -7269390 -23434182 -29014714 -31180108 -37049050
5938 -37049050 -41195157 -35288106 -21598081 -9575083 -3488479 -197385 2841452 3778570
5930 3778570 1579931 412145 5135336 13129859 14433947 3391718 -10783764 -10118716
5922 -10118716 12556185 43560033 62012689 61096132 50690169 41074755 32041488 19797982
5914A9797982j3268519r379621n858645n818116m455383J477162N708078J366482
5906a0430580o687293p381326P4704M598216j0037n773918l285156L630384M114179
5897b1150827l266056r552366r188285n259025p18501N561618J1344514R841144
5889b2387784J613870j331581Q505390K0888554K0058453N738376p802107j0897339
5881A4385832o753011j773749K166377M527115L780773O41056k544360o254834
5873H175199j1399115j3437359p342362K102185N342936M039863R366830K0935051
5865A7783228K1925944L930119j6256285j7595821l477694N282709K97283p619217
5857D270266r404605q526960q010667k389660R701826J6658443P902423r924652
$$ plain form
5914 19797982 6529463 -2850158 -8708803 -14526919 -18982302 -17505140 -11797062 -10430580
5906 -10430580 -17117873 -24499199 -24424495 -19826279 -19836316 -25610234 -28895390 -25265006 -21150827
5897 -21150827 -24416883 -33969249 -43157534 -48416559 -49135060 -43573442 -32228928 -22387784
5889 -22387784 -20773914 -22105495 -13600105 7288449 27346902 33085278 25283171 14385832
5881 14385832 7632821 5859072 8025449 12552564 16333337 16974393 14430033 8175199
5873 8175199 -3223916 -16661275 -24003637 -21901452 -16558516 -12518653 -3151823 17783228
5865 17783228 39709172 43639291 27383006 9787185 6309491 11592200 11889483 4270266
5857 4270266 -5134339 -13661299 -21671966 -24061626 -14359800 2298643 10201066 276414
5849B76414k0220123j6045346m424921N881367J2030601J3143342P747777j454275
5841c065164o305972j731248O955345R628478L524403l974363n290272j618625
5833a877418P60378M16418J965999P098995R996210N336285l023572o844330n141931
5824H687034m630807q208059r773283l622129O501719J2483717J2095923Q737500
5816B2271615L784351l963565j1805443j3408495p791781k121215j840476k805562
5808a7680571J598836Q778952R069502n93310j1246119j2502511m351320M958514
5800b1968027R931340J2136587J3905812J2553239M187069q418115j6012470j2719355
5792f403920l232098K744296J986650l1340J723978N122413N095424L90923o681991
$$ plain form
5849 276414 -19943709 -35989055 -40413976 -34532609 -22502008 -9358666 -1610889 -3065164
5841 -3065164 -9371136 -11102384 -4147039 5481439 9005842 5031479 -258793 -1877418
5833 -1877418 -1117040 -700622 1265377 8364372 18360582 23696867 20673295 13828965 8687034
5824 8687034 4056227 -4151832 -13925115 -17547244 -11045525 1438192 13534115 22271615
5816 22271615 26055966 22092401 10286958 -3121537 -10913318 -13034533 -14875009 -17680571
5808 -17680571 -16081735 -7302783 1766719 1173409 -10072710 -22575221 -26926541 -21968027
5800 -21968027 -12036687 99900 14005712 26558951 30746020 22327905 6315435 -6403920
5792 -6403920 -9636018 -6891722 -4905072 -4936412 -3212434 1909979 7005403 7396326 714335
5783G14335j3228710j4983277p246866P644307J7590304J2965140l83158q084231
5775e012156n803784k149579l618926o947049q024489p680415n182953K976188
5767d1443163J2626024J1759636j336077j0663322l455652J1027008J5661113
5760e824433R984876O332558P837801O481909P4258n034300p728079j3156165
5752a031575j9058597j6289250n470056J564168M49264l7602M711730P135485
5744b8026433K999856J69229L721184O011930J105106l624776p92071M156871
5736a4279104M844963O870295J5422911K0744582J1587019m726969j1500989n945867
5728B3016841J847540P186395J1546489J0231711j879931j4237860r857529P734680
$$ plain form
5783 714335 -12514375 -27497652 -34744518 -27100211 -9509907 3455233 3072075 -5012156
5775 -5012156 -10815940 -12965519 -16584445 -23531494 -31555983 -39236398 -44419351 -41443163
5767 -41443163 -28817139 -17057503 -18393580 -29056902 -32512554 -21485546 -5824433
5760 -5824433 4160443 10493001 18330802 24812711 24886969 19852669 12124590 -1031575
5752 -1031575 -20090172 -36379422 -41849478 -40285310 -39836046 -39873648 -35161918 -28026433
5744 -28026433 -25026577 -24857348 -21136164 -15124234 -14019128 -17643904 -18435975 -14279104
5736 -14279104 -9434141 -2563846 12859065 33603647 45190666 40463697 28962708 23016841
5728 23016841 24864381 32050776 43597265 53828976 51949045 37711185 27853656 35588336
5720C5588336J5534464L433398j1957962j2762269l146596K335897L35788l004324
5712B6356732n812521j0311977j3962250j1112850j695793Q264549J3181555J1127222
5704A6034667L527200m984062r192118p859904l016319M493693J3224649J6383847
5696B8611653P938519n883278j1530836o857934l562996p084273p345144K548677
5688c165612J1282080N438127q682804j3764161o655604l95003l044113q045074
5680b7032164o765063M18090P869437J1051057P496750j101476o950924l859052
5672a8873345K675713J592134o473599q062006L257855J5697645J4844580L142349
5664G801326m826595k229875L874682M944778J085087k480000k267691K701314
$$ plain form
5720 35588336 51122800 54556198 42598236 29835967 26689371 29025268 29361056 26356732
5712 26356732 20544211 10232234 -3730016 -14842866 -16538659 -8274110 4907445 16034667
5704 16034667 19561867 14577805 5385687 -2474217 -5490536 -996843 12227806 28611653
5696 28611653 36550172 30666894 19136058 12278124 8715128 1630855 -5714289 -3165612
5688 -3165612 8116468 13554595 4871791 -8892370 -15547974 -15942977 -18987090 -27032164
5680 -27032164 -33797227 -33379137 -25509700 -14458643 -6961893 -8063369 -15014293 -18873345
5672 -18873345 -16197632 -14605498 -21079097 -29141103 -25883248 -10185603 4658977 7801326
5664 7801326 2974731 744856 4619538 9564316 10649403 8169403 5901712 8603026
5656H603026J1315661J7748006J3337660k959233j8699908j9720720p772117R57615
5648B809990k928519j0230069q058342P47318K799366m878964j0644914n871601
5640c6255735L763603Q350686O444775K896689J331690L844155J1137842J7364306
5632A8878011J2198450m779077j8807746j7751735q651243o044725r963763r357913
5624d4279741l639999l563054r132701m903766J4533733K9855670K1221908k566969
5616b474919j4171876k546397J6575961K4146604J8323018Q772785J946474j808967
5608D8762683l612015m865342p197420r854673j0308394r189230r647172r999139
5600a5910702m174616O594314J0880874L134657n153095r69619R616201J0215389
$$ plain form
5656 8603026 19918687 37666693 51004353 48045120 29345212 9624492 1852375 2809990
5648 2809990 -118529 -10348598 -18406940 -17659622 -14860256 -19739220 -30384134 -36255735
5640 -36255735 -32492132 -24141446 -17696671 -14799982 -13468292 -9624137 1513705 18878011
5632 18878011 31076461 26297384 7489638 -10262097 -18913340 -24958065 -34921828 -44279741
5624 -44279741 -47919740 -51482794 -60615495 -65519261 -50985528 -21129858 92050 -2474919
5616 -2474919 -16646795 -19193192 -2617231 21529373 39852391 48625176 50571650 48762683
5608 48762683 45150668 40285326 33087906 23233233 12924839 3735609 -5911563 -15910702
5600 -15910702 -20085318 -13491004 -2610130 524527 -4628568 -5598187 4018014 14233403
5592A4233403L54787l834432L228826O932458k475523j2315949q172101J629436
5584d19095k94347j1320572j3496127l504723K949444j517413m177591N345463
5576b6434961J7821687K0148240J5157851J3145875J2940130N332554r001527
5569D9109849j7931024j4322836m825509m76049m425656j0913659j3149361j0367536
5561b7301781p155278n915358k649793O198461J5598842J7476887J2822045R419563
5553A8493588P967491J680880q366160j0398544O6760J1412517J2434952O361977
5545C9653461K42911p348398j6999698j8834587o702978P314212Q385424J431861
5537G142208J223489O320520K696829r166108j1970097P63033J3625369J2075162
$$ plain form
5592 14233403 14588190 10753758 13982584 20915042 18439519 6123570 -2048531 -419095
5584 -419095 -713442 -12034014 -25530141 -29034864 -26085420 -27602833 -31780424 -26434961
5576 -26434961 -8613274 11534966 26692817 39838692 52778822 58111376 49109849
5569 49109849 31178825 16855989 12030480 11554431 7128775 -3784884 -16934245 -27301781
5561 -27301781 -34457059 -40372417 -43022210 -36823749 -21224907 -3748020 9074025 18493588
5553 18493588 26461079 28141959 19775799 9377255 9444015 20856532 33291484 39653461
5545 39653461 39896372 32547974 15548276 -3286311 -9989289 -2675077 5710347 7142208
5537 7142208 8365697 14686217 17383046 8216938 -3753159 -2990126 10635243 22710405
5529B2710405Q68494p187935p927044m322838L59415J249093o080106j6139062
5521a6469578j6017469l250508Q854727R829530N217420L703415K376191m379367
5513a0135639j0280247m763330Q964221J5809658Q389450m451938r755975m617096
5505a0840896L296370N441482R82501l508249k744214P70747J768207O33121K72169
5496c928762k659014j2743880k1994666j4729850Q521340K5147804J8035110j455424
5488e807342r807407k523266M966410L046680p40427K805776J0534661J3456530
5480A5931615R260627K998569l88344p6553J931804L182761K260362q22716n003838
5471B9274287q237373q015336m025020J73818J034317o1486L46800R86106k469848
$$ plain form
5529 22710405 23578899 16390964 8463920 4141082 4500497 5749590 -330516 -16469578
5521 -16469578 -32487047 -35737555 -26882828 -17053298 -11835878 -8132463 -5756272 -10135639
5513 -10135639 -20415886 -25179216 -16214995 -405337 7984113 3532175 -6223800 -10840896
5505 -10840896 -7544526 -2103044 -1120543 -4628792 -7373006 -6602259 -4834052 -4200931 -3928762
5496 -3928762 -6587776 -19331656 -41326322 -56056172 -47534832 -22387028 -4351918 -5807342
5488 -5807342 -15614749 -18138015 -13171605 -10124925 -10865352 -8059576 2475085 15931615
5480 15931615 25192242 28190811 27802467 27725914 29657718 32840479 35100841 34278125 29274287
5471 29274287 21036914 13021578 8996558 9170376 10204693 10143207 10490007 11476113 9006265
5462I006265q955063j1793258p869573n34276P098510J3836606J4935788N487567
5454B1212566p918450j0494085M17000R657370N905403k681491l944158j384549
5446A0769606n289465j2789325j1835847q49426R299305J1079615O767061R28632
5438H080156l445195l328587O07125J431488m219664q289959l139811M342397
5430g962050K676806n115899o432269M08928N660834N982715O823675P588573
5422I631313J087428j0652734j6136278j2552050q529409o292549J531193J2880722
5414b9032364J2924603j913331j4158842j0390650l31778J456006k069231j162467
5406d4678054R60571l263561p264261L94983J3938273J6376891N486754l692899
$$ plain form
5462 9006265 51202 -11742056 -19611629 -20145905 -13047395 789211 15724999 21212566
5454 21212566 13294116 2800031 3217031 12874401 18779804 16098313 12154155 10769606
5446 10769606 5480141 -7309184 -19145031 -19994457 -10695152 384463 7151524 8080156
5438 8080156 4634961 1306374 1913499 3344987 -874677 -9164636 -12304447 -7962050
5430 -7962050 -5285244 -10401143 -16833412 -16424484 -10763650 -4780935 2042740 9631313
5422 9631313 10718741 66007 -16070271 -28622321 -37151730 -43444279 -41913086 -29032364
5414 -29032364 -16107761 -18021092 -32179934 -42570584 -42902362 -41446356 -43515587 -44678054
5406 -44678054 -43717483 -46981044 -54245305 -53850322 -39912049 -23535158 -18048404 -21741303
5398b1741303k755922Q0320k846501o040754j814929O643698J0304992O098582
5390a2071817j572745o688757n451134J936431J0554865J4428541J2094377O465327
5382A9695088J84267n373684q027857o570673l720912k538616j307355K369487
5374e290255M137229k526482j3951803j7145037o272050Q858237J5347885J2365210
5366d477066P979684N431995N48040p695079j1796169n191859O606623J0306496
5358A712665J120729j0284525j1206768l704161p33074o103640q051980K571033
5350c4679721J6693947J8747929Q241879j539639l527346k987943l485733m11610
5342b948237P025553J0035154M275722j193318R90565K225661p724443j9321096
$$ plain form
5398 -21741303 -24497225 -24416905 -27263406 -33304160 -35119089 -28475391 -18170399 -12071817
5390 -12071817 -13644562 -20333319 -25784453 -23848022 -13293157 1135384 13229761 19695088
5382 19695088 19879355 14505671 6477814 -92859 -3813771 -6352387 -7659742 -5290255
5374 -5290255 -1153026 -3679508 -17631311 -34776348 -41048398 -32190161 -16842276 -4477066
5366 -4477066 3502618 8934613 9482653 1787574 -10008595 -15200454 -8593831 1712665
5358 1712665 2833394 -7451131 -18657899 -22362060 -23095134 -29198774 -37250754 -34679721
5350 -34679721 -17985774 762155 9004034 7464395 3937049 949106 -2536627 -2948237
5342 -2948237 4077316 14112470 18388192 17194874 18185439 20411100 12686657 -6634439
5334f634439j3452645Q540107K2950043J5549119j037777r045882r207444j1068644
5326c407562j2781612o734358K528552L477281k759898m933331k679249o843790
5318c4133967j6625345j5802581N24111J3356029O548650q311788r528642K758416
5310f1215117J0123085N315852m55700J344124N281196M549446Q85050k278492
5302c6450556n195284o210948q91620Q938611J4306408J1428463O646511N378438
5294b049977N004195L118086L507721P575115Q063551p41228j2456123j6047969
5286d026629r769084q71665M969071P034976M865650k583377j2577480j7988796
5278c0947334j2861446J835480J7479694K3822157J8459850R146073L140868k526945
$$ plain form
5334 -6634439 -20087084 -11546977 11403066 26952185 25914408 16868526 7661082 -3407562
5326 -3407562 -16189174 -22923532 -20394980 -16917699 -19677597 -24610928 -27290177 -34133967
5318 -34133967 -50759312 -66561893 -66037782 -52681753 -46133103 -54444891 -63973533 -61215117
5310 -61215117 -51092032 -45776180 -46231880 -44887756 -39606560 -35057114 -34172064 -36450556
5302 -36450556 -41645840 -47856788 -48748408 -39809797 -25503389 -14074926 -7428415 -2049977
5294 -2049977 2954218 6072304 9580025 17155140 25218691 24477463 12021340 -4026629
5286 -4026629 -13795713 -14667378 -9698307 -2663331 2202319 -381058 -12958538 -30947334
5278 -30947334 -43808780 -41973300 -24493606 -671449 17788401 26934474 30075342 27548397
5270B7548397j2873216k0234457j0674830J2442789K5211959J2067839j2435638
5263B1052843k1737366j0254507L805837N084007k089789m773521P38204P125310
5255a048982P297465K521072m56308J930143O298567P737761O229510M792637
5247C5301865L934251K409710P97804j186074p215200j6570413j8580890o226512
5239g335459Q639357Q715899k098144m062068N402854O457225q619251j9369364
5231a2268951r290757P579736J0831981N835409R130174J6533925J1845145k061144
5223C8135518p733724m094263o547576j6926485j8791355n993431P044272R299842
5215e607202P176499P714835O040366k005043r687797j0099986n336998O71699
$$ plain form
5270 27548397 14675181 -5559276 -16234106 -3791317 21420642 33488481 21052843
5263 21052843 -684523 -10939030 -7133193 -2049186 -4138975 -8912496 -8174292 -1048982
5255 -1048982 6248483 8769555 8313247 10243390 16541957 24279718 30509228 35301865
5247 35301865 39236116 41645826 42443630 41257556 34042356 17471943 -1108947 -7335459
5239 -7335459 1303898 10019797 7921653 3859585 9262439 15719664 7100413 -12268951
5231 -12268951 -21559708 -13979972 -3147991 2687418 11817592 28351517 40196662 38135518
5223 38135518 30401794 26307531 19759955 2833470 -15957885 -21951316 -14907044 -5607202
5215 -5607202 1569297 9284132 15324498 13319455 3631658 -6468328 -11805326 -11133627
5207a1133627P253858J1152652P561943J73213j901846Q25632o12845o706918
5199F612062r147114q075288j1276647j4279663k983517J8429812K5619617R964744
5191A4864006o582361n544422J919066k61760m425066K382849R994740J800706
5183A4147758j3170152j3030341r0414L383120o515836r641727L078119J5338156
5175f501317J3872088Q221452J0652252J4830541Q763640l953401j0634722r407772
5167B5842761q754331j0853335q236579J777351R308572M200172q393269j1947964
5159g056622M27544J5058055J4047484q90451j0775766n793878K735648J772274
5151I524288m589184n635944k841570m242066o919468j118635J0650742J4527199
$$ plain form
5207 -11133627 -3879769 7272883 14834826 15008039 13106193 13931825 13318980 6612062
5199 6612062 -2535052 -10610340 -21886987 -36166650 -39150167 -20720355 4899262 14864006
5191 14864006 8281645 2737223 4656289 4394529 -30537 2352312 12347052 14147758
5183 14147758 977606 -12052735 -12143149 -8760029 -15275865 -24917592 -21839473 -6501317
5175 -6501317 7370771 15592223 26244475 41075016 49838656 45885255 35250533 25842761
5167 25842761 17088430 6235095 -2001484 -224133 9084439 13284611 4891342 -7056622
5159 -7056622 -6629078 8428977 22476461 21586010 10810244 5016366 7752014 9524288
5151 9524288 4935104 -700840 -3542410 -7784476 -14703944 -15822579 -5171837 9355362
5143I355362O490089j721357j433515R89084l293643j1440162j4419932r582996
5135b5057070j430115N079808O993184L597097j395287j783883L002035N264983
5127e729248j343297j2238022j6340318r242028J735601O629829M868639N361797
5119b6297047J3537088K1661483J7385414J023469j3343390j6201361j3398141
5112a5632485j3376927j2856485m959613N426426P497045K798308L714796J2656373
5104a4732562J6124691M679443j1735743j6060293n335307P778309J1433184O070111
5096a778167L0698j456354o04811j418276k797871r14276K394937K45656p439095
5087a3737559j0193746j729875Q169549O143767m763420r332994k845938L246825
$$ plain form
5143 9355362 15845451 14124094 12690579 13679663 10386020 -1054142 -15474074 -25057070
5135 -25057070 -26487185 -21407377 -14414193 -10817096 -12212383 -13996266 -10994231 -5729248
5127 -5729248 -7072545 -19310567 -35650885 -44892913 -43157312 -36527483 -31658844 -26297047
5119 -26297047 -12759959 8901524 26286938 27310407 13967017 -2234344 -15632485
5112 -15632485 -29009412 -41865897 -46825510 -41399084 -33902039 -31103731 -27388935 -14732562
5104 -14732562 1392129 6071572 -5664171 -21724464 -27059771 -19281462 -7848278 -1778167
5096 -1778167 -1747469 -3203823 -3808634 -5226910 -8024781 -8939057 -6544120 -6298464 -13737559
5087 -13737559 -23931305 -25661180 -17491631 -11347864 -16111284 -25444278 -28290216 -25043391
5079b5043391L81302m656514k159058N130102P286508K490203j199240J967888
5071a5802200P663299P440931l32033q026489p969548k233161L49007l489717
5063b2399911p896353q276234p713637q572843n819018L544327J1388501Q862901
5055c6882267J003496L80448R525879J9662154K3314370J8000270K284478j9059473
5047A8229355l0129028j9264854K411001J2839371P887707K181443K769883J963931
5039a111191j855217J426695J1710121J2643861j632262j3387896q518064J145114
5031D21161r12984q213602m357408Q091671J2699571N931240j021514k961404
5023I676731m798153p189921n265862j088589j726069m807261r21915Q689566
$$ plain form
5079 -25043391 -24662089 -29318603 -31477661 -26347559 -19061051 -16570848 -17770088 -15802200
5071 -15802200 -8138901 -697970 -1030003 -9056492 -17026040 -19259201 -18910194 -22399911
5063 -22399911 -30296264 -38572498 -46286135 -54858978 -60677996 -57133669 -45745168 -36882267
5055 -36882267 -35878771 -35498323 -25972444 -6310290 17004080 35004350 37288828 18229355
5047 18229355 -11899673 -31164527 -28753526 -15914155 -8026448 -5845005 -3075122 -1111191
5039 -1111191 -2966408 -1539713 10170408 22814269 21182007 7794111 -723953 421161
5031 421161 -491823 -8705425 -13062833 -4971162 7728409 13659649 12638135 9676731
5023 9676731 4878578 -2311343 -7577205 -8665794 -10391863 -15199124 -16121039 -7431473
5015g431473J1338525J974781j0205812j6813286j8946095j7426526p727628Q883756
5007e6353758K0076038J6585433M734257k032243R09477P468200J0862190J0351463
4999A2601057R631197J1232740J2090873O133003n954898j3249126p619710K595366
4991B7460502J670925j1082532j9110291j1566239K559148Q889650O414290L667584
4983H903037L761578L124393R13834k1645N5785j600004l423439j216699L166078
4974A3662918K808790k802171n224029N9156N376173K089501n043674l571872
4966G354792Q203180J7839066J5695966O732440P40966j703768n777986r881996
4958C9202660o937433K192770O568984k4930r661256j0929232l777250K614792
$$ plain form
5015 -7431473 3907052 5881833 -4323979 -21137265 -40083360 -57509886 -65237514 -56353758
5007 -56353758 -36277720 -19692287 -14958030 -16990273 -16080796 -8612596 2249594 12601057
4999 12601057 22232254 33464994 45555867 51688870 45733972 32484846 24865136 27460502
4991 27460502 29131427 18048895 -1061396 -12627635 -10068487 -1178837 5235453 8903037
4983 8903037 12664615 15789008 16702842 16681197 16736982 15136978 11713539 10496840 13662918
4974 13662918 16471708 13669537 8445508 8504664 13880837 15970338 10926664 7354792
4966 7354792 15557972 33397038 49093004 55825444 56566410 54862642 49084656 39202660
4958 39202660 32265227 34457997 41026981 41002051 31340795 20411563 16634313 19249105
4950A9249105L830510M842392R983957J4395035R758056l479526j4364597j3527218
4942C0687714l964419L407948K978560j371268m299266m847730l228018J105094
4934B0468615N280564M220692o2307J333509R327343J2056892L225548n546418
4926E0304438l017731J300494q039194k4669161k7749955j3973746j034097J241349
4918b5637603J745588O711357Q937196N099745M006911R156680J1340381P233749
4910B8594004O895852J3314344J3715038K489083o756391n122394m394986j3520245
4902C5214305j9289977r725605K024864m15279p258816j18307J4232728J4719264
4894B9383177J837226m404744J898672O018562j202224j1673983j4882127q287646
$$ plain form
4950 19249105 23079615 27922007 37905964 52300999 62059055 58579529 44214932 30687714
4942 30687714 26723295 30131243 33109803 31738535 27439269 22591539 19363521 20468615
4934 20468615 25749179 29969871 29907564 31241073 40568416 52625308 55850856 50304438
4926 50304438 47286707 48587201 40548007 15878846 -11871109 -25844855 -26878952 -25637603
4918 -25637603 -23892015 -17180658 -8243462 -3143717 863194 10019874 21360255 28594004
4910 28594004 35489856 48804200 62519238 65008321 58251930 53129536 48734550 35214305
4902 35214305 15924328 6198723 8223587 7808308 549492 431185 14663913 29383177
4894 29383177 31220403 26815659 28714331 34732893 33530669 21856686 6974559 -1313087
4886a313087N064551J6579662J5936579O095590L060574R706278Q997664k083093
4878F2044718M50615K3176284L2280283J2405235J0531993O2099043J03346108
4871C06334279L9516073j03736852j85608078j29570033j7633804L3389770J6414541
4864d0894104j464515K417719j443373j7632220j6802754M780430J7404971J0035274
4856d3598572K383696L852968K190441m918805m234137M360719O439559J875236
4848c1648895M603764J3442374J3231427M775553L366350P816690K346226r941439
4840G992050q215883Q033697J4682412K768141q740179p495117m239673n576596
4832g91148j104583J0360947J1477772k355443j0488639j808122N041258n300833
$$ plain form
4886 -1313087 3751464 20331126 36267705 42363295 45423869 55130147 64127811 62044718
4878 62044718 62495333 85671617 117951900 130357135 140889128 202988171 306334279
4871 306334279 345850352 242113500 56505422 -73064611 -90698415 -57308645 -40894104
4864 -40894104 -42358619 -39940900 -41384273 -59016493 -75819247 -71038817 -53633846 -43598572
4856 -43598572 -41214876 -37361908 -35171467 -40090272 -44324409 -39963690 -33524131 -31648895
4848 -31648895 -27045131 -13602757 -371330 4404223 7770573 15587263 17933489 7992050
4840 7992050 -223833 7809864 22492276 25260417 16520238 9025121 4785448 -791148
4832 -791148 -1895731 8465216 19942988 17587545 7098906 5290784 10332042 5031209
4824E031209j7255835j1310471L709548Q749675N793537O669088O990455k770514
4816E606692j2592650n858620J0640007J4742657K930459o667454l804762K343441
4808G339770K267173j456612l762435m587453l856475m22205K502094P37920k198161
4799c436384M26989O479629P451244J815228m372045q627235j2467509j1864912
4791b4594995n13991J5560380J9651505N778335j1709136j6051720p694360N60497
4783a9013485J791437N38660K721315P012172P561739K053820m912175o535612
4775h782129j564573L753379K478391n076461j1431120r373555J448477J4201360
4767a4346231K0203784J5938673N922246k106921m863727n039579n972447p696895
$$ plain form
4824 5031209 -12224626 -23535097 -19825549 -11075874 -5282337 1386751 8377206 5606692
4816 5606692 -6985958 -12844578 -2204571 12538086 15468545 8801091 4996329 7339770
4808 7339770 9606943 8150331 4387896 -199557 -4056032 -4478237 -1976143 -1238223 -3436384
4799 -3436384 -3009395 3470234 10921478 12736706 8364661 -262574 -12730083 -24594995
4791 -24594995 -25108986 -9548606 10102899 15881234 4172098 -11879622 -19573982 -19013485
4783 -19013485 -17222048 -16683388 -13962073 -6949901 611838 2665658 -2246517 -8782129
4775 -8782129 -10346702 -6593323 -4114932 -9191393 -20622513 -29996068 -28547591 -14346231
4767 -14346231 5857553 21796226 27718472 25611551 20747824 15708245 9735798 2038903
4759B038903q313682o310125j336661M594123P274539M962453J643250J503605
4751F056405K197612n59081m062254k563728J264663p31697p322743q095044j501535
4742a5317402O81872o460394r691625K446823J9058940K0427641O040604n395513
4734A1790946j915769Q683074J2529300N917405m261144q816126l449928O731734
4726B7209492R940813L23926j3302099j7328075j0362234l228294k906022m633448
4718a4285941j300970O421405J2212630J1767120O093677M1925j689900P30483
4710A9990429K357507L87113j817135j159813j413118p477012j5884968j7977909
4702b2994906j1121162l54240R369442J5469279J4205733L986205p551846r045005
$$ plain form
4759 2038903 -6274779 -12584904 -13921565 -9327442 -2052903 2909550 4552800 6056405
4751 6056405 8254017 7694936 3632682 1068954 2333617 1601920 -5720823 -13815867 -15317402
4742 -15317402 -14635530 -21095924 -30787549 -28340726 -9281786 11145855 17186459 11790946
4734 11790946 9875177 18558251 31087551 37004956 32743812 23927686 20477758 27209492
4726 27209492 37150305 37474231 24172132 6844057 -3518177 -6746471 -9652493 -14285941
4718 -14285941 -15586911 -9165506 3047124 14814244 20907921 20949846 19259946 19990429
4710 19990429 22347936 22735049 20917914 19758101 18344983 10867971 -5016997 -22994906
4702 -22994906 -34116068 -34470308 -25100866 -9631587 4574146 8560351 1008505 -8036500
4694h036500l48881O099873J990603o216977p465436n26688O762141Q153255M131660
4685D543050o17973j305419L057984P626193O319013j81471m761583l649876j263485
4676I766433k960966p587125j0319223q786015l289363M612539J0188579P252778
4668a122363k914744q687934j050123J2992615J7408037P110802o355293j0506482
4660F874515o429966l846768o638525q847053l903725O270491J2370923P011955
4652B861847o687619j5923468j0026614P313951K0293581J7576624M013997o941403
4644A2480896r094158o625676l837317L75410O548215J0471045Q944189M743973
4636B4006577K075309J444605K351418N644619Q897067N803818l493469q058826
$$ plain form
4694 -8036500 -8385381 -2285508 -294905 -6511882 -13977318 -14504006 -7741865 411390 4543050
4685 4543050 3925077 2619658 5677642 13303835 19622848 19441377 14679794 11029918 9766433
4676 9766433 6805467 -781658 -11100881 -19886896 -23176259 -18563720 -8375141 -1122363
4668 -1122363 -4037107 -12725041 -13775164 -782549 16625488 23736290 17380997 6874515
4660 6874515 444549 -3402219 -10040744 -18887797 -22791522 -16521031 -4150108 2861847
4652 2861847 -3825772 -19749240 -29775854 -22461903 -2168322 15408302 19422299 12480896
4644 12480896 3386738 -3238938 -7076255 -6700845 -152630 10318415 19262604 24006577
4636 24006577 26081886 27526491 29877909 35522528 44419595 50223413 46729944 38671118
4628C8671118r45186P608844L351507r734221j4404176o189057J145813j338412
4620A8166230n126585j130541N252787N418999J886465N62703j078323o304183
4612A7647552q573727j892590N385053J422718r248071j1423381k143938O552057
4604b274327O914892L318772N3886m750145j0129515r878901l335811K251367
4596a7829782L882808O436209J0120927O457196o323422j5086727q789030M534226
4588a6597595Q497813P57379o164967l856825K699846N522877M628152N021266
4580E07946P805155R095139O930090N287629Q183839J1155559M742091j0348941
4572D3358507j8482476q044030R521175J2070050k804240j4609457j0654719l287211
$$ plain form
4628 38671118 37725932 45334776 48686283 38952062 24547886 18358829 19504642 18166230
4620 18166230 13039645 11909104 17161891 22580890 24467355 25030058 23951735 17647552
4612 17647552 9073825 7181235 12566288 13989006 4740935 -6682446 -8826384 -2274327
4604 -2274327 4640565 7959337 8013223 3263078 -6866437 -16745338 -20081149 -17829782
4596 -17829782 -13946974 -7510765 2610162 9067358 2743936 -12342791 -21131821 -16597595
4588 -16597595 -8099782 -7342403 -13507370 -17364195 -14664349 -9141472 -4513320 507946
4580 507946 8313101 17408240 24338330 29625959 37809798 48965357 53707448 43358507
4572 43358507 24876031 16832001 26353176 38423226 35618986 21009529 10354810 7067599
4564G067599o706058j2206802l507963J3354172J6527663K101638r615989n020422
4556A993838M723384M700200j356745k240217o9204m227843j2169454j2711086
4548b1357127n297392l21449o30746J963106R573602J2938138Q478749O148419
4540A1495300J2011935J6277156R674077r9557k110851k267899j2413210k5925752
4532F641199k4161152o059627Q352766P105096Q55454K588109R406335J2737206
4524A7465386J1912820P943442l007074j8996780k6670907j7998293l304825L220988
4516b9435243J897742R57697J623572J621275L901354R181632R396644J864965
4508A009638p27190R960950J9556700J1573106l729242m151325P880599R593884
$$ plain form
4564 7067599 361541 -11845261 -15353224 -1999052 14528611 16630249 7014260 1993838
4556 1993838 6717222 11417422 10060677 7820460 7751256 3523413 -8646041 -21357127
4548 -21357127 -26654519 -26975968 -27606714 -25643608 -16070006 -3131868 5346881 11495300
4540 11495300 23507235 39784391 49458468 49358911 47248060 44980161 32566951 6641199
4532 6641199 -17519953 -23579580 -15226814 -8121718 -7266264 -4678155 4728180 17465386
4524 17465386 29378206 37321648 34314574 15317794 -11353113 -29351406 -32656231 -29435243
4516 -29435243 -27537501 -26579804 -24956232 -23334957 -19433603 -10251971 -855327 1009638
4508 1009638 282448 10243398 29800098 41373204 37643962 33492637 41373236 50967120
4500E0967120m046011j3896188j0271017o059256j0055630j2576766p107329l067235
4492a6112312n465988l124177R584481J8511551J1605564k045709r115544j1412515
4484g574649j3901263j0482688J358629P836212K7549o648436M537553K1417808
4476c429285J9615433R51439r933873l509995M583719J873111m985140o707809
4468a542400n131109m608266m246245l892457n957085p683629k620215P508621
4460b8172785J2895861R707448M030197M71444k890829o759590p808737n119543
4452b3646534p73202N432404J2480048J2039692j331109j5655439j2752018M965460
4444a9240698J5214428O878669o314866r245826n645025m808632l171257O551981
$$ plain form
4500 50967120 46921109 33024921 22753904 16694648 6639018 -5937748 -13045077 -16112312
4492 -16112312 -21578300 -24702477 -15117996 3393555 14999119 12953410 3837866 -7574649
4484 -7574649 -21475912 -31958600 -30599971 -22763759 -22736210 -29384646 -24847093 -3429285
4476 -3429285 16186148 17137587 7203714 3693719 8277438 10150549 5165409 -1542400
4468 -1542400 -6673509 -11281775 -15528020 -19420477 -25377562 -33061191 -35681406 -28172785
4460 -28172785 -15276924 -5569476 -1539279 -1067835 -3958664 -10718254 -18526991 -23646534
4452 -23646534 -24419736 -18987332 -6507284 5532408 4201299 -11454140 -24206158 -19240698
4444 -19240698 -4026270 2852399 -3462467 -12708293 -18353318 -23161950 -26333207 -19781226
4436a9781226J7842058J7313880M755425o341595o470252J183716Q193046Q945278
4428B5640330K221601q370553j5566283j4680544q235742j911580J370071P89810
4420a8742890m136367r964744q442013M180660J9157375K2888403J2121713l200534
4412A3861603j1792100j1306767o825626l464655k307168j645656l99567L06691
4404b3573245n66250r77444K434879R033813J3278972J0890310M237281k33727
4396A4524589Q48882M495880N025011M96050m796213m976488L97020N813415O602794
4387B8430940L351626j341068o185587q816066n259355L343271P922615J958985
4379B3405361q150261j0320307k701317M823554M433508j270878n052004l236572
$$ plain form
4436 -19781226 -1939168 15374712 20130137 13788542 7318290 8502006 16695052 25640330
4428 25640330 27861931 19491378 3925095 -10755449 -18991191 -20902771 -19532700 -18742890
4420 -18742890 -22879257 -32844001 -41286014 -37105354 -17947979 4940424 17062137 13861603
4412 13861603 2069503 -9237264 -16062890 -19527545 -21834713 -23480369 -23879936 -23573245
4404 -23573245 -24139495 -25116939 -22682060 -13648247 -369275 10521035 14758316 14524589
4396 14524589 15373471 19869351 24894362 25390412 20594199 15617711 16014731 21828146 28430940
4387 28430940 31782566 30441498 24255911 15439845 10180490 13523761 21446376 23405361
4379 23405361 15255100 4934793 2233476 7057030 11490538 10219660 5167656 1931084
4371A931084K391779O220714K905196n852171j0781750o393440O64245J337717
4363g576626k020763q86547L928502L585197l322290q679600q347510n766414
4355b9086051j672769O578201J3837824R928788k429622p300849N77805O194739
4347c371934k637752j6081564j7351853n981212N754847J0515782Q509490J059542
4339a9584654o381147k792126J3768699K6859718K0623407K250879q782632q537409
4331A7424735r056755j4064929j3254633l127917M488901J815926j685800M551788
4323a2908684J3697682J1169582k790029j1964281n534989P720296R774893n405986
4315C758484k3849402k5299795m692743K1317500L0759465J8583503O32958m264486
$$ plain form
4371 1931084 4322863 10543577 13448773 7596602 -3185148 -9578588 -8914343 -7576626
4363 -7576626 -9597389 -10483936 -6555434 -2970237 -6292527 -14972127 -23319637 -29086051
4355 -29086051 -30758820 -24180619 -10342795 -414007 -2843629 -10144478 -9566673 -3371934
4347 -3371934 -6009686 -22091250 -39443103 -45424315 -39669468 -29153686 -20644196 -19584654
4339 -19584654 -25965801 -28757927 -14989228 11870490 32493897 34744776 25962144 17424735
4331 17424735 8367980 -5696949 -18951582 -22079499 -17590598 -15774672 -17460472 -12908684
4323 -12908684 788998 11958580 9168551 -2795730 -8330719 -610423 9164470 3758484
4315 3758484 -20090918 -45390713 -50083456 -28765956 1993509 20577012 21209970 16945484
4307A6945484O033425J6163167J1295693n640284j7245771j2799915j292100J848012
4299A5307711l571574m434749L146298P049753k03700p640576k982096P034551
4291A3705618O897965m085800j2912574j3449682j0848348p134698J663963J2182227
4283a3981329J2898408J986916p054952m578529J791494J272773k720469l73775
4275a0759463O397169O426206k224555q084849k723287P283292R218946J28887
4267E662346j0756848j3480485p310416Q55033N005971M884835L625923L600060
4259g913581N261258P174248N496872l279281j5815611k1291128j2599927L210279
4251c9756871J1632669P865337J089011M01570L519986L504567O72630J028399
$$ plain form
4307 16945484 22978909 39142076 50437769 44797485 27551714 14751799 13459699 15307711
4299 15307711 11736137 7301388 10447686 17497439 17293739 9653163 6671067 13705618
4291 13705618 20603583 16517783 3605209 -9844473 -20692821 -27827519 -26163556 -13981329
4283 -13981329 -1082921 903995 -6150957 -10729486 -8937992 -7665219 -10385688 -10759463
4275 -10759463 -4362294 2063912 -160643 -8245492 -10968779 -3685487 5533459 5662346
4267 5662346 -5094502 -18574987 -25885403 -25030370 -20024399 -15139564 -11513641 -7913581
4259 -7913581 -2652323 4521925 10018797 6739516 -9076095 -30367223 -42967150 -39756871
4251 -39756871 -28124202 -20258865 -19169854 -18768284 -15248298 -11743731 -11071101 -10042702
4243a0042702N726966R396478Q996838P876473Q830872Q436276K482614o139206
4235C5564609j0228722q387224p420351j2965583k1111267k2081716j1057470
4228e7687724O163155J7427232J4275381M32053r506530m037091J1206200J8470923
4220c256401R506448m336663q624020n103102n357571j0680901j0748822j286305
4212c9887337R321455J3091979J1300832P263760O47631o572857p980712k297200
4204a5112449K554975M82572m268995m456666N11819O368657R320605O658145
4196B058663j016650o252147k235990M580406Q56489j1958391j6663723o424294
4188c7055637M498473N341480O654310J8677711K7648932J4373148j2995748k6473557
$$ plain form
4243 -10042702 -4315736 5080742 14077580 21954053 30784925 39221201 41703815 35564609
4235 35564609 25335887 16948663 9528312 -3437271 -24548538 -46630254 -57687724
4228 -57687724 -51524569 -34097337 -19821956 -19389903 -28896433 -32933524 -21727324 -3256401
4220 -3256401 6250047 1913384 -6710636 -11813738 -17171309 -27852210 -38601032 -39887337
4212 -39887337 -30565882 -17473903 -6173071 1090689 1738320 -4834537 -12815249 -15112449
4204 -15112449 -12557474 -12074902 -16343897 -20800563 -20288744 -13920087 -4599482 2058663
4196 2058663 1042013 -5210134 -7446124 -2865718 -2009229 -13967620 -30631343 -37055637
4188 -37055637 -32557164 -27215684 -20561374 -1883663 25765269 40138417 27142669 669112
4180F69112j5003766N255856J5932026J4317012O094857l413820p829298k530919
4172A3491060P517725J1682590O665293j365917n867323m145698L360744J0270734
4164D1609208O828803n813888j2040326l537716N232699k013818j6685713j7871850
4156d292601m036416P978570J0121533Q279992M501381l615205q174252J244219
4148A2007221J5519155J4760420k80731r024061m553312j328790o001304o466688
4140A4631910L030952J0348294P904960M618004O691498P433060M188834M485454
4132F3332966P820818K680466j1197858j9249823j6502084j2509627q309871M232756
4124A0297743J6666101J0292008o168706k825805J9226612K5398945R538528P298038
$$ plain form
4180 669112 -14334654 -9078798 6853228 21170240 27265097 23851277 16021979 13491060
4172 13491060 21008785 32691375 39356668 37990751 32123428 27977730 31338474 41609208
4164 41609208 48438011 42624123 30583797 27046081 32278780 30264962 13579249 -4292601
4156 -4292601 -8329017 -350447 9771086 18051078 22552459 18937254 10763002 12007221
4148 12007221 27526376 42286796 42006065 32982004 28428692 27099902 21098598 14631910
4140 14631910 17662862 28011156 35916116 40534120 47225618 54658678 58847512 63332966
4132 63332966 71153784 73834250 62636392 43386569 26884485 14374858 6064987 10297743
4124 10297743 26963844 37255852 31087146 28261341 47487953 72886898 82425426 89723464
4116H9723464K7576426L0350262O857643J4727585P5186418R8923481J630218
4109C44975497j46603868j89679134r3453905J5194618K9712995j2516964k3624063
4102g5994824L908938J9810722R907509L14490J54070j688029q03008J3547523
4094c0842609K5676336J1788287j6636244k4494438l927436J8229616K1462173
4087A255685J1558279k3281j0816890j8131822j5868654n533278L395956O200649
4079b7963356N641082L574203L43430q0480N370173J1607514J1193304M093809
4071A3779679m965419j3053593j6541795j0451606J798883P406124K022345j827323
4063b1832705N093931J1656593L764611j1076321j3820457k408596P204590N714911
$$ plain form
4116 89723464 117299890 147650152 154507795 169235380 244421798 343345279 344975497
4109 344975497 198371629 8692495 -84761410 -69566792 -39853797 -52370761 -75994824
4102 -75994824 -72085886 -52275164 -42367655 -42053165 -41899095 -43587124 -44390132 -30842609
4094 -30842609 -5166273 6622014 -10014230 -34508668 -38436104 -20206488 1255685
4087 1255685 12813964 12790683 1973793 -16158029 -32026683 -37559961 -34164005 -27963356
4079 -27963356 -22322274 -18748071 -18404641 -18485121 -13114948 -1507434 9685870 13779679
4071 13779679 8814260 -4239333 -20781128 -31232734 -29433851 -22027727 -20005382 -21832705
4063 -21832705 -16738774 -5082181 -1317570 -12393891 -26214348 -28622944 -21418354 -15703443
4055a5703443j72033k658412k445277j747633J94321K204015J224700q03976K020380
4046a7887358J0122666J6450435J5046072O856122l057898j0130700j2486235
4039D913104j1261642q286230l745986Q41870j6595p844192j2038513j788947
4031c9227131J4159658J5403885N70637q310891M48043R978495L368691q628191
4023a2236804o893660M404980P192313k97522n163464m419441n608107p473545
4015c0495250k038087O308130N187860k733978j866747R902950J7020294J1448584
4007A2733756L007160K63533q38358l744421l669273J13724j35002n585281o027299
3998c881461J930431N764931l956305j6815983j5690925O09075J6748715J8240307
$$ plain form
4055 -15703443 -15875476 -18533888 -20979165 -22726798 -22532477 -20328462 -19103762 -19907738 -17887358
4046 -17887358 -7764692 8685743 23731815 30587937 27530039 17399339 4913104
4039 4913104 -6348538 -14634768 -18380754 -17538884 -17555479 -25399671 -37438184 -39227131
4031 -39227131 -25067473 -9663588 -9092951 -17403842 -16955799 -6977304 -3608613 -12236804
4023 -12236804 -19130464 -14725484 -7533171 -7830693 -12994157 -17413598 -23021705 -30495250
4015 -30495250 -32533337 -26225207 -21037347 -23771325 -25638072 -15735122 1285172 12733756
4007 12733756 15740916 16004449 15166091 11421670 7752397 7866121 7731119 2145838 -3881461
3998 -3881461 -1951030 3813901 -142404 -16958387 -32649312 -32040237 -15291522 2948785
3990B948785M058977j3338214j7833726n282349R888430J1143646J682067j430677
3982h163061N899260R623531K468638l662383J005672O567378M92545j0257552
3974C974028j0268298j159926R38968q840360j6361149r245329O107725J3747764
3966b1106577P713988l518942r260334p506826k543142L524810J1096045J6161326
3958e439652J1600529r78763r091347n840522m32572k921792o945903j051725
3950b1101747R811072J1220788L680048Q80475M754714L242602n027550o336791
3942A123611J837838L036400r398506j7788201q545534N157438O491532K212209
3934a5873213O004297J0572571J091091j4435831j4681867N08374J0524989P165095
$$ plain form
3990 2948785 7007762 -6330452 -24164178 -29446527 -19558097 -8414451 -6732384 -8163061
3982 -8163061 -2263801 7359730 9828368 6165985 7171657 13739035 14231580 3974028
3974 3974028 -6294270 -7454196 -6515228 -15355588 -31716737 -40962066 -34854341 -21106577
3966 -21106577 -13392589 -16911531 -26171865 -33678691 -36221833 -32697023 -21600978 -5439652
3958 -5439652 6160877 5182114 -3909233 -9749755 -10182327 -13104119 -20050022 -21101747
3950 -21101747 -11290675 -69887 3610161 4490636 9245350 12487952 7460402 1123611
3942 1123611 2961449 5997849 -3400657 -21188858 -29734392 -24576954 -18085422 -15873213
3934 -15873213 -9868916 703655 1794746 -12641085 -27322952 -26814578 -16289589 -9124494
3926i124494K989440N166361M735639k724013p250554l509119r76406n459076
3918a6152222p228159P29713P273017J13281j2722623j4127789m044041J551239
3910d4607584m018311q450245O71798J7904848K6688675J8698547J589046j0012118
3902a535344p907937L488325J1498114O862174o275650j3234020n034109R376449
3894b761998J2715975J577084r039620p248021n20886j190270n050646j8048R330587
3885b205843O406549p419602j0210030N504130J7427091P238792j0569317j2942890
3877f771120m237450l687264r625326m847247Q495322J0029998j916077m797758
3869a7356922R290321J7656364L858234j3823268j0142161Q681424J6183797M634101
$$ plain form
3926 -9124494 -6135054 -968693 3766946 1042933 -6207621 -9716740 -10693146 -16152222
3918 -16152222 -23380381 -22650668 -15377651 -15264370 -27986993 -42114782 -46158823 -44607584
3910 -44607584 -48625895 -57076140 -56404342 -38499494 -11810819 6887728 8476774 -1535344
3902 -1535344 -9443281 -5954956 5543158 12405332 6129682 -7104338 -12138447 -2761998
3894 -2761998 9953977 11531061 2491441 -4756580 -5277466 -6467736 -11518382 -11536430 -2205843
3885 -2205843 4200706 -3218896 -13428926 -7924796 9502295 16741087 6171770 -6771120
3877 -6771120 -11008570 -14695834 -24321160 -29168407 -20673085 -10643087 -12559164 -17356922
3869 -17356922 -8066601 9589763 13447997 -375271 -10517432 -1836008 14347789 18981890
3861A8981890q612283r190895j287765M989637O802997O002623L310651j258262
3853A9738593o926595j1890378j2268530m727849O251668R107086p57903j2474939
3845a3948847j2593100k666906M078489J193267m358512l728118K996769Q975511
3837b0051447Q840124L368863j605850j084670L150276M789124K316173J335200
3829A057793M628409N749559j696060j2938949j7280274j1679410k266061N551612
3821b8873381J1124496J3694663J1260641N593323K110588K486584K042960l172283
3813A6267591j0453078j4302818j3648985j1933024j0705725o576542L182384
3806d8170197J3753129J6268267R764849M155460O355733Q818584O85609j3157581
$$ plain form
3861 18981890 10369607 1178712 -109053 4880584 11683581 17686204 20996855 19738593
3853 19738593 12811998 921620 -11346910 -16074759 -9823091 -716005 -1473908 -13948847
3845 -13948847 -26541947 -29208853 -25130364 -23937097 -28295609 -32023727 -29026958 -20051447
3837 -20051447 -11211323 -7842460 -9448310 -10532980 -7382704 -2593580 -277407 1057793
3829 1057793 5686202 11435761 9739701 -3199248 -20479522 -32158932 -34424993 -28873381
3821 -28873381 -17748885 -4054222 7206419 12799742 14910330 17396914 19439874 16267591
3813 16267591 5814513 -8488305 -22137290 -34070314 -44776039 -51352581 -48170197
3806 -48170197 -34417068 -18148801 -8383952 -4228492 2127241 10945825 11631434 -1526147
3798a526147j6489515n663240M397621K514602l551689j868803N643885J0217331
3790f325955J1074154J1241388P089190m213031j3223851r055824K394278N987678
3782D968027M00436k197478J381776N03607q701704j4644433r045596m53435l1035
3773b7819835m700435m237975K821910J0058542J4312839J6764623J6212591R533365
3765C2945625j954571j2143478j6058357j3379496p392962k350138j00133J662328
3757a8771182N577648R289104P734258Q93118m990454m345136L106089J3392963
3749A1886408J9380594J3505496l412042j8212714j8909250j0522834p428299
3742a3712641j1503076j0749653j89336J0573602J4054521J3989797J2041330
$$ plain form
3798 -1526147 -18015662 -23678902 -19281281 -16766679 -20318368 -22187171 -16543286 -6325955
3790 -6325955 4748199 15989587 23078777 18865746 5641895 -3413929 -1019651 4968027
3782 4968027 5368463 3170985 4552761 5056368 -3645336 -18289769 -27335365 -27788800 -27819835
3773 -27819835 -32520270 -36758245 -33936335 -23877793 -9564954 7199669 23412260 32945625
3765 32945625 30991054 18847576 2789219 -10590277 -17983239 -20333377 -20433510 -18771182
3757 -18771182 -13193534 -3904430 3829828 4722946 -267508 -4612644 -1506555 11886408
3749 11886408 31267002 44772498 41360456 23147742 4238492 -6284342 -13712641
3742 -13712641 -25215717 -35965370 -36154706 -25581104 -11526583 2463214 14504544
3735A4504544J476490j6309758k4056911j0852316R424117J6016605Q324657N95793
3727h76779k063360o015358j2415664j4361016r257742j182593P265857J4130647
3719b4776008J2818973O79518j0149233m644828J3274001K4109880J7818233L295596
3711C2426132o486275o601473J526362J1104745J0336047m646170j8415501j2787213
3703F456654O109265J4179926L389673r251022r791026m688559l759955n025721
3695b380765n423595q586696j1904407l995942J2974767J7198626j124032j9861653
3687b3103697j5789607O39122M382507l298394o56275J4372970J9516468N648080
3679A711174p953146m094535Q147376J0948443K979468n078868q249160q414143
$$ plain form
3735 14504544 15981034 -328724 -24385635 -35237951 -25813834 -9797229 -1472572 -876779
3727 -876779 -2940139 -8955497 -21371161 -35732177 -44989919 -46172512 -38906655 -24776008
3719 -24776008 -11957035 -11277517 -21426750 -26071578 -12797577 11312303 29130536 32426132
3711 32426132 25939857 19338384 20864746 31969491 42305538 37659368 19243867 6456654
3703 6456654 12565919 26745845 30135518 20884496 11093470 6404911 2644956 -2380765
3695 -2380765 -7804360 -16391056 -28295463 -32291405 -19316638 -2118012 -3242044 -23103697
3687 -23103697 -38893304 -38254182 -33871675 -37170069 -37826344 -23453374 -3936906 1711174
3679 1711174 -6241972 -10336507 -2189131 8759312 11738780 6659912 -1589248 -10003391
3671a0003391n763824R3336M931472L722420l121905j1451430j6970650j4445216
3663e3009188m31485J8217089K5443820J3001437p449299j6138455p262971O347631
3655b1281421R709136J680470o522015n496107K219657O297034J156017q232522
3647b0469751j3148709r964727o76685J0425914J7061875J3477392K673030k826249
3639c447910L853859J2307359P840680p288642j6938960j3743430o042518j714462
3631b5174024J226131M583674M170495J66963R44676Q630189J2106810M040556
3623A0695470n213052k340728Q328657J2012419N749805m14316j843934m665753
3615B2308568j1738353j6032813j2015622l972659J761060N512527J0440805J5683123
$$ plain form
3671 -10003391 -15767215 -15673879 -10742407 -7019987 -10141892 -21593322 -38563972 -53009188
3663 -53009188 -53440673 -35223584 -9779764 3221673 -4227626 -20366081 -27629052 -21281421
3655 -21281421 -11572285 -9891815 -16413830 -21909937 -19690280 -13393246 -12237229 -20469751
3647 -20469751 -33618460 -43583187 -44259872 -33833958 -16772083 -3294691 -621661 -3447910
3639 -3447910 405949 12713308 20553988 13265346 -3673614 -17417044 -23459562 -25174024
3631 -25174024 -23947893 -19364219 -15193724 -15026761 -14082085 -5451896 6654914 10695470
3623 10695470 5482418 3141690 11470347 23482766 29232571 28818255 26974321 22308568
3615 22308568 10570215 -5462598 -17478220 -21450879 -19689819 -14177292 -3736487 11946636
3607A1946636J8028481J6461561J1308249K440355q078881j4731140j3872917
3600B3502344q395569l748952r98715K654640P412586Q866525L485621o137857
3592B6640623j2820371j0730633K04942J3922114K1372601J6412731J549744j2454769
3584D4096982j5604717q502701j561049l478705j1939799j6574157r871174N138452
3576a8296868J6546829J3657342j497489j3669249j0454403J705230N158440m318236
3568a1168404j1140638l252765R923866J3053170P948166O416051P642630J273157
3560B0695233r663433r330103M301644J2611818L761991r412002r315646J702100
3552E351602Q157120L207788p363783j5453810j5444822n517225P528304J1426615
$$ plain form
3607 11946636 29975117 46436678 57744927 60185282 52106401 37375261 23502344
3600 23502344 15106775 11357823 10359108 13013748 20426334 29292859 32778480 26640623
3592 26640623 13820252 3089619 3294561 17216675 38589276 55002007 56551751 44096982
3584 44096982 28492265 19989564 18428515 14949810 3010011 -13564146 -23435320 -18296868
3576 -18296868 -1750039 11907303 10409814 -3259435 -13713838 -12008608 -6850168 -11168404
3568 -11168404 -22309042 -25561807 -15637941 -2584771 5363395 11779446 19422076 20695233
3560 20695233 11031800 1701697 6003341 18615159 22377150 12965148 3649502 5351602
3552 5351602 13508722 16716510 9352727 -6101083 -21545905 -27063130 -19534826 -8108211
3544h108211L480778m976725m924431n10921K680430P184095J2205022P178107
3536A4208144r887388k1528022j4719765k636107l175041q292044R17862J7908573
3528b7203788J8520212K097330n830937M462694J2111271K426558r113642m878487
3520g408789N954324N382321l852412o772729j985210P35781P37664N834129J5169507
3511A3794586J8258216R961527m474127j6885029k0117435r774103Q014857J6145158
3503A4923650N233161j1654911j4525591k759339O571742L776049l963343q028917
3495a0427499r215551r629465n957559K539889P758877K315005q637158j1824473
3487d3077934j526001J3234462J8292112R660822k587702o436256j225751M916083
$$ plain form
3544 -8108211 -4627433 -9604158 -14528589 -15039510 -12359080 -5174985 7030037 14208144
3536 14208144 4320756 -17207266 -31927031 -34563138 -37738179 -46030223 -45112361 -27203788
3528 -27203788 -8683576 -6586246 -12417183 -7954489 4156782 6583340 -2530302 -7408789
3520 -7408789 -1454465 3927856 75444 -6697285 -8682495 -7946714 -7209050 -1374921 13794586
3511 13794586 32052802 42014329 37540202 20655173 537738 -9236365 -1221508 14923650
3503 14923650 20156811 8501900 -6023691 -8783030 -2211288 1564761 -2398582 -10427499
3495 -10427499 -19643050 -29272515 -35230074 -32690185 -24931308 -22616303 -31253461 -43077934
3487 -43077934 -44603935 -31369473 -13077361 -3416539 -6004241 -12440497 -13666248 -8750165
3479h750165Q302018J2157386J5168535Q457589r436754k3605656j9332376k787667
3471a9827090N884374j403279j1942463j0621878J747198J1998762J1052386K807159
3463a0304831k022818P35429L246067l076502j2190665q227431J0784788K4842752
3455C786789J7195497j271281o735709M034560J1825941N775359k710992k309049
3447B9591115n09000q103280j7886000j5103747k970179k04656j2138182k0191126
3439d7515055p793992J4537677K2162466R315971m678659l618388M702734L899635
3431h987611n205943p870229j8630O113038K365397m070491n116136m120122n416346
3422c2327073l686269N022002J1625471O855945j382986J825291J5035508K1693377
$$ plain form
3479 -8750165 -448147 11709239 26877774 35335363 25898609 2292953 -17039423 -19827090
3471 -19827090 -13942716 -15345995 -27288458 -37910336 -36163138 -24164376 -13111990 -10304831
3463 -10304831 -12327649 -11592220 -8346153 -11422655 -23613320 -31840751 -21055963 3786789
3455 3786789 20982286 19711005 12975296 17009856 28835797 34611156 31900164 29591115
3447 29591115 29082115 20978835 3092835 -12010912 -14981091 -15185747 -27323929 -47515055
3439 -47515055 -55309047 -40771370 -18608904 -9292933 -13971592 -17589980 -12887246 -8987611
3431 -8987611 -14193554 -22063783 -22082413 -15969375 -13603978 -17674469 -22790605 -26910727 -32327073
3422 -32327073 -36013342 -30991340 -19365869 -12509924 -13892910 -12067619 2967889 24661266
3414B4661266J3041405l193989j5591799j8125519q715787P394428J4621260L090961
3406A7182226j2988618j0750250O653839J1915765m445535j7242487m674249J7858502
3398C509193K1613362O689836l168266Q26731M247782j408985n104099K015194
3390B9220748R797399M536408j0191560j8497964j1977674L107754J4778419J6101329
3382C6874859R520762L800386M531269O558001k80267j6472125k8772407k4059562
3374h299084m111397J6281504K3600346J5969117K041265p504526q436632m892095
3366B4648498k925322l132660k095147m7284j936521r010645j4278391j0659730
3358a9437202p74817O323201O779963M816928L722731L36931p630806j3578210
$$ plain form
3414 24661266 37702671 34508682 18916883 791364 -7924423 -529995 14091265 17182226
3406 17182226 4193608 -6556642 97197 12012962 7567427 -9675060 -14349309 3509193
3398 3509193 25122555 31812391 28644125 29470856 33718638 32309653 27205554 29220748
3390 29220748 39018147 43554555 33362995 14865031 2887357 5995111 20773530 36874859
3382 36874859 46395621 50196007 54727276 61285277 61005010 44532885 15760478 -8299084
3374 -8299084 -12410481 3871023 27471369 43440486 45481751 37977225 29540593 24648498
3366 24648498 21723176 18590516 16495369 16448085 14511564 5500919 -8777472 -19437202
3358 -19437202 -20212019 -13888818 -7108855 -2291927 1430804 1767735 -5863071 -19441281
3350a9441281q442349N313400J3414842P026570m827497n960916O036734J6283228
3342I402731J1288163m284032j3333374o375411Q191232J4377633O686395m633209
3334B1320128o927317p66114K260683l159072q298443m222799L495663K679312
3326F382041o501103j1364302n505418L324978O900600P156858P575245M171043
3318A2139942n977391j4683375j1845227p41185N988695L667512n51698l74884
3310a2377611K258917L339288K252422n26828m288264n271246L3273P233143P301786
3301d5120J30021l264183L333421J0953225Q102264k166172o961320k355064K362265
3292A0089337l17304n916042o382622j949488R01412m98426k705526k538856p41127
$$ plain form
3350 -19441281 -27883630 -22570230 -9155388 -2128818 -6956315 -12917231 -6880497 9402731
3342 9402731 20690894 16406862 3073488 -3301923 4889309 19266942 25953337 21320128
3334 21320128 14392811 13626697 15887380 12728308 4429865 207066 3702729 6382041
3326 6382041 -119062 -11483364 -16988782 -13663804 -6763204 393654 7968899 12139942
3318 12139942 6162551 -8520824 -20366051 -21107236 -15118541 -11451029 -12002727 -12377611
3310 -12377611 -10118694 -6779406 -4526984 -5053812 -9342076 -14613322 -14580049 -7346906 -45120
3301 -45120 84901 -3179282 154139 11107364 19209628 17043456 10082136 7727072 10089337
3292 10089337 9772033 3855991 -2526631 -4476119 -3574707 -4073133 -6778659 -9317515 -10058642
3283a0058642R22666K226230L067756K447681J91270k367480m245152n202319
3275a3017990l796694J772612R294085J2303192P094319k201153q219835p997212
3267d768676l580702K006317N840431N148716J045096k54831M605463R267639
3259A9309453N391452m481036r718171o661609j934275n5370J823332L739160
3251G412936j157339j3421622j9668104q311411J2683648K3880306J7316872K904361
3243B1639647n720599l711750M679151J0441368N764550p039188j4143087n341962
3235F568130J1166681J7844119J0389828R04782j991753m098795j1967037j9238809
3227I577146j5654914l479830M666694K410257l808172n105896r22831K948189
$$ plain form
3283 -10058642 -9135976 -6909746 -3841990 -1394309 -1203039 -3570519 -7815671 -13017990
3275 -13017990 -16814684 -15042072 -5747987 6555205 13649524 11448371 3228536 -4768676
3267 -4768676 -8349378 -6343061 -502630 4646086 5691182 5436351 10041814 19309453
3259 19309453 24700905 20219869 10501698 3840089 1905814 1850444 3673776 7412936
3251 7412936 6255597 -7166025 -26834129 -35145540 -22461892 1418414 18735286 21639647
3243 21639647 15919048 12207298 16886449 27327817 33092367 26053179 11910092 6568130
3235 6568130 17734811 35578930 45968758 46873540 44881787 40782992 28815955 9577146
3227 9577146 -6077768 -9557598 -4890904 -2480647 -6288819 -11394715 -12317546 -9369357
3219i369357L266842K416618K893823K352020k505492q330488p116221J775491
3211a4616764P498926J731780p582762n548208P846613J5565414O020058j1496562
3203e81505j9697335j4766682p290861n524508o125395j925359P382025J5294143
3195c3235477J6542437J2118551O265305P56402n108556r145185n900121M706890
3187a2999754J2666173Q615336k733990q044584m000785r37370n391017r467919
3179b2293910m136882N632583Q554797M192576J723933M299935N769505L207313
3171F949850J896299M663545N760023J086000k901908J781085J1160431J3308131
3163D3703456M442353o977680j3008344j5259005j7710508j7441606r551183J902184
$$ plain form
3219 -9369357 -6102515 -3685897 -792074 1559946 -945546 -9276034 -16392255 -14616764
3211 -14616764 -7117838 -5386058 -12968820 -18517028 -10670415 4894999 10915057 -581505
3203 -581505 -20278840 -35045522 -42336383 -47860891 -53986286 -55911645 -48529620 -33235477
3195 -33235477 -16693040 -4574489 1690816 2447218 -2661338 -11806523 -17706644 -12999754
3187 -12999754 -333581 8281755 5547765 -2496819 -6497604 -7434974 -12825991 -22293910
3179 -22293910 -26430792 -20798209 -12243412 -8050836 -6326903 -2026968 3742537 6949850
3171 6949850 8846149 13509694 19269717 20355717 17453809 19234894 30395325 43703456
3163 43703456 48145809 41168129 28159785 12900780 -4809728 -22251334 -31802517 -29900333
3155b9900333N971946j234933j0769773j1441219j976042R726532J5651336J3408798
3147a0563688O574917K258043N053384J0740137R968735J138359o021075m682280
3139A4466532k149521q199187j7342236j4862193O61492J3945268J4711444J0329265
3131A1560864J0952511J3271485Q325067k468301r852130j0982742j0905803j1676464
3123a775513r462836k845102L753245O386111N546454K761330j511395n456618
3115b604324o297760m568239l538284k924839J956631J1891558J8833704J4029258
3107B6777705l04757j1779010j1186691k250255L863856K007655k458980l244111
3099A425412k699073o929450j3448366j1630353J639918J3942859J1810837r77979
$$ plain form
3155 -29900333 -23928387 -25163320 -35933093 -47374312 -49350354 -39623822 -23972486 -10563688
3147 -10563688 -3988771 -1730728 3322656 14062793 24031528 25169887 19148812 14466532
3139 14466532 12317011 4117824 -13224412 -28086605 -27425113 -13479845 1231599 11560864
3131 11560864 22513375 35784860 44109927 41641626 31789496 20806754 9900951 -1775513
3123 -1775513 -11238349 -14083451 -10330206 -3944095 1602359 4363689 2852294 -2604324
3115 -2604324 -8902084 -13470323 -17008607 -19933446 -17976815 -6085257 12748447 26777705
3107 26777705 26472948 14693938 3507247 1256992 5120848 7128503 4669523 1425412
3099 1425412 -1273661 -8203111 -21651477 -33281830 -31641912 -17699053 -5888216 -6866195
3091f866195q362741m069579J340763j723639p127534l991527M536052N228632
3083b1035768m088778r957579l564729N718630N221558j491146j797090M678612
3075b6316290O646187K289612L628037J4804174K1104476R586063j1018486k3065125
3067b341352k3480085k1019298j7643935q595921L055548Q441426Q203588J0084215
3059d3295814J1951586M414401q483920j0112160K555105J2437970R362872M499114
3051a6670846P389660Q074304k417464j1188238l101025J1944467J3714664M346359
3043A2091881K244862Q444710N026636j1778993k1950279j2427813L260078O548277
3035h540641j372289p774825q297027o394138k660949L195302O366373L692567
$$ plain form
3091 -6866195 -15228936 -19298515 -17957752 -19681391 -26808925 -30800452 -26264400 -21035768
3083 -21035768 -25124546 -35082125 -38646854 -32928224 -27706666 -29197812 -30994902 -26316290
3075 -26316290 -19670103 -17380491 -13752454 1051720 22156196 31742259 20723773 -2341352
3067 -2341352 -25821437 -46840735 -64484670 -73080591 -70025043 -61583617 -53380029 -43295814
3059 -43295814 -31344228 -26929827 -35413747 -45525907 -42970802 -30532832 -21169960 -16670846
3051 -16670846 -9281186 -1206882 -3624346 -14812584 -17913609 -5969142 7745522 12091881
3043 12091881 14336743 22781453 27808089 16029096 -5921183 -18348996 -15088918 -8540641
3035 -8540641 -9912930 -17687755 -25984782 -32378920 -35039869 -31844567 -25478194 -21785627
3027b1785627J323225N768886J1553687Q077005l421790j0100459n518722J547341
3019a2556454K4404p887249r888473k30170J2796341J7776470J3796538Q256485
3011B2087892M179897j961077r218003r255752P8959P611692M168936k605035
3003A5087509k23753P687983O554653n502688j4338445j1289712l706313l74097
2995f104863M52407K937941M999446M253709L204736K490727k227890j0948678
2987i42465j5813184j2861307q334519o989343l720785N492146J3859926J4502408
2979a4807123J2328927J4261869J4976047N294840r816213j5391814p636732J395150
2971F04951J692362k882977m133114k175644k706292o248719o378439J089859
$$ plain form
3027 -21785627 -20462402 -14693516 -3139829 4937176 1515386 -8585073 -14103795 -12556454
3019 -12556454 -12532050 -20419299 -30307772 -30537942 -17741601 34869 13831407 22087892
3011 22087892 26267789 24306712 15088709 5832957 5911916 13523608 17692544 15087509
3003 15087509 14863756 22551739 29106392 23603704 9265259 -2024453 -5730766 -6104863
2995 -6104863 -5652456 -2714515 2284931 6538640 9743376 12234103 10006213 -942465
2987 -942465 -16755649 -29616956 -37951475 -44940818 -48661603 -43169457 -29309531 -14807123
2979 -14807123 -2478196 11783673 26759720 32054560 22238347 6846533 -790199 604951
2971 604951 2297313 -585664 -4718778 -6894422 -9600714 -15849433 -22227872 -21138013
2963b1138013J0741718J2627109M870731l003329k981155k80424m559795j2641021
2955a6364179j1638805N4662Q109174L232984n821209p664151m950998n748204
2947d0790726q284835n962639Q7800N009817J0075336J6982356J8861128R681009
2939E659246k713289o009437j321576J470838J510012N125780R719728O179727
2931A9621029l362985o943495l290854m364306j3840581j9172706j1303122J854607
2923d0802413R177019J1309945J3518955J4016750Q661518k21175p705371j2893694
2915d938466j5408596j1704714j365576Q495900J1249951Q605600N637305K906375
2907C477779j495039o205477p518376l608418L979308J0067215Q036927j945829
$$ plain form
2963 -21138013 -10396295 2230814 7101545 4098216 1117061 836637 -3723158 -16364179
2955 -16364179 -28002984 -27948322 -19839148 -16606164 -22427373 -30091524 -35042522 -40790726
2947 -40790726 -49075561 -55038200 -54950400 -49940583 -39865247 -22882891 -4021763 5659246
2939 5659246 2945957 -3063480 -4385056 -2914218 -1404206 3721574 13441302 19621029
2931 19621029 16258044 9314549 6023695 1659389 -12181192 -31353898 -42657020 -40802413
2923 -40802413 -31625394 -20315449 -6796494 7220256 15881774 15660599 7955228 -4938466
2915 -4938466 -20347062 -32051776 -33417352 -24921452 -13671501 -5065901 571404 3477779
2907 3477779 1982740 -4222737 -11741113 -15349531 -11370223 -1303008 6733919 4788090
2899D788090q697102k746417Q136983P949961k860399o594300M014075J3610347
2891A7601238Q296514l262802n405128J77902R03175m424602o091764j868176
2883E926357L66815k725338n480564l635405J135531O756259J1235677Q371911
2875B1951243o637963k6088957l3467915k1261065O49538J5758788J5773174N362330
2867b7960827l104835o67007Q233637R598304j855189j3375769j0438093K769561
2859c6800218R318383L019595n597660o407714j214632M065132Q324666J1882683
2851a3409765J2022213P244102J416104j87537L582365R399591J1913098P153598
2843C9133769k719406r323708p119594o66183K205158J392208J750186K525223
$$ plain form
2899 4788090 -3909012 -6655429 1481554 9431515 6571116 -23184 3990891 17601238
2891 17601238 25897752 22634950 17229822 17407724 18310899 13886297 7794533 5926357
2883 5926357 6293172 3567834 -1912730 -5548135 -4412604 2343655 13579332 21951243
2875 21951243 15313280 -10775677 -44243592 -65504657 -64855119 -49096331 -33323157 -27960827
2867 -27960827 -31065662 -31732669 -23499032 -13900728 -15755917 -29131686 -39569779 -36800218
2859 -36800218 -27481835 -24462240 -30059900 -36467614 -37682246 -33617114 -25292448 -13409765
2851 -13409765 -1387552 5856550 7272654 7085117 10667482 20067073 31980171 39133769
2843 39133769 36414363 27090655 19971061 19304878 21510036 22902244 24652430 27177653
2835B7177653r18570o074542m675515L546890Q430389L649973n197560j0147881
2827A5790837j0680872j0140161r168185o821552l140300K023408P967016J0178444
2819c991365M769244l602266n972336k235538j262169o132113r266576n715412
2811c3408531r62587k13859K85229M453546P608456M270049k257202n440978m432253
2802c0098130j042723N057374J1227265R861895P6390o108321P00074J1989881
2794A663705J2639826K157949p297053r965942j0342009r895692l934195O530015
2786a8443396J1873402O841988k349655p275108o306083j859131M073521Q625864
2778d818598Q464901M330222L92611j961372m293328n126343j204279M275050
$$ plain form
2835 27177653 26259083 20184541 15509026 19055916 27486305 31136278 25938718 15790837
2827 15790837 5109965 -5030196 -14198381 -21019933 -24160233 -22136825 -14169809 -3991365
2819 -3991365 777879 -2824387 -8796723 -11032261 -12294430 -18426543 -27693119 -33408531
2811 -33408531 -34371118 -34584977 -34299748 -29846202 -22237746 -17967697 -20224899 -25665877 -30098130
2802 -30098130 -31140853 -26083479 -14856214 -4994319 -4917929 -11026250 -10326176 1663705
2794 1663705 14303531 16461480 9164427 -801515 -11143524 -21039216 -24973411 -18443396
2786 -18443396 -6569994 271994 -2077661 -9352769 -15658852 -17517983 -13444462 -4818598
2778 -4818598 3646303 7976525 8369136 6407764 2114436 -3011907 -4216186 58864
2770E8864L171162m923111r724373m595646L332225L293625m294564r471658n668956
2761b8822432M494457J3702563J5579177Q398252k356474p340416l319663K574031
2753B909495K552253j123941r74439K673010J685915n880910j0039541k181465
2745a0379623J1156058J4908048M379657r115694j2445971m596812O106262J2904418
2737A2916343J3632664P438159l728179j1739052q623107K380533R062746N480929
2729B6821036j848665n188877n063320m581904k664296Q99618J231672l188987
2721F416277m759143J803495Q674528N856978k646594n275949j087471J466165
2713A0448286O23041J644878K629159l856726j3632173j2061992L043030J5229543
$$ plain form
2770 58864 3230026 -1693085 -11417458 -16013104 -12680879 -9387254 -13681818 -23153476 -28822432
2761 -28822432 -24327975 -10625412 4953765 13352017 10995543 3655127 335464 2909495
2753 2909495 5461748 4337807 3363368 6036378 7722293 1841383 -8198158 -10379623
2745 -10379623 776435 15684483 20064140 10948446 -1497525 -6094337 11925 12916343
2737 12916343 26549007 33987166 30258987 18519935 9896828 12277361 21340107 26821036
2729 26821036 24972371 19783494 14720174 10138270 7473974 8373592 9605264 6416277
2721 6416277 1657134 3460629 12135157 17992135 15345541 10069592 8982121 10448286
2713 10448286 11071327 12716205 15345364 11488638 -2143535 -14205527 -11162497 4067046
2705D067046J2785668M088173J677519M465279N196129L420976R10534m526519
2697C2084805j0398703o577158P403130J4448476L452877j1181609j0509721m92281
2689A8229816J77200p003363m635874O633052N901738j2061224k4620640j5492394
2681c2871689Q82959L730537l046361j899589Q661984J4404620R324909K140317
2673A327687M34102K070289L001188L073299K607414O68675k419885n933976j0782048
2664e953255j5689256j4372328l280153J0135960J4324568P858281L5979j895861
2656h836065O91136L699982N705771O235640M358528P69058k354554l847934k866101
2647C555461K417437J0705791J4589298Q451101j892753n193408l84638K118303
$$ plain form
2705 4067046 16852714 20940887 22618406 27083685 32279814 35700790 36611324 32084805
2697 32084805 21686102 15108944 22512074 36960550 40413427 29231818 18722097 18229816
2689 18229816 18407016 11403653 6767779 13400831 19302569 7241345 -17379295 -32871689
2681 -32871689 -31988730 -28258193 -31304554 -33204143 -24542159 -10137539 -812630 1327687
2673 1327687 1761789 3832078 6833266 9906565 12513979 13182654 10762769 4828793 -5953255
2664 -5953255 -21642511 -36014839 -39294992 -29159032 -14834464 -6976183 -6940204 -8836065
2656 -8836065 -8144929 -4444947 1260824 7496464 11854992 12624050 10269496 6421562 3555461
2647 3555461 5972898 16678689 31267987 39719088 37826335 32632927 32248289 34366592
2639C4366592l891515j2045225j3896593r743013m378726Q36224N959820Q224750
2631E432314N768194J280258k909685q324944j3935010j2851958k983886N035091
2623b3489626N59517j0469397j2974546m782501J307478j748445n403022o65954
2615e7666496Q436996J3238108J2891892J0721991N952406k046632p198372l851220
2607a9521327L281774N018576P58630k433422j173477J992080N345928Q469718
2599A738480P849865R40460o812151q220301o069561q068318j1402576n478409
2591c5522511Q605559J5797265R111111m3798r89434K24118n395964j1766127
2583a9979781p469179M216305R658370N161903l81156o78621K412020O799861
$$ plain form
2639 34366592 30475077 18429852 4533259 -5209754 -9588480 -8752256 -2792436 5432314
2631 5432314 11200508 12480766 9571081 1246137 -12688873 -25540831 -28524717 -23489626
2623 -23489626 -22930109 -33399506 -46374052 -51156553 -49849075 -51597520 -57000542 -57666496
2615 -57666496 -49229500 -35991392 -23099500 -12377509 -6425103 -8471735 -15670107 -19521327
2607 -19521327 -16239553 -11220977 -10462347 -12895769 -14069246 -12077166 -6731238 1738480
2599 1738480 9588345 10528805 3716654 -4503647 -10573208 -18641526 -30044102 -35522511
2591 -35522511 -26916952 -11119687 -2008576 -2052374 -3041808 -2817690 -8213654 -19979781
2583 -19979781 -27448960 -23232655 -13574285 -8412382 -8793538 -9472159 -7060139 -260278
2575b60278J1640611J1878753L203026p838765j0659816p564885j0425852j8657629
2567b8684835j5830676M901344K5323981K3285463J533384j5761235j2071646
2560a7304220M938073J5420855R503903m046730r017201m49439R835062Q805618
2552A7685921l51218l481367L631143R633522M815823n984884j2411591j2132606
2544A404743r348280o417788l300656m87211K652238P894958J2726730J0785617
2536A5910351J990967m534548l019713L71611k060632p360214q046585m815540
2528a1564303m267421p606029r821778p754930k302977M713855J0158092R783079
2520a8662412M564421K194961O174764R065750L754134m938525q509042p947127
$$ plain form
2575 -260278 11380333 23259086 26462112 18623347 7963531 398646 -10027206 -28684835
2567 -28684835 -44515511 -39614167 -14290186 8995277 10528661 -5232574 -17304220
2560 -17304220 -12366147 3054708 12558611 8511881 -505320 -954759 8880303 17685921
2552 17685921 17334703 13853336 17484479 27118001 31933824 25948940 13537349 1404743
2544 1404743 -7943537 -14361325 -17661981 -18149192 -15496954 -7601996 5124734 15910351
2536 15910351 17901318 13366770 10347057 10718668 8658036 1297822 -6748763 -11564303
2528 -11564303 -15831724 -23437753 -33259531 -41014461 -43317438 -38603583 -28445491 -18662412
2520 -18662412 -14097991 -11903030 -5728266 3337484 7091618 2153093 -6355949 -14303076
2512a4303076q294719o770052P66709O969948J871433q402683q083305L654392
2504c2591353J1445609Q766789O447804J0998738J2078163J451966j0139126q063168
2496C95422M022118J0230595M970928k301781k040071M944158J0612703P049317
2488C7883389p034244k2190845k4340909j0528061N135673P336662j798738o562528
2480b2099601J526580J3468642J4589729K737135q167848l956710J1091139J6745590
2472B5934656K571380j5364240j4337777K799467J1476921K161123o515563P15399
2464I441366J1119868O710240m521462k099530J1534766J3706191k176839j6526122
2456B7188478j4029467l697610l87689l533365n178014n620703q464998r678036
$$ plain form
2512 -14303076 -22597795 -29367847 -28601138 -21631190 -19759757 -28162440 -36245745 -32591353
2504 -32591353 -21145744 -12378955 -5931151 5067587 17145750 18597716 8458590 395422
2496 395422 4417540 14648135 19619063 17317282 15277211 20221369 30834072 37883389
2488 37883389 30849145 8658300 -15682609 -26210670 -21074997 -13738335 -15537073 -22099601
2480 -22099601 -20573021 -7104379 7485350 10222485 2054637 -1902073 9189066 25934656
2472 25934656 28506036 13141796 -1195981 1603486 13080407 15241530 8725967 9441366
2464 9441366 20561234 27271474 22750012 20650482 32185248 45891439 43714600 27188478
2456 27188478 13159011 9461401 9073712 5540347 362333 -5258370 -13723368 -23401404
2448b3401404m291675K264367J348089m366507m273444M551305J4389635J7763389
2440C983755J3049459J721921j0773353j3686974j915454J1821648Q697389r132313
2432C766078j7018662j396915J8195100J4655389p946758j9763885p436166R096762
2424g849057P884362n217778j0802060o304326m380177p901300o183011L758872
2416c6994475J0116132N371569k346782m005787k604175k273598L309829J8552044
2408a0875243L0536276K1800202l907666k2766703j9096156j378180J1900995
2401F213525J2202350L072580q573552j6953513j8171962j2191763k591874P480880
2393b9513329J6528323K1503481J8328537P741921l804753j1555184j6349001
$$ plain form
2448 -23401404 -27693079 -25428712 -24080623 -28447130 -32720574 -28169269 -13779634 3983755
2440 3983755 17033214 18755135 7981782 -5705192 -7620646 4201002 12898391 3766078
2432 3766078 -13252584 -14649499 3545601 18200990 10254232 -9509653 -16945819 -7849057
2424 -7849057 35305 -5182473 -15984533 -22288859 -26669036 -34570336 -40753347 -36994475
2416 -36994475 -26878343 -21506774 -23853556 -27859343 -30463518 -32737116 -29427287 -10875243
2408 -10875243 19661033 41461235 37553569 14786866 -4309290 -5687470 6213525
2401 6213525 18415875 21488455 12914903 -4038610 -22210572 -34402335 -36994209 -29513329
2393 -29513329 -12985006 8518475 26847012 34588933 30784180 19228996 2879995
2386B879995j8522277j3760073q19752J0840106R557779k463655r359480q79888
2378b2527245J4585680K1164877J5192799O743370L522534K169392k133756n918122
2370C2799529l717357J534624K555912p36322k207814p07942j156725m053912
2362B4309993l673053O53174J164214n485300j0779352o437499L342109R240138
2354A2334424R924087R129510N227012n552975j7947743k0476028j0281807K958718
2346a4684802R331587Q455376N882567N563202P558561R113027O871087O35706
2338C8726311n627539q679382r393612q579828l989916L602035O399180r10042
2330A1547207j1387806j4003511q819839m934400n251867l731731K044444O103512
$$ plain form
2386 2879995 -15642282 -29402355 -30222107 -19382001 -9824222 -12287877 -21647357 -22527245
2378 -22527245 -7941565 13223312 28416111 35159481 38682015 40851407 38717651 32799529
2370 32799529 29082172 30616796 33172708 32436386 30228572 29520630 28363905 24309993
2362 24309993 20636940 21290114 22454328 16969028 6189676 -247823 3094286 12334424
2354 12334424 22258511 31388021 36615033 31062058 13114315 -7361713 -17643520 -14684802
2346 -14684802 -5353215 3102161 8984728 14547930 22106491 31219518 38090605 38726311
2338 38726311 33098772 24419390 15025778 6445950 2456034 6058069 12457249 11547207
2330 11547207 159401 -13844110 -22663949 -27598349 -32850216 -36581947 -34537503 -28433991
2322b8433991M480640J570553K435009N579084O933597N870522M454943M362832
2314G253189N532571M838704k191653j3822582j9633742j2699586j114477J563452
2306c0274124n006262q978831m413111K972555P617838R752737Q791697L466013
2298a6071488m41624M471789J2728591J1317256J572189j022469O831389R059928
2290B8445561k188944j1240013m720802M891635l50772j3537729j3895854K72394
2282a2324524J0956116R092329L853833L199512K946781j487087o376344o768108
2274C092508k426067M899104J1203977Q037207q474894k6420728k7815484j1465235
2266d9369612M773638P112717O44445k420688R69524N719262P814258O266388
$$ plain form
2322 -28433991 -23953351 -22382798 -19947789 -14368705 -7435108 -1564586 2890357 7253189
2314 7253189 12785760 17624464 15432811 1610229 -18023513 -30723099 -31837576 -30274124
2306 -30274124 -35280386 -44259217 -48672328 -45699773 -38081935 -28329198 -19537501 -16071488
2298 -16071488 -16513112 -12041323 687268 12004524 13576713 12554244 19385633 28445561
2290 28445561 26256617 15016604 10295802 15187437 14836665 1298936 -12596918 -12324524
2282 -12324524 -1368408 7723921 11577754 14777266 17724047 16236960 9860616 3092508
2274 3092508 666441 5565545 16769522 24806729 16331835 -10088893 -37904377 -49369612
2266 -49369612 -44595974 -37483257 -36838812 -39259500 -38289976 -32570714 -24756456 -18490068
2258a8490068J075180n374918q024695l887359M766427J3009165J6496442J2570909
2250A2141083K246634q767424j4744531j5300733j2816793o694329M525328J6802147
2242b2608618K2448602J8360153P930519l977786j3115699j4956839q020308K497868
2234a1442108R392945J0486514P035288q85963j1134165j5925791r977014N34110
2226b1916184N422928L893318J636205j399187q579341j4422536q803329N588319
2218c8579807J3190199O476995m212073n683262L013699J4036684J9965763J6146314
2210B4354512L037514j0013881j1771495l129442L854593K770505o84650p46804
2202G670852J040628L489724Q944845J4272091J0496958k719702j3398202j4169738
$$ plain form
2258 -18490068 -17414888 -22789806 -30814501 -34701860 -29935433 -16926268 -429826 12141083
2250 12141083 14387717 5620293 -9124238 -24424971 -37241764 -43936093 -39410765 -22608618
2242 -22608618 -160016 18200137 26130656 22152870 9037171 -5919668 -13939976 -11442108
2234 -11442108 -2049163 8437351 15472639 14586676 3452511 -12473280 -22450294 -21916184
2226 -21916184 -16493256 -12599938 -10963733 -12362920 -20942261 -35364797 -44168126 -38579807
2218 -38579807 -25389608 -18912613 -23124686 -28807948 -25794249 -11757565 8208198 24354512
2210 24354512 27392026 17378145 5606650 2477208 6331801 9102306 8417656 7670852
2202 7670852 8711480 12201204 21146049 35418140 45915098 43195396 29797194 15627456
2194A5627456j1689351j2719706j3101698q944009o472009r988037j1014629j851591
2186f0153574R101133Q815470m20905n427979j103651P188020J5090747K0541006
2178f369733J7810545L691752j2141182j5366351n562408L891718M468844J369203
2170h207612K820192Q610012J1277611M575580q589024j4791806k513678J9978521
2162A3159796K8084984J0311227j4781650k2120631j1863589l238094m046440
2155d494397m731905k15444J819161k743827o461915l901087J64927J324134K580353
2146a6660000N749757O414208K524146j287075k072538k188661j620664K962381
2138f178446Q185023M554953p881409j5711164j0221750J169962Q055958J0769474
$$ plain form
2194 15627456 3938105 -8781601 -21883299 -30827308 -37299317 -47287354 -58301983 -60153574
2186 -60153574 -51052441 -42236971 -42657876 -48085855 -49189506 -42001486 -26910739 -6369733
2178 -6369733 11440812 15132564 2991382 -12374969 -17937377 -14045659 -9576815 -8207612
2170 -8207612 -5387420 3222592 14500203 19075783 10486759 -4305047 -6818725 13159796
2162 13159796 41244780 51556007 36774357 14653726 2790137 -447957 -4494397
2155 -4494397 -9226302 -9441746 -7622585 -10366412 -16828327 -20729414 -20564487 -19240353 -16660000
2146 -16660000 -10910243 -4496035 -1971889 -3258964 -5331502 -7520163 -9140827 -6178446
2138 -6178446 2006577 6561530 -1319879 -17031043 -27252793 -26082831 -18026873 -7257399
2130g257399J3064701J1836221M554687j596444N97813N624055L052205o465096
2122B3410743j3404257j4124045j3254582j3250247j0788819l293925P628986
2115c7076146J8217397K3011293J6818298K523310p250035m222632L393721J856641
2107A7271847p898495j1665133l011642Q060747R832869K922704m203217o432675
2099D877005m392157j132857n22452m911136j1139640j2185766n243459M779754
2091b9870708J1177927J1302008N786384k859481q831256n977050L691498R049971
2083f530707K662954q634124j1657748l552927N501583O111364K96185l425408
2075a9228828p21083N949125J2158837J5066581J3552295Q510340L200221P28558
$$ plain form
2130 -7257399 5807302 17643523 22198210 20601766 21199579 26823634 29875839 23410743
2122 23410743 10006486 -4117559 -17372141 -30622388 -41411207 -44705132 -37076146
2115 -37076146 -18858749 4152544 20970842 23494152 16244117 12021485 15415206 17271847
2107 17271847 9373352 -2291781 -5303423 2757324 12590193 15512897 11309680 4877005
2099 4877005 484848 -648009 -1170461 -6081597 -17221237 -29407003 -34650462 -29870708
2091 -29870708 -18692781 -7390773 -1604389 -4463870 -13295126 -19272176 -15580678 -6530707
2083 -6530707 -3867753 -12501877 -24159625 -27712552 -22210969 -16099605 -15803420 -19228828
2075 -19228828 -19949911 -14000786 -1841949 13224632 26776927 35287267 38487488 39216046
2067C9216046O33430j96875k997739n685454o536046o819855q078438q705558
2059H29511n762341M35942N766096O525108K885205j907725m708850m815322l983455
2050d735831m308083n947695p191337o452534l393457J133196M606341L609501
2042b2679899j687529m971643p96287O115411N621041k289027n650888J118205
2034b5220616O899148Q07505r299275q168091K746728P999357K811666j794467
2026b3218045N0315N36052m030005m389791L036113N027052o693237j6175938
2018d5857484m287450J9467853K6881347J0126481r478314j3885865r868997j0657592
2010c7560021j3008707n769171Q935243J7532202J4381980P408853M624672M626249
$$ plain form
2067 39216046 39849476 39652601 36654862 30969408 24433362 17613507 9535069 829511
2059 829511 -4932830 -4496888 1269208 7794316 10679521 8771796 4062946 -752376 -4735831
2050 -4735831 -9043914 -14991609 -22182946 -28635480 -32028937 -30895741 -26289400 -22679899
2042 -22679899 -24367428 -29339071 -30135358 -24019947 -18398906 -20687933 -26338821 -25220616
2034 -25220616 -18321468 -17513963 -26813238 -34981329 -32234601 -24235244 -21423578 -23218045
2026 -23218045 -23167730 -22631678 -26661683 -31051474 -28015361 -22988309 -29681546 -45857484
2018 -45857484 -50144934 -30677081 -3795734 6330747 -3147567 -17033432 -26902429 -37560021
2010 -37560021 -50568728 -56337899 -47402656 -29870454 -15488474 -8079621 -3454949 1171300
2002A171300K694026q45319k530364k277427l702066q724036j4689998j7228443
1994d6132327j4173730o131821M689030J4266317J7189678J1005842L01590o846307
1986b5831728o976061k613310L786836J1301416J5094161Q078763o803894j3816840
1978a7780657k615524J5928770K1986040J1745704n25938l960072k659821m209567
1970A7908935q367848j1879625j4637771j4907848o943782R012774K0977073J8074006
1962I235914N108975l711543k893894L29570j231210n676673o827892k515374
1954h182127L785436O573713L083356l279543n079081Q35052Q456214R386658
1946A5579678L109397l521330o000852o382689p389352p455901m165465O63856
$$ plain form
2002 1171300 3865326 3020007 489643 -1787784 -5489850 -14213886 -28903884 -46132327
1994 -46132327 -60306057 -66437878 -61748848 -47482531 -30292853 -19287011 -18985421 -25831728
1986 -25831728 -32807789 -35421099 -31634263 -20332847 -5238686 2840077 -3963817 -17780657
1978 -17780657 -20396181 -4467411 17518629 29264333 28738395 24778323 22118502 17908935
1970 17908935 9541087 -2338538 -16976309 -31884157 -38827939 -29815165 -8838092 9235914
1962 9235914 14344889 10633346 7739452 8069022 6837812 1161139 -5666753 -8182127
1954 -8182127 -4396691 2177022 5260378 1980835 -3098246 -2263194 6193020 15579678
1946 15579678 18689075 15167745 9166893 2784204 -4605148 -12061049 -16226514 -15562658
1938a5562658K456214n99562n331290o484782j331898P431203J2644616Q109175
1930A331018m823830j6118725j4939645r52422J3172498J4185921M237913j61406
1922d068678J0890907K5308927K2580634J126629j8270803j9167065r110646n544524
1914C745381j0908244j3033044n960002K259748L266701n53535k020311J308973
1906b1894333O942838J0967217R016559o20932j1967815j4882461o983659K843287
1898b6579299O073782M339006L494764L488599N17606m176124m821082J10421
1890a7552327N140556M526603j553881p761304q340930j838393O969559J1129394
1882i280723R063467N650265L986924M05969p937635j4664395j0721373J775309
$$ plain form
1938 -15562658 -13106444 -13706006 -19037296 -25522078 -26853976 -19422773 -6778157 1331018
1930 1331018 -3492812 -19611537 -34551182 -35503604 -22331106 -8145185 -3907272 -4068678
1922 -4068678 6822229 32131156 54711790 55838419 37567616 18400551 9289905 3745381
1914 3745381 -7162863 -20195907 -26155909 -23896161 -20629460 -21182995 -23203306 -21894333
1906 -21894333 -14951495 -3984278 5032281 4411349 -7556466 -22438927 -29422586 -26579299
1898 -26579299 -20505517 -16166511 -12671747 -9183148 -8665542 -12841666 -17662748 -17552327
1890 -17552327 -12411771 -7885168 -9439049 -17200353 -25541283 -27379676 -20410117 -9280723
1882 -9280723 -217256 5433009 9419933 9825902 1888267 -12776128 -23497501 -21722192
1874b1722192J0040348O877800J0327J171157J0103004J4747861O580844q674969
1866A9134180j7604011j4291678n657220j126361j137848k8993K872317K819961
1858a5019653K90040K438024J0027687J2569698L999523n393225l291073N142013
1850A0763034N279888l598718q248690m043732j278373n520136p388563Q37779
1842a3197511J1674284J4645155J1373136Q953495P480552M049305J105142P72809
1834D6856367j778873r296255j4263592j0473271m871469n409113n126277N903611
1826A541128J8875679J5413576l268140j5710936j1019619j894578j494108m776550
1818b333548k135706K948259J847545l548872m719600K10913O348952R971818
$$ plain form
1874 -21722192 -11681844 -4804044 -4793717 -3622560 6480444 21228305 27809149 19134180
1866 19134180 1530169 -12761509 -18418729 -19545090 -20682938 -20711931 -17839614 -15019653
1858 -15019653 -14729613 -12291589 -2263902 10305796 14305319 8912094 5621021 10763034
1850 10763034 16042922 12444204 4195514 151782 -1126591 -6646727 -14035290 -13197511
1842 -13197511 -1523227 13121928 24495064 33448559 40929111 44978416 46083558 46856367
1834 46856367 45077494 35781239 21517647 11044376 6172907 763794 -4362483 1541128
1826 1541128 20416807 35830383 32562243 16851307 5831688 3937110 2443002 -2333548
1818 -2333548 -4469254 -1520995 326550 -3222322 -7941922 -7731009 -1382057 8589761
1810H589761R108992J817793q799930j3339003p224807J824086M335269J788712
1802a899127J449688L895483M426457L025309L782477O347407O087406J804492
1794B8919592l550041q781037j4504699j8011320j4518996m285202O061332J0005573
1786a8664798O512584j61068m031576k661465j45454j519130l782975J011957
1778b3441925J1812659J6775014J0703029M567703Q580943J4383871O866640j1302590
1770C8945344k1220666j3106239K726992J1940018J1904488P858225K869623k852050
1762C9065735q333917j2165054j3661707j1963684o805858p27834K363104J001239
1754a1227976l050659o066814l445590N696925J2896451O822472r700442j7971382
$$ plain form
1810 8589761 17698753 19516546 10716616 -2622387 -9847194 -8023108 -3687839 -1899127
1802 -1899127 -449439 3446044 7872501 10897810 14680287 21027694 27115100 28919592
1794 28919592 25369551 16588514 2083815 -15927505 -30446501 -34731703 -28670371 -18664798
1786 -18664798 -12152214 -12313282 -16344858 -19006323 -19151777 -20670907 -24453882 -23441925
1778 -23441925 -11629266 5145748 15848777 20416480 28997423 43381294 50247934 38945344
1770 38945344 17724678 4618439 7345431 19285449 31189937 39048162 41917785 39065735
1762 39065735 30731818 18566764 4905057 -7058627 -13864485 -14592319 -12229215 -11227976
1754 -11227976 -14278635 -20345449 -23791039 -18094114 -5197663 1624809 -8075633 -26047015
1746b6047015o812827J1026249J6450183R307408K540902p39444o614950j1954713
1738a2844207p194130L114649L296362p034732r881146J956943J2216070O782221
1730i587970n565359r370574m789331j655581l286912p312468j1856227j1279316
$$ plain form
1746 -26047015 -32859842 -21833593 -5383410 3923998 6464900 5725456 -889494 -12844207
1738 -12844207 -20038337 -16923688 -13627326 -20662058 -30543204 -28586261 -16370191 -9587970
1730 -9587970 -15153329 -24523903 -29313234 -30968815 -34255727 -41568195 -53424422 -64703738
$$ [...]
##END NTUPLES=NMR SPECTRUM
##END=
