##TITLE=31Pdec_DE-57_TFA
 DMSO-d6
 64 sc
 24.6.2024
##JCAMPDX= 6.0         $$ Bruker NMR JCAMP-DX V2.0
##DATA TYPE= NMR SPECTRUM
##DATA CLASS= NTUPLES
##ORIGIN= UXNMR, Bruker Analytische Messtechnik GmbH
##OWNER= root
$$ XWIN-NMR		Version 3.5
$$ Mon Jun 24 15:50:26 2024 Russian Standard Time (UT+4h)  she@DPX200
##.OBSERVE FREQUENCY= 81.013821
##.OBSERVE NUCLEUS= ^31P
##.ACQUISITION MODE= SIMULTANEOUS
##.ACQUISITION SCHEME= undefined
##.AVERAGES= 64
##.DIGITISER RES= 16
##SPECTROMETER/DATA SYSTEM= spect
##.PULSE SEQUENCE= zgpg30
##.SOLVENT NAME= CDCl3
##.SHIFT REFERENCE= (INTERNAL, CDCl3, 0, 248.564)
##AUDIT TRAIL= $$ (NUMBER, WHEN, WHO, WHERE, WHAT)
$$ ##TITLE= Audit trail, XWIN-NMR		Version 3.5
$$ ##JCAMPDX= 5.01
$$ ##ORIGIN= Bruker BioSpin GmbH
$$ ##OWNER= she
$$ F:/spectra/data/she/nmr/P31/1/pdata/1/auditp.txt
$$ ##AUDIT TRAIL=  $$ (NUMBER, WHEN, WHO, WHERE, WHAT)
(   1,<2024-06-24 15:49:41.93 +0400>,<she>,<DPX200>,
      <continue with go, POWCHK disabled, PULCHK disabled
       configuration hash MD5:
       00 E9 B6 7A A2 85 ED C7 34 08 36 98 17 FE 4E 26
       data hash MD5: 32K
       03 E1 FC 54 7E B4 09 CD EE F0 FE 9F D0 33 EC 2C>)
(   2,<2024-06-24 15:49:44.71 +0400>,<she>,<DPX200>,
      <Start of raw data processing
       efp BC_mod = 2 LB = 10 FT_mod = 6 PKNL = 1 PHC0 = -207.7518 PHC1 = 59.4 SI = 64K 
       data hash MD5: 64K
       27 5C 19 75 F1 66 D9 23 84 3C B4 4C 83 AB 3C 4C>)
(   3,<2024-06-24 15:49:59.07 +0400>,<she>,<DPX200>,
      <pk PHC0 = -30.19032 PHC1 = 121 
       data hash MD5: 64K
       44 95 94 09 96 EE 09 9F 0C B2 2C C7 56 81 58 D1>)
$$ ##END=
$$ 
$$ hash MD5
$$ CE 0E A3 14 29 26 25 29 B4 C5 8B 4E BC 6F 53 B5
##$RELAX= 
##$RELAX= 
##$RELAX= 
##$RELAX= 
##$RELAX= 
##$RELAX= 
##$RELAX= 
##$RELAX= 
##$RELAX= 
$$ Bruker specific parameters
$$ --------------------------
##$DU= <F:/spectra>
##$EXPNO= 1
##$NAME= <P31>
##$PROCNO= 1
##$TYPE= <nmr>
##$USER= <she>
##$AMP= (0..31)
100 100 100 100 100 100 100 100 100 100 100 100 100 100 100 100 100 100 
100 100 100 100 100 100 100 100 100 100 100 100 100 100 
##$AQSEQ= 0
##$AQ_mod= 1
##$AUNM= <au_zg>
##$AUTOPOS= <>
##$BF1= 81.014009
##$BF2= 200.13
##$BF3= 200.13
##$BF4= 200.13
##$BF5= 200.13
##$BF6= 200.13
##$BF7= 200.13
##$BF8= 200.13
##$BYTORDA= 1
##$CFDGTYP= 0
##$CFRGTYP= 5
##$CHEMSTR= <none>
##$CNST= (0..31)
1 1 145 1 1 1 1 1 1 1 1 1 1 1 1 1 1 1 1 1 1 1 1 1 1 1 1 1 1 1 1 1 
##$CPDPRG= <waltz16>
##$CPDPRG1= <>
##$CPDPRG2= <waltz16>
##$CPDPRG3= <>
##$CPDPRG4= <mlev>
##$CPDPRG5= <mlev>
##$CPDPRG6= <mlev>
##$CPDPRG7= <mlev>
##$CPDPRG8= <mlev>
##$CPDPRGB= <>
##$CPDPRGT= <>
##$D= (0..31)
0 1 0 0 0 0 0 0 0 0 0 0.03 2e-05 3e-06 0 0 0 0 0 0 0 0 0 0 0 0 0 0 0 0 
0 0 
##$DATE= 1719229700
##$DBL= (0..7)
120 120 120 11 120 120 24 19 
##$DBP= (0..7)
150 150 150 150 150 150 150 150 
##$DBP07= 0
##$DBPNAM0= <>
##$DBPNAM1= <>
##$DBPNAM2= <>
##$DBPNAM3= <>
##$DBPNAM4= <>
##$DBPNAM5= <>
##$DBPNAM6= <>
##$DBPNAM7= <>
##$DBPOAL= (0..7)
0.5 0.5 0.5 0.5 0.5 0.5 0.5 0.5 
##$DBPOFFS= (0..7)
$$ [...]
##$SUBNAM2= <"">
##$SUBNAM3= <"">
##$SUBNAM4= <"">
##$SUBNAM5= <"">
##$SUBNAM6= <"">
##$SUBNAM7= <"">
##$SUBNAM8= <"">
##$SUBNAM9= <"">
##$SW= 501.771253377433
##$SWIBOX= (0..15)
0 1 3 0 0 0 0 0 0 0 0 0 0 0 0 0 
##$SW_h= 40650.406504065
##$TD= 32768
##$TD0= 1
##$TE= 0
##$TE2= 300
##$TE3= 300
##$TEG= 300
##$TL= (0..7)
0 120 53 12 22 120 120 120 
##$TP= (0..7)
150 150 150 150 150 150 150 150 
##$TP07= 0
##$TPNAME0= <>
##$TPNAME1= <>
##$TPNAME2= <>
##$TPNAME3= <>
##$TPNAME4= <>
##$TPNAME5= <>
##$TPNAME6= <>
##$TPNAME7= <>
##$TPOAL= (0..7)
0.5 0.5 0.5 0.5 0.5 0.5 0.5 0.5 
##$TPOFFS= (0..7)
0 0 0 0 0 0 0 0 
##$TUNHIN= 0
##$TUNHOUT= 0
##$TUNXOUT= 0
##$USERA1= <user>
##$USERA2= <user>
##$USERA3= <user>
##$USERA4= <user>
##$USERA5= <user>
##$V9= 5
##$VALIST= <valist>
##$VCLIST= <CCCCCCCCCCCCCCC>
##$VD= 0
##$VDLIST= <DDDDDDDDDDDDDDD>
##$VPLIST= <PPPPPPPPPPPPPPP>
##$VTLIST= <TTTTTTTTTTTTTTT>
##$WBST= 1024
##$WBSW= 4
##$XGAIN= (0..3)
0 0 0 0 
##$XL= 0
##$YL= 0
##$YMAX_a= 3909
##$YMIN_a= -1972
##$ZGOPTNS= <>
##$ZL1= 120
##$ZL2= 120
##$ZL3= 120
##$ZL4= 120
##$ABSF1= 0
##$ABSF2= 0
##$ABSG= 0
##$ABSL= 0
##$ALPHA= 0
##$AQORDER= 0
##$ASSFAC= 0
##$ASSFACI= 0
##$ASSFACX= 0
##$ASSWID= 0
##$AUNMP= <proc_1d>
##$AZFE= 0.1
##$AZFW= 0.5
##$BCFW= 0
##$BC_mod= 2
##$BYTORDP= 0
##$COROFFS= 0
##$CY= -3
##$DATMOD= 1
##$DC= 0
##$DFILT= <>
##$DTYPP= 0
##$F1P= 0
##$F2P= 0
##$FCOR= 1
##$FTSIZE= 65536
##$FT_mod= 6
##$GAMMA= 0
##$GB= 0
##$INTBC= 1
##$INTSCL= 6.047779e-11
##$ISEN= 30
##$LB= 10
##$LEV0= 0
##$LPBIN= 0
##$MAXI= 10000
##$MC2= 0
##$MEAN= 0
##$ME_mod= 0
##$MI= 50
##$NCOEF= 0
##$NC_proc= -10
##$NLEV= 6
##$NOISF1= 182.463
##$NOISF2= 159.3651
##$NSP= 0
##$NTH_PI= 0
##$NZP= 0
##$OFFSET= 248.5645
##$PC= 4
##$PHC0= -237.9421
##$PHC1= 180.4
##$PH_mod= 1
##$PKNL= yes
##$PPARMOD= 0
##$PSCAL= 0
##$PSIGN= 0
##$REVERSE= no
##$SF= 81.0140089999694
##$SI= 65536
##$SIGF1= 159.3651
##$SIGF2= -187.1042
##$SINO= 113.3802
##$SIOLD= 16384
##$SREGLST= <1H.CDCl3>
##$SSB= 0
##$STSI= 65536
##$STSR= 0
##$SW_p= 40650.406504065
##$SYMM= 0
##$S_DEV= 0
##$TDeff= 32768
##$TDoff= 0
##$TI= <>
##$TILT= no
##$TM1= 0
##$TM2= 0
##$TOPLEV= 0
##$USERP1= <user>
##$USERP2= <user>
##$USERP3= <user>
##$USERP4= <user>
##$USERP5= <user>
##$WDW= 1
##$XDIM= 65536
##$YMAX_p= 294152426
##$YMIN_p= -50307271
$$ End of Bruker specific parameters
$$ ---------------------------------
##NTUPLES= NMR SPECTRUM
##VAR_NAME=  FREQUENCY,     SPECTRUM/REAL,   SPECTRUM/IMAG
##SYMBOL=    X,             R,               I
##VAR_TYPE=  INDEPENDENT,   DEPENDENT,       DEPENDENT
##VAR_FORM=  AFFN,          ASDF,            ASDF
##VAR_DIM=   65536,         65536,           65536
##UNITS=     HZ,            ARBITRARY UNITS, ARBITRARY UNITS
##FACTOR=    0.620285442955139, 1,           1
##FIRST=     20137.2065510682, 0,            0
##LAST=      -20513.1999529968, 0,           0
##MIN=       -20513.1999529968, -50307271,   0
##MAX=       20137.2065510682, 294152426,    0
$$ Real data points
##PAGE= N=1
##DATA TABLE= (X++(R..R)), XYDATA
$$ [...]
13078g917692O10568L37370J37594L2316P661L0912P0664J09167J41687J66660
13068f273093J75868J52956Q2437l6847j84326l23035m15077m37583l91421l01486
13058g951607k11001j70635k22664l84314o38978r41764j236948j477245j635169
13049a4870325j703728j690540j610991j483320j324496j144820r42112p01045
13041b5471377m02787m1647L63686P74707J150051J460316J690697J835594J895741
13032a6745019J880638J809285J703501J578204J438221J284836J124860R72411
13024d953063Q41295P34949O42302N42364M14543K49277N3469j53007l47730n15154
13014b490755o48412p45439q06286q33209q29126p93228p20009o05930m57778
$$ plain form
13078 -7917692 -7307124 -6969754 -6832160 -6799844 -6792183 -6761271 -6690607 -6581440 -6439753 -6273093
13068 -6273093 -6097225 -5944269 -5861832 -5898679 -6083005 -6406040 -6821117 -7258700 -7650121 -7951607
13058 -7951607 -8162608 -8333243 -8555907 -8940221 -9579199 -10520963 -11757911 -13235156 -14870325
13049 -14870325 -16574053 -18264593 -19875584 -21358904 -22683400 -23828220 -24770332 -25471377
13041 -25471377 -25874164 -25915811 -25552125 -24777418 -23627367 -22167051 -20476354 -18640760 -16745019
13032 -16745019 -14864381 -13055096 -11351595 -9773391 -8335170 -7050334 -5925474 -4953063
13024 -4953063 -4111768 -3376819 -2734517 -2192153 -1777610 -1528333 -1474864 -1627871 -1975601 -2490755
13014 -2490755 -3139167 -3884606 -4690892 -5524101 -6353227 -7146455 -7866464 -8472394 -8930172
13005h930172k92967j30782J6739J46002K55069L35659L71801L48543K65629J44501
12995g469978K0247p7070j37638j73197k05859k54180l25025m12973n03652n77040
12985a0116365o10635n85447m94972l51849j85581l0502Q9952J73883K39707L13216
12975a1558593M11987N39947O95702Q83311J110889J375930J650724J880933J999118
12966a010052J946667J695950J264364P12868J27382m08710q37539j134890j302098
12957A053942j349437j283135j103708q13109m22028M8162N67805J103058J620436
12948e78014K089897K483745K772743K925881K918165K742575K417748J986051
12940A9758791J502691J020375N76010J85095j55162m58294p41164j017443j291110
$$ plain form
13005 -8930172 -9223139 -9353921 -9337182 -9191180 -8936111 -8600452 -8228651 -7880108 -7614479 -7469978
12995 -7469978 -7449731 -7526801 -7664439 -7837636 -8043495 -8297675 -8622700 -9035673 -9539325 -10116365
12985 -10116365 -10727000 -11312447 -11807419 -12159268 -12344849 -12375351 -12285399 -12111516 -11871809 -11558593
12975 -11558593 -11146606 -10606659 -9910957 -9027646 -7916757 -6540827 -4890103 -3009170 -1010052
12966 -1010052 936615 2632565 3896929 4609797 4737179 4328469 3490930 2356040 1053942
12957 1053942 -295495 -1578630 -2682338 -3495447 -3917475 -3869313 -3301508 -2198450 -578014
12948 -578014 1511883 3995628 6768371 9694252 12612417 15354992 17772740 19758791
12940 19758791 21261482 22281857 22857867 23042962 22887800 22429506 21688342 20670899 19379789
12931A9379789j551608j773855j923503j964649j867575j616754j219281p10140
12923F752424j47629M04171Q98178J316364J660824J931172K107920K156368K048547
12914A9128339J788126J421724J027918O88035M55053L38561L11554L30142L53824
12905B5843276L59722L48078L36640L45709L82394M33240M67039M43743L25553
12896B9285394Q7734k73537p37605j259260j772982k205461k495809k612910k557822
12887A5457742k351590k021725j598959j123116o47224k30918P5403K44492K74115
12878H078220J78994j4504k64300n08856o78642p23014o35680m61275k78201j65264
12868D527478j66298k69818m16279n30392n59340m94715l68918k33755j36944
$$ plain form
12931 19379789 17828181 16054326 14130823 12166174 10298599 8681845 7462564 6752424
12923 6752424 6604795 7008966 7907144 9223508 10884332 12815504 14923424 17079792 19128339
12914 19128339 20916465 22338189 23366107 24054142 24509195 24847756 25159310 25489452 25843276
12905 25843276 26202998 26551076 26887716 27233425 27615819 28049059 28516098 28959841 29285394
12896 29285394 29373128 29099591 28361986 27102726 25329744 23124283 20628474 18015564 15457742
12887 15457742 13106152 11084427 9485468 8362352 7715128 7484210 7559613 7804105 8078220
12878 8078220 8257214 8242710 7978410 7469554 6790912 6067898 5432218 4970943 4692742 4527478
12868 4527478 4361180 4091362 3675083 3144691 2585351 2090636 1721718 1487963 1351019
12859A351019j08217j56436k72071m31061o01263p52383q64413r28675r42360
12850c705860r02877q05262o42044m06346r9265K63673O55544J050168J431402
12841c160867J790229K114003K378636K548557K582692K445166K120083J625222
12833A4443721J016392L78385j94671o23640q66751r31739q70274p54353o45437
12824A0951633n72896n32705n03277m64356m06532l30431k42090j48474n3136
12815G697736M5584J49421K51486L35521L87946M11032M21667M35767M53200M55053
12805A1044413M12216K98301J02452j60980m50061p02513q50103q35794o30303
12796H227628k44353K68589Q22312J317927J667053J811097J732515J456600J044491
$$ plain form
12859 1351019 1242802 1086366 814295 383234 -218029 -970412 -1834825 -2763500 -3705860
12850 -3705860 -4608737 -5413999 -6056043 -6462389 -6561654 -6297981 -5642437 -4592269 -3160867
12841 -3160867 -1370638 743365 3122001 5670558 8253250 10698416 12818499 14443721
12833 14443721 15460113 15838498 15643827 15020187 14153436 13221697 12351423 11597070 10951633
12824 10951633 10378737 9846032 9342755 8878399 8471867 8141436 7899346 7750872 7697736
12815 7697736 7743320 7892741 8144227 8479748 8867694 9278726 9700393 10136160 10589360 11044413
12805 11044413 11456629 11754930 11857382 11696402 11246341 10543828 9693725 8857931 8227628
12796 8227628 7983275 8251864 9074176 10392103 12059156 13870253 15602768 17059368 18103859
12787A8103859N78749J43247j98405m17959n23556n46949n25887m91716m65693
12778A5655690m60507m81888n27864n87669o44810o86306p13159p43294q02977
12769A0007216r12054j071641j259269j432406j540523j543041j424806j199968
12761c76492r04192n84572k94437q9688j9146j09460l53721p11260j117219j496089
12751f056276j775740j900787j843034j605815j221839p46859k50685J94889N30421
12742a4675725P21350P63660O80447N10589K93821N8725j79942m13528o28097
12733a2868700p99219q97312q99010p96106n97405l25389j2027L05111N89277
12724a6300780Q15148R78911J099248J205281J317740J435402J534322J578092
$$ plain form
12787 18103859 18682608 18825855 18627450 18209491 17685935 17138986 16613099 16121383 15655690
12778 15655690 15195183 14713295 14185431 13597762 12952952 12266646 11553487 10810193 10007216
12769 10007216 9095162 8023521 6764252 5331846 3791323 2248282 823476 -376492
12761 -376492 -1280684 -1865256 -2159693 -2249381 -2268527 -2377987 -2731708 -3442968 -4560187 -6056276
12751 -6056276 -7832016 -9732803 -11575837 -13181652 -14403491 -15150350 -15401035 -15206146 -14675725
12742 -14675725 -13954375 -13190715 -12510268 -11999679 -11705858 -11647133 -11827075 -12240603 -12868700
12733 -12868700 -13667919 -14565231 -15464241 -16260347 -16857752 -17183141 -17195168 -16890057 -16300780
12724 -16300780 -15485632 -14506721 -13407473 -12202192 -10884452 -9449050 -7914728 -6336636
12716f336636J532112J376420J115312P82345M37304J51663j5419m0804N2334
12707i45369K05176L50119M38597M53624M01174K89917J17222j27198m45120q17328
12697g9186j205722j566129j860138k059674k147546k118783j982373j759623
12689a4779174j478008j163795q37400n12463j97129J03589L83666O30064Q18687
12680a7031963R18414R04751P75422N56551K95218M4928j47038k47710k44320
12671a4175747j47561J2346J98532L82825N53128P07706Q40715R29769R36027
12662i762260Q20278N67632K05129k01307n70522q35561r60359r36802p71405
12653a2445177m77819q2526L65180P95310J137971J351220J436207J429330J378006
$$ plain form
12716 -6336636 -4804524 -3428104 -2312792 -1530447 -1093143 -941480 -956899 -997703 -945369
12707 -945369 -740193 -390074 48523 502147 903321 1193238 1310460 1183262 738142 -79186
12697 -79186 -1284908 -2851037 -4711175 -6770849 -8918395 -11037178 -13019551 -14779174
12689 -14779174 -16257182 -17420977 -18258377 -18770840 -18967969 -18864380 -18480714 -17850650 -17031963
12680 -17031963 -16113549 -15208798 -14433376 -13876825 -13581607 -13536679 -13683717 -13931427 -14175747
12671 -14175747 -14323308 -14310962 -14112430 -13729605 -13176477 -12468771 -11628056 -10698287 -9762260
12662 -9762260 -8941982 -8374350 -8169221 -8370528 -8941050 -9776611 -10736970 -11673772 -12445177
12653 -12445177 -12922996 -13005522 -12640342 -11845032 -10707061 -9355841 -7919634 -6490304 -5112298
12644e112298J315415J247024J153428J005748P83847M87861J40215k18653n38974
12635B63613p75789r05370r33725q90629q15558p46733p14791p34529p95761q64342
12625g913614q98317q67148p57822n66542k89271P7581N27592J035306J555773
12616h096462K034677K424225K695786K841868K867552K778855K576815K261722
12608A2385038J844496J356270Q46948L71800k5282l21772n17291o29221o86442
12599A4624544p21243p59831q14123q78328r33037r57373r43749r03618q56900
12590F856342q13411p64804o95386n99783m88927l80296k85075k05220j40513
12581B482927r5338p6846q5926j10904j33023j41726j45567j64754k07568k50673
$$ plain form
12644 -5112298 -3796883 -2549859 -1396431 -390683 393164 881025 1021240 802587 263613
12635 263613 -512176 -1417546 -2351271 -3241900 -4057458 -4804191 -5518982 -6253511 -7049272 -7913614
12625 -7913614 -8811931 -9679079 -10436901 -11003443 -11292714 -11215133 -10687541 -9652235 -8096462
12616 -8096462 -6061785 -3637560 -941774 1900094 4767646 7546501 10123316 12385038
12608 12385038 14229534 15585804 16432752 16804552 16779270 16457498 15940207 15310986 14624544
12599 14624544 13903301 13143470 12329347 11451019 10517982 9560609 8616860 7713242 6856342
12590 6856342 6042931 5278127 4582741 3982958 3494031 3113735 2828660 2623440 2482927
12581 2482927 2387589 2310743 2224817 2113913 1980890 1839164 1693597 1528843 1321275 1070602
12571A070602k43224j34944R2156M10877P61518J079380J319906J468969J535512
12562G360752J533497J465901J321313J084096P50126L38402j06763n23969q51468
12553A2371887j046942j101773j042922r21613p94027p02116o62696o69093p01419
12544D729286p35640p45960p05601n93695m06302j60422J15451L97644O77940
12535B572701R62436J261988J581252J911259K227900K496963K684677K769574
12527A8468750K749051K635886K447116K193898J879151J501779J062628N71109
12519C3509368N3853m38929q39639j086328j152007j061129q81386o95334n68763
12510B6839706n32961n86563p09063q73304j051288j216215j344586j417931j423459
$$ plain form
12571 1070602 827378 692434 784590 1195467 1956985 3036365 4356271 5825240 7360752
12562 7360752 8894249 10360150 11681463 12765559 13515685 13854087 13747324 13223355 12371887
12553 12371887 11324945 10223172 9180250 8258637 7464610 6762494 6099798 5430705 4729286
12544 4729286 3993646 3247686 2542085 1948390 1542088 1381666 1497117 1894761 2572701
12535 2572701 3535137 4797125 6378377 8289636 10517536 13014499 15699176 18468750
12527 18468750 21217801 23853687 26300803 28494701 30373852 31875631 32938259 33509368
12519 33509368 33563221 33124292 32284653 31198325 30046318 28985189 28103803 27408469 26839706
12510 26839706 26306745 25720182 25011119 24137815 23086527 21870312 20525726 19107795 17684336
12501A7684336j355611j219627j033413q23671o17848m37114k93319j89298j21780
12492A1592655q6543q3844j20795k08634l55085n54366p81208r96599j165254
12483G240327j272366j324854j336679j313489j250623j143028r95108q22347
12475b218167o46403m89084l67568k90204k52762k37462k17983j70864q8457J4929
12465d964025J09731J68311J81665J63316J37053J18303J04428Q0434L1877m7839
12455c916746j59105k99070m58973o18368p43791p95628p40458n63804k78469
12446h574412P5245M38802P51060R64421J056151J031964R20943P63836O00084
12437a971906M59461L59317L03758K82450K72453K47619J93311J16673M4026O468
$$ plain form
12501 17684336 16328725 15109098 14075685 13252014 12634166 12197052 11903733 11714435 11592655
12492 11592655 11506112 11422268 11301473 11092839 10737754 10183388 9402180 8405581 7240327
12483 7240327 5967961 4643107 3306428 1992939 742316 -400712 -1395820 -2218167
12475 -2218167 -2864570 -3353654 -3721222 -4011426 -4264188 -4501650 -4719633 -4890497 -4978954 -4964025
12465 -4964025 -4854294 -4685983 -4504318 -4341002 -4203949 -4085646 -3981218 -3900784 -3868907 -3916746
12455 -3916746 -4075851 -4374921 -4833894 -5452262 -6196053 -6991681 -7732139 -8295943 -8574412
12446 -8574412 -8499167 -8060365 -7309305 -6344884 -5288733 -4256769 -3335826 -2571990 -1971906
12437 -1971906 -1512445 -1153128 -849370 -566920 -294467 -46848 146463 263136 307162 313630
12427C13630K3649R6120K10145L50099N08255O83274Q67850J036850J149293J167015
12417F406180J078415R10428P19419N65733M87064M87015N44650O34668P40444
12408A2574016Q52172R59237J049368J114069J149103J145966J084561R38999
12400B0867491O94792L63650j5682l90567p12320r48773j087605j133290j102403
12391A6535293j018502r05296p79982o52507n32824m39135l97068m27503n31427
12382A0851049o83575q40935r62595j029481j051369j056162j068270j090081
12374C068581j098566j060559r58903q12248o71417n91374n99142o82931q08353
12365d214912r44007j075303j201236j323327j436566j526172j570659j549743
$$ plain form
12427 313630 337279 433399 643544 993643 1501898 2185172 3053022 4089872 5239165 6406180
12417 6406180 7484595 8395023 9114442 9680175 10167239 10654254 11198904 11833572 12574016
12408 12574016 13426188 14385425 15434793 16548862 17697965 18843931 19928492 20867491
12400 20867491 21562283 21925933 21910251 21519684 20807364 19858591 18770986 17637696 16535293
12391 16535293 15516791 14611495 13831513 13179006 12646182 12207047 11809979 11382476 10851049
12382 10851049 10167474 9326539 8363944 7334463 6283094 5226932 4158662 3068581
12374 3068581 1970015 909456 -49447 -861695 -1533112 -2124486 -2723628 -3406559 -4214912
12365 -4214912 -5158919 -6234222 -7435458 -8758785 -10195351 -11721523 -13292182 -14841925
12357a4841925j452107j276692j027006p05600l16502J25100N85377J016527J374121
12348a6518707J635420J803847J895845J923035J887192J791380J652567J499882
12340b429539J359208J239051J128601J005154Q42509O18189L22412l2777m11526
12331C641282p63054j036022j190052j201600j066368p99571m33312j1140M18462
12322b441375Q09122J124400J344218J465667J497301J451720J341617J179559
12314G772229R78196P49599N05564K60389L4228j47075k58431k86756k40419j48988
12304I218536n0430K7518P9767J21942J76483K57081L60697M68971N54866N91325
12294A1806756N61981M72707L57274K69580K63384L69963N84519Q65243J144067
$$ plain form
12357 -14841925 -16294032 -17570724 -18597730 -19303330 -19619832 -19494732 -18909355 -17892828 -16518707
12348 -16518707 -14883287 -13079440 -11183595 -9260560 -7373368 -5581988 -3929421 -2429539
12340 -2429539 -1070331 168720 1297321 2302475 3144984 3763173 4085585 4052808 3641282
12331 3641282 2878228 1842206 652154 -549446 -1615814 -2415385 -2848697 -2859837 -2441375
12322 -2441375 -1632253 -507853 836365 2302032 3799333 5251053 6592670 7772229
12314 7772229 8750425 9500024 10005588 10265977 10300205 10153130 9894699 9607943 9367524 9218536
12304 9218536 9168106 9195624 9275391 9397333 9573816 9830897 10191594 10660565 11215431 11806756
12294 11806756 12368737 12841444 13198718 13468298 13731682 14101645 14686164 15551407 16695474
12285A6695474J347064J419185J342623J138749Q53461N35564K19097q4172l80463
12276B3086582o81028r89314j296999j588539j845114k042926k152213k145190
12268A0345259k009477j754743j407072r98692n62761j32944K59381N91990Q55784
12259E186725J049660J170395J208020J151749J000728P70237M90178J99596n9239
12250A2168049k47520l38225l23291k15561m4636J50220L26606M43824M67509
12241A2386975L76263J70206j23230m53215p61182j000789j150075j209342j189021
12232G046590j098231r42446p30841m86186k47572o1257L6484L5123m3771j52632
12222C355261k34697k45441j68702j9026J69753L60500N24211O45638P26608P86225
$$ plain form
12285 16695474 18042538 19461723 20804346 21943095 22796556 23332120 23551217 23467045 23086582
12276 23086582 22405554 21416240 20119241 18530702 16685588 14642662 12490449 10345259
12268 10345259 8335782 6581039 5173967 4175275 3612514 3479570 3738951 4330941 5186725
12259 5186725 6236385 7406780 8614800 9766549 10767277 11537514 12027692 12227288 12168049
12250 12168049 11920529 11582304 11259013 11043452 10998816 11149036 11475642 11919466 12386975
12241 12386975 12763238 12933444 12810214 12356999 11595817 10595028 9444953 8235611 7046590
12232 7046590 5948359 5005913 4275072 3788886 3541314 3480057 3516541 3551664 3507893 3355261
12222 3355261 3120564 2875123 2706421 2687395 2857148 3217648 3741859 4387497 5114105 5900330
12212E900330Q52351R43828J054417J152790J200776J175660J078865R26734P34751
12203A5020502N09108K48953m7128l76366p28640j082768j404711j653499j796508
12194H688943j826625j769266j672656j586839j544476j552804j595655j638657
12186d498035j634810j534170j300952r33214m73480n84L97327O57345P66540
12177h554033P63476P16276O90837P26980Q32253R91228J181359J386028J597581
12168C31985J807879J992472K102731K078157J876179J500859J010354M97740
12160A3198356N7210k46019l89749l90669k88239j26856N4992K26954L65913M57794
12150A2919687N01298N08062M96071M79754M63421M42110M08186L57303K87706
$$ plain form
12212 5900330 6752681 7696509 8750926 9903716 11104492 12280152 13359017 14285751 15020502
12203 15020502 15529610 15778563 15731435 15355069 14626429 13543661 12138950 10485451 8688943
12194 8688943 6862318 5093052 3420396 1833557 289081 -1263723 -2859378 -4498035
12186 -4498035 -6132845 -7667015 -8967967 -9901181 -10374661 -10375245 -9977918 -9320573 -8554033
12177 -8554033 -7790557 -7074281 -6383444 -5656464 -4824211 -3832983 -2651624 -1265596 331985
12168 331985 2139864 4132336 6235067 8313224 10189403 11690262 12700616 13198356
12160 13198356 13255566 13009547 12619798 12229129 11940890 11814034 11869026 12095980 12461893 12919687
12150 12919687 13420985 13929047 14425118 14904872 15368293 15810403 16218589 16575892 16863598
12141A6863598J93481N9889j31064l86597o91860j011525j304132j540045j712148
12132A0339597j833100j920623j980683k000959j959778j843336j658231j431483
12124d288596j199658r93981q29171p01434n95727m96496l95631k96847k18432
12115a0015973j91538k48016l99940o24975q70280j071626j172409j133138r35135
12106a6663030n84878j16665M13358R41938J413964J790988K053204K198485K239253
12097f313383K196336K091538J943306J767173J578297J392487J225483J092117
12089F973354J005324R72835R90853J038678J080524J077789J007076Q73172P07202
12080A5726807N49317M25890L35258K50530J37271k4539k26662m34209o01465
$$ plain form
12141 16863598 17057079 17116968 16985904 16599307 15907447 14895922 13591790 12051745 10339597
12132 10339597 8506497 6585874 4605191 2604232 644454 -1198882 -2857113 -4288596
12124 -4288596 -5488254 -6482235 -7311406 -8012840 -8608567 -9105063 -9500694 -9797541 -10015973
12115 -10015973 -10207511 -10455527 -10855467 -11480442 -12350722 -13422348 -14594757 -15727895 -16663030
12106 -16663030 -17247908 -17364573 -16951215 -16009277 -14595313 -12804325 -10751121 -8552636 -6313383
12097 -6313383 -4117047 -2025509 -82203 1684970 3263267 4655754 5881237 6973354
12089 6973354 7978678 8951513 9942366 10981044 12061568 13139357 14146433 15019605 15726807
12080 15726807 16276124 16702014 17037272 17287802 17425073 17400534 17173872 16739663 16138198
12071A6138198o92755o96099o22008m90380l17705j16124R6102K85416M07538
12062A3992183M24815L22955J15333j65137m78455p87507j063534j286552j441082
12053I633019j511030j480134j340318j102659q02466m93900k35298o9967r547
12044B587700k8454p5026r5819o0311K8390J42822K53753L50928M48115N69562
12034D121660P28411R13033J090321J221998J282373J267864J195607J094134
12026A2915401R91893R09376Q57211Q37617Q44101Q58259Q48442P76456O12460
12017B0451216L50302J2525l60494p32300j089045j441882j811131k203850k600067
12008A0575274k954656l210849l317304l243196k988531k587130k100420j603342
$$ plain form
12071 16138198 15445443 14749344 14127336 13636956 13319251 13203127 13299229 13584645 13992183
12062 13992183 14416998 14739953 14855286 14690149 14211694 13424187 12360653 11074101 9633019
12053 9633019 8121989 6641855 5301537 4198878 3396412 2902512 2667214 2597247 2587700
12044 2587700 2559246 2484220 2388401 2328090 2356480 2499302 2753055 3103983 3552098 4121660
12034 4121660 4850071 5763104 6853425 8075423 9357796 10625660 11821267 12915401
12026 12915401 13907294 14816670 15673881 16511498 17355599 18213858 19062300 19838756 20451216
12017 20451216 20801518 20814043 20453549 19721249 18632204 17190322 15379191 13175341 10575274
12008 10575274 7620618 4409769 1092465 -2150731 -5139262 -7726392 -9826812 -11430154
12000a1430154j166962q43186o55277n95914o32363p16382p95437q23163p68997
11991a8427835o26582m17213j83421K6642J75819K47119K45939K01628J67838
11982a8590066K11328L83328O86659J062796J411596J633414J670978J531792
11974i998175J281879J012816P97629O60516N77909N06010M12156K90426J58206
11965d300628M2983l0211m5501K418J07995K52658M03079N15466N47703M74092
11955b029946K95198L8840k47622n11509p11221q28011q67623q51882q06222p50054
11945g270052o93602o40104n89461n39889m87486m26346l51228k62074j68512
11936a1428754r2150o3510j10030k37919m19824o01545p27369p66633p22335o18847
$$ plain form
12000 -11430154 -12597116 -13440302 -14095579 -14691493 -15323856 -16040238 -16835675 -17658838 -18427835
11991 -18427835 -19054417 -19471630 -19655051 -19628409 -19452590 -19205471 -18959532 -18757904 -18590066
11982 -18590066 -18378738 -17995410 -17308751 -16245955 -14834359 -13200945 -11529967 -9998175
11974 -9998175 -8716296 -7703480 -6905851 -6245335 -5667426 -5161416 -4749260 -4458834 -4300628
11965 -4300628 -4257645 -4287856 -4333357 -4330939 -4222944 -3970286 -3567207 -3051741 -2504038 -2029946
11955 -2029946 -1734748 -1695908 -1943530 -2455039 -3166260 -3994271 -4861894 -5713776 -6519998 -7270052
11945 -7270052 -7963654 -8603758 -9193219 -9733108 -10220594 -10646940 -10998168 -11260242 -11428754
11936 -11428754 -11520904 -11584414 -11694444 -11932363 -12352187 -12953732 -13681101 -14447734 -15170069 -15788916
11926a5788916m82785l31696j72282j200J94651M33827P28865J072953J434620
11917a2911963J765370K016618K157279K183548K116361J988825J832194J669027
11909B817259J515096J384488J291712J248548J256830J300252J341156J328597
11901A3483938J217693R90227O63059K79027j12597m73363p82080j031128j219362
11892A3015414j347962j420197j441328j415366j339995j205076r99039p21498
11884C124953l94243o2236K17071L89825M20190L01133O1559k35384n09481o91968
11874B621419p48387o82145n23431l18661j25678n482l774j30858l54714o11221
11864h82932q23528r23334q72917o84246m22564j82594m3278k6935r0153j52583
$$ plain form
11926 -15788916 -16271701 -16603397 -16775679 -16776879 -16582228 -16148401 -15419536 -14346583 -12911963
11917 -12911963 -11146593 -9129975 -6972696 -4789148 -2672787 -683962 1148232 2817259
11909 2817259 4332355 5716843 7008555 8257103 9513933 10814185 12155341 13483938
11901 13483938 14701631 15691858 16354917 16633944 16521347 16047984 15265904 14234776 13015414
11892 13015414 11667452 10247255 8805927 7390561 6050566 4845490 3846451 3124953
11884 3124953 2730710 2668474 2885545 3275370 3695560 3996693 4058252 3822868 3313387 2621419
11874 2621419 1873032 1190887 667456 348795 223117 217635 213861 83003 -271711 -882932
11864 -882932 -1706460 -2629794 -3502711 -4186957 -4609521 -4792115 -4835393 -4862328 -4952481 -5105064
11854e105064j43468l6161J46743L53466N31465O48318O97940O93154O51256N81983
11844i80368M85311L58631K04597L0574j59558l70651o09411q68875j118340j309598
11834d337688j396474j354040j186228r21205o01081k71398K8553K74256M60010
11825i305295N95053O94039P69521Q31244Q88034R44655R94900J021990J012750
11816a553109R75290R41392R47685J010518J114997J224502J300542J319118J276429
11807H557364J183548J054546Q96535P09600M96129K69381N2474j29936k58312
11798A2831329l19604l07518k24457q1789J04247L16720N36785P39704Q96414
11789A4491831R82889R89670R23093P98483O32301M38681K30457K1675j71556
$$ plain form
11854 -5105064 -5248532 -5284693 -5137950 -4784484 -4253019 -3604701 -2906761 -2213607 -1562351 -980368
11844 -980368 -495057 -136426 68171 98745 -60813 -431464 -1040875 -1909750 -3028090 -4337688
11834 -4337688 -5734162 -7088202 -8274430 -9195635 -9796716 -10068114 -10039561 -9765305 -9305295
11825 -9305295 -8710242 -8016203 -7246682 -6415438 -5527404 -4582749 -3587849 -2565859 -1553109
11816 -1553109 -577819 363573 1311258 2321776 3436773 4661275 5961817 7280935 8557364
11807 8557364 9740912 10795458 11691993 12401593 12897722 13167103 13219577 13089641 12831329
11798 12831329 12511725 12204207 11979750 11897961 12002208 12318928 12855713 13595417 14491831
11789 14491831 15474720 16464390 17387483 18185966 18818267 19256948 19487405 19509080 19337524
11780A9337524l33683m54857n34718n81485o07339o24689o45877o84424p54517
11771A4115935q68558j035157j258114j533893j846260k162639k439373k636742
11763C35199k733956k732047k642924k475040k227317j893214j468416r56303
11755a6794018l70480K64062R11216J526581K063252K479738K748542K862602
11747d308505K835873K695988K472046K185387J850499J484790J116897P83349
11739A1116324N14768L24078K07103J52296J47205J75026K07799K07246J36152
11730A3187997k7765k84963o16072r87194j353404j661425j855996j891720j747170
11721B762288j436238j012162n59794j73756P2345J51564R0623m4129j72681k27808
$$ plain form
11780 19337524 19003841 18548984 18014266 17432781 16825442 16200753 15554876 14870452 14115935
11771 14115935 13247377 12212220 10954106 9420213 7573953 5411314 2971941 335199
11763 335199 -2398757 -5130804 -7773728 -10248768 -12476085 -14369299 -15837715 -16794018
11755 -16794018 -17164498 -16900436 -15989220 -14462639 -12399387 -9919649 -7171107 -4308505
11747 -4308505 -1472632 1223356 3695402 5880789 7731288 9216078 10332975 11116324
11739 11116324 11631092 11955170 12162273 12314569 12461774 12636800 12844599 13051845 13187997
11730 13187997 13160232 12875269 12259197 11272003 9918599 8257174 6401178 4509458 2762288
11721 2762288 1326050 313888 -245906 -419662 -347317 -195753 -105130 -149259 -321940 -549748
11711e49748j74900k1909J82886L66179M56023M11907K44804J2976k07889l61583
11701C58746m29831m23431l60602k52434j01404R4049L34986O17606R28888J245356
11691B011929J537237J775831J939558K015871J999318J888834J687724J407019
11683A6263321J069009P06854L59504O3804j53738k83136l33167l29872l13307
11674A7049272l31221m24982o08942q57021j111913j314472j431765j464256j433074
11665H071626j362948j272140j169019j051210r07758p26918n07805k69067m8068
11656G56693J10066J68292J11985m2462k48101m40538n62977n91967n46495m72511
11646a758015m13646l88821l88959l88746l61047k84969j46702O1902L41300O78132
$$ plain form
11711 -549748 -724648 -746557 -563671 -197492 258531 670438 915242 928218 720329 358746
11701 358746 -71085 -494516 -855118 -1107552 -1208956 -1114907 -779921 -162315 766573 2011929
11691 2011929 3549166 5324997 7264555 9280426 11279744 13168578 14856302 16263321
11683 16263321 17332330 18039184 18398688 18462492 18308754 18025618 17692451 17362579 17049272
11674 17049272 16718051 16293069 15684127 14827106 13715193 12400721 10968956 9504700 8071626
11665 8071626 6708678 5436538 4267519 3216309 2308551 1581633 1073828 804761 756693
11656 756693 866759 1035051 1147036 1104574 856473 415935 -147042 -739009 -1285504 -1758015
11646 -1758015 -2171661 -2560482 -2949441 -3338187 -3699234 -3984203 -4130905 -4069003 -3727703 -3049571
11636c049571J040831J384069J662029J842509J913987J885413J783212J647481
11628A0109960J524200J451050J440997J473649J501961J472323J346220J110941
11620B1431301P76628L67867q0752n25199r16747j214853j400643j479198j468571
11611A5489833j386139j244097j055254q41015o34031m74169l99564m34857n80675
11602H440032q10359j076579j324026j502538j579171j549175j440372j303024
11594b145212j186401j117107j094323j101663j120424j131783j110798j025036
11586a1032747q45025n60931j93142K10708N89442Q83431J043951J038005Q54747
11577h011561N15671Q1293l56323o97925q68665q41464o41031l26859L6128M03605
$$ plain form
11636 -3049571 -2008740 -624671 1037358 2879867 4793854 6679267 8462479 10109960
11628 10109960 11634160 13085210 14526207 15999856 17501817 18974140 20320360 21431301
11620 21431301 22207929 22575796 22495044 21969845 21053098 19838245 18437602 16958404 15489833
11611 15489833 14103694 12859597 11804343 10963328 10329297 9855128 9455564 9020707 8440032
11602 8440032 7629673 6553094 5229068 3726530 2147359 598184 -842188 -2145212
11594 -2145212 -3331613 -4448720 -5543043 -6644706 -7765130 -8896913 -10007711 -11032747
11586 -11032747 -11877772 -12438703 -12631845 -12421137 -11831695 -10948264 -9904313 -8866308 -8011561
11577 -8011561 -7495890 -7414597 -7770920 -8468845 -9337510 -10178974 -10820005 -11146864 -11110736 -10707131
11567a0707131P59729J104525J433921J729281J961259K099322K117888J999693
11559B498487J741254J359560Q92930L92099r4156n30571q99044j195068j420901
11550B744590j579932j674700j708247j686399j618599j516788j393774j262489
11542i696338j135980j026400r42081q84027q43910q04702p44142o41576m87374
11533a7206530k90497p8370J11900K45820L01599K75987J84796N5968q3384k17122
11523a6699833l38718m41312n12044n38177n18292m66324m05123l56440l34613
11514b0610876l44406l79783m22623m43776m09430k93435r2022J66794M27395
11505b2402162O26010P16491O88210N67542M05795K62177J87701K12354L38498
$$ plain form
11567 -10707131 -9947402 -8842877 -7408956 -5679675 -3718416 -1619094 498794 2498487
11559 2498487 4239741 5599301 6492231 6884330 6790174 6259603 5360559 4165491 2744590
11550 2744590 1164658 -510042 -2218289 -3904688 -5523287 -7040075 -8433849 -9696338
11542 -9696338 -10832318 -11858718 -12800799 -13684826 -14528736 -15333438 -16077580 -16719156 -17206530
11533 -17206530 -17497027 -17575397 -17463497 -17217677 -16916078 -16640091 -16455295 -16399327 -16482711 -16699833
11523 -16699833 -17038551 -17479863 -17991907 -18530084 -19048376 -19514700 -19919823 -20276263 -20610876
11514 -20610876 -20955282 -21335065 -21757688 -22201464 -22610894 -22904329 -22996351 -22829557 -22402162
11505 -22402162 -21776152 -21059661 -20371451 -19803909 -19398114 -19135937 -18948236 -18735882 -18397384
11496a8397384N43252P87144J021889J195366J260277J190512R96167P22455M29064
11487a0251258J63097n7283k40293m02400n46111o48970o73755n94272m17236
11478a3668481j83784M8544K29134L29799L47748K98134K02116P8149n8922j93914
11468a2571477l09362l88301m18316l92771l09330j69058K1533K46394M78676
11459a3812012O86926Q46877R49481R97869R97819R53771Q74793P81076O99246
11450f024154O46881O19039N89124N25078M10712K58645J06810O80k7921K6489
11440b868617J43672K87097M14224M84779M70148L65392J96762J4376j30002k05493
11430h27662k09164j56101o4766N0705J79723L11113M30423N21091N69563N70820
$$ plain form
11496 -18397384 -17854132 -17066988 -16045099 -14849733 -13589456 -12398944 -11402777 -10680322 -10251258
11487 -10251258 -10088161 -10145444 -10385737 -10788137 -11334248 -11983218 -12656973 -13251245 -13668481
11478 -13668481 -13852265 -13803721 -13574587 -13244788 -12897040 -12598906 -12396790 -12318641 -12377563 -12571477
11468 -12571477 -12880839 -13269140 -13687456 -14080227 -14389557 -14558615 -14537082 -14290688 -13812012
11459 -13812012 -13125086 -12278209 -11328728 -10330859 -9333040 -8379269 -7504476 -6723400 -6024154
11450 -6024154 -5377273 -4758234 -4169110 -3644032 -3233320 -2974675 -2867865 -2867185 -2895106 -2868617
11440 -2868617 -2724945 -2437848 -2023624 -1538845 -1068697 -703305 -506543 -492167 -622169 -827662
11430 -827662 -1036826 -1192927 -1257693 -1206988 -1027265 -716152 -285729 235362 804925 1375745
11420A375745N29252M53904L53571K37315J19234K1221l0996j8161O0018J76777
11410C277880K81616L17926K48788P7267j51512l69617n17304n68423n36125m57985
11400A602511l72974l05411k61785k36372k19009k01372j80158j56052j29676
11391d60298r9138o2338k1534J5970M3222O0232P5464J01308J47857K18873L10265
11380C29883M10479N03539N74535O14191O19238N90191N31380M54352L79682L31721
11370E339191L27566L67297M31895M89164N03233M43684K94049O0226k25090n09161
11360G522054p38456q79580r27362q96650q08149o79689n24535l52570j72838
11351A542225K542J57803K81880L81589M85238O27247Q22382J050601J266513
$$ plain form
11420 1375745 1904997 2358901 2712472 2949787 3069021 3090242 3059246 3041085 3101103 3277880
11410 3277880 3559496 3877422 4126210 4203477 4051965 3682348 3165044 2596621 2060496 1602511
11400 1602511 1229537 924126 662341 425969 206960 5588 -174570 -330622 -460298
11391 -460298 -559436 -621774 -643308 -627338 -584116 -523884 -448420 -347112 -199255 19618 329883
11380 329883 740362 1243901 1818436 2432627 3051865 3642056 4173436 4627788 5007470 5339191
11370 5339191 5666757 6034054 6465949 6955113 7458346 7902030 8196079 8256305 8031215 7522054
11360 7522054 6783598 5904018 4976656 4080006 3271857 2592168 2067633 1715063 1542225
11351 1542225 1544767 1702570 1984450 2366039 2851277 3478524 4300906 5351507 6618020
11342F618020J427600J520558J567327J607652J670896J754930J823595J822799
11334A9813377J705702J453709J083383O38644J76170k47257n83334p99938q88725
11325B2351731q67750p74055o48272n19570l98809k81296j55271j1422J49492
11316A8844778L12928M52740N39518N51073M78835L27265J09355j56656m48062
11307B1011774p38750j003107j221591j384380j490638j544511j551932j521547
11299A0555318j467827j410197j364834j334389j305574j258616j181703j079045
11291A53133r66536q58378p53888o33251m65879k27790Q1399M31773P71633J048008
11281a419776J229248J317472J343293J345564J348953J353714J342369J295292
$$ plain form
11342 6618020 8045620 9566178 11133505 12741157 14412053 16166983 17990578 19813377
11334 19813377 21519079 22972788 24056171 24694815 24870985 24623728 24040394 23240456 22351731
11325 22351731 21483981 20709926 20061654 19542084 19143275 18861979 18706708 18695286 18844778
11316 18844778 19157706 19610446 20149964 20701037 21179872 21507137 21616492 21459836 21011774
11307 21011774 20273024 19269917 18048326 16663946 15173308 13628797 12076865 10555318
11299 10555318 9087491 7677294 6312460 4978071 3672497 2413881 1232178 153133
11291 153133 -813403 -1671781 -2425669 -3058920 -3524799 -3752589 -3671190 -3239417 -2467784 -1419776
11281 -1419776 -190528 1126944 2470237 3815801 5164754 6518468 7860837 9156129
11273I156129J202402J065058Q91552O91981M74368K42035n044k63027n16916
11264A2938538p43625r26562j067588j181502j276382j340185j348769j288759
11256C765166j174794j047705r56437r35730r90310j092107j192668j245834j227842
11247f098261j142384j010013q53881o93525n46721m30903l59392l35768l50719
11238a1821567l81631l94746l53279k33145l8941J92338M05196N49356N99441
11229a1476978N61527M66343L54810K63186K13342K10230K45230L02699L67102
11220h492509M28351M83520N34525N83373O27553O57878O59694O16907N17747
11211c382961L61374J63477m3448k19383l33674l79821l77785l62261l64908m00635
$$ plain form
11273 9156129 10358531 11423589 12315141 13007122 13481490 13723525 13718481 13455454 12938538
11264 12938538 12194913 11268351 10200763 9019261 7742879 6402694 5053925 3765166
11256 3765166 2590372 1542667 586230 -349500 -1339810 -2431917 -3624585 -4870419 -6098261
11247 -6098261 -7240645 -8250658 -9104539 -9798064 -10344785 -10775688 -11135080 -11470848 -11821567
11238 -11821567 -12203198 -12597944 -12951223 -13184368 -13223309 -13030971 -12625775 -12076419 -11476978
11229 -11476978 -10915451 -10449108 -10094298 -9831112 -9617770 -9407540 -9162310 -8859611 -8492509
11220 -8492509 -8064158 -7580638 -7046113 -6462740 -5835187 -5177309 -4517615 -3900708 -3382961
11211 -3382961 -3021587 -2858110 -2901558 -3120941 -3454615 -3834436 -4212221 -4574482 -4939390 -5340025
11201e340025m63407n31554n78799n85803n47866m77063l98408l40351l22717
11192i585993l48849m06727m76003n33245n53421n13245m00042k20695j676K21582
11182a2818314M18525N71222O72389P17876P02225O23164M91699L37163J99663
11173h084388J13721R4593J35627K16228L13936M13532N08930N98196O76710P34686
11163d278229P61406P52291P12175O51259N77127M90176L87047K68828J45989
11154D68069L4721n3754j24159k00624l17602n00276p45991j020372j270906j446818
11144e177712j512180j450475j266817r89875o68475l60056j16311K7099N5444
11135a1459358k3043j77954l63318n30474o43115o88245o77891o38697n91555
$$ plain form
11201 -5340025 -5803432 -6334986 -6913785 -7499588 -8047454 -8524517 -8922925 -9263276 -9585993
11192 -9585993 -9934842 -10341569 -10817572 -11350817 -11904238 -12417483 -12817525 -13038220 -13039896 -12818314
11182 -12818314 -12399789 -11828567 -11156178 -10438302 -9736077 -9112913 -8621214 -8284051 -8084388
11173 -8084388 -7970667 -7876074 -7740447 -7524219 -7210283 -6796751 -6287821 -5689625 -5012915 -4278229
11163 -4278229 -3516823 -2764532 -2052357 -1401098 -823971 -333795 53252 322080 468069
11154 468069 502790 449036 324877 124253 -193349 -693625 -1439616 -2459988 -3730894 -5177712
11144 -5177712 -6689892 -8140367 -9407184 -10397059 -11065534 -11425590 -11541901 -11514802 -11459358
11135 -11459358 -11482401 -11660355 -12023673 -12554147 -13197262 -13885507 -14563398 -15202095 -15793650
11126a5793650n32029m27294k37091N3270M12699P72960J059086J219962J242739
11117a2229348J149198R80227P76356N63629L52722J49837l2626j75851k62832
11108h728688k86249k52136j80895j04632n7598o2661j23686k29511l64234n14666
11098a0904956o71712q28320r76305j102542j185789j197171j107252q99738n86708
11089a9460493k14768J47100M35061O16175O94848O98559O57687N94508N23102
11080a5308221M51651L80954L02127K00214O5135r6868k60181l88374m49333m27869
11070a5530765l29132j72628J7061K15464L96885N31286N86063N34391L65749
11061a3385626R3402k44280n90215q82581j071226j127611j043175q21179m72125
$$ plain form
11126 -15793650 -16325679 -16752973 -16990064 -16936794 -16524095 -15751135 -14692049 -13472087 -12229348
11117 -12229348 -11080150 -10099923 -9323567 -8759938 -8407216 -8257379 -8290005 -8465856 -8728688
11108 -8728688 -9014937 -9267073 -9447968 -9552600 -9610198 -9672859 -9796545 -10026056 -10390290 -10904956
11098 -10904956 -11576668 -12404988 -13381293 -14483835 -15669624 -16866795 -17974047 -18873785 -19460493
11089 -19460493 -19675261 -19528161 -19093100 -18476925 -17782077 -17083518 -16425831 -15831323 -15308221
11080 -15308221 -14856570 -14475616 -14173489 -13973275 -13908140 -14005008 -14265189 -14653563 -15102896 -15530765
11070 -15530765 -15859897 -16032525 -16015464 -15800000 -15403115 -14871829 -14285766 -13751375 -13385626
11061 -13385626 -13292224 -13536504 -14126719 -15009300 -16080526 -17208137 -18251312 -19072491 -19544616
11052a9544616j7850M99889J015237J445906J714952J780242J656804J416938
11044a0032498J165015R99586R81132J117241J366930J659434J919430K088645
11036A264915K136328K058265J870272J601042J284483R50767O19230K98477n541
11027A2078238k80283n04978o59385p36423p48640p23295o89882o68496o65293
11018F401563o75711o91813p07943p20159p20415o92865o18721m86195k95420
11009G92321n4531K25018N25249Q13835J043007J160764J129219R41305O28671
11000G204858K55266j04218l91166n78483o66633o68837o00534m79965l35315
10991C634973k09153j51753k00418l54139n63223p47627q35070p92757o32689
$$ plain form
11052 -19544616 -19562466 -19062577 -18047340 -16601434 -14886482 -13106240 -11449436 -10032498
11044 -10032498 -8867483 -7867897 -6886765 -5769524 -4402594 -2743160 -823730 1264915
11036 1264915 3401243 5459508 7329780 8930822 10215305 11166072 11785302 12083779 12078238
11027 12078238 11797955 11292977 10633592 9897169 9148529 8425234 7735352 7066856 6401563
11018 6401563 5725852 5034039 4326096 3605937 2885522 2192657 1573936 1087741 792321
11009 792321 737790 962808 1488057 2301892 3344899 4505663 5634882 6576187 7204858
11000 7204858 7460124 7355906 6964740 6386257 5719624 5050787 4450253 3970288 3634973
10991 3634973 3425820 3274067 3073649 2719510 2156287 1408660 573590 -219167 -851856
10982h51856l92701j11647J84212M79352P60069J010279J216296J374273J491519
10973E159796J580157J647956J690607J688164J610565J434773J164427Q34879
10965A6811324M97180J94798m7866k21913l27992l77880l99141m31919n14621
10956A5181970o66793q80846j127641j370688j578793j730352j810199j804621
10948D212037j699675j484891j161228p49048k90648J55166N24855P64869Q46427
10939A117864P75622N91952L52735J11694r4606k46367l32973l48501k93315j77167
10929A456938j9290J55127L20529M56953N53924O09740O27364O11588N70126N14468
10919E857467M54558L88673K98496J57182n3304l27891o36344r33102j171957
$$ plain form
10982 -851856 -1244557 -1356204 -1171992 -692640 67429 1077708 2294004 3668277 5159796
10973 5159796 6739953 8387909 10078516 11766680 13377245 14812018 15976445 16811324
10965 16811324 17308504 17503302 17455436 17233523 16905531 16527651 16128510 15696591 15181970
10956 15181970 14515177 13634331 12506690 11136002 9557209 7826857 6016658 4212037
10948 4212037 2512362 1027471 -133757 -882805 -1173453 -1018287 -493432 271437 1117864
10939 1117864 1893486 2485438 2838173 2949867 2855261 2608894 2275921 1927420 1634105 1456938
10929 1456938 1437648 1592775 1913304 2370257 2924181 3533921 4161285 4772873 5342999 5857467
10919 5857467 6312025 6700698 6999194 7156376 7103072 6775181 6138837 5205735 4033778
10910D033778j318408j356408j290441j144763r58730p74776o20833m97560l81219
10901d309360k40989n7873J66172M09868O40588Q25546R43565R92008R85083R46238
10891A300846R00677Q70413Q70462R06159R73640J063056J161134J250983J311503
10882A0608873J320291J261563J135880R64571P82688O22685N00224M12869L50573
10873A7960217L06572K79230K65659K55100K29468J72947Q5030j2908q4102r2413
10863A9364800j7819J35809L41524N57235P38216Q48006Q61278P61050N40332
10854B4130431K11145j90371o13950j014233j361607j638604j832896j938470
10846A5751445j961940j922752j843367j736492j598105j409516j146690p92866
$$ plain form
10910 4033778 2715370 1358962 68521 -1076242 -2034972 -2809748 -3430581 -3928141 -4309360
10901 -4309360 -4550349 -4608222 -4442050 -4032182 -3391594 -2566048 -1622483 -630475 354608 1300846
10891 1300846 2201523 3071936 3942398 4848557 5822197 6885253 8046387 9297370 10608873
10882 10608873 11929164 13190727 14326607 15291178 16073866 16696551 17196775 17609644 17960217
10873 17960217 18266789 18546019 18811678 19066778 19296246 19469193 19554223 19541315 19457213 19364800
10863 19364800 19346981 19482790 19824314 20381549 21119765 21967771 22829049 23590099 24130431
10854 24130431 24341576 24151205 23537255 22523022 21161415 19522811 17689915 15751445
10846 15751445 13789505 11866753 10023386 8286894 6688789 5279273 4132583 3339717
10838C339717l49780J56614O77703J150981J514649J723856J760910J633115J360966
10829A2968731R67690M79531o4865o06918j072394j388919j509414j430360j195080
10820G148002q78775n61338l01313j23535k4089J4135O231m1863j31074k60509
10810D845872m17519n72562o83924p12592o40535m81859k80091r2626L0575O5186
10800A059925J9873p1196j66734k36068k65363k52305j98981j11256k777J03831
10790a21051J82006K09769J77891R5768p540r0906j17410p1534L3538J63086K76887
10779G30504L44107L50885L00685K10447J05158J2262m3529m5693P717R9186J94069
10768B265798K53589K53388J95879J08184K8115j1724O573Q4349K08307L52523
$$ plain form
10838 3339717 2989937 3146551 3824254 4975235 6489884 8213740 9974650 11607765 12968731
10829 12968731 13936421 14415952 14351087 13744169 12671775 11282856 9773442 8343082 7148002
10820 7148002 6269227 5707889 5406576 5283041 5258952 5273087 5279318 5237455 5106381 4845872
10810 4845872 4428353 3855791 3171867 2459275 1818740 1336881 1056790 964164 994739 1059925
10800 1059925 1079798 1008602 841868 605800 340437 88132 -110849 -222105 -224882 -121051
10790 -121051 60955 270724 448615 544383 536843 445937 328527 256993 290531 453617 730504
10779 730504 1074611 1425496 1726181 1936628 2041786 2054048 2010519 1964826 1972543 2071729 2265798
10768 2265798 2519387 2772775 2968654 3076838 3104953 3093229 3099802 3184151 3392458 3744981
10758C744981M80310N49042N20841L77506J32452j68639m60962o82005p90904
10749C702622p76744o52698m40135j52366K11329O56001J170387J709531K196117
10740G624044K544323K692552K623295K359165J943878J426201Q55804K84777
10732B2354039k35929o67387r92956j218860j364111j447760j483171j481645
10724A3462220j458557j433520j423059j431876j448835j448691j397639j262097
10716B157946j020928o77814k66307J58138N36281Q22216R89528J027240R35242
10707D661542P26017M28712Q6800k52287n48755p77275r29480j013586j048674
10698A333014j051790j024445r50318q09619o02220l63147j57199n1888q3297
$$ plain form
10758 3744981 4225291 4774333 5295174 5672680 5805132 5636493 5175531 4493526 3702622
10749 3702622 2925878 2273180 1833045 1680679 1892008 2548009 3718396 5427927 7624044
10740 7624044 10168367 12860919 15484214 17843379 19787257 21213458 22069262 22354039
10732 22354039 22118110 21450723 20457767 19238907 17874796 16427036 14943865 13462220
10724 13462220 12003663 10570143 9147084 7715208 6266373 4817682 3420043 2157946
10716 2157946 1137018 459204 192897 351035 887316 1709532 2699060 3726300 4661542
10707 4661542 5387559 5816271 5903071 5650784 5102029 4324754 3395274 2381688 1333014
10698 1333014 281224 -743221 -1693539 -2503158 -3105378 -3468525 -3625724 -3677612 -3760909
10689c760909k36712m55409o70691q31435r15744r24396q67576p54810n90936
10680a0008618l77746j20249J66277M54651P12222R10840J033363J074793J041155
10671e113312R48425Q20024O81562N54914M54485L85276L40613L00845K38216
10662c88952J30480k2161j87569l08068l22808j96881N8295L86956P14213R78466
10652H41971J149473J224404J214102J135878J014967Q83782P72786O99873O67814
10643I605050O69466O93553P28012P63580P97679Q34087Q76419R20347R50316
10634A6838509R40899Q60923O82278L95613K6416l62574o90542q90459r34228
10625A6866835q37726o47015m16768j91780K183J56798K72486L49950L87889L86023
$$ plain form
10689 -3760909 -3997621 -4453030 -5123721 -5955156 -6870900 -7795296 -8662872 -9417682 -10008618
10680 -10008618 -10386364 -10506613 -10340336 -9885685 -9173463 -8262623 -7229260 -6154467 -5113312
10671 -5113312 -4164887 -3344863 -2663301 -2108387 -1653902 -1268626 -928013 -627168 -388952
10662 -388952 -258472 -280633 -468202 -776270 -1099078 -1295959 -1237664 -850708 -136495 841971
10652 841971 1991444 3215848 4429950 5565828 6580795 7464577 8237363 8937236 9605050
10643 9605050 10274516 10968069 11696081 12459661 13257340 14091427 14967846 15888193 16838509
10634 16838509 17779408 18640331 19322609 19718222 19744638 19382064 18691522 17801063 16866835
10625 16866835 16029109 15382094 14965326 14773546 14775729 14932527 15205013 15554963 15942852 16328875
10615A6328875L47600K78036J81755O0515q6563k62389m70574p13080r88162j289292
10605A3386721j603757j910908k183426k393504k519368k546146k462646k261920
10597d494954j948304j543536j083271o04067j29680L33672P88770J230185J631479
10588e819706J949931K148917K221323K194344K110856K001466J867018J681739
10580A0355888J412457J040898N77633O3680m38815q64160j164472j325882j369240
10571H287987j333426j251937j138012r86255p87307n44762k83121m1817J39962
10562B061312K36986K42841J66600K6134j58435l68858n88841q00788r83528j114375
10552a280952j174308j152464j047388q64613o12454l00531N5621M28166P78094
$$ plain form
10615 16328875 16676475 16954511 17136266 17196781 17110218 16847829 16377255 15664175 14676013 13386721
10605 13386721 11782964 9872056 7688630 5295126 2775758 229612 -2233034 -4494954
10597 -4494954 -6443258 -7986794 -9070065 -9674132 -9803812 -9470140 -8681370 -7451185 -5819706
10588 -5819706 -3869775 -1720858 500465 2694809 4805665 6807131 8674149 10355888
10580 10355888 11768345 12809243 13386876 13450556 13011741 12147581 10983109 9657227 8287987
10571 8287987 6954561 5702624 4564612 3578357 2791050 2246288 1963167 1921350 2061312
10562 2061312 2298298 2541139 2707739 2733873 2575438 2206580 1617739 816951 -166577 -1280952
10552 -1280952 -2455260 -3607724 -4655112 -5519725 -6132179 -6432710 -6377089 -5948923 -5170829
10543e170829J066561J267725J373664J391731J340457J245890J136106J034123
10535D685428R51939Q87361Q24826P42261O22566M62510K73759P9308q9487j96888
10525I243583k11791j18345P9069L57124O76011R82204J216238J327671J294109
10516A4845873J138545R35556P94246Q16299J049690J467797J986505K505755
10508B5540266K951168L297432L567438L815253M109377M524578N133998N993368
10500E8932878P126997Q529974J0181929J2055875J4118609J6328489J8622872
10493A45897623K0880726K2868143K4195231K4310579K2568702J8427616J1776763
10486B90925383L227043n910844j4067430k0035019k3359758k4302144k3511385
$$ plain form
10543 -5170829 -4104268 -2836543 -1462879 -71148 1269309 2515199 3651305 4685428
10535 4685428 5637367 6524728 7349554 8091815 8714381 9176891 9450650 9529958 9440471 9243583
10525 9243583 9031792 8913447 8992516 9349640 10025651 11007855 12224093 13551764 14845873
10516 14845873 15984418 16919974 17714220 18530519 19580209 21048006 23034511 25540266
10508 25540266 28491434 31788866 35356304 39171557 43280934 47805512 52939510 58932878
10500 58932878 66059875 74589849 84771778 96827653 110946262 127274751 145897623
10493 145897623 166778349 189646492 213841723 238152302 260721004 279148620 290925383
10486 290925383 294152426 288241582 274174152 254139133 230779375 206477231 182965846
10479A82965846k1694562j9429789j7105532j4929298j2978962j1269929r798558
10472G5759216q548141p483042o556741n730289m984230m316855l732268l226344
10464C1181306k781969k380263k018399j715753j502602j402678j421303j540783
10456A6417556j721651j910881k054898k110479k050075j864869j567814j193491
10448A943398p92053m19372j26070N3679J10634O0666o5001k33512m20339o11837
10438d99807q00034r71201j093960j116571r80458o47152j25578N17712J176234
10429d540815J742950K147699K369410K420836K324940K102893J776689J376174
10421A1720776R41037N15561J38601j66660l97228n65082o85261p66317q10451
$$ plain form
10479 182965846 161271284 141841495 124735963 109806665 96827703 85557774 75759216
10472 75759216 67211075 59728033 53171292 47441003 42456773 38139918 34407650 31181306
10464 31181306 28399337 26019074 24000675 22284922 20782320 19379642 17958339 16417556
10456 16417556 14695905 12785024 10730126 8619647 6569572 4704703 3136889 1943398
10448 1943398 1151345 731973 605903 659582 770216 830882 765881 532369 112030 -499807
10438 -499807 -1299841 -2271042 -3365002 -4481573 -5462031 -6109183 -6234761 -5717049 -4540815
10429 -4540815 -2797865 -650166 1719244 4140080 6465020 8567913 10344602 11720776
10421 11720776 12661813 13177374 13315975 13149315 12752087 12187005 11501744 10735427 9924976
10412I924976q21538q11617p97887p91485p87341p63679o92023n51874l42460
10403C565072q6102J78407M08718N71358O49604O47506N90591N19824M76929M87727
10393H009634N54317O59259P75104Q72448R26578R23941Q65081P60391O22335
10384A4969088M61898K90638J21670l5028j77625l09168m26967n16414n58357
10375A3819735n44961m89989m25384l88489m08739m98322o47619q27353r98829
10366H590050j128136j195997j198397j140963j034328q95132p50655o39667o02893
10357C882o64951q18659j022633j213172j322263j293836j096127p30684k36190
10348h394633L16743Q41298J256759J509073J581664J494031J292015J034928
$$ plain form
10412 9924976 9103438 8291821 7493934 6702449 5915108 5151429 4459406 3907532 3565072
10403 3565072 3478970 3657377 4066095 4637453 5287057 5934563 6525154 7044978 7521907 8009634
10393 8009634 8563951 9223210 9998314 10870762 11797340 12721281 13586362 14346753 14969088
10384 14969088 15430986 15721624 15843294 15808266 15630641 15321473 14894506 14378092 13819735
10375 13819735 13274774 12784785 12359401 11970912 11562173 11063851 10416232 9588879 8590050
10366 8590050 7461914 6265917 5067520 3926557 2892229 1997097 1246442 606775 3882
10357 3882 -661069 -1479728 -2502361 -3715533 -5037796 -6331632 -7427759 -8158443 -8394633
10348 -8394633 -8077890 -7236592 -5979833 -4470760 -2889096 -1395065 -103050 931878
10340I31878P81611N76572M40666L71916L56526L81753M40559N25172O17018O84905
10330F108576O96652O36594N14692L61019K13082J07075P4479J36929K95870N22478
10320I667446P56372R17329R28300P42107L59919j68179p59860j324743j786475
10311I332216k097727k245168k242747k117887j899996j616088j289660r38556
10303e115613n74343k06985J47830M64781P10600Q50627Q60870P44081N39676
10294a578476L14615J34844L3860r36j5213n5659j37370k30228k73500k10289
10284b018352j9668K73325O13443R43174J224179J441764J596072J692197J737010
10275G483144J739337J705568J630878J495390J271963R41035N02791j7714n71346
$$ plain form
10340 931878 1713489 2290061 2730727 3102643 3459169 3840922 4281481 4806653 5423671 6108576
10330 6108576 6805228 7441822 7956514 8317533 8530615 8637690 8712169 8849098 9144968 9667446
10320 9667446 10423818 11341147 12269447 13011554 13371473 13203294 12443434 11118691 9332216
10311 9332216 7234489 4989321 2746574 628687 -1271309 -2887397 -4177057 -5115613
10303 -5115613 -5689956 -5896941 -5749111 -5284330 -4573730 -3723103 -2862233 -2118152 -1578476
10294 -1578476 -1263861 -1129017 -1095157 -1096093 -1111306 -1166965 -1304335 -1534563 -1808063 -2018352
10284 -2018352 -2038020 -1764695 -1151252 -208078 1016101 2457865 4053937 5746134 7483144
10275 7483144 9222481 10928049 12558927 14054317 15326280 16267315 16770106 16752392 16181046
10266A6181046j091965j511799j781180j881327j821858j627892j329663r61308
10258D174054n62963j77153J60697M29285O20210P32501P71037P50432O97401
10249G595501O44543O17336O23686O53432O86723P04146O93226O51266N86264
10240A3456123N15216M57826M27263M23318M31958M29768L89553K86575J07489
10231A6925089j39579m21328o89110r00023j037020j114649j166081j219311j277696
10222H960292j317821j306663j225700j083253r05899p18285n30282l40694j49150
10213A382545L7958K11507L66199N01725O17667P06579P50613P26090O16128M23625
10203F340636J73270j01276l75222o40870r00812j154483j391030j594018j751581
$$ plain form
10266 16181046 15089081 13577282 11796102 9914775 8092917 6465025 5135362 4174054
10258 4174054 3611091 3433938 3594635 4023920 4644130 5376631 6147668 6898100 7595501
10249 7595501 8240044 8857380 9481066 10134498 10821221 11525367 12218593 12869859 13456123
10240 13456123 13971339 14429165 14856428 15279746 15711704 16141472 16531025 16817600 16925089
10231 16925089 16785510 16364182 15675072 14775049 13738029 12623380 11457299 10237988 8960292
10222 8960292 7642471 6335808 5110108 4026855 3120956 2402671 1872389 1531695 1382545
10213 1382545 1420503 1632010 1998209 2499934 3117601 3824180 4574793 5300883 5917011 6340636
10203 6340636 6513906 6412630 6037408 5396538 4495726 3341243 1950213 356195 -1395386
10194a395386j860842j922302j931366j877712j754138j566212j334038j085806
10186a4727802q47894o34984m43447k53273m1582J98668M47425O61920P94289
10177a4846680Q13146P18822N44903L45420J75607P7251P2867J64686L34651N48096
10167a1051231P65540R60080J130698J301949J507790J766849K063314K346466
10159G91455K550741K623844K545360K327203K001540J608822J193311Q02657
10151A6444933M82241K60495J33907O6426Q991p2191j77977k79745l38303l24326
10141A6204451k29705o7297J37634L58187N72751P65328R22157J030908J085249
10132B0779663J090646J064214J026518R90961R58695R21976Q72592Q09371P40158
$$ plain form
10194 -1395386 -3256228 -5178530 -7109896 -8987608 -10741746 -12307958 -13641996 -14727802
10186 -14727802 -15575696 -16210680 -16654127 -16907400 -16948982 -16750314 -16302889 -15640969 -14846680
10177 -14846680 -14033534 -13314712 -12769809 -12424389 -12248782 -12171531 -12098664 -11933978 -11599327 -11051231
10167 -11051231 -10285691 -9325611 -8194913 -6892964 -5385174 -3618325 -1555011 791455
10159 791455 3342196 5966040 8511400 10838603 12840143 14448965 15642276 16444933
10151 16444933 16927174 17187669 17321576 17388002 17396993 17324802 17146825 16867080 16528777 16204451
10141 16204451 15974746 15907449 16045083 16403270 16976021 17741349 18663506 19694414 20779663
10132 20779663 21870309 22934523 23961041 24952002 25910697 26832673 27705265 28514636 29254794
10123B9254794O76730O25525N80994N27252M46646L27580J65538m1050k93939
10114C2270070n93078r30219j281907j607192j854875j979868j960604j807272
10106B0255055j558053j269316j006132q33154q03082r43893j250211j682149
10098A0909065k170698k627925k962442l099417k999863k671081k163274j553471
10090i339106r22402l32503J83981O20827R80831J258982J439178J506277J462193
10081c141742J332389J158410R82396Q32869P18085O28738N47769M61773L67772
10072C888459K72305J84842J11084N0997K278l5242o0273p6803r9992j51924k46048
10061C839683l70632m84578n30154m55297k33572J26265N82793J074104J534750
$$ plain form
10123 29254794 29931524 30557049 31138043 31665295 32111941 32439521 32605059 32564009 32270070
10114 32270070 31676992 30746773 29464866 27857674 26002799 24022931 22062327 20255055
10106 20255055 18697002 17427686 16421554 15588400 14785318 13841425 12591214 10909065
10098 10909065 8738367 6110442 3148000 48583 -2951280 -5622361 -7785635 -9339106
10090 -9339106 -10261508 -10594011 -10410030 -9789203 -8808372 -7549390 -6110212 -4603935 -3141742
10081 -3141742 -1809353 -650943 331453 1164322 1882407 2511145 3058914 3520687 3888459
10072 3888459 4160764 4345606 4456690 4507687 4509965 4474723 4414450 4337647 4237655 4085731 3839683
10061 3839683 3469051 2984473 2454319 1999022 1765450 1891715 2474508 3548612 5083362
10052E083362J911076K169334K295231K288980K161395J932790J630980J284246
10044B0757394R10865N13479Q5906l69533q26358j232966j529387j672442j655309
10035A4981649j511659j303124j096890r44475q71130q77431r47022j053605j165923
10026E210390j252920j288754j254822j138764r34829o47984k97623Q4925M64667
10017a055714Q10500J097429J305636J421181J439134J365592J216147J013403
10009H613308P87464N78340M33733L97193M90639P01777R84651J272871J499192
10000A5759168J614422J600041J470117J261791J019093P77771N56299L53971
9992B4412673J55120o1567l10832n90333q77213j134727j326876j433771j459124
$$ plain form
10052 5083362 6994438 9163772 11459003 13747983 15909378 17842168 19473148 20757394
10044 20757394 21668259 22181738 22267644 21898111 21071753 19838787 18309400 16636958 14981649
10035 14981649 13469990 12166866 11069976 10125501 9254371 8376940 7429918 6376313 5210390
10026 5210390 3957470 2668716 1413894 275130 -659699 -1307683 -1605306 -1520381 -1055714
10017 -1055714 -245214 852215 2157851 3579032 5018166 6383758 7599905 8613308
10009 8613308 9400772 9979112 10412845 10810038 11300677 12002454 12987105 14259976 15759168
10000 15759168 17373590 18973631 20443748 21705539 22724632 23502403 24058702 24412673
9992 24412673 24567793 24506226 24195394 23605061 22727848 21593121 20266245 18832474 17373350
9983A7373350j425811j363213j293984j226051j151557j052124r08412p09896
9975H242302m60274j76228J19247M05541O70325R07771J109074J253773J313221
9966A3384752J267570J123534R17122O97661N04056L48315K14699P3437r9086
9957A8432060l04679n20892p12181q45796r01307q70174p51578n52898k95722
9948A2676833j9821K22805L84036M38244L93275K87112J71047Q8399O0381Q4073
9938A4786384J38115J90734K10749J82720J18385N1863J7800K8522O8527J08881
9928A5902680J28204J24962J15049J19422J52057K16268L09128M26712N64442
9919A8058924P13732Q59428R79902J049807J046657R61407Q08289O25767M64466
$$ plain form
9983 17373350 15947539 14584326 13290342 12064291 10912734 9860610 8952198 8242302
9975 8242302 7782028 7605800 7725047 8130588 8800913 9708684 10817758 12071531 13384752
9966 13384752 14652322 15775856 16692978 17390639 17894695 18243010 18457709 18531146 18432060
9957 18432060 18127381 17606489 16894308 16048512 15147205 14277031 13525453 12972555 12676833
9948 12676833 12657012 12879817 13263853 13702097 14095372 14382484 14553531 14641930 14702311 14786384
9938 14786384 14924499 15115233 15325982 15508702 15627087 15678950 15696750 15725272 15793799 15902680
9928 15902680 16030884 16155846 16270895 16390317 16542374 16758642 17067770 17494482 18058924
9919 18058924 18772656 19632084 20611986 21661793 22708450 23669857 24478146 25103913 25568379
9910B5568379L66480L47071L89795M57301N08174N06459M19884K14205j48971
9901B8628777p11089j514001k592095l954189n555105p262456q833818r936016
9893a1729992j0236811r551459p959149n796153l516525j512561m621R64146J470105
9884d7873020J644465J626146J532265J442860J397640J401164J434241J471060
9876c5923179J496333J510941J520591J517916J476407J364859J172135R21765
9868b4942232O63792M49949L10377K44744K26249K11154J51500J2498k10013m82341
9858b3364323p42068r19557r62527q55223o25370l34118n0449J79163L49952M95297
9848b6829223O62147Q80965J149169J435448J696209J890636J989079J977548
$$ plain form
9910 25568379 25934859 26281930 26671725 27129026 27637200 28143659 28563543 28777748 28628777
9901 28628777 27917688 26403687 23811592 19857403 14302298 7039842 -1793976 -11729992
9893 -11729992 -21966803 -31518262 -39477411 -45273564 -48790089 -50302650 -50307271 -49343125 -47873020
9884 -47873020 -46228555 -44602409 -43070144 -41627284 -40229644 -38828480 -37394239 -35923179
9876 -35923179 -34426846 -32915905 -31395314 -29877398 -28400991 -27036132 -25863997 -24942232
9868 -24942232 -24278440 -23828491 -23518114 -23273370 -23047121 -22835967 -22684467 -22671969 -22881982 -23364323
9858 -23364323 -24106391 -25025948 -25988475 -26843698 -27469068 -27803186 -27853635 -27674472 -27324520 -26829223
9848 -26829223 -26167076 -25286111 -24136942 -22701494 -21005285 -19114649 -17125570 -15148022
9840a5148022J859686J653578J383015J068369P23310L59383n188l40595o11923
9831i058387p95381q90549r15785q90325q20634p02651n34178l23641q8585J52642
9821a4867474L88632O15916Q31484J022741J165290J232533J209098J096855R10955
9812f393970O72505M04437J31384j19299l18410m39300m64754l92685k37404k6111
9802g183607K07811M32953O26639P76504Q76313R21215R08335Q42106P37830O18585
9792b35316N07355M20820L69436L61955M06578N02615O27033P30079P50559O45354
9782E086468M14491J05476k05400m44077n66692n72378m96728l90770k96325k28996
9772B405069j75792j07922k389J38893K82814L75359L64114K23297k9954l36777
$$ plain form
9840 -15148022 -13288336 -11634758 -10251743 -9183374 -8460064 -8100681 -8105869 -8446464 -9058387
9831 -9058387 -9853768 -10744317 -11660102 -12550427 -13371061 -14073712 -14607890 -14931531 -15020116 -14867474
9821 -14867474 -14478842 -13862926 -13031442 -12008701 -10843411 -9610878 -8401780 -7304925 -6393970
9812 -6393970 -5721465 -5317028 -5185644 -5304943 -5623353 -6062653 -6527407 -6920092 -7157496 -7183607
9802 -7183607 -6975796 -6542843 -5916204 -5139700 -4263387 -3342172 -2433837 -1591731 -853901 -235316
9792 -235316 272039 692859 1062295 1424250 1830828 2333443 2960476 3690555 4441114 5086468
9782 5086468 5500959 5606435 5401035 4956958 4390266 3817888 3321160 2930390 2634065 2405069
9772 2405069 2229277 2121355 2118966 2257859 2540673 2916032 3280146 3503443 3473489 3136712
9762C136712o16559p97036q39645p48157n58910l21679q3721J16656K51238L05947
9752a55154K88112K27403J62833J22928J15640J35840J79975K51213L51238M70638
9742B150666N89842O87980P47516P49710O69681M81817J74511k36628p05766j165088
9732D144241j541925j780768j861325j801608j643497j431644j199299r65286
9724h081111p37005n14321k92921o7209J67321M11720O61506R06901J135938J337396
9714e071785J501193J618925J687178J709456J689832J620524J475355J217796
9706G448474Q19840K80385l64769j043727j660155k114561k329925k272612j960238
9697c197288j454267q42507k19823L28108P38229R80815J063173J022224R09007
$$ plain form
9762 3136712 2520153 1723117 883472 135315 -423595 -745274 -828995 -712339 -461101 -155154
9752 -155154 132958 360361 523194 646122 761762 897602 1077577 1328790 1680028 2150666
9742 2150666 2740508 3428488 4176004 4925714 5595395 6077212 6251723 6015095 5309329 4144241
9732 4144241 2602316 821548 -1039777 -2841385 -4484882 -5916526 -7115825 -8081111
9724 -8081111 -8818116 -9332437 -9625358 -9692567 -9525246 -9113526 -8452020 -7545119 -6409181 -5071785
9714 -5071785 -3570592 -1951667 -264489 1444967 3134799 4755323 6230678 7448474
9706 7448474 8268314 8548699 8183930 7140203 5480048 3365487 1035562 -1237050 -3197288
9697 -3197288 -4651555 -5494062 -5713885 -5385777 -4647548 -3666733 -2603560 -1581336 -672329
9688f72329P73552O54608N72583N25224M91320M46174L81968L18191K92304L35861
9678D119456M53284O19097P94186R45633J053215J101104J068805R33878O83804
9669A1772462L24860j18241o07065j092278j516972j827799j993881k020849j946034
9660I74203j815518j660492j490276j302731j098055q83947o72003m72454k92297
9651h713570j36904j2046P7589J34613J75067K26827L18641M67443O72752R19337
9641e870251J182045J427709J614983J697638J635840J412627J044634N76997
9633D722222O5433m39362q94105j257831j493410j580125j526717j371129j163976
9624d939000r45278p29435n08065k67937j0295K41736M50032N75399N90970M91582
$$ plain form
9688 -672329 101223 755831 1328414 1853638 2344958 2791132 3173100 3491291 3783595 4119456
9678 4119456 4572740 5191837 5986023 6931656 7984871 9085975 10154780 11088658 11772462
9669 11772462 12097322 11979081 11372016 10279738 8762766 6934967 4941086 2920237 974203
9660 974203 -841315 -2501807 -3992083 -5294814 -6392869 -7276816 -7948819 -8421273 -8713570
9651 -8713570 -8850474 -8862520 -8784931 -8650318 -8475251 -8248424 -7929783 -7462340 -6789588 -5870251
9641 -5870251 -4688206 -3260497 -1645514 52124 1687964 3100591 4145225 4722222
9633 4722222 4787655 4348293 3454188 2196357 702947 -877178 -2403895 -3775024 -4939000
9624 -4939000 -5884278 -6613713 -7121778 -7389715 -7400010 -7158274 -6708242 -6132843 -5541873 -5050291
9614e050291K96272M0679k38248n15002p76193j011260j204440j336143j390367
9605a1184993j360029j247757j066698q43773o20084m41772l43444l35286m03232
9596a7847068n20557o60116p97620r05973r50681q96475p23924m42400q7258K95356
9586b3536716O61836R75335J207460J344575J393659J377772J321852J241263
9578a4012964J142540J032645R25360Q37659P79447P46961P27530P12245P04013
9569f404564P12603P41929P82415Q14249Q16098P71554O71516N15170L11231P8189
9559a89610j58764l75005n55417o99926q22659r46238j094053j280382j498618
9550g620672j713613j866851j896665j765654j482475j106343p28190m34020k69586
$$ plain form
9614 -5050291 -4754019 -4713340 -4951588 -5466590 -6242783 -7254043 -8458483 -9794626 -11184993
9605 -11184993 -12545022 -13792779 -14859477 -15703250 -16323334 -16765106 -17108550 -17443836 -17847068
9596 -17847068 -18367625 -19027741 -19825361 -20731334 -21682015 -22578490 -23302414 -23744814 -23832072 -23536716
9586 -23536716 -22874880 -21899545 -20692085 -19347510 -17953851 -16576079 -15254227 -14012964
9578 -14012964 -12870424 -11837779 -10912419 -10074760 -9295313 -8548352 -7820822 -7108577 -6404564
9569 -6404564 -5691961 -4950032 -4167617 -3353368 -2537270 -1765716 -1094200 -579030 -267799 -189610
9559 -189610 -348374 -723379 -1278796 -1978722 -2801381 -3747619 -4841672 -6122054 -7620672
9550 -7620672 -9334285 -11201136 -13097801 -14863455 -16345930 -17452273 -18180463 -18614483 -18884069
9541a8884069k27289k60433l10767l31599k98642k09405p4392R4178K88004M99733
9531a9714681P17934R28131J119115J287393J435834J568264J682477J763977
9523i211556J785250J714432J529394J226835Q20667L34204k04896p63324j297964
9514d066958j755102k076540k211197k127381j821622j322425o87416Q688O93719
9505a5366234J315783J848494K282697K613732K832625K923018K863872K639841
9497C953828K257320J755719J202880O75376K36167p8841k64085l42586l61173
9488I034605l79622m52574o11251q55941j163332j500834j835847k135753k364364
9479b264913k482048k451441k247432j869882j354709p74235k20004K26863N22344
$$ plain form
9541 -18884069 -19111358 -19371791 -19682558 -20014157 -20312799 -20522204 -20596596 -20502418 -20214414 -19714681
9531 -19714681 -18996747 -18068616 -16949501 -15662108 -14226274 -12658010 -10975533 -9211556
9523 -9211556 -7426306 -5711874 -4182480 -2955645 -2134978 -1800774 -2005670 -2768994 -4066958
9514 -4066958 -5822060 -7898600 -10109797 -12237178 -14058800 -15381225 -16068641 -16059953 -15366234
9505 -15366234 -14050451 -12201957 -9919260 -7305528 -4472903 -1549885 1313987 3953828
9497 3953828 6211148 7966867 9169747 9845123 10081290 10002449 9738364 9395778 9034605
9488 9034605 8654983 8202409 7591158 6735217 5571885 4071051 2235204 99451 -2264913
9479 -2264913 -4746961 -7198402 -9445834 -11315716 -12670425 -13444660 -13664664 -13437801 -12915457
9470a2915457O70356P16108P27673P71548Q87377J070501J272522J422515J458779
9461c918078J353660J119533P97034M36456Q3271k28081m74066o39588p16411
9452b186270p04384o14640m70606l02531j36700J3214J45226K58483L40591L62496
9442c295121K86592Q6511k31049o16929r92035j276778j419217j405367j250885
9433a0114278r87713o57540l10554N38K35071L79155M49229M82178N19451N92687
9423i411776P13244Q66706J016256J117129J136095J064555R18229P26122N17031
9414a336409L10946J18644n2473j92904k92087l44580l53809l29011k79579k12795
9404b964057j35046n2913K5855Q9623J21169J02998K8854q8646k22695l45876
$$ plain form
9470 -12915457 -12245101 -11528993 -10801320 -10029772 -9142395 -8071894 -6799372 -5376857 -3918078
9461 -3918078 -2564418 -1444885 -647851 -211395 -128124 -356205 -830271 -1469859 -2186270
9452 -2186270 -2890654 -3505294 -3975900 -4278431 -4415131 -4401917 -4256691 -3998208 -3657617 -3295121
9442 -3295121 -3008529 -2922018 -3153067 -3769996 -4762031 -6038809 -7458026 -8863393 -10114278
9433 -10114278 -11101991 -11759531 -12070085 -12069547 -11834476 -11455321 -11006092 -10523914 -10004463 -9411776
9423 -9411776 -8698532 -7831826 -6815570 -5698441 -4562346 -3497791 -2579562 -1853440 -1336409
9414 -1336409 -1025463 -906819 -959292 -1152196 -1444283 -1788863 -2142672 -2471683 -2751262 -2964057
9404 -2964057 -3099103 -3152016 -3126161 -3036538 -2915369 -2812371 -2783517 -2872163 -3094858 -3440734
9394c440734m41018n01751n25422n07176m41777l32037j95992o5050K7289N8809
9384f364859K6595n2451j46859k20367k44901k12048j35828m2801M6327J32570
9374g214622K40543M02751O34425R14564J185474J371311J405267J252640R22377
9365A114730M66545l0159m70013p69060q82660q16151o13895l36310m2064K18446
9355b160591M07006N05426N19141M66018L56444J84467n9966l69309p07021j014375
9345a872760j228551j301459j213346r79211o47215k89069J6023K00322K24208
9336g091058Q5372j81589n13696q33629j067047j159502j086668q53049m81351
9327a3182217j023N56324J154269J748217K288526K731384L050987L244102L323785
$$ plain form
9394 -3440734 -3881752 -4383503 -4908925 -5416101 -5857878 -6189915 -6385907 -6450957 -6423668 -6364859
9384 -6364859 -6338264 -6390715 -6537574 -6757941 -7002842 -7214890 -7350718 -7393519 -7347192 -7214622
9374 -7214622 -6974079 -6571328 -5936903 -5022339 -3836865 -2465554 -1060287 192353 1114730
9365 1114730 1581275 1551116 1081103 312043 -570617 -1386768 -2000663 -2336973 -2379037 -2160591
9355 -2160591 -1753585 -1248159 -729018 -263000 93444 277911 217945 -151364 -858385 -1872760
9345 -1872760 -3101311 -4402770 -5616116 -6595327 -7242542 -7531611 -7515588 -7315266 -7091058
9336 -7091058 -7005686 -7187275 -7700971 -8534600 -9601647 -10761149 -11847817 -12700866 -13182217
9327 -13182217 -13183240 -12626916 -11472647 -9724430 -7435904 -4704520 -1653533 1590569 4914354
9318D914354L308415L215551L063320K872470K661289K435013K180364J873766
9310B6524542J500262J071011O27796K30667o6848k43656l23529l64648m30771
9301B8524826n61662p59534r95068j223964j403323j502638j509148j429322j288320
9292A7851847j126895r92249r21478r24336r77210j033892j046609r84973q45302
9283H998903o50088m39911k60227j46544j13451j52512k40213l51838m72713n98994
9273E572412p27527q43607r17563r13663q04753n82604k58584J43596N96801J075174
9263B339682J552554J997602K371466K632521K748144K708239K532635K266834
9255B1149677J967177J683150J445739J265910J140952J063419J028241J035642
$$ plain form
9318 4914354 8222769 11438320 14501640 17374110 20035399 22470412 24650776 26524542
9310 26524542 28024804 29095815 29723611 29954278 29887430 29643774 29320245 28955597 28524826
9301 28524826 27963164 27203630 26208562 24984598 23581275 22078637 20569489 19140167 17851847
9292 17851847 16724952 15732703 14811225 13886889 12909679 11875787 10829178 9844205 8998903
9283 8998903 8348815 7908904 7648677 7502133 7388682 7236170 6995957 6644119 6171406 5572412
9273 5572412 4844885 4001278 3083715 2170052 1365299 782695 524111 667707 1264508 2339682
9263 2339682 3892236 5889838 8261304 10893825 13641969 16350208 18882843 21149677
9255 21149677 23116854 24800004 26245743 27511653 28652605 29716024 30744265 31779907
9247C1779907J089751J194601J349775J545998J759413J945742K041486J979863
9239D4686536J718888J265015O74121K7654n98834j154770j616150j979574k258521
9230D0764365k480759k679996k880383l081695l255310l354684l335175l173770
9222A6522593k880702k498923k091088j717807j416527j192655j027282q93573
9214B804036p69371o41608n07542l76196k66184j96602j76399k01053k57416l29401
9204i17736l99284m47256m54090m06429l00268j40261O2649K91488N20982P16316
9194a473889Q36839Q45034P17599M55301Q8645l25357p19495j041578j273757
9185a890658j432437j550817j659141j774623j899938k023773k121543k158996
$$ plain form
9247 31779907 32869658 34064259 35414034 36960032 38719445 40665187 42706673 44686536
9239 44686536 46405424 47670439 48344560 48372214 47773380 46618610 45002460 43022886 40764365
9230 40764365 38283606 35603610 32723227 29641532 26386222 23031538 19696363 16522593
9222 16522593 13641891 11142968 9051880 7334073 5917546 4724891 3697609 2804036
9214 2804036 2034665 1393057 885515 509319 243135 46533 -129866 -330919 -588335 -917736
9204 -917736 -1317020 -1764276 -2218366 -2624795 -2925063 -3065324 -3002675 -2711187 -2190205 -1473889
9194 -1473889 -637050 207984 925583 1380884 1469529 1144172 424677 -616901 -1890658
9185 -1890658 -3323095 -4873912 -6533053 -8307676 -10207614 -12231387 -14352930 -16511926
9177a6511926k099586j913685j587608j129667n69206N2501O93152J313202J871223
9168a9881600K318757K603076K679366K527744K167972J663717J110200O07519
9160d203249K31854J8220m0276J8910J44638K89712M24424N40467O43286P37734
9150a194280Q15981Q54278Q19757O83721M35532R0824l10112p13807j069879j343613
9140i31598j517508j581610j522704j325565r89607n47906o9392L61820O75637
9131g448433Q33046Q24026O57662L58251l2164m55780q51804j172697j391573
9122h679466j497727j488702j367294j142917q31319m50885k0254M38584Q94513
9113a4145467J306209J629705J830640J892963J819397J626439J340104R94619
$$ plain form
9177 -16511926 -18611512 -20525197 -22112805 -23242472 -23811678 -23759177 -23066025 -21752823 -19881600
9168 -19881600 -17562843 -14959767 -12280401 -9752657 -7584685 -5920968 -4810768 -4203249
9160 -4203249 -3971395 -3953175 -3993451 -3974541 -3829903 -3540191 -3115767 -2575300 -1932014 -1194280
9150 -1194280 -378299 475979 1295736 1979457 2414989 2505813 2195701 1481894 412015 -931598
9140 -931598 -2449106 -4030716 -5553420 -6878985 -7868592 -8416498 -8485890 -8124070 -7448433
9131 -7448433 -6615387 -5791361 -5133699 -4775448 -4807612 -5263392 -6115196 -7287893 -8679466
9122 -8679466 -10177193 -11665895 -13033189 -14176106 -15007425 -15458310 -15478564 -15039980 -14145467
9113 -14145467 -12839258 -11209553 -9378913 -7485950 -5666553 -4040114 -2700010 -1705391
9105a705391O30610K89204L605k07196l40082m05747m24064m17453m04312l95887
9095c376713l97202m09434m31867m64236n09164n70877o48670p30662p95456q21157
9085i155438p93124p04370n51784l34861n8745K62176O04107R38641J241638J501710
9075g050050J720525J900370K025832K056129J940328J649832J206105O81469
9067F130540J69215k57870n72759p88843r33746j025635j067607j057340r98625
9058d02670r05569p99483p02954o33750n99547n95270o05801o14820o15215o12498
9048g087577o15665o20843o02580n23895l59919j16647J70225M54542P02041R01318
9038g699000J059184J186465J284992J344381J349694J293572J184587J047892
$$ plain form
9105 -1705391 -1074781 -785577 -781972 -989168 -1329250 -1734997 -2159061 -2576514 -2980826 -3376713
9095 -3376713 -3773915 -4183349 -4615216 -5079452 -5588616 -6159493 -6808163 -7538825 -8334281 -9155438
9085 -9155438 -9948562 -10652932 -11204716 -11539577 -11598322 -11336146 -10732039 -9793398 -8551760 -7050050
9075 -7050050 -5329525 -3429155 -1403323 652806 2593134 4242966 5449071 6130540
9067 6130540 6299755 6041885 5469126 4680283 3746537 2720902 1653295 595955 -402670
9058 -402670 -1308239 -2107722 -2810676 -3444426 -4043973 -4639243 -5245044 -5859864 -6475079 -7087577
9048 -7087577 -7703242 -8324085 -8926665 -9450560 -9810479 -9927126 -9756901 -9302359 -8600318 -7699000
9038 -7699000 -6639816 -5453351 -4168359 -2823978 -1474284 -180712 1003875 2051767
9030B051767R18441Q28821P95641Q12309Q55314R01685R44662R94675J064824
9021A0168139J152389J230370J255793J190825J024367P80497N08024K58397O6316
9012A7635117n6851j17299j28311j02443m9724J9274Q9926J44121J65367J44017
9002A7743194P8289k7418j61618l00985m08669m43913l81848k30844l3066J55485
8992A5988607K94687L81481M48300N38213O72147Q30624R62881J015171R56181
8983B2088292P83761N16679J85952j66711m89135p26297q35590q02156o46881
8974A9907914m23747k06166o5058m6668j60532l82004o63434r44643j160205j248861
8964A4606596j169085r16012n29777q8761L11231N84702O80954N95348L63010
$$ plain form
9030 2051767 2970208 3799029 4594670 5406979 6262293 7163978 8108640 9103315 10168139
9021 10168139 11320528 12550898 13806691 14997516 16021883 16802380 17310404 17568801 17635117
9012 17635117 17578266 17460967 17332656 17230213 17180489 17199763 17289689 17433810 17599177 17743194
9002 17743194 17821483 17794065 17632447 17331462 16922793 16478880 16097032 15866188 15833122 15988607
8992 15988607 16283294 16664775 17113075 17651288 18323435 19154059 20116940 21132111 22088292
8983 22088292 22872053 23388732 23574684 23407973 22918838 22192541 21356951 20554795 19907914
8974 19907914 19484167 19278001 19212943 19166275 19005743 18623739 17960305 17015662 15855457 14606596
8964 14606596 13437511 12521499 11991722 11902961 12214192 12798894 13479848 14075196 14438206
8955A4438206L9864l18049o68284r85999j258976j476280j617273j651267j552411
8946D949531j321073r94681o37807l17486p9938N9061J10212J01314O8683M8330
8936A986146O4462J19071J90993K46770K55108J95479O0905j38971l74767o02223
8926B002973p78452q79468r04745q66387p75128o36828m60765k69099r6265K2653
8916c641511O5335K7820p8111k28098l83790m92169m95474l53145o2902L35635
8906e306410P79223J207950J582022J880728K092424K209350K231665K172742
8898H849694K055727J900397J709525J466085J145587P36909K58583k39795o91386
8889A7191326j032987j222869j249006j125436q79246n36290j16389L57786Q46349
$$ plain form
8955 14438206 14478070 14160021 13491737 12505738 11246762 9770482 8153209 6501942 4949531
8946 4949531 3628458 2633777 1995970 1678484 1598546 1657607 1767819 1869133 1937816 1986146
8936 1986146 2050608 2169679 2360672 2607442 2862550 3058029 3118934 2979963 2605196 2002973
8926 2002973 1224521 345053 -559692 -1426079 -2201207 -2838035 -3298800 -3567899 -3664164 -3641511
8916 -3641511 -3576176 -3548356 -3626467 -3854565 -4238355 -4730524 -5225998 -5579143 -5642045 -5306410
8906 -5306410 -4527187 -3319237 -1737215 143513 2235937 4445287 6676952 8849694
8898 8849694 10905421 12805818 14515343 15981428 17127015 17863924 18122507 17882712 17191326
8889 17191326 16158339 14935470 13686464 12561028 11681782 11145492 11029103 11386889 12233238
8880A2233238J287690J612365J769260J748199J585934J353132J129553R77755
8872B3697126R24399R55060J024255J076202J066584R75981Q11699O00474L75740
8863C1507520J63067l0431k15668m08637o13428q13641r77911j074958j088656
8854B6447257j025683r13331p89859o93059o51798o80766p75491r07657j025979
8845A8983634j067866r79988p39198l64315Q6583N33284Q99000J133268J221382
8836A9705784J178084J033894Q24994N89905L67539J90715P6014J7040j2149m3173
8826B3928647r6840j75066k66013l55732m34281m92320n16522m93847m23677l26986
8816B0347363k43690k18783k83790m41024o58144q78815j047160j132698j140483
$$ plain form
8880 12233238 13520928 15133293 16902553 18650752 20236686 21589818 22719371 23697126
8872 23697126 24621525 25576585 26600840 27677042 28743626 29719607 30531306 31131780 31507520
8863 31507520 31670587 31640156 31424488 31015851 30402423 29588782 28610871 27535913 26447257
8854 26447257 25421574 24508243 23718384 23025325 22373527 21692761 20917270 20009613 18983634
8845 18983634 17915768 16935780 16196582 15832267 15918850 16452134 17351134 18484402 19705784
8836 19705784 20883868 21917762 22742756 23332661 23700200 23890915 23966929 23983969 23971820 23928647
8826 23928647 23831807 23656741 23390728 23034996 22600715 22108395 21591873 21098026 20674349 20347363
8816 20347363 20103673 19884890 19601100 19160076 18501932 17623117 16575957 15443259 14302776
8807A4302776j102376j058812j043028j071857j142046j233210j320136j389192
8799D942119j444554j495345j534151j528953j438337j236732r28922n46372j33237
8790e344484K68252O28215R31783J172371J342090J431287J439844J387283J307715
8781D564356J231851J171989J121599J066981J000513R26825Q58860Q06606P66421
8772A3516001P19621O42515N20882L59153J79765J5204j02418j51473j29523n7940
8762A5511787K2262O5030L7742o8133k40509m58932p04214r59754j208281j431026
8752A0565972j610645j732856j782959j741874j591944j334631j005789o69671
8744i04397l90682k04753j13072r8051j41877k31658l52570m80385n82152o26853
$$ plain form
8807 14302776 13200400 12141588 11098560 10026703 8884657 7651447 6331311 4942119
8799 4942119 3497565 2002220 468069 -1060884 -2499221 -3735953 -4664875 -5211247 -5344484
8790 -5344484 -5076232 -4448017 -3516234 -2343863 -1001773 429514 1869358 3256641 4564356
8781 4564356 5796207 6968196 8089795 9156776 10157289 11084114 11942974 12749580 13516001
8772 13516001 14235622 14878137 15399019 15758172 15937937 15953141 15850723 15699250 15569727 15511787
8762 15511787 15534049 15599079 15636821 15568688 15328179 14869247 14165033 13205279 11996998 10565972
8752 10565972 8955327 7222471 5439512 3697638 2105694 771063 -234726 -904397
8744 -904397 -1295079 -1499832 -1612904 -1710955 -1852832 -2084490 -2437060 -2917445 -3499597 -4126450
8734d126450o01630n23304m34025l79180l80185m20659m55540m36881l39464j70832
8724h268150L7806K50009M37395N80535O61518O57792N44754L08192m0061m55193
8714e285403q69468j214198j438112j511864j423778j178581q01863l41538J41152
8705a3923653N87853R56604J226406J393595J463884J443864J336810J147372
8697d367265Q93642O15168L64765J86033R4072P4537R7433J29586J37732Q9315
8687a684982m0190k55155n31446q17347j044163j144572j073382q21445m16206
8678g828888Q8660O27134J133579J552969J846625J992351J982419J823782J539113
8669D757744J164367P43976L29037k2556k53256l24546k37406l9155J89747L63524
$$ plain form
8734 -4126450 -4728080 -5251384 -5685409 -6064589 -6444774 -6865433 -7320973 -7757854 -8097318 -8268150
8724 -8268150 -8230344 -7980335 -7542940 -6962405 -6300887 -5643095 -5098341 -4790149 -4830210 -5285403
8714 -5285403 -6154871 -7369069 -8807181 -10319045 -11742823 -12921404 -13723267 -14064805 -13923653
8705 -13923653 -13335800 -12379196 -11152790 -9759195 -8295311 -6851447 -5514637 -4367265
8697 -4367265 -3473623 -2858455 -2493690 -2307657 -2213585 -2139048 -2041615 -1912029 -1774297 -1684982
8687 -1684982 -1725172 -1980327 -2511773 -3329120 -4373283 -5517855 -6591237 -7412682 -7828888
8678 -7828888 -7740228 -7113094 -5979515 -4426546 -2579921 -587570 1394849 3218631 4757744
8669 4757744 5922111 6666087 6995124 6972568 6719312 6394766 6157360 6118205 6307952 6671476
8659F671476M22604L55859K00895J8559j44161k77297m01781n42273p01854q55412
8649D746615r61954r84886r08010p39925n05934k33602N8108L59383O61603R49089
8639B440487J197241J377255J463354J439768J306732J083561Q04408N04728K05324
8630A1822858r3474m00807p15396j013294j252876j392237j406927j300017j103030
8621C144800q68353o54765n11253m66338n26360o79856r03179j164605j426399
8612d056308j646121j781098j799222j692007j478868j196126q78146n45748k09442
8603a5283086J19320M21536O74871Q64208R88710J059118J087912J081199J038637
8594g947575R59346Q47235P12407N70467M41469L47042L04045L16721L72066M42023
$$ plain form
8659 6671476 7094080 7449939 7650834 7669393 7525232 7247935 6846154 6303881 5602027 4746615
8649 4746615 3784661 2799775 1891765 1151840 645906 412304 470412 829795 1491398 2440487
8639 2440487 3637728 5014983 6478337 7918105 9224837 10308398 11112806 11617534 11822858
8630 11822858 11729384 11328577 10613181 9599887 8347011 6954774 5547847 4247830 3144800
8621 3144800 2276447 1621682 1110429 644091 117731 -562125 -1465304 -2629909 -4056308
8612 -4056308 -5702429 -7483527 -9282749 -10974756 -12453624 -13649750 -14527896 -15073644 -15283086
8603 -15283086 -15163766 -14742230 -14067359 -13203151 -12214441 -11155323 -10067411 -8986212 -7947575
8594 -7947575 -6988229 -6140994 -5428587 -4858120 -4416651 -4069609 -3765564 -3448843 -3076777 -2634754
8584b634754M92504M95400M37883L24321J70264p340j96955l90990n76656p27709
8574b614032q08287p91640o81736n18897l60914k50520j91588j50690q2564L8052
8564f412816J99216L58561M66598M89906M21942K80101R5193j00208k80848m33338
8554d915693n54947o46834p05793p21556o84235n97504m85558l85515l29376l28289
8544a0355300l68366m17634m38255l99034k85061j01639J29902L83750O42467
8535a1209170R01315J158598J399958J594623J712674J748975J728767J688036
8527G23776J648692J611597J567706J508941J427430J309876J138724R00610N93070
8518A2430422K23485j96534o54428j134471j613256k058697k436033k718570k896310
$$ plain form
8584 -2634754 -2142250 -1646850 -1208967 -884646 -714382 -721722 -918677 -1309667 -1886323 -2614032
8574 -2614032 -3422319 -4213959 -4895695 -5414592 -5775506 -6026026 -6217614 -6368304 -6450868 -6412816
8564 -6412816 -6213600 -5855039 -5388441 -4898535 -4476593 -4196492 -4101299 -4201507 -4482355 -4915693
8554 -4915693 -5470640 -6117474 -6823267 -7544823 -8229058 -8826562 -9312120 -9697635 -10027011 -10355300
8544 -10355300 -10723666 -11141300 -11579555 -11978589 -12263650 -12365289 -12235387 -11851637 -11209170
8535 -11209170 -10307855 -9149257 -7749299 -6154676 -4442002 -2693027 -964260 723776
8527 723776 2372468 3984065 5551771 7060712 8488142 9798018 10936742 11837352 12430422
8518 12430422 12653907 12457373 11802945 10668474 9055218 6996521 4560488 1841918 -1054392
8509a054392k976017k971801k892723k736340k492692k154949j729114j238044
8501b0246072p19571k19731K17999N63977Q08032R56487J024703J032017J000504
8492a5581655R52874R05855Q62662Q12594P41135O43907N32677M28531L49868
8483i351552L06433L00655L27534L69319L94438L71301K91798J85039J07242J12934
8473f584859K26439M30877O79309R18891J112190J244635J319412J348724J346478
8464B042096J321068J268829J174696J023559Q14462N65218L04922O3474j33792
8455H444532k67875l29600l24443k72890k03385j41608j02444q7936r0581r9470
8445F524300j06600j10700j16423j28671j45476j55324j42947j00539l5362L3178
$$ plain form
8509 -1054392 -4030409 -7002210 -9894933 -12631273 -15123965 -17278914 -19008028 -20246072
8501 -20246072 -20965643 -21185374 -20967375 -20403398 -19595366 -18638879 -17614176 -16582159 -15581655
8492 -15581655 -14628781 -13722926 -12860264 -12047670 -11306535 -10662628 -10129951 -9701420 -9351552
8483 -9351552 -9045119 -8744464 -8416930 -8047611 -7653173 -7281872 -6990074 -6805035 -6697793 -6584859
8473 -6584859 -6358420 -5927543 -5248234 -4329343 -3217153 -1972518 -653106 695618 2042096
8464 2042096 3363164 4631993 5806689 6830248 7644710 8209928 8514850 8578324 8444532
8455 8444532 8176657 7847057 7522614 7249724 7046339 6904731 6802287 6714351 6623770 6524300
8445 6524300 6417700 6307000 6190577 6061906 5916430 5761106 5618159 5517620 5482258 5515436
8435E515436Q4377J05158R0566L8953n0262j73409l18559m66649n98213p00615
8425C526783p70043q06678q06921p59467o49455m68282k21654O9656L75163O60382
8415A49484Q89495J027654J047941R43016P34120M68821K06598N07j15925j34017
8405E217694o9864L9972J48012K09097J92271Q7487r3177l19524n52868p58566
8395D100534r14498j011185j046891j024018r48109q26798o68873m86938l03244
8386c130020j51601o8937p9015j78733l36989n07251o45441p21932p23445o50180
8376g193544n15010l43383j66633o587J39649L02492N25785Q42328J251422J709759
8366c453722K140428K455497K581251K476341K139439J607688R48022K43513m21659
$$ plain form
8435 5515436 5599813 5704971 5795537 5834490 5784228 5610819 5292260 4825611 4227398 3526783
8425 3526783 2756740 1950062 1143141 383674 -265781 -734063 -955717 -886061 -510898 149484
8415 149484 1038979 2066633 3114574 4057590 4791710 5260531 5467129 5467636 5351711 5217694
8405 5217694 5147830 5187802 5335814 5544911 5737182 5824669 5731492 5411968 4859100 4100534
8395 4100534 3186036 2174851 1127960 103942 -844167 -1670965 -2339838 -2826776 -3130020
8386 -3130020 -3281621 -3350558 -3429573 -3608306 -3945295 -4452546 -5097987 -5819919 -6543364 -7193544
8376 -7193544 -7708554 -8051937 -8218570 -8225157 -8085508 -7783016 -7257231 -6414903 -5163481 -3453722
8366 -3453722 -1313294 1142203 3723454 6199795 8339234 9946922 10894944 11138457 10716798
8357A0716798r75345j367693j578717j621318j536685j381746j213054j073129
8349c0889r82929r41046r28551r17863q83547q12200p08154n91959m90508m21423
8339g709069l79190l32972k41435p7946J50833M07047O42437Q21037R28629R68238
8329d822391R51902Q96409Q22084P50619P01118O86125P08272P57657Q12474Q46634
8319C110903Q43198Q05137P53968P15383P01576P02009O87169O21310M77293K48027
8309I665973m8863l73994o74209q92402r79346r09495o96785l98789j00166J18916
8299D710840K11735J76543M8933j16522k65798l59282l76663l14130j79468R775
8289C545963K25894M33586N97902O93740P11289O56075N46601M11701K86224K03247
$$ plain form
8357 10716798 9741453 8373760 6795043 5173725 3637040 2255294 1042240 -30889
8349 -30889 -1013818 -1954864 -2883415 -3801278 -4684825 -5497025 -6205179 -6797138 -7287646 -7709069
8339 -7709069 -8088259 -8421231 -8662666 -8740612 -8589779 -8182732 -7540295 -6719258 -5790629 -4822391
8329 -4822391 -3870489 -2974080 -2151996 -1401377 -700259 -14134 694138 1451795 2264269 3110903
8319 3110903 3954101 4759238 5513206 6228589 6930165 7632174 8319343 8940653 9417946 9665973
8309 9665973 9617110 9243116 8568907 7676505 6697159 5787664 5090879 4692090 4591924 4710840
8299 4710840 4922575 5099118 5148051 5031529 4765731 4406449 4029786 3715656 3536188 3545963
8289 3545963 3771857 4205443 4803345 5497085 6208374 6864449 7411050 7822751 8108975 8312222
8279H312222J84574K34423L40188M79984O32971P87140R41059J099696J268214
8270A4280471J447790J633798J813460J962165K042672K012400J838375J512944
8262B8544075J062527N45455L8397l86204o84020q51978r21988r39681r43368
8253B5463215r55681r87153j041962j118904j208668j292076j342722j335685
8245A6180364j261486j138431j012534r39978r60678j079259j263973j461532
8237G062493j618613j700639j701089j637996j539795j428546j309347j170874
8229e044406r96294p79074n34710l00084j19133k2423j1771n7885j13155j35503
8219h114438j11706o5082m0549p6741j84836l46515n27395o93349q20183q95307
$$ plain form
8279 8312222 8496796 8731219 9071407 9551391 10184362 10971502 11912561 13012257 14280471
8270 14280471 15728261 17362059 19175519 21137684 23180356 25192756 27031131 28544075
8262 28544075 29606602 30152057 30190454 29804250 29120230 28268252 27346264 26406583 25463215
8253 25463215 24507534 23520381 22478419 21359515 20150847 18858771 17516049 16180364
8245 16180364 14918878 13780447 12767913 11827935 10867257 9787998 8524025 7062493
8237 7062493 5443880 3743241 2042152 404156 -1135639 -2564185 -3873532 -5044406
8229 -5044406 -6040700 -6819774 -7354484 -7654568 -7773701 -7796124 -7807895 -7865780 -7978935 -8114438
8219 -8114438 -8226144 -8291226 -8331775 -8408516 -8593352 -8939867 -9467262 -10160611 -10980794 -11876101
8209a1876101r15235q83470q10636p15188o21562n54719n32414n57305o11906
8200a8078536o61122o65052n96453m50922k43031N690K75676N50572Q14876J052609
8190a7995693J247585J385147J456319J463116J420088J348880J269349J193636
8182g211573J125668J063940J005367R49422Q99979Q61134Q28435P84368P05725
8173A012465N79142M12126K31246P1550l3471n7890J1258J67620L82350O08021
8163C384417P87749Q65332P96371N62545J85776k68031p03332j023019j156618
8154C431190j077570q07454m09504K8350M20249P10336Q85898R65903R73219R12474
8144F033091P69927N32629K09618j60599n19713q09216r89446j050159j009330
$$ plain form
8209 -11876101 -12791336 -13674806 -14485442 -15200630 -15822192 -16376911 -16909325 -17466630 -18078536
8200 -18078536 -18739658 -19404710 -20001163 -20452085 -20695116 -20689426 -20413750 -19863178 -19048302 -17995693
8190 -17995693 -16748108 -15362961 -13906642 -12443526 -11023438 -9674558 -8405209 -7211573
8182 -7211573 -6085905 -5021965 -4016598 -3067176 -2167197 -1306063 -477628 306740 1012465
8173 1012465 1591607 2003733 2234979 2306529 2273058 2215168 2226426 2394046 2776396 3384417
8163 3384417 4172166 5037498 5833869 6396414 6582190 6314159 5610827 4587808 3431190
8154 3431190 2353620 1546166 1136662 1165012 1585261 2295597 3181495 4147398 5120617 6033091
8144 6033091 6803018 7335647 7545265 7384666 6864953 6055737 5066291 4016132 3006802
8135C006802r02475p68715o40358n38508m72908m43079m40728m55509m83328n31873
8125b670679o17850p56764r52109j189992j439989j660752j810125j858189j797305
8116a4753754j643148j427971j192770r80948q29081p52337p32126p17838o46460
8107b3676433m71363j85606J72637N37243Q46618J073056J230139J353988J472885
8098a7646836J586518J666928J677954J598997J437075J220220R80022P39797
8090f739325N17010L32081K09399J66859K03471K95228M00840M73372M74823L91087
8080c275155K41965P9765k6054j4326J41894M21443P62462J088531J338160J480838
8070B239523J515041J455947J322188J125598Q65913N34461J28233l32916p98925
$$ plain form
8135 3006802 2104327 1335612 695254 156746 -316162 -759241 -1199969 -1655478 -2138806 -2670679
8125 -2670679 -3288529 -4045293 -4997402 -6187394 -7627383 -9288135 -11098260 -12956449 -14753754
8116 -14753754 -16396902 -17824873 -19017643 -19998591 -20827672 -21580009 -22312135 -23029973 -23676433
8107 -23676433 -24147796 -24333402 -24160765 -23623522 -22776904 -21703848 -20473709 -19119721 -17646836
8098 -17646836 -16060318 -14393390 -12715436 -11116439 -9679364 -8459144 -7479122 -6739325
8090 -6739325 -6222315 -5890234 -5680835 -5513976 -5310505 -5015277 -4614437 -4141065 -3666242 -3275155
8080 -3275155 -3033190 -2953425 -2979479 -2993805 -2851911 -2430468 -1668006 -579475 758685 2239523
8070 2239523 3754564 5210511 6532699 7658297 8524210 9058671 9186904 8853988 8055063
8061H055063j200190j472548j583583j545477j406520j225602j045428q80967
8053b305252p27045n73918m16881k56866r9382M2648J46293J83698J35171J710
8043c869824j92042m06151n99179p39346q08039p96398p00501n20937k67831L3537
8033h866711L43041O14540Q09706R10101R21612Q69561P87090P02177O28979N67618
8023a712286N12289M62090M25687M15168M33838M68750M94524M85215M25821L17831
8013B728927J78020L1325j00368k08172k96737l72226m26624m34242l68174k25904
8003E05825m2667J19795K01439J70709L7162j52000l28779m30207m22972l12758
7993f54453j33021P5732K79580M52431N72591O22546N92275M82520L06138Q6126
$$ plain form
8061 8055063 6854873 5382325 3798742 2253265 846745 -378857 -1424285 -2305252
8053 -2305252 -3032297 -3606215 -4023096 -4279962 -4379344 -4336696 -4190403 -4006705 -3871534 -3869824
8043 -3869824 -4061866 -4468017 -5067196 -5806542 -6614581 -7410979 -8111480 -8632417 -8900248 -8866711
8033 -8866711 -8523670 -7909130 -7099424 -6189323 -5267711 -4398150 -3611060 -2908883 -2279904 -1712286
8023 -1712286 -1199997 -737907 -312220 102948 536786 1005536 1500060 1985275 2411096 2728927
8013 2728927 2906947 2938272 2837904 2629732 2332995 1960769 1534145 1099903 731729 505825
8003 505825 463158 582953 784392 955101 992263 840263 511484 81277 -341695 -654453
7993 -654453 -787474 -711742 -432162 20269 592860 1215406 1807681 2290201 2596339 2682465
7983B682465j50957l83746o00161p93271r53868j067762j119622j098609j001045
7974d486576q29655n91609k97870L4205L75979O85670R15574J028384J014305
7965b151593Q97817P27989N55901M11345K92677J75720L4221j42752l45749n50254
7955i4678p25248q41736q82172q48861p64295o58440n48993m29710k77648p4583
7945f146364J74396M39445O81855Q75406J019685J138248J262875J412246J577064
7936B434856J721006J798344J778808J665175J491946J304495J131916R72960
7928A4299506Q05012O07242L78819J40367p7389k46463l48793l77459l34168k25576
7918A4621098o1454J42848L60443N48346O50730O13748M07972M6051m17796r08733
$$ plain form
7983 2682465 2531508 2147762 1547601 754330 -199538 -1267300 -2386922 -3485531 -4486576
7974 -4486576 -5316231 -5907840 -6205710 -6171505 -5795526 -5109856 -4194282 -3165898 -2151593
7965 -2151593 -1253776 -525787 30114 441459 734136 909856 944077 801325 455576 -94678
7955 -94678 -819926 -1661662 -2543834 -3392695 -4156990 -4815430 -5364423 -5794133 -6071781 -6146364
7945 -6146364 -5971968 -5532523 -4850668 -3975262 -2955577 -1817329 -554454 857792 2434856
7936 2434856 4155862 5954206 7733014 9398189 10890135 12194630 13326546 14299506
7928 14299506 15104518 15711760 16090579 16230946 16153557 15907094 15558301 15180842 14846674 14621098
7918 14621098 14559644 14702492 15062935 15611281 16262011 16875759 17283731 17329782 16911986 16003253
7908A6003253j359933j731220k009205k193514k280372k254355k094292j790561
7900B89801j361115q51749l17990J97443O73191J097977J451977J699786J803252
7891D682573J744516J540382J237131Q91533N53003K56052K0757j45329k46013
7882A0534605k93796l04315k89254k49983j74582m1224J71068M68622Q34536J230677
7872A1886354J607909J917304K117418K178788K089086J858232J517770J110867
7864B6283728O78350K51238j46415m92580p69667r72060j107546j188367j221479
7855B1315202j209277j158892j088425j023454r87735r94564j041167j107912
$$ plain form
7908 16003253 14643320 12912100 10902895 8709381 6429009 4174654 2080362 289801
7900 289801 -1071314 -1923063 -2241053 -2043610 -1370419 -272442 1179535 2879321 4682573
7891 4682573 6427089 7967471 9204602 10096135 10649138 10905190 10925947 10780618 10534605
7882 10534605 10240809 9936494 9647240 9397257 9222675 9181451 9352519 9821141 10655677 11886354
7872 11886354 13494263 15411567 17528985 19707773 21796859 23655091 25172861 26283728
7864 26283728 26962078 27213316 27066901 26574321 25804654 24832594 23725048 22536681 21315202
7855 21315202 20105925 18947033 17858608 16835154 15847419 14852855 13811688 12703776
$$ [...]
##END NTUPLES=NMR SPECTRUM
##END=
