##TITLE=31Pdec_DE-57__NaOH_b
 D2O, 64 sc
 26.6.2024
##JCAMPDX= 6.0         $$ Bruker NMR JCAMP-DX V2.0
##DATA TYPE= NMR SPECTRUM
##DATA CLASS= NTUPLES
##ORIGIN= UXNMR, Bruker Analytische Messtechnik GmbH
##OWNER= root
$$ XWIN-NMR		Version 3.5
$$ Wed Jun 26 15:54:41 2024 Russian Standard Time (UT+4h)  she@DPX200
##.OBSERVE FREQUENCY= 81.013821
##.OBSERVE NUCLEUS= ^31P
##.ACQUISITION MODE= SIMULTANEOUS
##.ACQUISITION SCHEME= undefined
##.AVERAGES= 64
##.DIGITISER RES= 17
##SPECTROMETER/DATA SYSTEM= spect
##.PULSE SEQUENCE= zgpg30
##.SOLVENT NAME= D2O
##.SHIFT REFERENCE= (INTERNAL, D2O, 0, 182.463)
##AUDIT TRAIL= $$ (NUMBER, WHEN, WHO, WHERE, WHAT)
$$ ##TITLE= Audit trail, XWIN-NMR		Version 3.5
$$ ##JCAMPDX= 5.01
$$ ##ORIGIN= Bruker BioSpin GmbH
$$ ##OWNER= she
$$ F:/spectra/data/she/nmr/P31/2/pdata/1/auditp.txt
$$ ##AUDIT TRAIL=  $$ (NUMBER, WHEN, WHO, WHERE, WHAT)
(   1,<2024-06-26 15:53:29.31 +0400>,<she>,<DPX200>,
      <continue with go, POWCHK disabled, PULCHK disabled
       configuration hash MD5:
       00 E9 B6 7A A2 85 ED C7 34 08 36 98 17 FE 4E 26
       data hash MD5: 32K
       79 76 D0 85 88 76 7A C0 C5 A2 90 07 93 05 E3 13>)
(   2,<2024-06-26 15:53:31.82 +0400>,<she>,<DPX200>,
      <Start of raw data processing
       efp BC_mod = 2 LB = 1.5 FT_mod = 6 PKNL = 1 PHC0 = 2749.729 PHC1 = 251.6863 SI = 64K 
       data hash MD5: 64K
       00 6E D3 81 3F 9E 59 7D 23 60 AA A1 D9 C9 3B CC>)
(   3,<2024-06-26 15:53:42.53 +0400>,<she>,<DPX200>,
      <pk PHC0 = -36.06066 PHC1 = 0 
       data hash MD5: 64K
       61 00 7F 7F 36 FC C5 EE D7 B0 1F FA 25 1B F8 A5>)
(   4,<2024-06-26 15:53:59.76 +0400>,<she>,<DPX200>,
      <pk PHC0 = 17.4 PHC1 = 0 
       data hash MD5: 64K
       BE 17 83 5C F0 F6 E4 D6 D5 C7 C5 43 04 05 03 E7>)
(   5,<2024-06-26 15:54:09.87 +0400>,<she>,<DPX200>,
      <abs ABSG = 5 
       data hash MD5: 64K
       E7 AB A1 1F 8A 16 E4 FB 8C 04 7E EE 58 ED 61 FE>)
$$ ##END=
$$ 
$$ hash MD5
$$ C7 EC 40 30 1B 81 27 3C 0C BF 43 58 E6 AC 06 F9
##$RELAX= 
##$RELAX= 
##$RELAX= 
##$RELAX= 
##$RELAX= 
##$RELAX= 
##$RELAX= 
##$RELAX= 
$$ Bruker specific parameters
$$ --------------------------
##$DU= <F:/spectra>
##$EXPNO= 2
##$NAME= <P31>
##$PROCNO= 1
##$TYPE= <nmr>
##$USER= <she>
##$AMP= (0..31)
100 100 100 100 100 100 100 100 100 100 100 100 100 100 100 100 100 100 
100 100 100 100 100 100 100 100 100 100 100 100 100 100 
##$AQSEQ= 0
##$AQ_mod= 1
##$AUNM= <au_zg>
##$AUTOPOS= <>
##$BF1= 81.014009
##$BF2= 200.13
##$BF3= 200.13
##$BF4= 200.13
##$BF5= 200.13
##$BF6= 200.13
##$BF7= 200.13
##$BF8= 200.13
##$BYTORDA= 1
##$CFDGTYP= 0
##$CFRGTYP= 5
##$CHEMSTR= <none>
##$CNST= (0..31)
1 1 145 1 1 1 1 1 1 1 1 1 1 1 1 1 1 1 1 1 1 1 1 1 1 1 1 1 1 1 1 1 
##$CPDPRG= <waltz16>
##$CPDPRG1= <>
##$CPDPRG2= <waltz16>
##$CPDPRG3= <>
##$CPDPRG4= <mlev>
##$CPDPRG5= <mlev>
##$CPDPRG6= <mlev>
##$CPDPRG7= <mlev>
##$CPDPRG8= <mlev>
##$CPDPRGB= <>
##$CPDPRGT= <>
##$D= (0..31)
0 1 0 0 0 0 0 0 0 0 0 0.03 2e-05 3e-06 0 0 0 0 0 0 0 0 0 0 0 0 0 0 0 0 
0 0 
$$ [...]
##$SUBNAM3= <"">
##$SUBNAM4= <"">
##$SUBNAM5= <"">
##$SUBNAM6= <"">
##$SUBNAM7= <"">
##$SUBNAM8= <"">
##$SUBNAM9= <"">
##$SW= 369.568048894756
##$SWIBOX= (0..15)
0 1 3 0 0 0 0 0 0 0 0 0 0 0 0 0 
##$SW_h= 29940.119760479
##$TD= 32768
##$TD0= 1
##$TE= 0
##$TE2= 300
##$TE3= 300
##$TEG= 300
##$TL= (0..7)
0 120 53 12 22 120 120 120 
##$TP= (0..7)
150 150 150 150 150 150 150 150 
##$TP07= 0
##$TPNAME0= <>
##$TPNAME1= <>
##$TPNAME2= <>
##$TPNAME3= <>
##$TPNAME4= <>
##$TPNAME5= <>
##$TPNAME6= <>
##$TPNAME7= <>
##$TPOAL= (0..7)
0.5 0.5 0.5 0.5 0.5 0.5 0.5 0.5 
##$TPOFFS= (0..7)
0 0 0 0 0 0 0 0 
##$TUNHIN= 0
##$TUNHOUT= 0
##$TUNXOUT= 0
##$USERA1= <user>
##$USERA2= <user>
##$USERA3= <user>
##$USERA4= <user>
##$USERA5= <user>
##$V9= 5
##$VALIST= <valist>
##$VCLIST= <CCCCCCCCCCCCCCC>
##$VD= 0
##$VDLIST= <DDDDDDDDDDDDDDD>
##$VPLIST= <PPPPPPPPPPPPPPP>
##$VTLIST= <TTTTTTTTTTTTTTT>
##$WBST= 1024
##$WBSW= 4
##$XGAIN= (0..3)
0 0 0 0 
##$XL= 0
##$YL= 0
##$YMAX_a= 25363
##$YMIN_a= -3154
##$ZGOPTNS= <>
##$ZL1= 120
##$ZL2= 120
##$ZL3= 120
##$ZL4= 120
##$ABSF1= 182.463
##$ABSF2= -187.1042
##$ABSG= 5
##$ABSL= 3
##$ALPHA= 0
##$AQORDER= 0
##$ASSFAC= 0
##$ASSFACI= 0
##$ASSFACX= 0
##$ASSWID= 0
##$AUNMP= <proc_1d>
##$AZFE= 0.1
##$AZFW= 0.5
##$BCFW= 0
##$BC_mod= 2
##$BYTORDP= 0
##$COROFFS= 0
##$CY= -3
##$DATMOD= 1
##$DC= 0
##$DFILT= <>
##$DTYPP= 0
##$F1P= 0
##$F2P= 0
##$FCOR= 1
##$FTSIZE= 65536
##$FT_mod= 6
##$GAMMA= 0
##$GB= 0
##$INTBC= 1
##$INTSCL= 9.790993e-09
##$ISEN= 30
##$LB= 1.5
##$LEV0= 0
##$LPBIN= 0
##$MAXI= 10000
##$MC2= 0
##$MEAN= 0
##$ME_mod= 0
##$MI= 50
##$NCOEF= 0
##$NC_proc= -10
##$NLEV= 6
##$NOISF1= 182.463
##$NOISF2= 159.3651
##$NSP= 0
##$NTH_PI= 0
##$NZP= 0
##$OFFSET= 182.463
##$PC= 4
##$PHC0= 2731.068
##$PHC1= 251.6863
##$PH_mod= 1
##$PKNL= yes
##$PPARMOD= 0
##$PSCAL= 0
##$PSIGN= 0
##$REVERSE= no
##$SF= 81.0140089999434
##$SI= 65536
##$SIGF1= 159.3651
##$SIGF2= -187.1042
##$SINO= 113.3802
##$SIOLD= 16384
##$SREGLST= <1H.CDCl3>
##$SSB= 0
##$STSI= 65536
##$STSR= 0
##$SW_p= 29940.119760479
##$SYMM= 0
##$S_DEV= 0
##$TDeff= 32768
##$TDoff= 0
##$TI= <>
##$TILT= no
##$TM1= 0
##$TM2= 0
##$TOPLEV= 0
##$USERP1= <user>
##$USERP2= <user>
##$USERP3= <user>
##$USERP4= <user>
##$USERP5= <user>
##$WDW= 1
##$XDIM= 65536
##$YMAX_p= 323087839
##$YMIN_p= -280438941
$$ End of Bruker specific parameters
$$ ---------------------------------
##NTUPLES= NMR SPECTRUM
##VAR_NAME=  FREQUENCY,     SPECTRUM/REAL,   SPECTRUM/IMAG
##SYMBOL=    X,             R,               I
##VAR_TYPE=  INDEPENDENT,   DEPENDENT,       DEPENDENT
##VAR_FORM=  AFFN,          ASDF,            ASDF
##VAR_DIM=   65536,         65536,           65536
##UNITS=     HZ,            ARBITRARY UNITS, ARBITRARY UNITS
##FACTOR=    0.456856943014862, 1,           1
##FIRST=     14782.0589164792, 0,            0
##LAST=      -15158.0608439998, 0,           0
##MIN=       -15158.0608439998, -280438941,  0
##MAX=       14782.0589164792, 323087839,    0
$$ Real data points
##PAGE= N=1
##DATA TABLE= (X++(R..R)), XYDATA
$$ [...]
##PAGE= N=2
##DATA TABLE= (X++(I..I)), XYDATA
4872a0779131n773585K074892N294658N604752Q242284J0756457O484476l801056
4864A8103747j1502805j1261531o615180l569427k866637q81135M155312R388852
4856e048804J0585472O668799M91404m147111n243140k655529K782888R055795
4848A2489774J2888104J1498523M634163n361894j4702968j9113588j5567074
4841a3234960n052999O969981J4499850J5422095J1633507N947840R4246n171428
4833C1108132r515661j2456940j2858125r803538m373271P28300L813582N093656
4825h263865M818792K799694K74779m35838J011975L106570O138032J1508233
4817B0958372J6071144J2776550O91875j0555273j1489099m210517K182067L905494
$$ y = [-10779131, -16552716, -14477824, -9183166, -3578414, 4663870, 15420327, 21904803, 18103747, 6600942, -4660589, -11275769, -14845196, -17711833, -18592968, -14437656, -5048804, 5536668, 12205467, 12696871, 8549760, 3306620, 651091, 3433979, 12489774, 25377878, 36876401, 41510564, 36148670, 21445702, 2332114, -13234960, -18287959, -11317978, 3181872, 18603967, 30237474, 36185314, 36279560, 31108132, 21592471, 9135531, -3722594, -13526132, -17899403, -17171103, -13357521, -8263865, -3445073, -645379, -370600, -806438, 205537, 3312107, 9450139, 20958372, 37029516, 49806066, 50497941, 39942668, 28453569, 24243052, 26425119, 30330613]
4809C0330613L858419L742370K442647J032809K074219M180271L788072J639075
4801E3088495N82259j792983r499162j7490681j5502924m738794R24518m419167
4793A151561q408642O00762J4312899J6283430O273131r52117J669803O058842
4785C6989669N006214K073858J133434k096789j0432595j6009952j0349492J438599
4777G752946O378684J619569k621595J204887P768574P846685J133804n268835
4769B5814719p462093p685700p469851l945529M359120J1736158R889321j566130
4761B3670015j2531615j2486621j836070R003687J1310358N988266p01869n373264
4753A7042887q104910p823484l112546K463312K467372k416863k827083N935554
$$ y = [30330613, 34189032, 37931402, 40374049, 41406858, 43481077, 47661348, 51449420, 53088495, 53670754, 51877771, 42378609, 24887928, 9385004, 4646210, 5570728, 1151561, -7257081, -6656319, 7656580, 23940010, 30213141, 29261024, 30930827, 36989669, 41995883, 44069741, 45203175, 43106386, 32673791, 16663839, 6314347, 7752946, 14131630, 15751199, 13129604, 14334491, 22103065, 29949750, 31083554, 25814719, 18352626, 10666926, 3197075, -748454, 3610666, 15346824, 25236145, 23670015, 11138400, -1348221, -3184291, 5819396, 17129754, 23118020, 22416151, 17042887, 8937977, 1114493, -1998053, 465259, 2932631, 515768, -2311315, 3624239]
4745C624239J4642231J1746638M99291n107202m39544M432023J599705l330477
4737B7666904k438228J345690Q50430k259633j146978L080696K223319n698654
4729B3623546j2957219j3017896p830016k814392l27470N10552J736629M454016
4721f622250N526853q14277j2749868j6923449m226280J3779012J7001243M952725
4713g6291k246444N633191J3779804O494984q515903j3949526r779169q971629
4705a7630983j2585061q291791O252346J6415324J2179065K571765O91974M984487
4697D587126M952253j360004n646568k379643M871998J0220540J2429717J3459347
4689D1134766J3583983J0267341J592240r724636j6853394j5362840r074105o538009
$$ y = [3624239, 18266470, 30013108, 30512399, 25405197, 24965653, 29397676, 30997381, 27666904, 25228676, 26574366, 27424796, 25165163, 24018185, 27098881, 29322200, 23623546, 10666327, -2351569, -10181585, -12995977, -13323447, -12812895, -11076266, -6622250, -1095397, -1909674, -14659542, -31582991, -35809271, -22030259, -5029016, -76291, -2322735, 3310456, 17090260, 23585244, 15069341, 1119815, -8659354, -17630983, -30216044, -38507835, -32255489, -15840165, -3661100, -1089335, -397361, 4587126, 9539379, 8179375, 2532807, 153164, 5025162, 15245702, 27675419, 41134766, 54718749, 64986090, 66578330, 56853694, 40000300, 24637460, 15563355, 9025346]
4681I025346j0649914j4657258j0539373R65498J1465873J4696702J2027640Q157056
4673B0491570M443487j245939r175790j5112012j4263589o261338N219777J5992555
4665H8721K2176078J9921253R369162j693688m350559j29001L79492o852689j2370410
4656B6538359p038419M338885J0650069R692301O578722K075850n949409j2427268
4648C4459090r689072k239561l362127j4267728k0132554j2271184j251551K07846
4640b8546841m337319m373022l15434Q63038Q42275O208509J2951416R732688
4632f974690k733692r226391q77106J2442401J6250473R734362L234136K795863
4624B4645356M359170J978190l327675m658824J676556R772776R782542P48409
$$ y = [9025346, -1624568, -16281826, -26821199, -25855701, -14389828, 306874, 12334514, 20491570, 24935057, 23689118, 14513328, -598684, -14862273, -21123611, -15903834, 88721, 22264799, 42186052, 51555214, 49861526, 45510967, 45381966, 45761458, 38908769, 26538359, 19499940, 23838825, 34488894, 44181195, 50759917, 52835767, 46886358, 34459090, 24770018, 22530457, 19168330, 4900602, -15231952, -27503136, -28754687, -28546841, -32884160, -37257182, -37572616, -36709578, -35867303, -29658794, -16707378, -6974690, -9708382, -18934773, -19811879, -7369478, 8880995, 18615357, 21849493, 24645356, 29004526, 30982716, 27655041, 22996217, 24672773, 34445549, 44228091, 44976500]
4616D4976500p015462n880540j662991l744057r442918q276348M75649N988637
4608A5418470K442313l924383o971574q684499j0437773p227010K190213Q729357
4600h464886N293399j579408j346301N248925R605059Q684317N366709m4424q026667
4591A4736723j2572906o867466M690824J0274744O259590j53899l240175l706803
4583I420632j812655L165095N567067k493496j6606348k1582626j2084466k47983
4575c6674780K838395J131352J563135Q40690m220726m567790P511686K0376160
4567a1201878J6129185j576664j0827798l256690N249189P20439q497871p462005
4559b0724093J745535N161653j016483o374319k470795P120750J3833076J4075288
$$ y = [44976500, 37961038, 32080498, 30417507, 26673450, 17230532, 8954184, 9429833, 15418470, 17860783, 13936400, 6964826, -1719673, -12157446, -19384456, -17194243, -8464886, -3171487, -4750895, -6097196, -848271, 8756788, 17441105, 22807814, 22763390, 14736723, 2163817, -4703649, -12825, 10261919, 16521509, 16367610, 13127435, 9420632, 7607977, 10773072, 16340139, 13846643, -2759705, -24342331, -36426797, -36674780, -33836385, -32705033, -31141898, -30301208, -34521934, -39089724, -31578038, -11201878, 4927307, 3350643, -7477155, -10733845, -5484656, -4764217, -13262088, -20724093, -18978558, -13816905, -14833388, -21207707, -23678502, -16557752, -2724676, 11350612]
4551A1350612J0448044P190054N604002K328908o438067j7212256j9418299p677747
4543a3824749R155286J6960965J2500865M524997K63912j445966l016171k781694
4535B2337445p92070k670682j1210726j8661167j4694464j47887J3795472J9203714
4527G159635J7457688J1857074K311914r407311j6196791j3285569n327782k96356
4519e727498N51486J028498J597618j44992k367668n78811L763867M548244J731351
4510D402095J544026L985274J174924o845702o993564O333785J6676582O323000
4502B6600420j5239796k1573087o318279Q729688O116819m775800o582230J11465
4494a2930800L114479M60943L92900M357718M640905j602648p935014r346346
$$ y = [11350612, 21798656, 28988710, 34592712, 36921620, 30483553, 13271297, -6147002, -13824749, -4669463, 12291502, 24792367, 29317364, 29581276, 28135310, 25119139, 22337445, 21545375, 18874693, 7663967, -10997200, -25691664, -25839551, -12044079, 7159635, 24617323, 36474397, 38786311, 29379000, 13182209, -103360, -5431142, -5727498, -5176012, -4147514, -2549896, -2694888, -5062556, -5641367, -1877500, 2670744, 4402095, 5946121, 9931395, 11106319, 4260617, -2732947, 3600838, 20277420, 26600420, 11360624, -10212463, -16530742, -7801054, -1684235, -6460035, -13042265, -12930800, -9816321, -9355378, -8962478, -4604760, 36145, -1566503, -9501517, -18847863]
4486a8847863p338557k729240O763430J8172435K1352717J1515657k149425p184796
4478A9554358l918353l697322j1595320j8076815j1603762M888006J6447144J4568353
4470F566289O269297J682765k23058n759700j1464075p161045N824641J2804955
4462H540069P004411K86560L951069R990030M317552r338755j4683277q623062
4454A444597m895574j0357839j3715288m423548R834625J4002126N975200l337049
4446e472750n670286k554506J302018M555553Q241977J2124635J3512057R412984
4438C5451682N08696p701260r990446p086569l620525j752117o51983o43003k526336
4429A988139l852321j814255J090458J000597J027562O943659J4728092J3004932
$$ y = [-18847863, -26186420, -28915660, -22152230, -3979795, 17372922, 28888579, 26739154, 19554358, 15636005, 11938683, 343363, -17733452, -29337214, -24449208, -8002064, 6566289, 12835586, 14518351, 14295293, 8535593, -2928482, -10089527, -4264886, 8540069, 15544480, 15831040, 19782109, 29772139, 34089691, 24750936, 10067659, 1444597, -3450977, -13808816, -27524104, -31947652, -22113027, -8110901, -2135701, -5472750, -11143036, -13697542, -12395524, -7839971, 402006, 12526641, 26038698, 35451682, 35960378, 28259118, 18268672, 11182103, 7561578, 5809461, 5157478, 4514475, 1988139, -1864182, -3678437, -2587979, -1587382, -559820, 6383839, 21111931, 34116863]
4421C4116863L61163j0307631r140359j248397L890802N228830N731201M438299
4413C3070771R41729k40741K031431O45874p638769j3330728p749768K265866
4405I995665N154826L200962O132903J1145607N722892j0315581k1227059j6404037
4397f593822k208294J0060478J5994786J4406592L768788j1703738k1313478j9020694
4389a6609382r333465N59860P415504R142801M514398j434519p26360N738235
4381g32928Q884298O576575O703054J1022680R204303l108484j2972115q178635
4373A7398748L691674P225254J942662j219411L6602j128368m163045r90110O557786
4364B9351792N187054r008081k1396900j7715275k175557J0725322J4279654J1385653
$$ y = [34116863, 34478026, 24170395, 15030036, 13781639, 17672441, 22901271, 28632472, 33070771, 34012500, 33771759, 35803190, 36449064, 28810295, 15479567, 7729799, 9995665, 15150491, 18351453, 24484356, 35629963, 41352855, 31037274, 9810215, -6593822, -8802116, 1258362, 17253148, 31659740, 35428528, 23724790, 2411312, -16609382, -25942847, -25382987, -17967483, -8824682, -4310284, -5744803, -6471163, -732928, 8151370, 14727945, 21430999, 32453679, 41657982, 38549498, 25577383, 17398748, 21090422, 28315676, 30258338, 29038927, 29075529, 27947161, 23784116, 22794006, 29351792, 34538846, 25530765, 4133865, -13581410, -15756967, -5031645, 9248009, 20633662]
4356B0633662N055395l088235q020320m625377L751190P361027K705961k366878
4348B1406425N05019Q183566R787007J422256q367614j0236584o406743n802101
4340A0491231r359278q621500m67452N923419K685762l780789k552963M285925
4332a395645N310838q35774k386649O704596J6461416J5266993N545824k050796
4324D2620803l095962k05433M921208J1230466J3343139O033836o947769j5978214
4316E1922074j7274414j4900730j1759484o395388L54469L634749K437754K170031
4308A0189061N447994O803190J813916m176673l482925J603799K109306l280203
4300A7027465n674305M47047Q425248Q517948J030199n049707m515749j789604
$$ y = [20633662, 25689057, 22600822, 14580502, 9955125, 13706315, 21067342, 23773303, 21406425, 21911444, 30095010, 39882017, 41304273, 32936659, 22700075, 16293332, 10491231, 1131953, -7489547, -7956999, -2033580, 652182, -3128607, -5681570, -1395645, 3915193, 3079419, 692770, 7397366, 23858782, 39125775, 44671599, 42620803, 39524841, 39319408, 44240616, 55471082, 68814221, 74848057, 67900288, 51922074, 34647660, 19746930, 7987446, 1592058, 1946527, 5581276, 8019030, 10189061, 15637055, 22440245, 24254161, 20077488, 16594563, 18198362, 20307668, 17027465, 11353160, 11800207, 20225455, 28743403, 29773602, 24723895, 20208146, 18418542]
4292A8418542l687953j0045217j3883501r883163o83491O051882O071747K435714
4284e205440N26437J194202J023377j850319n383402p015329o122306k504622
4276b5337402L936351J0469300J2222551Q383098M624192N953486R728880R706458
4268C9686914M823777o33935l898302n369634m440363j17825L720297Q20523p182317
4259B7409135j0062657l281905L496140m91337j0180656j0877496l68166O444800
4251B087858r13096j2081442r688478O022174J7226242J2335209q95487q979373
4243E113607r454094p337659l116998M973363J0858043N576845o872829j0687417
4235a0947139M27991J3562429J4663370O817860J680409Q73677k322430p936301
$$ y = [18418542, 14730589, 4685372, -9198129, -19081292, -19764783, -13712901, -7641154, -5205440, -4679003, -3484801, -2461424, -4311743, -9695145, -16710474, -22832780, -25337402, -21401051, -10931751, 1290800, 9673898, 14298090, 20251576, 29980456, 39686914, 44510691, 43876756, 39978454, 34608820, 30168457, 30050632, 33770929, 34591452, 27409135, 17346478, 14064573, 17560713, 17069376, 6888720, -3988776, -4356942, 2087858, 1174762, -10906680, -20595158, -14572984, 2653258, 14988467, 14092980, 5113607, -4340487, -11678146, -14795144, -9821781, 1036262, 6613107, -259722, -10947139, -10519148, 3043281, 17706651, 24524511, 26204920, 27078597, 24756167, 16819866]
4227A6819866r157867n505753l468481l729614j34174O800985P938998R85148
4219A0549108m274061j984066J86487m717208j0012200o970498k69848M46862
4211a7045424j980772L120301J5091045K0874106J3667648J294248o313855q522269
4203B0185028r465669r569495o137279J398417R635659J3161770R047035J493073
4195B9748539r18479L785884O967785J683439o273711p522916l979428l708649
4187A9782464m961617P52308J0673437J1458963P43490p252137l743915J375005
4179B8827998k723917r857284q702561k443842k403648q408013r929053l926543
4171a9566863J822179K723371K793842M966794O219335M395946J465458j515228
$$ y = [16819866, 7661999, 2156246, -1312235, -5041849, -5176023, 1624962, 9563960, 10549108, 6275047, 4290981, 4477468, -239740, -10251940, -17222438, -17492286, -17045424, -19026196, -15905895, -814850, 20059256, 33726904, 35021152, 28707297, 20185028, 10719359, 1149864, -4987415, -3588998, 6046661, 19208431, 28255466, 29748539, 28830060, 32615944, 39583729, 41267168, 34993457, 27470541, 23491113, 19782464, 14820847, 15573155, 26246592, 37705555, 38449045, 31196908, 27452993, 28827998, 26104081, 16246797, 7544236, 5100394, 2696746, -5711267, -15640320, -19566863, -17744684, -15021313, -12227471, -7260677, -1041342, 3354604, 4820062, 3304834]
4163C304834m712589m119393M595411J4719775J1649658p208050k4977435k5301435
4155c2049224j2395405k286949j84167J939613Q095473J2034239J0565149J0645159
4147c636112J6218306J7904383O587189q746741j0153750L214857J2155686M569576
4139C8113394p554566p355193J338913J393035j0219633j8209625j2510651j177038
4131a6181364M886163P116836J1029727J2823441N326565p797140j4439129r430527
4123f665428M22068O455314O899395N068477L886025L528803K083368j444790
4115B0233232l884028l19599Q290498J3653983R666734K4609p228794r108894
4107C1327741p840344o006767o361629j1628326j8225670j5246085J569090J8383071
$$ y = [3304834, -1407755, -5527148, -931737, 13788038, 25437696, 18229646, -6747789, -32049224, -44444629, -46731578, -46915745, -44976132, -36880659, -24846420, -14281271, -3636112, 12582194, 30486577, 37073766, 28327025, 18173275, 21388132, 33543818, 38113394, 30558828, 23203635, 24542548, 25935583, 15715950, -2493675, -15004326, -16181364, -11295201, -4178365, 6851362, 19674803, 25001368, 17204228, 2765099, -6665428, -6243360, 211954, 7111349, 12179826, 16065851, 19594654, 21678022, 20233232, 16349204, 16029605, 24320103, 37974086, 47640820, 47665429, 40436635, 31327741, 23487397, 17480630, 11119001, -509325, -18734995, -33981080, -32411990, -14028919]
4099a4028919J6621085k397502j6765213j0657004P303635J7030569J1312013
4092H418664O41344k869516L21951N87492o296187j2090041o637138O753797J3819292
4083B649658R263590N055145J1821647K0404632J3924032o280225k0626295j6955378
4075A9256806l324421O616642Q658496M950367k220354p932971n857684K027761
4067B2174642N445418N38814m660039m613959n108264j0121736j1408249k478876
4059a0232249O567706K190968j0760453j5100939o053389M645089Q562942R832237
4051a0348088J2434405J2050977N995579J55800p13904q57984m532454o605717
4043G578614o08500Q949836J1549411N804395R34954K745295N842672K635183
$$ y = [-14028919, 2592166, 194664, -16570549, -27227553, -19923918, -2893349, 8418664, 9060008, 6190492, 6512443, 7099935, 803748, -11286293, -17923431, -11169634, 2649658, 11913248, 16968393, 28790040, 49194672, 63118704, 56838479, 36212184, 19256806, 15932385, 22549027, 31207523, 36157890, 33937536, 26004565, 20146881, 22174642, 27620060, 28158874, 23498835, 18884876, 13776612, 3654876, -7753373, -10232249, -3664543, -1473575, -12234028, -27334967, -33388356, -28743267, -20180325, -10348088, 2086317, 14137294, 20132873, 20288673, 19574769, 18716785, 14184331, 7578614, 6970114, 15919950, 27469361, 33273756, 34208710, 36954005, 42796677, 45431860]
4035D5431860n652644j1280767r984303m090437K677264Q625917J2164201J1017669
4027D8908760N117281l022696j2022792k1410984k6050652j7821744J252274J4045852
4019a1004701O667459j1274238j6539991k422435J3715145J6137574J0236750
4012E515563Q506104R400491L089035q931158j4324967q441741n02510l6294n623079
4003a1348556q721853l006327J0073350K0390080J6187733j995669j7654414j6199073
3995a2274729l421712L186601j093830m386198R22981O724636L423148n147332
3987a2066435q329995l082157N023232J0233091J0194392N123913j335775l546832
3979B213434n24534J733655j602868o704705n895961K144960J0900014J3667709
$$ y = [45431860, 39779216, 28498449, 18514146, 14423709, 17100973, 25726890, 37891091, 48908760, 54026041, 51003345, 38980553, 17569569, -8481083, -26302827, -25050553, -11004701, -4337242, -15611480, -32151471, -34573906, -20858761, -4721187, 5515563, 14021667, 23422158, 26511193, 17580035, 3255068, -5186673, -5689183, -5725477, -11348556, -20070409, -23076736, -13003386, 7386694, 23574427, 21578758, 3924344, -12274729, -15696441, -12509840, -13603670, -17989868, -17066887, -10342251, -6919103, -12066435, -20396430, -23478587, -18455355, -8222264, 1972128, 7096041, 5760266, 2213434, 1688900, 3422555, 1819687, -4885018, -10780979, -8636019, 2263995, 15931704]
3971A5931704R735621L389910j130943l245179m776567n668589l466028J610954
3963A2380883M899822L983630K798930L922082K057935o458946j2599688n239447
3955E745201R280696J2510094J36140j2120591j3021866j0340807j2792484j3178020
3947c3781637k805447R757415J0890717M802067O456096J5594592J5931527J023704
3939B7869034j5367930j8978394j1841437l770562J861865O586592R184850P566096
3931C110114M176429L563597O679276J0897296J3293200J1809410N968022j870388
3923E7626956q364818j2564636j4276184j0320281J470353J4163171J5343939
3916D3078500K455376j1676043j3628549n089217J734314Q86811j893015K46629
$$ y = [15931704, 25667325, 29057235, 27926292, 24681113, 19904546, 14235957, 10769929, 12380883, 17280705, 21264335, 24063265, 27985347, 30043282, 23584336, 10984648, 5745201, 15025897, 27535991, 27672131, 15551540, 2529674, -7811133, -20603617, -33781637, -36587084, -26829669, -15938952, -11136885, -4680789, 10913803, 26845330, 27869034, 12501104, -6477290, -18318727, -22089289, -20227424, -13640832, -4455982, 3110114, 7286543, 10850140, 17529416, 28426712, 41719912, 53529322, 59497344, 57626956, 49262138, 36697502, 22421318, 12101037, 13571390, 27734561, 43078500, 45533876, 33857833, 20229284, 15140067, 16874381, 17761192, 15868177, 16114806]
3908A6114806N608564P306499K933071k396688k541906K011129M598598O14826
3900C4248899o564527r683435o331351o80291L085875N179386O504948M291889
3892C0051393m299478j4989652j7568733p239201P406738J2142357L419181p453790
3884A468815q853553k636224J957900L481612P635548J2783127Q719670n812739
3876A8744156j6188388j1084394N92372K886598l947005o252845P68927P499964
3868f980615O455474J560194j386400k415064k247908R16406N902096Q321326
3860A0125509Q708761J2076284J6704713J3761901K560451m613896J72656Q030157
3852F7526536O673475j754613n962740k557434K008950K366055j754277q784735
$$ y = [16114806, 21723370, 29029869, 31962940, 29566252, 27024346, 29035475, 33634073, 34248899, 27684372, 18000937, 11669586, 10989295, 14075170, 19254556, 25759504, 30051393, 25751915, 10762263, -6806470, -14045671, -6638933, 5503424, 8922605, 1468815, -7384738, -10020962, -8063062, -4581450, 3054098, 15837225, 24556895, 18744156, 2555768, -8528626, -7936254, -5049656, -8996661, -15249506, -14480579, -6980615, -525141, 1035053, -351347, -2766411, -5014319, -4097913, 1804183, 10125509, 18834270, 30910554, 47615267, 61377168, 63937619, 59323723, 59496379, 67526536, 74200011, 72445398, 66482658, 63925224, 65934174, 68300229, 66545952, 57761217]
3844E7761217j4340026j0933710K255826J2648922P130100j0163572k2337303
3837B2021454k0688448j1557125l164902L383724Q223050Q326840L473314r15797
3829I102110j284389n31743j714235k845910j559594K43247J90113n66523o96610
3820C36466j878316n095270p602764p109610n267433l440963Q32507Q345904J2851579
3811h027900P794184k826435p178852o43272P642251P006256K5078j016896P912863
3802A0687277J5205034Q953093m977071q983132K017128J2299320O664558q384065
3794C3482142j4277855n954989M013931N271614R05236l151741p219821j0667556
3786B400961o950713N209506J4229058R651101k216848p365468m077968j850710
$$ y = [57761217, 43421191, 32487481, 34743307, 47392229, 54522329, 44358757, 22021454, 1333006, -10224119, -13389021, -10005297, -1782247, 6544593, 10017907, 9102110, 7817721, 7285978, 5571743, 2725833, 1166239, 1409486, 1599599, 1033076, 336466, -1541850, -6637120, -14239884, -21349494, -26616927, -30057890, -29225383, -20879479, -8027900, -233716, -3060151, -10239003, -10882275, -3240024, 3766232, 3791310, 2774414, 10687277, 25892311, 34845404, 29868333, 20885201, 22902329, 35201649, 41866207, 33482142, 19204287, 13249298, 17263229, 22534843, 23440079, 20288338, 13068517, 2400961, -4549752, 659754, 14888812, 24539913, 22323065, 14957597, 10879629, 9028919]
3778I028919l298959j213566N406711O741937j132539p313939k247975O869903
3770A2840492P215346j30396l564372Q9688K660800M2953k057306m59085p85535
3761A5852585n544289o334049K797755J1897853P198562o645794r914672M535606
3753A3843557J9244270J4627633n159084j8360509j3243005O21702Q237080O588514
3745B6400158K635762J278630J657877K078848K335244J553668j469894n081584
3737C1388709n646873k686560K13730J054450K264536N008949M202454n379047
3729C0420348j8983883k4011719j4349529J941477J2259232J2923901R026494
3722I226321M432532j498592p781569r345475l669611M477590Q502192P489683
$$ y = [9028919, 5729960, 4516394, 9923105, 16665042, 15532503, 8218564, 5970589, 12840492, 20055838, 19925442, 16361070, 16450758, 19111558, 19154511, 17097205, 16638120, 15852585, 10308296, 3974247, 6772002, 18669855, 25868417, 19222623, 9307951, 13843557, 33087827, 47715460, 42556376, 24195867, 10952862, 11574564, 19811644, 26400158, 29035920, 30314550, 31972427, 34051275, 36386519, 37940187, 36470293, 31388709, 25741836, 23055276, 23269006, 24323456, 26587992, 31596941, 35799395, 30420348, 11436465, -12575254, -26924783, -24983306, -12724074, 199827, 9226321, 13658853, 12160261, 4378692, -4966783, -8636394, -4158804, 4343388, 11833071]
3714A1833071M807295J390516m891139j2912277j5710035p555511P378411J6722705
3706A063036J2120906j572229j1581834j1118395m854252l77598R37426J750410
3698a3632530K392552K136945L297966P150886Q124044N04374r883912j0727551
3690a0637226j601337L583400k802872r881206m891669P120217J1491545N805431
3682a813717R26588K744350N416207L301350j564810o153508j0832846j3907282
3674b1883668j0427297m37952Q763696J2210996J2286098J1110834O130701j863352
3666A5890056m701637J681862Q266942M285931o853223j2315976p986892k130840
3658c863777j245251k050386j33601J994890O69791j073647K005118P815693Q461097
$$ y = [11833071, 16640366, 18030882, 13139743, 227466, -15482569, -23038080, -15659669, 1063036, 13183942, 11611713, 29879, -11088516, -15942768, -16320366, -15382940, -13632530, -11239978, -9103033, -5805067, 1345819, 9469863, 9974237, 90325, -10637226, -12238563, -8655163, -11458035, -21339241, -26230910, -19110693, -7619148, -1813717, -887129, 1857221, 7273428, 10574778, 9009968, 2856460, -7976386, -21883668, -32310965, -32748917, -23985221, -11774225, 511873, 11622707, 17753408, 15890056, 11188419, 12870281, 21137223, 25423154, 18569931, 6253955, -1732937, -3863777, -5109028, -7159414, -7293015, -5298125, -4628334, -5701981, -3696863, 4118830, 12579927]
3649A2579927J425932o054092n984922M80575N353222M237414M10171j808427
3641A0639800l420919p304599j0996680q050409K526220J2302209J2080421L049024
3633A0825067l902124n36432R299002J4418131R412474j3326n697948p148435
3625B6656409q973100j1141851r097226l711189k293984n934309m864256O019671
3617a3339835J4972210Q275867p275098j0710072M139555J9531506J7556948J349590
3609C4500671j3278744j7235628j1532755K88000J3346593J9607047J3985426
3602C9680610J177990r039601j1683756q429946l471397j407942m709178q891262
3594f774482n342169O038324J2975083O321415o092184r281089n00698R775744
$$ y = [12579927, 14005859, 7951767, 1966845, 2447420, 7800642, 12038056, 12448227, 10639800, 7218881, -85718, -11082398, -19132807, -16606587, -4304378, 7776043, 10825067, 6922943, 6386511, 15685513, 30103644, 39516118, 39502792, 33804844, 26656409, 17683309, 6541458, -2555768, -6266957, -8560941, -14495250, -19359506, -13339835, 1632375, 9908242, 2633144, -8076928, -3937373, 15594133, 33151081, 34500671, 21221927, 3986299, -7546456, -7258456, 6088137, 25695184, 39680610, 40858600, 31818999, 20135243, 11705297, 8233900, 6825958, 2116780, -6774482, -12116651, -6078327, 6896756, 13218171, 7125987, -2155102, -2655800, 7119944]
3586G119944J2746582Q092672j205964j0981557j4332878p915852N92276P92357
3578e092420m978675m731817M130670J0413054O865289J049832K621177R118916
3570A9396026J1966678R710028P170970N863089L010211k076222p019285j0767711
3562C7253784j4021650j5826253j3807792q051515k093439O01640L47451J242820
3554a4354954O536260J2906581J1751132k60132j3948813j6380056o127909O177424
3546a3700467J2189419J3283551J2603077Q500864L86946n954654m928433J300270
3538B3680573O457736P337762L507963n019293j4807512j8376783j2372723k872969
3530a2465246K550233M066729N316099M524162k203421j1145747j2900452m400691
$$ y = [7119944, 19866526, 27959198, 26753234, 15771677, 1438799, -6477053, -5884777, -5092420, -10071095, -14802912, -10672242, -259188, 6606101, 7655933, 10277110, 19396026, 31362704, 41072732, 48243702, 54106791, 57117002, 55040780, 48021495, 37253784, 23232134, 7405881, -6401911, -14453426, -16546865, -15945225, -15597774, -14354954, -7818694, 5087887, 16839019, 16578887, 2630074, -13749982, -19877891, -13700467, -1511048, 11772503, 24375580, 32876444, 33263390, 27308736, 22380303, 23680573, 30138309, 37476071, 40984034, 35964741, 21157229, 2780446, -9592277, -12465246, -9915013, -5848284, -532185, 3991977, 1788556, -9357191, -22257643, -26658334]
3522b6658334P212345J3320847J1657131N504249l17505k553217k118075k814293
3514C233148m740870k266124O805476J4338601J1755904L771419K507651Q765938
3506D4171143J0285791R05605r707461j0968783o318353n172039p311822n317108
3498A0566973J544051O293482O035254M957954M331541j145435j2778191k1105358
3490a299729j6446061k340954Q346917R330246O544063P626350J1995616J4086589
3482C7843037J1640782O568468N25965n686117r782320r680794p130331n439819
3474A8858871l931281M42725N668528M971337k950617r661800p309781R78816
3466G066798N899818L861365j329960o131655j0280806j2828757j1175587n150502
$$ y = [-26658334, -19445989, -6125142, 5531989, 11036238, 10718733, 8165516, 6047441, 3233148, -1507722, -3773846, 3031630, 17370231, 29126135, 32897554, 35405205, 44171143, 54456934, 55362539, 45655078, 34686295, 28367942, 23195903, 15884081, 10566973, 12111024, 18404506, 24439760, 29397714, 33729255, 32583820, 19805629, -1299729, -17745790, -20086744, -11739827, -2409581, 4134482, 11760832, 23756448, 37843037, 49483819, 56052287, 56578252, 50892135, 41109815, 31429021, 24298690, 18858871, 14927590, 15370315, 21038843, 26010180, 23059563, 13397763, 6087982, 7066798, 12966616, 16827981, 15498021, 9366366, -914440, -13743197, -24918784, -30069286]
3458c0069286K037511P560788J0449701R951209O625265M524311P225672J1544279
3450B9849450J0564877L567941k979920n649913q376461j3423054j5166139q773231
3442a0386450L82485L468019J026195Q62063M435142M430320k120409o536351
3434d438986K96690J4325167K2250288J7263689N336845m073782q329320j0495281
3426C2135310j1906354j0272926m820119L80464M15024m222768p553253m849972
3418a0694594J908346O751129P376019P822522J2139891J7261556J5582210N031912
3410F3178991o974694j2055260j0568282q991677r457918p612215j617958K936884
3402H837871J116817k887630j297695N299616Q201989L294235k936595l017777
$$ y = [-30069286, -28031775, -20470987, -10021286, -70077, 6555188, 11079499, 18305171, 29849450, 40414327, 43982268, 41002348, 35352435, 26975974, 13552920, -1613219, -10386450, -10003965, -6535946, -5509751, -4647688, -212546, 4217774, 2097365, -4438986, -4142296, 10182871, 32433159, 49696848, 55033693, 50959911, 42630591, 32135310, 20228956, 9956030, 5135911, 5516375, 5931399, 1708631, -5844622, -10694594, -8786248, -2035119, 5340900, 13163422, 25303313, 42564869, 58147079, 63178991, 56204297, 44149037, 33580755, 24589078, 15131160, 7518945, 5900987, 8837871, 9954688, 7067058, 5769363, 11068979, 19270968, 22565203, 19628608, 16610831]
3394A6610831J256284L261017K540170M142976P575435M915237n975948j3527347
3386B0798655o192188R158895J3330414Q18847j1278160o650646P557613J2139944
3378C9683374L240021n776369p516251r188883j4715379j4626422l131824Q181642
3370c850091O941807N21538M275210J5249975J5521665R96541j1105378q133763
3362B0417504M01193j61071p341798p940561P23125Q315130P585417K358488j083762
3353B3273665k350212m019204n742546m998752j752360P12989K79526j93215L947425
3344I157316J1518467J4609533Q585776l33324k947070M8697N53403k846538k925166
3335C5421094K547290N589648J042939m608681m051500m41206K10214M67705N119904
$$ y = [16610831, 17867115, 21128132, 23668302, 27811278, 35386713, 40301950, 34326002, 20798655, 14606467, 23765362, 37095776, 37914623, 26636463, 19985817, 27543430, 39683374, 42923395, 37147026, 29630775, 20441892, 5726513, -8899909, -12031733, -3850091, 3091716, 3613254, 7888464, 23138439, 38660104, 39656645, 28551267, 20417504, 20818697, 20657626, 13315828, 5375267, 6098392, 14413522, 21998939, 24357427, 23273665, 20923453, 16904249, 11161703, 6162951, 4410591, 5123580, 5403106, 5209891, 9157316, 20675783, 35285316, 43871092, 43537768, 40590698, 40639395, 41192798, 38346260, 35421094, 37968384, 43558032, 44600971, 39992290, 35940790, 35499584, 35709798, 36177503, 41297407]
3326D1297407Q880068K274605j2225574k1165416j7646635q504178k807067j734995
3318a1631785j895516j138058J670518O569228R785808O430204k008783p665906
3310A15710n566785J200967O120970M563839m763850j7091010k0471347o055093
3302d1946599J7937265L0682283K1712904K919551o917525l239981M150825O272960
3294C1571683K967938j414457l802260m261733n376098q569486r942987l830242
3286b657642P604578J3931207R047628j518206r647618j3718756j3224677l436089
3278a3619575J4364376K4584149J3350073r713718k0145593j0048659L000250
3271A771303K140496p170231r348677j517425O537123Q832070Q612055R328893
$$ y = [41297407, 50177475, 52452080, 40226506, 19061090, 1414455, -7089723, -9896790, -11631785, -13527301, -14665359, -12994841, -6425613, 3360195, 9790399, 7781616, 115710, -5451075, -4250108, 1870862, 6434701, 1670851, -15420159, -35891506, -41946599, -24009334, 6672949, 28385853, 31305404, 24387879, 21147898, 25298723, 31571683, 34539621, 33125164, 29322904, 25061171, 19685073, 11115587, 1172600, -2657642, 4946936, 18878143, 27925771, 26407565, 16759947, 3041191, -10183486, -13619575, 744801, 25328950, 38679023, 28965305, 8819712, -1228947, 1771303, 3911799, -3258432, -12607109, -14124534, -7587411, 1244659, 9856714, 19185607]
3263A9185607R095818M935151k594983r491521j0621389m018997M493819M734030
3255A5717535n396124j4485308j0483247L482607J2671471Q885853j687828q830464
3247a25505r528104o810847l334356j00149J750425J794157J921722M532309R194520
3238g05828J2353513J0849594N802006K202225K958436M058289m12473p814167
3230B9291595p737802K698793J0825817L788158j2124692j7954709p142170O947735
3222H592725J0864882P376755O032786O798822K402834p973328j6673186j7903902
3214d81612j3115566o483987o45390K978095M154870M747363O701544R142473
3206F997790R482021O552520J096651n015649q575518o919368j982471R28722
$$ y = [19185607, 28281425, 33216576, 30621593, 21130072, 10508683, 6489686, 10983505, 15717535, 10321411, -4163897, -14647144, -11164537, 1506934, 10392787, 8704959, -125505, -9653609, -16464456, -19798812, -19898961, -18148536, -16354379, -14432657, -9900348, -705828, 11647685, 22497279, 28299285, 30501510, 33459946, 37518235, 37105762, 29291595, 21553793, 24252586, 35078403, 38866561, 26741869, 8787160, 1644990, 8592725, 19457607, 26834362, 32867148, 39665970, 42068804, 34095476, 17422290, -481612, -13597178, -20081165, -20726555, -17748460, -13593590, -8846227, -2144683, 6997790, 16479811, 23032331, 24128982, 19113333, 10537815, 3618447, 1635976, 2564698]
3198B564698M56296Q08238L557645M014716K68175j171119M049906Q459507L453125
3189B6461187n401196n602975K614666P164245M331469L754170J0055263J3700665
3181E7077494P215470j428648j212126M944424O062120R6927n391616o427364
3173F0936681p050225j1324614j7813812k1677175j7880316m619866J1832636
3166g596691J9031680J1054555l095297r405321m657022L382795Q349236J0307782
3158B7371717J0013233O216495m61671o958112j1807336j5154165j5408572j1067106
3150a7255517m918204p49755L027538R969869J6736226J5393524N210713n457162
3142B1957232j0560709j2201814j3034224j0539029k514451Q063049J7006048
$$ y = [2564698, 3020994, 3829232, 7386877, 11401593, 11669768, 10498649, 14548555, 23008062, 26461187, 21059991, 15457016, 18071682, 25235927, 29567396, 33321566, 43376829, 57077494, 64292964, 62864316, 61652190, 66596614, 72658734, 72755661, 67364045, 60936681, 53886456, 42561842, 24748030, 3070855, -14809461, -19429327, -7596691, 11434989, 22489544, 19394247, 9988926, 5331904, 8714699, 17063935, 27371717, 37384950, 43601445, 43139774, 36181662, 24374326, 9220161, -6188411, -17255517, -22173721, -22923476, -19895938, -9926069, 6810157, 22203681, 27414394, 21957232, 11396523, -805291, -13839515, -24378544, -26892995, -18829946, -1823898]
3135a823898K1742039J7946913J956730j8580504k5598317j0962981J0071752
3128e248266J5288376J652422j4116704j7933295j0789324l9496R974674J5863558
3120e348055J3887841O059244N11864P33305N55858m849895r212163l836486Q046645
3111F548158J4092626Q796065r64865o591580o951708n238918k936633l39703
3103F413442Q98133q77407n154357r488098r955803k805641R338749J4300920
3095B669938K177195j7770458k2532828l900783J8142945K0237064N474768m621369
3087a23528j822224K015381j253694l937868O59836N441096K641342k887376l872762
3078c139797l613791p438670j0017080l874862N868883Q216636L303028K68357
$$ y = [-1823898, 19918141, 37865054, 39821784, 21241280, -4357037, -15320018, -5248266, 10040110, 11692532, -2424172, -20357467, -31146791, -31186287, -21211613, -5348055, 8539786, 14599030, 15110894, 15844199, 16400057, 11550162, 2337999, -1498487, 6548158, 20640784, 29436849, 28471984, 21880404, 14928696, 9689778, 6753145, 6413442, 7311575, 6434168, 1279811, -8208287, -18164090, -20969731, -11630982, 2669938, 4847133, -12923325, -35456153, -39356936, -21213991, -976927, 4497841, -123528, -1945752, 69629, -1184065, -5121933, -4462097, 978999, 3620341, 732965, -3139797, -6753588, -14192258, -24209338, -28084200, -22215317, -13998681, -10695653, -10427296]
3070a0427296J757095L129833M188944Q245231J1086086M965657o177700r443708
3062G324142k423360L760032K904538O03183o45412o885671j6619536j5865455
3054b7847539k06513J2750232O895601q107787j1858333l291206K204979m4745
3046b9505311N12386P585101J0707254M613230k79721N235338J3988522J3385916
3038B6242715K918779q184407j4305730j5577614j1513482j994520P354114R498361
3030e561784O077156N978140J2193803J6287009R446687n034967j4757627j2272207
3022A2356210k566598L433718J30759q502731j3610845r144545L348349J5736232
3014A180549J9830753J4393153N311361j580671n816133q917149q898245k800618
$$ y = [-10427296, -8670201, -5540368, -1351424, 6893807, 17979893, 22945550, 16767850, 7324142, 4900782, 8660814, 11565352, 12168535, 11523123, 4637452, -11982084, -27847539, -28054052, -15303820, -8408219, -16516006, -28374339, -31665545, -29460566, -29505311, -28992925, -21407824, -10700570, -6087340, -6367061, -1131723, 12856799, 26242715, 29161494, 20977087, 6671357, -8906257, -20419739, -22414259, -15060145, -5561784, 515372, 6493512, 18687315, 34974324, 44421011, 39386044, 24628417, 12356210, 9789612, 13223330, 13354089, 4851358, -8759487, -17904032, -14555683, 1180549, 21011302, 35404455, 40715816, 39135145, 33319012, 24401863, 15503618, 12703000]
3006A2703000O260039J0126584N317516k489432n961903m621142l093661l696306
2998A4544695m184190j665483L741580Q469457P516078j305993j3350176j9138577
2990e372609j2976825O51313J0692970R671248L49111p044410m946266L037691
2982e937777N528805k429436j1505522r418166K111374R275063N086311k284242
2974i573590k821572K152528N317400M722266K981363L87343l679097n825436
2966f338795k376703L773406O261948M045289J788239K487355M461931N060036
2958A9162706L570526R81907r29190j738597m149355r477101j1129468p06029
2950d414601J6280122K1141507O094644j2030825j3058861k71593P655488N033374
$$ y = [12703000, 18963039, 29089623, 34407139, 31917707, 25955804, 21334662, 18241001, 14544695, 10360505, 8695022, 12436602, 20906059, 28422137, 27116144, 13765968, -5372609, -18349434, -17698121, -7005151, 2666097, 3015208, -4029202, -8975468, -5937777, -408972, -2838408, -14343930, -23762096, -21650722, -12375659, -7289348, -9573590, -12395162, -10242634, -4925234, -202968, 2778395, 3165738, -513359, -6338795, -8715498, -4942092, 1319856, 5365145, 7153384, 9640739, 14102670, 19162706, 22733232, 23715139, 22785949, 21047352, 16897997, 7420896, -3708572, -4414601, 11865521, 33007028, 39101672, 27070847, 14011986, 13740393, 21395881, 26429255]
2942B6429255K452604M177154J211204r618552j6711625j1307863p75365M049883
2934i3305L749363L786459K950055j550846n084742k403694J755982p73242p859154
2925e523124r906092m847702r06219l840875r192537r173507j839042Q423132
2917c6805966J5467450J4933558O659849m356846j1067000r856126k686279N741874
2909b1969486J1619525J2937754Q680765o66624j0791917j3650927m147477J1885230
2901f103157K0711678J5283472L265756l755582m765773o471979j0050637j0437520
2893b323742p429046o543780p484713k858260P806723J3495639P466835j691068
2885D38588k769597J870546K161828l183867o470633m635076k837763m129275
$$ y = [26429255, 28881859, 33059013, 34270217, 24651665, 7940040, -3367823, -4143188, -93305, 3656058, 7442517, 10392572, 8841726, 3756984, 1353290, 3109272, 2336030, -5523124, -15429216, -20276918, -21183137, -25024012, -34216549, -43390056, -45229098, -36805966, -21338516, -6404958, 254891, -4101955, -15168955, -25025081, -27711360, -21969486, -10349961, 2587793, 11268558, 10601934, -189983, -13840910, -17988387, -6103157, 14608521, 29891993, 33157749, 29402167, 24636394, 18164415, 8113778, -2323742, -9752788, -16296568, -23781281, -26639541, -18832818, -5337179, 2129656, 438588, -2331009, -460463, 1701365, -1482502, -7953135, -12588211, -15425974, -19555249]
2877a9555249m202071Q87366P796261J0394958Q052724N849336P027628Q114334
2869B4365287L879287l706704o015102L01908O968887N207541j460745l767547
2861B5772812j984702l131755n120749J428760J3861731J6358965M128543p291799
2853D4021806o123603j886633n927685r685598n46080J2331592J0142001l801127
2845C8524673p834155L238291J0212195J013706j1048107j0175783j890103q04422
2837B1236295o706678p448854N15840P786327O720734M29036m068118m923881
2829A3540701n048817n866929m809531J41342N571457O462755M926968Q262893
2821B3180839J5230482J3377715k043859j5636436j1359457K248520L487976q660717
$$ y = [-19555249, -23757320, -22869954, -15073693, -4678735, 3373989, 9223325, 16250953, 24365287, 28244574, 24537870, 18522768, 18824676, 25793563, 31001104, 29540359, 25772812, 23788110, 20656355, 15535606, 16964366, 30826097, 47185062, 51313605, 44021806, 37898203, 36011570, 30083885, 20398287, 19852207, 32183799, 42325800, 38524673, 30690518, 33928809, 44141004, 45154710, 34106603, 23930820, 22040717, 21236295, 14529617, 7080763, 7596603, 15382930, 22103664, 22532700, 18464582, 13540701, 8491884, 2624955, -2184576, -2043234, 3528223, 9990978, 14917946, 23180839, 38411321, 51789036, 49745177, 34108741, 22749284, 24997804, 28485780, 19825063]
2813A9825063j2347489K384112J7221508J3370732j927846j0197692r187607r165493
2805I975288j0952408n600572O933080J4483828R550315j456733p780408n457238
2797I695152K056418Q217015P958113K591209o08839K718185Q314588J0358440
2789E1300281R636086R011305N683174m328917j7354558k5336300k5186355j8282150
2781a4857434n173073J0798168J9570692J5123360O760764P404233J3089044Q558608
2773F1274362o884313j5576324p634509N050040Q636439O551762P880309Q923391
2765F8221157Q20005j2060497j6285096q725853P80812M170977J406618n919108
2757C2409015j5504485j9762570j2186268J228147Q016180O702483N771107N241746
$$ y = [19825063, 7477574, 9861686, 27083194, 40453926, 38526080, 28328388, 19140781, 9975288, -977120, -6577692, 355388, 14839216, 24389531, 22932798, 15152390, 9695152, 11751570, 19968585, 27926698, 30517907, 29909068, 32627253, 40941841, 51300281, 60936367, 69947672, 75630846, 71301929, 53947371, 28611071, 3424716, -14857434, -20030507, -9232339, 10338353, 25461713, 32222477, 39626710, 52715754, 61274362, 54390049, 38813725, 31179216, 36229256, 44865695, 51417457, 59297766, 68221157, 69041162, 56980665, 40695569, 31969716, 32750528, 36921505, 38328123, 32409015, 16904530, -2858040, -15044308, -13816161, -5799981, 902502, 6673609, 11915355]
2749A1915355m137310j9002717j9517183J213107K0380174J4995883m167032q828943
2741g148666M124711J0337456j869816j3630917n923828J2487894K0670136J4413422
2733C3460392M632559k836239r838871j3881995r100082J582674P705223N684544
2725A7408205K300549K721040L697810O91431n244185j0212733j2328214j2169565
2717a3135662j1574842j1989912j1549106o024989M025398J1002013J0360918
2710b8886182Q493614J3011284J8931674J4273461j828879j6359388j8453528
2703a0817944r733596K121719J1511432J4790499J0057351K99427q413142j3015557
2695c199811j3255481p557896L352897J0830778O512355m090425p064450j3015
$$ y = [11915355, 7778045, -11224672, -30741855, -29528748, -9148574, 5847309, 1680277, -7148666, -3023955, 7313501, 5443685, -8187232, -14111060, -1623166, 19046970, 33460392, 38092951, 35256712, 25417841, 11535846, 2435764, 4018438, 11723661, 17408205, 19708754, 22429794, 26127604, 26819035, 21574850, 11362117, -966097, -13135662, -24710504, -36700416, -48249522, -54274511, -50249113, -39247100, -28886182, -20392568, -7381284, 11550390, 25823851, 23994972, 7635584, -10817944, -20551540, -18429821, -6918389, 7872110, 17929461, 18228888, 9815746, -3199811, -16455292, -24013188, -20660291, -9829513, -3317158, -7407583, -14472033, -14485048]
2687a4485048N232419K091319j235205L293750J0736339J2250291P700982K386909
2679B7971756j107009k202360r14195j228872p280558j2967049o636435R384536
2671E019814J7215134Q402383l469730m704524j569305n197030r700804k769335
2663C226603J0800901J4622214N340499m698260o739042k877496L616245J0983716
2655C4275380J3403038O034488n041162r300883o168192k212798J414198N773622
2647C8177691L972064r102262k0587597j2565943Q932674J7783976M031863j2846318
2639A7796148j3285646k573596K821750p57250m834578l467977K133744O819639
2631D652234L871458q451067j9833021j6978924k347688P476649M964114P9806
$$ y = [-14485048, -9252629, -7161310, -8396515, -5102765, 5633574, 17883865, 25584847, 27971756, 26864747, 24662387, 23748192, 22519320, 15238762, 2271713, -4364722, 5019814, 22234948, 30637331, 27167601, 22463077, 20893772, 15696742, 5995938, 3226603, 14027504, 28649718, 33990217, 29291957, 22552915, 19675419, 23291664, 34275380, 47678418, 53712906, 48671744, 39370861, 33202669, 30989871, 32404069, 38177691, 42149755, 33047493, 12459896, -106047, 8826627, 26610603, 30642466, 17796148, 4510502, 1936906, 4758656, 4001406, -833172, -4301149, -2167405, 4652234, 8523692, 72625, -19760396, -36739320, -39087008, -31610359, -26646245, -26566439]
2623b6566439J545364M440230L228480K544490N828103O289363n26438o679328
2615i896175m715198q7772n75301l371696k620429K36795L120210R296807J6889651
2606H276892J4918010J353457q263100m038814N60236q447751j8654185r453734
2598b3748989J2523624K1145333R588763l173154m067232m00057j98345m77118
2590A1192825k68383m974705j1293632p033693O382543J0105943l486873j6095362
2582a5471337j0291904M267212O770787l948989j0912257m673118P453127J4833503
2574a1972976J4048262P275513m31596k892382J391834O305084N641965P96096
2566B0161800l033926l969654k449471J595022N516838L743295l327625o466680
$$ y = [-26566439, -25021075, -20580845, -17352365, -14807875, -8979772, -2690409, -3216847, -9896175, -14611373, -14699145, -15274446, -18646142, -21266571, -21029776, -17909566, -8612759, 8276892, 23194902, 24548359, 16285259, 12246445, 12806681, 4358930, -14295255, -23748989, -11225365, 9919968, 19508731, 16335577, 12268345, 11868288, 11669943, 11192825, 10924442, 5949737, -5343895, -12377588, -5995045, 4110898, 624025, -15471337, -25763241, -21496029, -14725242, -18674231, -29586488, -34259606, -26806479, -11972976, 2075286, 9350799, 8919203, 6026821, 7418655, 13723739, 19365704, 20161800, 17127874, 13158220, 10708749, 12303771, 17820609, 21563904, 18236279, 11769599]
2558A1769599q49623M113696k505363j5282530j8060816n717211R840803J5844934
2550h46511J2004381N817758J885478n21897l136897m962264k621340M674661
2542A2293369J0633203P243148k890635o345689L055087J2753205P482953q143929
2534C6080712j5276180p411531K071940J326643l900288k045697O394843J1533792
2526B8774234Q766484K501875j642319j578044K348139P407367Q484395K604559
2518E7666690p065675j4667691j7528627j6011504j0384830j901678N149213O929387
2510B185285M432469Q61017l307940q301565j0486081o089686J086658K401249
2502a7218594l679433q130478k565239J0394518K0537843K0368009J0057981l828237
$$ y = [11769599, 10919976, 15033672, 12528309, -2754221, -20815037, -26532248, -16691445, -846511, 11157870, 16975628, 18861106, 18339209, 15202312, 10240048, 7618708, 12293369, 22926572, 30169720, 27279085, 20933396, 23988483, 36741688, 44224641, 36080712, 20804532, 13393001, 15464941, 16791584, 12891296, 10845599, 17240442, 28774234, 37540718, 40042593, 38400274, 36822230, 39170369, 46577736, 55062131, 57666690, 50601015, 35933324, 18404697, 2393193, -7991637, -9893315, -4744102, 2185285, 6617754, 7478771, 4170831, -4130734, -14616815, -20706501, -19619843, -17218594, -20898027, -29028505, -31593744, -21199226, -661383, 19706626, 29764607, 25936370]
2494B5936370j2007798q899625J256174P784326N773225J111157M73418J612883
2486B3040130j013928n766920o664434m002121l639962o353082o409192j809877
2478a2619386K164487K030058J250880K993310M667834L974816M136429P877796
2470A6476224J1216425Q614083L95674r416238j8168918k2893610j9024301p147334
2462c9947995L593234N809517L514064M273283O471483L728570j807505k088058
2454a6453407K297229K473001k808302m086327K401361P272985L167866l277083
2446i012677k860685J642560K278719M09219K875948P516280M864243n588572
2438B125035j2050986o730123L260276O654372L673072M091422J2100973J9939735
$$ y = [25936370, 13928572, 5028947, 6285121, 14069447, 19842672, 20953829, 21427247, 23040130, 22026202, 16259282, 9594848, 5592727, 1952765, -4400317, -10809509, -12619386, -10454899, -8424841, -7173961, -4180651, 487183, 4461999, 8598428, 16476224, 27692649, 36306732, 36702406, 27286168, 9117250, -13776360, -32800661, -39947995, -36354761, -30545244, -27031180, -22757897, -16286414, -12557844, -14365349, -16453407, -14156178, -11683177, -14491479, -18577806, -16176445, -8903460, -5735594, -9012677, -11873362, -10230802, -7952083, -7542864, -4666916, 2849364, 7713607, 2125035, -9925951, -16656074, -13395798, -6741426, -3068354, 1023068, 13124041, 33063776]
2430C3063776J8154675P591227k702845p531104j0164349j3662095j3374949l695667
2422G678669J0740816J8083022J3726290M836053j067485m726763q926056j0881280
2414B9463266p030711o25605K253887J666273K836681P830761J3207963J4705045
2406F4307560J0329491Q17711r209561j3380094j1027228r031429j1510681j2406351
2398H889418n186446M831525P377483L384643K991946Q097934R127449J460237
2390D0974189o739315p845928n405595n309356n926106m581778n248459j0620029
2382a0702377j3561093o670876M970182J1240095J2635525J6380274J9802187
2375C4093917J2026563o278670j8839880j4992760l628840J394997J68497J461778
$$ y = [33063776, 51218451, 58809678, 56106833, 48575729, 38411380, 24749285, 11374336, 7678669, 18419485, 36502507, 50228797, 55064850, 53997365, 49270602, 40344546, 29463266, 22432555, 21806950, 24060837, 25727110, 28563791, 36394552, 49602515, 64307560, 74637051, 75454762, 66245201, 52865107, 41837879, 32806450, 21295769, 8889418, 3702972, 8534497, 15911980, 19296623, 22288569, 30386503, 39513952, 40974189, 34234874, 26388946, 20983351, 15673995, 9747889, 5166111, -82348, -10702377, -24263470, -30934346, -25964164, -14724069, -2088544, 14291730, 34093917, 46120480, 39841810, 21001930, 6009170, 2380330, 3775327, 3943824, 5405602]
2367E405602N657389M931007j764349n338160k79711O819120O630321o04350o968199
2358A4488670p848057n740621l655355R5242P496131J3996655J1610940M03451
2350C0847056q270537n134366L671623M277862m729561r815728l476944L024768
2342A0394173l356098j5811715j5748881N85620J6855492J9044957J0809682K675056
2334B5448286k621454p086914q899410n880150j947882j598726j746449K917698
2326a415001R310511R108418J580760m471342k545008L647844N655894j9890q602557
2317A2249629j1504724n174247L238939K759282o490970j1339640l792144N889622
2309a4164253L620479o686087q541173J962048J0600139O613950l447710q256475
$$ y = [5405602, 11062991, 15993998, 14229649, 8891489, 8611778, 15430898, 22061219, 21456869, 14488670, 6640613, 899992, -2755363, -2660121, 4836010, 18832665, 30443605, 30847056, 22576519, 17442153, 21113776, 25391638, 20662077, 10846349, 7369405, 10394173, 7038075, -8773640, -24522521, -23936901, -7081409, 11963548, 22773230, 25448286, 22826832, 15739918, 6840508, 960358, -987524, -2586250, -4332699, -1415001, 7895510, 17003928, 18584688, 14113346, 11568338, 15216182, 20872076, 20852186, 12249629, 744905, -4429342, -1190403, 1568879, -4922091, -16261731, -20053875, -14164253, -10543774, -17229861, -25771034, -23808986, -13208847, -6594897, -10042607, -18299082]
2301a8299082o331273j639244N088814J2585473J4914077R710197M096782M313952
2293B4439696N515044L46111p897461j0120638n336071k71321J945924L384943
2285A2006227L763372P54205l093049k631846J006015K249793J457742M268408
2277A9780867R783327R120786r74153j1375229j2173868n051865N43989q18538
2269H835316o706937j1523359j1548965p104177j515497L171919Q431706J4304383
2261c655611J4901238N362940p810394j1792348m130306M000210L826841p59268
2253e6698l388154n912603j0984238j2133255k355116J1873468J6850519J0593635
2245D487558M474642N358120P270989M169628M15301J909795M959135K686438
$$ y = [-18299082, -24630355, -26269599, -21180785, -8595312, 6318765, 16028962, 20125744, 24439696, 29954740, 30300851, 22403390, 12282752, 6946681, 6675360, 8621284, 12006227, 15769599, 16523804, 13430755, 10798909, 11804924, 14054717, 15512459, 19780867, 29564194, 38684980, 37710827, 26335598, 14161730, 9109865, 9653854, 8835316, 2128379, -9394980, -20943945, -28048122, -29563619, -26391700, -17959994, -3655611, 11245627, 16608567, 8798173, -2994175, -7124481, -3124271, 702570, -56698, -3444852, -9357455, -20341693, -32474948, -34830064, -22956596, -6106077, 4487558, 8962200, 14320320, 21591309, 25760937, 26176238, 28086033, 33045168, 35731606]
2237C5731606k604027l076063Q80651M13645p360828j3635219j0217381o24562
2229d92178O007398O904284N968879N865397N816381N084897K974484k958896
2221C5170646j2876703k0144628j7304285o317470L427532P241321Q404758R213047
2213F814218P232346K607430M16231J841652J171922l595155n549883o29969L692216
2204A4001008r3568o483885n439585J514041M591818J569313p83608Q73686L151129
2195A2900349L946421L891535J095933n378251q445731j147641Q967142P118078
2187B2947835n747691j1776386k224288R602759Q645012j478901p974258q202479
2179C791603p943258p647794k581626O599791J3406913J4331378J1093036O048168
$$ y = [35731606, 33127579, 30051516, 30932167, 31345812, 23984984, 10349765, 132384, -492178, 5515220, 12419504, 18388383, 24253780, 30070161, 35155058, 38129542, 35170646, 22293943, 2149315, -15154970, -21472440, -18044908, -10803587, -2398829, 6814218, 14046564, 16653994, 17070225, 18911877, 20083799, 16488644, 10938761, 10308792, 14001008, 13907440, 7423555, 1983970, 3498011, 8089829, 9659142, 8875534, 9749220, 12900349, 16846770, 20738305, 21834238, 16455987, 8010256, 6862615, 15829757, 22947835, 17200144, 5423758, 3199470, 12802229, 21447241, 19968340, 11994082, 3791603, -4151655, -11799449, -14381075, -7781284, 5625629, 19957007, 31050043, 37098211]
2171C7098211J359304K31649L011543M224196j018547r562132j3881166j1136831
2163A0326227m423361K427240O921195P184487L586920l51207j714851j170149
2155B2786501l68503Q39111K855959M915144O164085N210194k76877q685533j1996749
2146B1443332o240364j007826o323020j2727338k128701K0151265K6019506N425290
2138D4612144j5851963j3703280K1957R19196q639764r492336j872561k034865
2130f041472r266116o640287N968431R102969k039785q384205K40704Q988395
2122h071366N737938J210451P050414J4402482J1002426K830938J328887K745626
2114C8237796k126648q701531o776755L69171J916784j807896k423843m5244j209879
$$ y = [37098211, 38457515, 38689164, 41700707, 45924903, 44906356, 35344224, 21463058, 10326227, 5902866, 8330106, 15251301, 22435788, 26022708, 25671501, 23956650, 22786501, 22417998, 23257109, 26113068, 31028212, 37192297, 42402491, 42125614, 33440081, 21443332, 15202968, 14195142, 7872122, -4855216, -6983917, 13167348, 39186854, 44612144, 28760181, 15056901, 15078858, 15998054, 7358290, -2134046, -4006607, -6041472, -15307588, -21947875, -15979444, -6876475, -8916260, -17300465, -17059761, -8071366, -2333428, -1122977, 5927437, 20329919, 31332345, 34163283, 35492170, 38237796, 36111148, 27409617, 20632862, 21002033, 22918817, 21110921, 18687078, 18641834, 17431955]
2105A7431955m049662p86380O836877Q841723L373537r93517J71818J798562j63873
2096C2461040k960040l631604l053812j699282J661979N765914P026850M419180
2088C9990225j33085n029050q605056q425142n572476n453575r020120q895746
2080a1144025j155940N882736M046524n63335J783669N805626p65127j3297316
2072i407188j2729374N520917K2263511K0704832P524154q56976j164681j816587
2064C0038608o718600j1310030j0782450m281465O138769J5095574J6100894R408299
2056D3689599L726913M996919P575340K377186r617637j8273590j6977556r070758
2048H426416k439844j831765o089689j0002667r075743l735437K191686O788744
$$ y = [17431955, 13382293, 12595913, 19432790, 28274513, 31648050, 30654533, 30826351, 32624913, 32461040, 29501000, 25869396, 22815584, 21116302, 22778281, 28544195, 35571045, 39990225, 39857140, 34828090, 26223034, 17797892, 12225416, 6771841, -2248279, -11144025, -12299965, -6417229, -2370705, -2934040, -1150371, 4655255, 3890128, -9407188, -22136562, -16615645, 5647866, 26352698, 33876852, 33019876, 31855195, 30038608, 23320008, 12009978, 1227528, -3053937, 3084832, 18180406, 34281300, 43689599, 47416512, 52413431, 59988771, 62365957, 52748320, 34474730, 17497174, 8426416, 5986572, 4154807, -1934882, -11937549, -21013292, -24748729, -22557043, -15768299]
2040a5768299J0445059J1201015N587937l821050p957354k507475N612970P891531
2032A0684334N483648M932576O739631N490786o02063p286194j0829316j0901287
2024C712115p159265Q79967R777693J3681880J1575755Q214550O113521J748974
2016D8545190p029080j4283062j1979191j166039P775318O818825j161461p087002
2008B0433498o405714k542483p72359k002797l628597l762774k072502J911901
2000A158173P774738J1696527Q891413K52152o490694n065260J510287M270727
1992B3998063j107161r602057j2743986o944751M485802J5232493K0141901J7031703
1984E0492007P418067l425447r021657o833123j074019J445050j041554l497946
$$ y = [-15768299, -5323240, 5877775, 11465712, 7644662, -312692, -2820167, 2792803, 10684334, 16167982, 21100558, 27840189, 33330975, 32728912, 25442718, 14613402, 3712115, -3447150, -2567183, 7210510, 20892390, 32468145, 40682695, 46796216, 48545190, 41516110, 27233048, 15253857, 14087818, 21863136, 28681961, 27520500, 20433498, 14027784, 11485301, 10712942, 8710145, 5081548, 1318774, -753728, 1158173, 8932911, 20629438, 29520851, 29773003, 23282309, 18217049, 19727336, 23998063, 22890902, 13288845, 544859, -6399892, -1914090, 13318403, 33460304, 50492007, 57910074, 54484627, 45462970, 38629847, 37555828, 39000878, 37959324, 34461378]
1976C4461378j093342M004858N303676N98112m961664n063811L96443N131348
1968C8776998K737334p211793j8342006k2438562j6500124n859428L82414j622978
1960c0078145n837358k346828J0385982K0792918J5873868j583752j3062931o025432
1952a1881678R500943J3806954L595991n824616m425206j26698k304509n597832
1944c256651q15465P427106P297601j316380p908021q651182r139656j0589531
1936b6952179p241213K73010K123044n209230j1557850p485354K532658P799477
1928d5717637N635521J997659K962156J0192475K0294782K5416367J9517747O569443
1920D6868513k997696n415255n978665p303411n260316N7561O98269n460324q220840
$$ y = [34461378, 33368036, 37372894, 42676570, 43274682, 38313018, 33249207, 33645650, 38776998, 41514332, 34302539, 15960533, -6478029, -22978153, -28837581, -28455167, -30078145, -35915503, -38262331, -27876349, -7083431, 8790437, 7206685, -5856246, -11881678, -2380735, 11426219, 15022210, 9197594, 4772388, 4645690, 2341181, -3256651, -4072116, 3354990, 10652591, 9336211, 1428190, -7222992, -16362648, -26952179, -34193392, -33920382, -31797338, -37006568, -48564418, -56049772, -53517114, -45717637, -40082116, -38084457, -35122301, -24929826, -4635044, 20781323, 40299070, 46868513, 43870817, 38455562, 32476897, 25173486, 19913170, 19970731, 20669000, 15208676, 6987836]
1911F987836r39657O765280K768656q831912j4308876r882329k918123K267771
1903a8091354P728716J3007861J4033574J0483719N346868j586340j1053229j6954128
1895B915687j1454930K812084J4336221J6231884J0418316L00962j0980368j6178570
1887H401286r126007M210835R955721L898267m237385o121594m689651n283849
1879b992377o365921m419086r25198Q95873J018176L94173r92694q22940M826678
1870i383316J3824786J7033946R621071j383421n230685N28585R555718J4410019
1862D8976703J1621112L099599m147265l179295M914334J1164934Q938454N42394
1854H1930970q001788j4142658j8030947j9058267j6958194j3443239r775585
$$ y = [6987836, 6048179, 12813459, 15582115, 6750203, -7558673, -17441002, -20359125, -18091354, -10362638, 2645223, 16678797, 27162516, 32509384, 30923044, 19869815, 2915687, -8539243, -5727159, 8609062, 24840946, 35259262, 35560224, 24579856, 8401286, -724721, 3486114, 13441835, 17340102, 13102717, 6981123, 2291472, -2992377, -9358298, -13777384, -14702582, -13806709, -12788533, -12394360, -13387054, -14209994, -9383316, 4441470, 21475416, 31096487, 29713066, 24482381, 25010966, 34566684, 48976703, 60597815, 63697414, 59550149, 56370854, 61285188, 72450122, 81388576, 81930970, 73929182, 59786524, 41755577, 22697310, 5739116, -7704123, -17479708]
1847a7479708n253390k10588K613995K094466J209990L018366O313722P250864
1839d42283L675092l000800q462915q234884k196859M294151O479655N696484
1831b192359N354301M464546P92875k544134j259021J491202k51019l229788J575916
1822D202519J2711715J7149883Q853767k432998n811797k574759Q50975L684123
1814C6633428P274026Q814420O088117K086205j362165p603211j6443114j9128679
1806A6359027j0073503K745944P288152K171340n226376r659191r624463m096799
1798a0115869M070996O727687P08803n184279j371042R268752J7052168J8655336
1790C9812552J6111489Q940343k366459j0101002p604621k7308L442052L666338
$$ y = [-17479708, -22733098, -22943686, -20329691, -18235225, -17025235, -14006869, -7693147, -442283, 3232809, 232009, -8230906, -16465790, -18662649, -14368498, -7888843, -2192359, 3161942, 7626488, 8419363, 5875229, 4616208, 6107410, 5856391, 2626603, 4202519, 16914234, 34064117, 42917884, 40484886, 34673089, 32098330, 32949305, 36633428, 43907454, 52721874, 58809991, 60896196, 59534031, 51930820, 35487706, 16359027, 6285524, 9031468, 16319620, 18490960, 13264584, 3605393, -6019070, -10115869, -6044873, 682814, 1391617, -3792662, -5163704, 4105048, 21157216, 39812552, 55924041, 64864384, 62497925, 52396923, 44792302, 44764994, 48207046, 51873384]
1782E1873384O578671Q746030J748837j1054880j6413348j0427679k936613j084238
1774B7030164r72166J341491K176342j634803o004921n797224j344027L961857
1766A8756713O723939L557313m837792r598476k340937J1326175J6235769P429952
1758D7252656l873586o729816l294894r58815n46366J430221N012675P510353
1750D5802428Q154525P205424L048161n897415j7287111k4793093k2356360j0189462
1742a6312903K581741N189686j890914n928662J809009J3850487J6365520O485647
1734B2149611o402494j2163887p364676K983386O600214m449192j8661040j4684772
1726c1992850P013393J9799277R774301k810963N63454M554493p996024j7426768
$$ y = [51873384, 58452055, 67198085, 68946922, 57892042, 41478694, 31051015, 28114402, 27030164, 26057998, 27399489, 29575831, 27941028, 21936107, 16138883, 14794856, 18756713, 25480652, 29037965, 24200173, 14601697, 12260760, 23586935, 39822704, 47252656, 43379070, 36649254, 33354360, 32395545, 31849179, 33279400, 38292075, 45802428, 53956953, 61162377, 64210538, 58313123, 41026012, 16232919, -6123441, -16312903, -13731162, -8541476, -10432390, -16361052, -14552043, -701556, 15663964, 22149611, 15747117, 3583230, -3781446, -798060, 5802154, 1352962, -17308078, -31992850, -24979457, -5180180, 4594121, 1783158, 2346612, 6901105, -1094919, -18521687]
1718a8521687o38036J9675457J2550010R307046O5534650J49113946J48036942
1711C85058328K4455297j11081087j34877477o4217016r798698j6186170l0207984
1704D3145193j0631002J4795675J3008211k048104o348596n681125j1437744j3526686
1696B1275822l110016O138886K100435l900417J202242R496933R001076M511839
1688D6716800M657129M761923j512970p928909p138641l351215j919996L74467
1680C4658588M472582K844143n801823j0292886n184104J24845k79613J368935
1672B1910667P745656O335720q024911j8647471j1517132J759483L013930n087452
1664b511510q812678o779885m469044J687452J3799002J7550017Q15827k0993000
$$ y = [-18521687, -19159723, 515734, 13065744, 22372790, 87907440, 237021386, 385058328, 409513625, 298432538, 163555061, 99338045, 89539347, 73353177, 43145193, 32514191, 47309866, 60318077, 58269973, 51921377, 46240252, 34802508, 21275822, 18165806, 24304692, 26405127, 22504710, 23706952, 33203885, 42204961, 46716800, 51373929, 56135852, 54622882, 46693973, 39555332, 36204117, 34284121, 34658588, 39131170, 41975313, 36173490, 25880604, 20696500, 20821345, 20541732, 21910667, 29656323, 35992043, 27967132, 9319661, -2197471, -437988, 2575942, -2511510, -11324188, -18104073, -22573117, -20885665, -7086663, 10463354, 11279181, -9713819]
1656i713819k1992453l421935R031076L380632n808141l819254N668878J2349637
1648a4325379J2573794O637371l158277q577445k078841J0618919J6115056J1701440
1640B9506638O027904K418535l908485j1323991j0116083R78766J0229079R488334
1632C3300697L714254L7277j575611k919271l251736l886202p286574r242737
1624H890097k657004Q569584J1343914K609931n272355l096099L017416L901255
1616B7306739P27251q54856l45317P40026K926228L419700m192629j7972046k4413539
1607a2658443j5241161M78608Q955397Q621714O084450L332177m10623o77992
1599a515873O064173J1978305O095105p997762j4643292p899365R7008k851189
$$ y = [-9713819, -31706272, -35128207, -26097131, -22716499, -28524640, -32343894, -26675016, -14325379, -1751585, 4885786, 1727509, -6849936, -8928777, 1690142, 17805198, 29506638, 35534542, 37953077, 34044592, 22720601, 12604518, 13583284, 23812363, 33300697, 37014951, 37052228, 35476617, 32557346, 29305610, 25419408, 18132834, 8890097, 6233093, 14802677, 26146591, 28756522, 23484167, 20388068, 23405484, 27306739, 28033990, 27179134, 26833817, 27573843, 30500071, 33919771, 29727142, 11755096, -12658443, -27899604, -27420996, -18465599, -9843885, -3759435, -427258, -837881, -1515873, 4548300, 16526605, 22621710, 14623948, -19344, -7918709, -7821701, -10672890]
1591a0672890j1313469j0151385M089061J8012090J8307997P313206k541918n576752
1583G465940o735334r232053q106423j060041L347090j915822q152682k107997
1575b6497322J1725011J5311997M907759j545361Q614874K2851056K1298946M158953
1567F0825913j1157350j3798776q401171l899842m355434r408220j4631200j1984903
1559a6810983K223117J9684204K6546661J7695072N44487j3450624j6655109p981235
1551A1795590N863580J3856725J1374293N616010M925645O026556k92406j2798753
1543D6367240j8742666j0832677K593970Q076802K701116m470309l997982L807268
1535B5502762R900086O817361k685684r285909r106847p385859q415983q318630
$$ y = [-10672890, -21986359, -32137744, -28048683, -10036593, 8271404, 15584610, 13042692, 7465940, 730606, -8501447, -16607870, -17667911, -14320821, -16236643, -24389325, -26497322, -14772311, 539686, 5447445, 3902084, 12516958, 35368014, 56666960, 60825913, 49668563, 35869787, 27468616, 23568774, 19213340, 9805120, -4826080, -16810983, -14587866, 5096338, 31642999, 49338071, 49882558, 36431934, 19776825, 11795590, 17659170, 31515895, 42890188, 48506198, 53431843, 59458399, 59165993, 46367240, 27624574, 16791897, 19385867, 27462669, 30163785, 25693476, 21695494, 25502762, 35402848, 42220209, 39534525, 30248616, 21141769, 13755910, 5339927, -2978703]
1527b978703k968997K830178K020495k657625k276852M283845R080553P961435
1519A5294329N892754P531746J0050578Q432297K362692m708525q950109p323600
1511B8582162k04162O290483N885225P67102j413400J99643j684881q967926j2069373
1502A7384873l557997Q924648J1705569L440523m175936l298881O21025j316540
1494B9727284q175702j0541086l099952Q494902J4239519J0716487L253326j744041
1486D2870737l329433l987617m633265m933165o396370j0512487j4028794j0736345
1478a5686739K96058J1496961J4218202P880719l9151k284075J343022N312571
1470B2537568N502677L571939L190784L640438R34903m613824p114620l838099
$$ y = [-2978703, -5947700, -3117522, -1097027, -3754652, -6031504, -1747659, 7332894, 15294329, 21187083, 28718829, 38769407, 47201704, 49564396, 44855871, 35905762, 28582162, 28378000, 34668483, 40553708, 41320810, 39907410, 40107053, 38422172, 29454246, 17384873, 13826876, 22751524, 34457093, 37897616, 33721680, 30422799, 31043824, 29727284, 21551582, 11010496, 7910544, 16405446, 30644965, 41361452, 44614778, 42870737, 39541304, 35553687, 30920422, 25987257, 19590887, 9078400, -4950394, -15686739, -15390681, -3893720, 10324482, 18205201, 18166050, 15881975, 17224997, 22537568, 28040245, 31612184, 34802968, 38443406, 39378309, 34764485, 27649865, 23811766]
1462B3811766j77589j609063n147193m479249j05382K245585R22346q91596k166040
1453A2403585m578446o827949n470312j155670K641669O202446J1317616J3701439
1445B8234378P219139m026881q329759l023057K208288J555960Q04752L772280
1437B8415100L582163l976620r603612m337602M505939M108495l484420n781395
1429A3428048j077240n51607q938877j6629714j4504648o007848K38019J981017
1421c2062850K886056O100000J1837335J7389360J7967531J1744495M197179J968266
1413D2027372K750227j404970j0220885j3736868p571866j73772P53253K49366
1405A2671857O047257J3303003J0537901j853311j0518058p774018j169000m38783
$$ y = [23811766, 23634177, 22025114, 16877921, 12398672, 12293290, 14538875, 15461221, 14569625, 12403585, 7825139, 997190, -4473122, -5628792, -2987123, 3215323, 14532939, 28234378, 35453517, 31426636, 23096877, 20073820, 22282108, 23838068, 24642820, 28415100, 31997263, 28020643, 18417031, 14079429, 18585368, 22693863, 19209443, 13428048, 12350808, 11799201, 2860324, -13769390, -28274038, -34281886, -34043867, -32062850, -29176794, -23076794, -11239459, 6149901, 24117432, 35861927, 40059106, 42027372, 44777599, 43372629, 33151744, 19414876, 11843010, 11669238, 12422491, 12671857, 18719114, 32022117, 42560018, 40706707, 30188649, 22414631, 21245631, 20806848]
1397B0806848l645107l343326m62977k285523q136649p377200M789981J7337596
1389A7683643J5941558J399526j1624587j2618178m981673K118578M415336K965954
1381A5300157O2329j924250j883428k525880p218454j2740417j1370545k726550
1373b5027038L979413L802059L732527R580885J3723353O464678o611387j1215496
1365a571006m926168J784568L653488N952125J0498227J0212262K169321n622736
1357B2150081o252178l007914j045890N53057K451660K63968o559831r511873
1349i58920k924467N993649P225173J600285l760647o985043r131744o525130
1341a5466844L649261J4224364J5581935R750204O521236P697986O339506P71348
$$ y = [20806848, 17161741, 13818415, 13355438, 11069915, 2933266, -4443934, 346047, 17683643, 33625201, 35024727, 23400140, 10781962, 5800289, 7918867, 12334203, 15300157, 15362486, 13438236, 11554808, 9028928, 1810474, -10929943, -22300488, -25027038, -21047625, -17245566, -13513039, -3932154, 9791199, 16255877, 9644490, -1571006, -6497174, -4712606, -1059118, 4893007, 15391234, 25603496, 27772817, 22150081, 15897903, 12889989, 11844099, 12397156, 14848816, 15112784, 8552953, -958920, -3883387, 2110262, 9335435, 10935720, 7175073, 190030, -8941714, -15466844, -11817583, 2406781, 17988716, 27738920, 34260156, 41958142, 48297648, 49068996]
1333D9068996k428242r20914j236345p382104j3507813j2163835l617031O277491
1325A4090203J2262031J1631804N145679k251548n902390o707897p136061l982270
1317A7149551O725762J8287935J7240340J486974j4796333j8633727j2489222
1310A4971280o295995l119940P27530O832997J2334426J3282789O642762p021241
1302C8354608k0009815k1934416j1252598K368605R529096R003120K865826o833346
1294B091080j2629731m041614J6519932K9845161K2239042M106545m878698k254723
1286E0996994j279891p953075j4590403j5127875j2283266p943097J81172Q796867
1278G97426Q230404k804490j1407068o262277P659718J6219962J2678017K005856
$$ y = [49068996, 46640754, 45719840, 44483495, 37101391, 23593578, 11429743, 7812712, 14090203, 26352234, 37984038, 43129717, 40878169, 34975779, 28267882, 21131821, 17149551, 23875313, 42163248, 59403588, 60890562, 46094229, 27460502, 14971280, 8675285, 5555345, 6282875, 13115872, 25450298, 38733087, 45375849, 38354608, 18344793, -3589623, -14842221, -12473616, -2944520, 6058600, 8924426, 2091080, -10538651, -14580265, 1939667, 31784828, 54023870, 58130415, 53251717, 50996994, 49717103, 41764028, 27173625, 12045750, -237516, -8180613, -7999441, 797426, 9027830, 6223340, -5183728, -11446005, -3786287, 12433675, 25111692, 27117548]
1270B7117548p019454r370367o306694l417389l943925l779995K523145J1014806
1262F817675J0555138k233169j6933824k1514706j4939974m639173K924755N697248
1254c4266030N250428O121431J1510753J7169520J4801620L961977n528959o094468
1246A2926272j037134K573894K656548k17246o183439j1652024r225774R17462
1238i241441O635340p84657j2763451j4336693m500596M155477L425225k403179
1230b9813975n191326j422340P233410J4816323J3862342L783019n779664o568209
1222i080420l039831l930232o899245k901948O593420R995732L965629j525020
1214f821915L56171L763636J958123k115288l181088k280980j351929K498949
$$ y = [27117548, 20098094, 10727727, 4421033, 1003644, -2940281, -6720276, -4197131, 6817675, 17372813, 15139644, -1794180, -23308886, -38248860, -42888033, -39963278, -34266030, -29015602, -22894171, -11383418, 5786102, 20587722, 24549699, 19020740, 12926272, 11889138, 14463032, 17119580, 16902334, 10718895, -933129, -10158903, -9241441, -2606101, -3390758, -16154209, -30490902, -34991498, -30836021, -27410796, -29813975, -35005301, -36427641, -29194231, -14377908, -515566, 3267453, -2512211, -9080420, -12120251, -16050483, -22949728, -25851676, -19258256, -9262524, -5296895, -6821915, -6465744, -2702108, -743985, -2859273, -6040361, -8321341, -9673270, -7174321]
1206g174321R736515J2605393N209226n647384q163090r65667O597377P299477
1198A9497526K220900m596634j1025822j5561679j5548213q759159L340883J3357781
1190a7074417J1262711m651365k0433526j8204777J651899J8007291J3994901
1183a5447283k888786j2621556p667334K990879R608973J0557529P512628K278360
1175e676590j170650L3414J831841j607316p012386n010898N032953J2449460
1167a130172J0204645L521590m22471k767911p059806j0567355r035283m609936
1159b1866699j187618L541591J2424672J8606823J2039457l593943j1642016m033094
1151D289173P513914Q126063m05982n355028k934815r14638k801747j713082O406312
$$ y = [-7174321, 2562194, 15167587, 20376813, 14729429, 6566339, 5600672, 12198049, 19497526, 21718426, 17121792, 6095970, -9465709, -25013922, -33773081, -30432198, -17074417, -5811706, -10463071, -30896597, -49101374, -47449475, -29442184, -15447283, -18336069, -30957625, -38624959, -35634080, -26025107, -15467578, -7954950, -5676590, -6847240, -6813826, -4981985, -6589301, -13601687, -18612585, -13579632, -1130172, 9074473, 12596063, 12173592, 9405681, 2345875, -8221480, -17256763, -21866699, -23054317, -19512726, -7088054, 11518769, 23558226, 19964283, 8322267, 4289173, 11803087, 19929150, 19523168, 14168140, 11233325, 10318687, 7516940, 5803858, 12210170]
1142A2210170J3567127J0366729r11315j0713096j4545847j3821385r081396r92561
1134a3921574M722409K527513l526621m015382K522237Q636745R869491Q204467
1126A5019285L524455o962476j8154024j8150200n737442M483421K295363l383222
1118b7064840j03277P418832N832685l769792o730385K523040J2844937J3410828
1110D362028O670114O68394k009642k997310k892524j708966P6668L459412R359443
1101A4987617J3746108R829703k577235j4582837j7293763r663793L369891J5504842
1093A3320533K0524910J4809376J684963j0005527j3948764j0867575n028661
1086A0489255l9420J594449p91131m170324l803250J838138R753331J4988192
$$ y = [12210170, 25777297, 36144026, 35232711, 24519615, 9973768, -3847617, -12929013, -13921574, -9199165, -6671652, -10198273, -14213655, -11691418, -3054673, 6814818, 15019285, 18543740, 11581264, -6572760, -24722960, -30460402, -25976981, -23681618, -27064840, -27168117, -19749285, -13916600, -17686392, -24416777, -21893737, -9048800, 4362028, 11032142, 11700536, 9690894, 6693584, 3801060, 2092094, 2168762, 5628174, 14987617, 28733725, 38563428, 35986193, 21403356, 4109593, -5554200, -2184309, 13320533, 33845443, 48654819, 50339782, 40334255, 26385491, 15517916, 10489255, 10449835, 12044284, 11253153, 7082829, 3279579, 5117717, 14871048, 29859240]
1078B9859240J2866175K288569r614145j1289267j413097N902963n65687j1440649
1070A6594102r983415J272271L908293o385262j2006933j163922J4276069J8283655
1062B4794858J2674373P496633K824824n084419r920499m197853M631115L330351
1054C6549383n853723r032425l689435j611259p882304j2461913p203396J391789
1046i793283K995681j738764l765172J947887J1092617J4523604P032376n830486
1038A6464460j1709150o311959o2429k999339q489598l190798J0517944J6601115
1030A0820246R697560J826362J687181L136841P59580J289568Q943585J2797486
1022E0958409K706793j1774553j3482103k506082O134064N984763M703648O609797
$$ y = [29859240, 42725415, 45013984, 35399839, 24110572, 22697475, 28600438, 28034751, 16594102, 6610687, 7882958, 11791251, 5405989, -6600944, -7764866, 6511203, 24794858, 37469231, 44965864, 47790688, 42706269, 32785770, 28587917, 33219032, 36549383, 30695660, 21663235, 17973800, 16362541, 8480237, -3981676, -11185072, -9793283, -6797602, -8536366, -12301538, -10353651, 738966, 15262570, 22294946, 16464460, 4755310, -1556649, -1619078, -4618417, -13108015, -16298813, -5780869, 10820246, 20517806, 22344168, 24031349, 27168190, 27927770, 29217338, 38160923, 50958409, 53665202, 41890649, 28408546, 25902464, 32036528, 38021291, 42724939, 49334736]
1014D9334736N238596k883509r874041q315490k503232j443187o696979j2512724
1006A0344170j3551151q661775j109328K519437j403891o530040k426023R818282
998a1000319J6050492Q148503l812488o215829r74859P03449k160666n12560O828688
989G054411R628292L039471m508296m878236r50083J733504L801336N706933K521868
980B3149200o116163r936708k648555N255985R30863r997077j1792301l602228
972a4756984Q22988k384740j362347Q774102J4878901O283076p558854j0877873
964f181731k919935N292419P560407N409699P07013m620303o169030k726305L44314
955c303452K33509K484218R885186J3725238O448112m530566p654171n009264
$$ y = [49334736, 54573332, 51689823, 41815782, 33500292, 30997060, 29553873, 22856894, 10344170, -3206981, -11868756, -12978084, -10458647, -11862538, -18392578, -20818601, -11000319, 5050173, 13198676, 9386188, 3170359, 2195500, 2898949, 738283, 225723, 7054411, 16682703, 19722174, 15213878, 10335642, 9385559, 11119063, 14920399, 20627332, 23149200, 17033037, 7096329, 4447774, 9703759, 10634622, 637545, -11154756, -14756984, -13933996, -16318736, -17681083, -8906981, 5971920, 12254996, 4696142, -6181731, -9101666, -3809247, 3751160, 9160859, 9867872, 5247569, -921461, -3647766, -3303452, -3069943, -585725, 9299461, 23024699, 29472811, 24942245, 17288074, 12278810]
947A2278810n608137o980630J66145J2055424J4113439L610988o231453o913466
939A6491120l964227k459804J030515O653857O451722r85174m171067L956920
931B3003862J3433169J1558940P74888p219762p840998n069589k402199o19637
923B5618674l36562o07680R43122K829686M19807n113937o602770l081578k389420
914A1679342o936033q042336j055435N589705M901474L184478P030134R987051
906B6338380M648175k545939k595924l55538m180542q156545k415646O063920
898A6800341K898579p957565r151240O75270M244996n195592j3157847q136593
890a8979651K535594Q870563J2822375J6942838J3993465j08527j4775281j7866220
$$ y = [12278810, 6670673, -309957, -143812, 11911612, 26025051, 29636039, 23404586, 16491120, 12526893, 10067089, 11097604, 17751461, 24203183, 23218009, 19046942, 23003862, 36437031, 47995971, 48770859, 41551097, 33710099, 28640510, 26238311, 25618674, 25282112, 24674432, 25617554, 28447240, 28867047, 23753110, 17150340, 14068762, 11679342, 4743309, -3299027, -4354462, 1235243, 6136717, 9321195, 16351329, 26338380, 30986555, 28440616, 25844692, 25489154, 21308612, 13152067, 10736421, 16800341, 19698920, 11741355, 2590115, 3265385, 7510381, 2314789, -10843058, -18979651, -16444057, -7573494, 5248881, 22191719, 36185184, 36076657, 21301376, 3435156]
882C435156j1258775l440271M361568J4173466K1181952J8654144Q237972k888530
874E2456682j0379430j1987637n279704O625052J3618608J0390448L583636Q48139
866E9875794M75376r75324L4484N572475P885742R02637p530550p282314k894331
857E6063989n171213j1661230j0960989k917446J420103j524933m944136o757592
849A3546553j1067416j3611553l802592J4406224K1503656R884045m024939m979611
841B1854367p12359n177651j3418492j0565890K106175Q553315K943390l387708
833B195147j427579L116963J328108n252090p836848j231734J1875686K2999308
825B5766961K3236609J1705844j164134m581733j220368k642302j0867272j4465170
$$ y = [3435156, -7823619, -11263890, -6902322, 7271144, 28453096, 47107240, 55345212, 52456682, 42077252, 30089615, 24809911, 31434963, 45053571, 55444019, 59027655, 59875794, 60351170, 59375846, 59410330, 64982805, 72868547, 73771184, 66240634, 58958320, 56063989, 50892776, 39231546, 28270557, 25353111, 26773214, 25248281, 20304145, 13546553, 2479137, -11132416, -14935008, -528784, 20974872, 30858917, 26833978, 21854367, 21142008, 15964357, 2545865, -8020025, -5913850, 2639465, 5582855, 2195147, 767568, 3884531, 5212639, -39451, -7876299, -9108033, 2767653, 25766961, 49003570, 60709414, 59545280, 54963547, 53743179, 51100877, 40233605, 25768435]
817B5768435o407698M181986N069635j945787n700797k540821R82161J27404k509960
808A7024558l811670m565081n136305k977826K718097Q122139Q818504L795875
800B3988291n217643j4443905j7588635r943704M882724J6673102J9123367J4606760
792C2080357P452349j063973q207182q083333o66601M010478j137903q207117
784A6177075n004303N968069J0867863N453665l28233l21385j049400p214401
776B4548950j1178859o092960Q58659j57136m616831j083234Q991415J2868117
768B4138121O653175J66640K35M07232m484580j0146310r593682l763509K279843
759E657165O901154R791717Q557029L792923K067963P030307J2256929R938235
$$ y = [25768435, 19360737, 23542723, 28612358, 26666571, 20965774, 18424953, 19407114, 19534518, 17024558, 13212888, 8647807, 3511502, 533676, 3251773, 11373912, 20192416, 23988291, 18770648, 4326743, -13261892, -23205596, -18322872, -1649770, 17473597, 32080357, 39532706, 38468733, 30261551, 22178218, 21511617, 25522095, 24384192, 16177075, 11172772, 17140841, 28008704, 33462369, 33134136, 32812751, 31763351, 24548950, 13370091, 7277131, 8135790, 7978654, 3361823, 2278589, 11270004, 24138121, 30791296, 30957936, 30958171, 31365403, 26880823, 16734513, 7140831, 3377322, 5657165, 12558319, 22350036, 30907065, 34699988, 36767951, 43798258, 56055187, 65993422]
751F5993422K268014l342889o050886r573139j1882507p796377p69455m34322
743B8411861o829469q782806k151814J903791n482301j4857257j1122077L684060
735a5226012J2723244P762794j746801m674389k424121k234059m775924n733898
727a6329166m685712m699330n350442l324885N11779J515585j21598K066567J0141398
718b0275804J5482008R349186l508752r238088k559849P310027J0314790P677610
710A4551128N704958M240476o61201o484756o457359j375327N41331k733759l391364
701C934127K290265O177734J365097n407603l689168M662882R821648R489605
693B8644587Q390328N871097k216046j0235330o642425O258410J1644219K850030
$$ y = [65993422, 68261436, 64918547, 58867661, 49294522, 37412015, 29615638, 28846183, 28411861, 21582392, 12799586, 10647772, 12551563, 7069262, -7787995, -18910072, -15226012, -2502768, 5260026, 3513225, -1161164, -3585285, -5819344, -10595268, -16329166, -21014878, -25714208, -31064650, -34389535, -33877756, -32362171, -32483769, -30417202, -20275804, -4793796, 4555390, 1046638, -8191450, -10751299, -3441272, 6873518, 14551128, 20256086, 24496562, 23835361, 17350605, 10893246, 9517919, 10059250, 7325491, 3934127, 6224392, 12402126, 13767223, 8359620, 4670452, 9333334, 19154982, 28644587, 37034915, 42906012, 40689966, 30454636, 23812211, 30070621, 41714840, 44564870]
685D4564870o171740l516671K234413j438102r168251q704322l609474n486313
677H704410r682760r24102J7438028K2799833P467553p802940m981413N061645
669C8080254K626130r084380j1254547l15057Q188828M671821l022939n356593
661B4533517l809171l464428m437243n957026r564737j2727100p762913O168536
653a7020565J7033278J3802029J659093m778122n35381N811101O339255L120553
645B5431241J283082L98588k290049n046651m242119j556776k405398p294602
637D277316j0483482q559948m809332k329133J544280Q867135J3812395R222666
629A1541897j585317p557939m459310J208691L982655O352710J0314823J0632422
$$ y = [44564870, 38393130, 34876459, 37110872, 35672770, 26504519, 17800197, 14190723, 8704410, -978350, -1902452, 15535576, 38335409, 45802962, 38000022, 33018609, 38080254, 40706384, 31622004, 20367457, 20052400, 28241228, 32913049, 29890110, 24533517, 20724346, 17259918, 12822675, 6865649, -2699088, -15426188, -23189101, -17020565, 12713, 13814742, 15473835, 10695713, 10160332, 15971433, 22310688, 25431241, 26714323, 27112911, 24822862, 19776211, 15534092, 13977316, 11571918, 4277316, -6206166, -14766114, -19575446, -21904579, -20360299, -11493164, 2319231, 11541897, 9956580, 2398641, -2060669, -851978, 3130677, 9483387, 19798210, 30430632]
621C0430632L078139o920973j1177701r544111o595719k219958N654164J2275885
613A4980358J0303578K114231k020627J000135L396809J35672l255165j004054
605B5650937L046357K246525k195415m188326k443113o78443o17914o94606l44461
596A9781541l78312K03445L061908O218636N076617j355272q234809j0115881
588A4257873o676732k190422j92195J17350J535209L680366K913234r52518j386267
579A1105898O593734J6941429J8108319Q196302k617314o386756o209449p294280
571C8437883p727350m545112j714219l509010n277407m29723O937404O795395
563B8967861j006135o168462l468948J164555J743829o9279j033156j361981n38334
$$ y = [30430632, 33508771, 26587798, 15410097, 5865986, -729733, -2949691, 2704473, 14980358, 25283936, 27398167, 25377540, 26377675, 29774484, 29910156, 26654991, 25650937, 28697294, 30943819, 28748404, 24560078, 22116965, 21438522, 20820608, 20126002, 19781541, 19403229, 19606674, 22668582, 28887218, 33963835, 32608563, 24373754, 14257873, 7581141, 5390719, 5198524, 5315874, 6851083, 10531449, 13444683, 12492165, 11105898, 17699632, 34641061, 52749380, 60945682, 58328368, 51941612, 45732163, 38437883, 30710533, 26165421, 24451202, 20942192, 15664785, 15235062, 22172466, 28967861, 27961726, 21793264, 18324316, 19488871, 21232700, 21163421, 20130265, 18768284, 18229950]
554A8229950L403198O964847K656981q032134j2739721n741956K235535M46378
546G423078m673105m87781J0268045J2838113K687152r079723j2587888r426496
538c038605m914533j491500j640488o371254q615035L15622J4811866J8317093
530G373166P249165k342021O05641N711861Q62244n965695j511928P001136K171851
521B1155420j2521747j4876226J373151J5772514J1835379l32325k645093M993016
513B4754089J0283042Q776058M668508r68634r089415j4357775j0510992j822165
505A1732716J531313j890156m454602k699564j387169l940713p027702n964546
497a4100423L52531R819292J7159075J5375676L674657p858662q688255j260875
$$ y = [18229950, 21633148, 28597995, 31254976, 23222842, 10483121, 4741165, 6976700, 7423078, 2749973, 2262192, 12530237, 25368350, 28055502, 18975779, 6387891, -3038605, -7953138, -9444638, -11085126, -17456380, -26071415, -25755793, -10943927, 7373166, 14622331, 12280310, 12885951, 18597812, 19460056, 13494361, 11982433, 18983569, 21155420, 8633673, -6242553, -4869402, 10903112, 22738491, 22406166, 19761073, 24754089, 35037131, 43813189, 48481697, 47513063, 38423648, 24065873, 13554881, 11732716, 13264029, 11373873, 6919271, 4219707, 2832538, -1108175, -8135877, -14100423, -13747892, -3928600, 13230475, 28606151, 32280808, 24422146, 15733891, 14473016]
489A4473016L701875L289387M092013Q358162R413680L289813m730877q800452
481C3086617r537247q789585n196377Q76027M891613M743770L710306L755117
473B7540241K659148O53618J840128N215171L190647n623309j1338771p530306
465A6606567k057879m157043r055838o851487j13581J026294k227850J528586
457e302231J3000502J6897737L263016j6481766k2708670j0880259N404243J1492802
449e314626N722808k723475n161719r64897M432483O728016O165856M257576O25246
440A3767268m586722p891585n675492Q37857O637144Q004019M559936j824966
432A3827459p587680q820017m792641J270611O381543R910978J0343900N085734
$$ y = [14473016, 18174891, 21464278, 25556291, 33914453, 43328133, 46617946, 41887069, 33086617, 23549370, 14759785, 9563408, 10439435, 15331048, 20074818, 23785124, 27540241, 30199389, 30853007, 32693135, 37908306, 41098953, 35475644, 24136873, 16606567, 14548688, 10391645, 1335807, -5515680, -5629261, -4602967, -6830817, -5302231, 7698271, 24596008, 27859024, 11377258, -11331412, -22211671, -16807428, -5314626, 408182, -2315293, -7477012, -8441909, -4009426, 2718590, 8884446, 13142022, 13767268, 9180546, 1288961, -4386531, -3548674, 3088470, 11092489, 15652425, 13827459, 6239779, -2580238, -7372879, -6102268, 279275, 10190253, 20534153, 25619887]
424B5619887l328774o608832j377951M816557M129766m39281j956310k007208
416A8847854o289625j1654723r262335L04328O476492M248535p2629n17392R46690
407C027195J227435J595460L012795L516801K838048K522303L41549o849752j3792466
398b560632j0941217j07768N780086K302764Q3774N854855J0772893O840640J773323
389A9798718M892839R409003L935559o808417r547811m896595m249941p119279
381E414076j020834J4275867K1333093J0426870n444303r930093m844019j864006
373B8346651l315416l720437l527120p819757j3857635j2161309j116711R012278
365h159456R384096K988582j263548M42962N040516P893431O394761P66179n488848
$$ y = [25619887, 22291113, 15682281, 14304330, 19120887, 23250653, 22811372, 20855062, 18847854, 12558229, 903506, -8358829, -8054501, -1578009, 2670526, 2597897, 2080505, 3027195, 4254630, 5850090, 8862885, 12379686, 15217734, 17740037, 18081586, 11231834, -2560632, -13501849, -13609617, -7829531, -5526767, -5442993, 411862, 11184755, 18025395, 19798718, 24691557, 34100560, 38036119, 31227702, 21679891, 16783296, 12533355, 5414076, 4393242, 18669109, 40002202, 50429072, 44984769, 35054676, 30210657, 28346651, 25031235, 21310798, 17783678, 9963921, -3893714, -16055023, -17171734, -8159456, 1224640, 4213222, 2949674, 3392636, 8433152, 16326583, 22721344, 23487523, 17998675]
356A7998675p435907l804084Q00771J275542j492490k624186r84918n45017k983885
347B04501l719574J192134P759703Q675566L439064j582547k685424k618015m010745
338F654663m890288l134808l15216K016824N363307J0008331J1860041P872642
330C5435496J339752k618958m072056o342844r520288j0559679q166335l495183
322h000095K314570P639112R599188P487622M364349J739917l151606r915120
314A2077937j0371101L78149J2407737J1284385j268199q475057j865635P750001
306B1918217P093967j680546o737211l094547M011800P843714N729068j035748
298C4048714p515789p916552k343934J957350j91323m986947n858150k290093
$$ y = [17998675, 10562768, 6758684, 7559455, 8834997, 7342507, 4718321, 3733403, 3188386, 204501, -3515073, -2322939, 5436764, 14112330, 17551394, 15968847, 13283423, 10665408, 6654663, 1764375, -1370433, -1685649, 331175, 5694482, 15702813, 27562854, 35435496, 36775248, 34156290, 30084234, 23741390, 14221102, 3661423, -4504912, -8000095, -5685525, 1953587, 11552775, 19040397, 23404746, 25144663, 21993057, 12077937, 1706836, 2084985, 14492722, 25777107, 24508908, 16033851, 14168216, 21918217, 29012184, 27331638, 20594427, 17499880, 21511680, 29355394, 35084462, 34048714, 26532925, 18616373, 16272439, 18229789, 18038466, 13051519, 7193369, 4903276]
290D903276K551468Q287880J4383054J4620180L940370j0138541j3028669k518259
282B3000759O225382L01640j3398253j7955099r471106q48964k284974p215384
274b1645999k976175J0195880J8625765J2785137j489792j1214246j0169782j404976
266g294188R172587J6259773J5235581N602293n489298q703369l005540L267136
258B5044975K976918k015457n094132l284250P52853K617417L86542l313155l218704
249A4853007K027713N986000J733253o812422p461219L504045J3712236R715371
241C7257984m768748j3196877p552643K307981K888114n337652r835585l440712
233a678138O398068Q417320L012954M23481M325092N937553j390880j0132222
$$ y = [4903276, 7454744, 15742624, 30125678, 44745858, 48686228, 38547687, 25519018, 23000759, 29226141, 29527781, 16129528, -1825571, -11296677, -12145641, -14430615, -21645999, -24622174, -14426294, 4199471, 16984608, 15494816, 4280570, -5889212, -7294188, 1878399, 18138172, 33373753, 38976046, 33486748, 24783379, 21777839, 25044975, 28021893, 26006436, 20912304, 17628054, 18380907, 20998324, 21384866, 18071711, 14853007, 16880720, 22866720, 24599973, 17787551, 10326332, 13830377, 27542613, 37257984, 32489236, 19292359, 11739716, 14047697, 16935811, 11598159, 1762574, -1678138, 4719930, 13137250, 16150204, 16573685, 20898777, 26836330, 25445450, 15313228]
225A5313228r958231n100755p735006j6184374j4708486J687292J6619806J4478802
217e587724J758369m111078J262743P941200Q557734M636742r41792o744281r175921
208b404008n573722l85588o9899k848383j646110M062721Q038870Q014401P602434
199A4790716P749882N437970J180365j252755k821472p271656j1010501o259635
191E42914M019009O927305o17691n845705m78121N603122J039897p521536n792229
182b123035N268787J1051621N029560l970153o265269k160563L278275P124190
174A7233413P587524L253985l646265q101955q299678o684024m571111n08811
166c736922N272590R618267J0720085R328365N272123k108575r116177r177573
$$ y = [15313228, 5354997, 254242, -7480764, -23665138, -38373624, -36686332, -20066526, -5587724, -3829355, -7940433, -6677690, 1263510, 9821244, 14457986, 13516194, 6771913, -2404008, -7977730, -8363318, -8433217, -11281600, -12927710, -8864989, -826119, 7188282, 14790716, 22540598, 27978568, 29158933, 27906178, 25084706, 17813050, 6802549, 542914, 4561923, 11489228, 10871537, 5025832, 4547711, 10150833, 11190730, 3669194, -2123035, 3145752, 14197373, 19226933, 15256780, 8991511, 6830948, 10109223, 17233413, 24820937, 28074922, 24428657, 16326702, 8027024, 1343000, -3228111, -3736922, 1535668, 11153935, 21874020, 31202385, 36474508, 34365933, 25249756, 16072183]
158A6072183j922843M165198J938078n139930p915826l438563K189442K239721
150H187460k601231n481886j553566N888975Q328357J920821p017771q972960
142a301801k615057M648615P271847P363585P903808N927681k185233j1932551
134A5080894j4057747o824432R51484J322129k832724k891878L241968Q733382
126B723076P657901L054269K653780Q428787J3551919J0522463N46567p086151
118D2052611n174787L288871Q643663N757969n94112k793228m85543j90112n349172
109D5156160j1185020j1382275o300814j290649O36704N56549k71220j651459
101A4267976k407884j382191m24225k159402m638749k876245L544961R272961
$$ y = [16072183, 14149340, 18314538, 20252616, 15112686, 7196860, 3758297, 5947739, 8187460, 5586229, 104343, -1449223, 4439752, 12768109, 14688930, 7671159, -1301801, -3916858, 731757, 8003604, 15367189, 23270997, 29198678, 27013445, 15080894, 1023147, -5801285, -4849801, -3527672, -6360396, -9252274, -6010306, 2723076, 10380977, 13435246, 16089026, 24517813, 38069732, 48592195, 49138762, 42052611, 36877824, 40166695, 48810358, 54568327, 53974215, 51180987, 50695444, 50505332, 45156160, 33971140, 22588865, 16288051, 14997402, 15634106, 16190655, 15919435, 14267976, 11860092, 10477901, 10053676, 7894274, 3255525, 379280, 3924241, 13197202]
93A3197202J0797392J0029819Q545186M320403k459322o360730m381619j492534
85C2195797k790260m905499k134115L009413L754603Q90762J155383M555430L315993
76C9047507m776426j1342777r414866k538870K617327N588627Q462721R071253
68C6714496M670292j634669m664834m498173m184766l029400J378033O441803
60C1192782O716287K132979k104176l490128m000554m185086k329220j97027k202996
51B1532861o740120n958196J935685P577642L593181l615972l250001L385097
43A8460177N477227j96092n242983l698084l8538L31576m62719N33108l22128
34A4841544o352885j1799207q695592O04622O331385N090563K432326K346350
$$ y = [13197202, 23994594, 34024413, 42569599, 46890002, 44430680, 38069950, 33688331, 32195797, 29405537, 24500038, 22365923, 25375336, 29129939, 30020701, 31176084, 35731514, 39047507, 34271081, 22928304, 13513438, 10974568, 13591895, 19180522, 27643243, 36714496, 41384788, 39750119, 35085285, 30587112, 26402346, 23372946, 24750979, 31192782, 37909069, 40042048, 37937872, 34447744, 30447190, 26262104, 23932884, 23735857, 21532861, 14792741, 8834545, 10770230, 18347872, 21941053, 18325081, 15075080, 18460177, 23937404, 23741312, 18498329, 14800245, 14761707, 15093283, 14630564, 15163672, 14841544, 8488659, -3310548, -12006140, -11401518, -5070133, 20430, 2452756, 4799106]
26D799106K829538K609374L705571N297774L246618j432050j840680L169339N042803
17B7427393j272151q277763p561494l337184m895517j0705426j0932679l538425
9b3093246K898655K735977J94982Q44138L847744N324704L793230L42404k280329
0e391741
$$ y = [4799106, 7628644, 10238018, 13943589, 19241363, 22487981, 21055931, 19215251, 22384590, 27427393, 26155242, 17877479, 10315985, 6978801, 2083284, -8622142, -19554821, -23093246, -20194591, -17458614, -17263632, -16419494, -12571750, -7247046, -3453816, -3111412, -5391741]
##END NTUPLES=NMR SPECTRUM
##END=
