##TITLE=31Pdec_DE-57_NaOH_C
 D2O, 64 sc
 11.7.2024
##JCAMPDX= 6.0         $$ Bruker NMR JCAMP-DX V2.0
##DATA TYPE= NMR SPECTRUM
##DATA CLASS= NTUPLES
##ORIGIN= UXNMR, Bruker Analytische Messtechnik GmbH
##OWNER= root
$$ XWIN-NMR		Version 3.5
$$ Thu Jul 11 13:47:10 2024 Russian Standard Time (UT+4h)  she@DPX200
##.OBSERVE FREQUENCY= 81.013821
##.OBSERVE NUCLEUS= ^31P
##.ACQUISITION MODE= SIMULTANEOUS
##.ACQUISITION SCHEME= undefined
##.AVERAGES= 64
##.DIGITISER RES= 17
##SPECTROMETER/DATA SYSTEM= spect
##.PULSE SEQUENCE= zgpg30
##.SOLVENT NAME= CDCl3
##.SHIFT REFERENCE= (INTERNAL, CDCl3, 0, 198.062)
##AUDIT TRAIL= $$ (NUMBER, WHEN, WHO, WHERE, WHAT)
$$ ##TITLE= Audit trail, XWIN-NMR		Version 3.5
$$ ##JCAMPDX= 5.01
$$ ##ORIGIN= Bruker BioSpin GmbH
$$ ##OWNER= she
$$ F:/spectra/data/she/nmr/P31/2/pdata/1/auditp.txt
$$ ##AUDIT TRAIL=  $$ (NUMBER, WHEN, WHO, WHERE, WHAT)
(   1,<2024-07-11 13:45:53.34 +0400>,<she>,<DPX200>,
      <created by zg, POWCHK disabled, PULCHK disabled
       configuration hash MD5:
       00 E9 B6 7A A2 85 ED C7 34 08 36 98 17 FE 4E 26
       data hash MD5: 32K
       FE 06 B1 DB ED E5 BC 31 18 D7 16 CE 35 4E 1A A2>)
(   2,<2024-07-11 13:45:55.28 +0400>,<she>,<DPX200>,
      <Start of raw data processing
       efp BC_mod = 2 LB = 1.5 FT_mod = 6 PKNL = 1 PHC0 = 2615.764 PHC1 = -104.713 SI = 64K 
       data hash MD5: 64K
       D7 93 D0 91 22 F7 49 E8 86 FC B8 5E 73 61 F3 C3>)
(   3,<2024-07-11 13:46:12.92 +0400>,<she>,<DPX200>,
      <pk PHC0 = 73.13113 PHC1 = 0 
       data hash MD5: 64K
       EA 5C 9C 1F 18 74 35 06 80 EF 62 75 03 22 08 ED>)
(   4,<2024-07-11 13:46:17.40 +0400>,<she>,<DPX200>,
      <abs ABSG = 5 
       data hash MD5: 64K
       E0 04 8A B0 1F C0 B8 6A FF 3E 70 6B F0 71 76 8D>)
(   5,<2024-07-11 13:46:41.01 +0400>,<she>,<DPX200>,
      <pk PHC0 = -2.507034 PHC1 = 2.200161 
       data hash MD5: 64K
       A4 F9 AD 20 65 21 39 43 71 4F 35 7F 5D E5 61 E5>)
$$ ##END=
$$ 
$$ hash MD5
$$ 99 F0 74 F8 2D C7 01 94 70 6E 74 53 55 C2 7F 67
##$RELAX= 
##$RELAX= 
##$RELAX= 
##$RELAX= 
##$RELAX= 
##$RELAX= 
##$RELAX= 
##$RELAX= 
$$ Bruker specific parameters
$$ --------------------------
##$DU= <F:/spectra>
##$EXPNO= 2
##$NAME= <P31>
##$PROCNO= 1
##$TYPE= <nmr>
##$USER= <she>
##$AMP= (0..31)
100 100 100 100 100 100 100 100 100 100 100 100 100 100 100 100 100 100 
100 100 100 100 100 100 100 100 100 100 100 100 100 100 
##$AQSEQ= 0
##$AQ_mod= 1
##$AUNM= <au_zg>
##$AUTOPOS= <>
##$BF1= 81.014009
##$BF2= 200.13
##$BF3= 200.13
##$BF4= 200.13
##$BF5= 200.13
##$BF6= 200.13
##$BF7= 200.13
##$BF8= 200.13
##$BYTORDA= 1
##$CFDGTYP= 0
##$CFRGTYP= 5
##$CHEMSTR= <none>
##$CNST= (0..31)
1 1 145 1 1 1 1 1 1 1 1 1 1 1 1 1 1 1 1 1 1 1 1 1 1 1 1 1 1 1 1 1 
##$CPDPRG= <waltz16>
##$CPDPRG1= <>
##$CPDPRG2= <waltz16>
##$CPDPRG3= <>
##$CPDPRG4= <mlev>
##$CPDPRG5= <mlev>
##$CPDPRG6= <mlev>
##$CPDPRG7= <mlev>
##$CPDPRG8= <mlev>
##$CPDPRGB= <>
##$CPDPRGT= <>
##$D= (0..31)
0 1 0 0 0 0 0 0 0 0.06 0 0.03 2e-05 3e-06 0 0 0.0002 0 0 0 0 0 0 0 0 0 
$$ [...]
##$SUBNAM4= <"">
##$SUBNAM5= <"">
##$SUBNAM6= <"">
##$SUBNAM7= <"">
##$SUBNAM8= <"">
##$SUBNAM9= <"">
##$SW= 400.765351723535
##$SWIBOX= (0..15)
0 1 3 0 0 0 0 0 0 0 0 0 0 0 0 0 
##$SW_h= 32467.5324675325
##$TD= 32768
##$TD0= 1
##$TE= 0
##$TE2= 300
##$TE3= 300
##$TEG= 300
##$TL= (0..7)
0 120 53 12 22 120 120 120 
##$TP= (0..7)
150 150 150 150 150 150 150 150 
##$TP07= 0
##$TPNAME0= <>
##$TPNAME1= <>
##$TPNAME2= <>
##$TPNAME3= <>
##$TPNAME4= <>
##$TPNAME5= <>
##$TPNAME6= <>
##$TPNAME7= <>
##$TPOAL= (0..7)
0.5 0.5 0.5 0.5 0.5 0.5 0.5 0.5 
##$TPOFFS= (0..7)
0 0 0 0 0 0 0 0 
##$TUNHIN= 0
##$TUNHOUT= 0
##$TUNXOUT= 0
##$USERA1= <user>
##$USERA2= <user>
##$USERA3= <user>
##$USERA4= <user>
##$USERA5= <user>
##$V9= 5
##$VALIST= <valist>
##$VCLIST= <CCCCCCCCCCCCCCC>
##$VD= 0
##$VDLIST= <DDDDDDDDDDDDDDD>
##$VPLIST= <PPPPPPPPPPPPPPP>
##$VTLIST= <TTTTTTTTTTTTTTT>
##$WBST= 1024
##$WBSW= 4
##$XGAIN= (0..3)
0 0 0 0 
##$XL= 0
##$YL= 0
##$YMAX_a= 3254
##$YMIN_a= -11953
##$ZGOPTNS= <>
##$ZL1= 120
##$ZL2= 120
##$ZL3= 120
##$ZL4= 120
##$ABSF1= 198.0616
##$ABSF2= -202.7028
##$ABSG= 5
##$ABSL= 3
##$ALPHA= 0
##$AQORDER= 0
##$ASSFAC= 0
##$ASSFACI= 0
##$ASSFACX= 0
##$ASSWID= 0
##$AUNMP= <proc_1d>
##$AZFE= 0.1
##$AZFW= 0.5
##$BCFW= 0
##$BC_mod= 2
##$BYTORDP= 0
##$COROFFS= 0
##$CY= -3
##$DATMOD= 1
##$DC= 0
##$DFILT= <>
##$DTYPP= 0
##$F1P= 0
##$F2P= 0
##$FCOR= 1
##$FTSIZE= 65536
##$FT_mod= 6
##$GAMMA= 0
##$GB= 0
##$INTBC= 1
##$INTSCL= 9.790993e-09
##$ISEN= 30
##$LB= 1.5
##$LEV0= 0
##$LPBIN= 0
##$MAXI= 10000
##$MC2= 0
##$MEAN= 0
##$ME_mod= 0
##$MI= 50
##$NCOEF= 0
##$NC_proc= -11
##$NLEV= 6
##$NOISF1= 182.463
##$NOISF2= 159.3651
##$NSP= 0
##$NTH_PI= 0
##$NZP= 0
##$OFFSET= 198.0616
##$PC= 4
##$PHC0= 2686.388
##$PHC1= -102.5128
##$PH_mod= 1
##$PKNL= yes
##$PPARMOD= 0
##$PSCAL= 0
##$PSIGN= 0
##$REVERSE= no
##$SF= 81.0140089999434
##$SI= 65536
##$SIGF1= 159.3651
##$SIGF2= -187.1042
##$SINO= 113.3802
##$SIOLD= 16384
##$SREGLST= <1H.CDCl3>
##$SSB= 0
##$STSI= 65536
##$STSR= 0
##$SW_p= 32467.5324675325
##$SYMM= 0
##$S_DEV= 0
##$TDeff= 32768
##$TDoff= 0
##$TI= <>
##$TILT= no
##$TM1= 0
##$TM2= 0
##$TOPLEV= 0
##$USERP1= <user>
##$USERP2= <user>
##$USERP3= <user>
##$USERP4= <user>
##$USERP5= <user>
##$WDW= 1
##$XDIM= 65536
##$YMAX_p= 389031446
##$YMIN_p= -261999574
$$ End of Bruker specific parameters
$$ ---------------------------------
##NTUPLES= NMR SPECTRUM
##VAR_NAME=  FREQUENCY,     SPECTRUM/REAL,   SPECTRUM/IMAG
##SYMBOL=    X,             R,               I
##VAR_TYPE=  INDEPENDENT,   DEPENDENT,       DEPENDENT
##VAR_FORM=  AFFN,          ASDF,            ASDF
##VAR_DIM=   65536,         65536,           65536
##UNITS=     HZ,            ARBITRARY UNITS, ARBITRARY UNITS
##FACTOR=    0.49542278885378, 1,            1
##FIRST=     16045.7642231865, 0,            0
##LAST=      -16421.768244346, 0,            0
##MIN=       -16421.768244346, -261999574,   0
##MAX=       16045.7642231865, 389031446,    0
$$ Real data points
##PAGE= N=1
##DATA TABLE= (X++(R..R)), XYDATA
$$ [...]
41213B420480k3115503O449384K7400951J5067779j1196683j6068476J794632
41206B752564J3680899M554914j2026702j8385229j1676635L97376Q458262P484181
41198d760370K423072K755312P074132M425201m401336l815057J0340500K0478758
41190C4520212J3937028M79782q138181j4316590j7952926r166878O654593N254561
41182A1271601j4745783j8054315J2225796L8347098K2455695j2713599k1148993
41175A7637500n942625l432759j3375535k487055K8455396L8598849J3550449
41168G3004220j2834868j3392869L38948J1517269K0460379K1804325J161002
41161A02058406l0955888m1438293k5245920j3952048j9237707j2462791J8096680
$$ plain form
41213 2420480 -20695023 -14245639 13155312 28223091 17026408 957932 2752564
41206 2752564 16433463 20988377 8961675 -9423554 -21100189 -20702813 -12244551 -4760370
41198 -4760370 -2337298 418014 7492146 11917347 7516011 3700954 14041454 34520212
41190 34520212 48457240 48937022 40798841 26482251 8529325 -637553 6017040 11271601
41182 11271601 -3474182 -21528497 -9302701 29044397 51500092 38786493 17637500
41175 17637500 11694875 8262116 -5113419 -7600474 20854922 59453771 73004220
41168 73004220 60169352 46776483 47115431 58632700 79093079 100897404 102058406
41161 102058406 71102518 29664225 4418305 -9533743 -28771450 -41234241 -23137561
41154b3137561L5797055J3317674j8202277j5972590J0348768K1708360J1334565
41147C5193994J360947l253526j4225863k4256500j3274763J2864602K6009881
41140B0418772J8095662P952993M666995m105284k1117708k6373344q073700J5133931
41132F598317J8822233O048561p7949Q972458J5243427Q01218k3219396k6136536
41124G052333J500638K9764977K4899386o132952k6646752k1510398j1179519
41117b252287j0934930n898997J8337248M5267105M8940002K8465642R10464k4669265
41109I8164982m4912768m8134404k7407953M6938R046810j897969j2997525j2247487
41101d0339376m937798J356757M957996O093858P312693J3458304K1616500J9644966
$$ plain form
41154 -23137561 12659494 25977168 7774891 -8197699 2151069 23859429 35193994
41147 35193994 36554941 33301415 19075552 -5180948 -18455711 -5591109 20418772
41140 20418772 38514434 46467427 51134422 47029138 25911430 -461914 -8535614 6598317
41132 6598317 25420550 31469111 31391162 40363620 55607047 56408265 33188869 7052333
41124 7052333 8552971 38317948 63217334 57084382 30437630 8927232 -2252287
41117 -2252287 -13187217 -19086214 -748966 44518139 93458141 121923783 122834247 98164982
41109 98164982 53252214 5117810 -22290143 -22243205 -13196395 -15094364 -28091889 -40339376
41101 -40339376 -45277174 -43920417 -38962421 -32868563 -25555870 -12097566 9518934 29163900
41093B9163900M317054j1348439j9216335k7143434l4933522k1918462J7849586
41086f3229652M9694325M0200418R167465J769060J8445123J6063039j9841165
41079E2268613m8401560l3265906P278568L0955900K5268278Q129152n373327
41072C6859718j3214034j4455389p599178K375775P920925P922555O568314P132204
41064C3510890J0175677J2725118Q570840l294277j1575700m497387J1280244
41057E6895405J5349483r21366k3775544l3384748k2118452K062549K0753400
41050A4860727J7079437n681266k1589364j1417941J0770312J5957937q94336
41043A9085506j8527131k0162539o182328J7241756L7781843L2019254q559846
$$ plain form
41093 29163900 33480954 22132515 2916180 -24227254 -59160776 -81079238 -63229652
41086 -63229652 -13535327 26665091 35832556 37601616 56046739 72109778 52268613
41079 52268613 3867053 -29398853 -22120285 8835615 34103893 42233045 36859718
41072 36859718 23645684 9190295 1591117 3966892 11887817 19810372 26378686 33510890
41064 33510890 43686567 56411685 64982525 61688248 50112548 45615161 56895405
41057 56895405 72244888 71323522 47547978 14163230 -7955222 -5892673 14860727
41050 14860727 31940164 26258898 4669534 -6748407 4021905 19979842 19085506
41043 19085506 558375 -19604164 -25786492 -8544736 29237107 61256361 52696515
41036E2696515m9649473m6816897p523417J6955606O425649m503487R463471K3395227
41028D43194J1282434p025322m098553N798425k023686j1579244N020698K8361250
41020B6179196J5004769k8291478m7131710j9785370J3997900J6758833K647379
41013b0620481K793950J6039269J9721308P051162r503280j7999773j3217832
41006a5735677M551381K3228062K3288291Q69000k3461033k8637438j5380439
40999c1277853K814878J7332390K3333787J4992534m851888k0429193k1188092
40992a9273437j6185720j9003625k6280541k3473997o322691J4495925K6143432
40985f9900654K3014264R057219j874799M235927K2594153K9028462R582213j7769898
$$ plain form
41036 52696515 3047042 -43769855 -51293272 -34337666 -27912017 -32415504 -22952033 443194
41028 443194 11725628 4700306 601753 6400178 4376492 -7202752 -2182054 26179196
41020 26179196 41183965 12892487 -34239223 -54024593 -40026693 -23267860 -20620481
41013 -20620481 -17826531 -1787262 17934046 24985208 15481928 -2517845 -15735677
41006 -15735677 -11184296 12043766 35332057 36201057 12740024 -15897414 -31277853
40999 -31277853 -28462975 -11130585 12203202 27195736 22343848 1914655 -19273437
40992 -19273437 -35459157 -54462782 -80743323 -104217320 -110540011 -96044086 -69900654
40985 -69900654 -46886390 -37829171 -39703970 -35468043 -12873890 16154572 25736785 7966887
40977G966887k4836205r666663N250343P098727N763787J1082637J5714311Q715651
40969B7089475p031439k0338518k5605777k2709188j0823573P680934K1826971
40962b9911115K0850928Q013525k056283p45335N848184P494676L646572J802447
40954A4943599M290951L634202n087951j2016337j688230K3950776M1058569K9819494
40946I8905073j225165k6270975l3286938l1545924l0014810k4931607j4436559
40939f2806905r389827j6478399k1094790l664901L0558793N3529852M7232347
40932A7886170K2122806R17377m468612L247355J4241920J7036892N923183j0206625
40924F6700466j4266038k957529N912043k962476j9174242j9890672k785867R309409
$$ plain form
40977 7966887 -16869318 -26535981 -21285638 -14186911 -8423124 2659513 18373824 27089475
40969 27089475 20058036 -280482 -25886259 -48595447 -59419020 -51738086 -29911115
40962 -29911115 -9060187 -1046662 -3102945 -3848280 1999904 9494580 13141152 14943599
40954 14943599 19234550 22868752 17780801 5764464 4076234 28027010 69085579 98905073
40946 98905073 97679908 71408933 38121995 6576071 -23438739 -48370346 -62806905
40939 -62806905 -72196732 -88675131 -109769921 -113434822 -82876029 -29346177 17886170
40932 17886170 40008976 40926353 36457741 39705096 53947016 70983908 76907091 66700466
40924 66700466 52434428 49476899 55388942 52426466 33252224 13361552 10575685 19885094
40916A9885094l96951j9852420k4964282j1043967M118383O822726M772093J1630334
40908i028990K2743797J9357406k165700j8898464q936950J7762045L0261507
40901E1094651J6429567l050861l972689J1365219K0977789J0631827j3466459
40894I0009044l2731533l1119823r355021J1051838P834737j2764148k0455516
40887B469578l443485J0855313n143501l4904677l8054176p069848K4665033L0752159
40879a9873604J9130508O434664o258959j9233439k0575843n453734R101250P824971
40871b8904186J204657O319714J6569556J3271702r87570n535357M149626J0001026
40863A6089168L064451q26593J2641039L1195051L1453850J0403608j1913467
$$ plain form
40916 19885094 19488143 -364277 -25328559 -36372526 -32254143 -25431417 -20659324 -9028990
40908 -9028990 13714807 33072213 30906513 12008049 3071099 20833144 51094651
40901 51094651 67524218 64473357 60500668 71865887 92843676 103475503 90009044
40894 90009044 57277511 26157688 16802667 27854505 35689242 22925094 2469578
40887 2469578 -973907 9881406 4737905 -30166772 -68220948 -75290796 -50625763 -19873604
40879 -19873604 -743096 5691568 -567391 -19800830 -40376673 -45830407 -36729157 -28904186
40871 -28904186 -27699529 -21379815 -4810259 8461443 7473873 1938516 6088142 16089168
40863 16089168 19153619 18327026 30968065 62163116 93616966 104020574 92107107
40856I2107107j7991794j1036785p396601j7000819l2500423l5710288j6204716
40849d5734319J4369809K9586297J4865023j3977179k5118532o623121J7766749
40842a4865273J6064539j1545608l1443971j9364535Q664764K0162160J1074517
40835b1253407P241537K2656859L8728357L3647447J3548209n02295l298982n336007
40827H5431718r644366q319775j207152o55903j3151315k8015930k9738405j4617312
40819a9918440P455060K1902290J9485062L878533j0061859j0988315l045974
40812H706357K183743J733233K00863l283444j3355231k3771283k0012891j652323
40804d9250976J1990013P398875l546028j101168J3855373K2861930J7179858
$$ plain form
40856 92107107 74115313 63078528 55681927 38681108 6180685 -29529603 -45734319
40849 -45734319 -31364510 -1778213 13086810 -890369 -26008901 -32632022 -14865273
40842 -14865273 1199266 -10346342 -41790313 -61154848 -52490084 -32327924 -21253407
40835 -21253407 -14011870 8644989 47373346 81020793 94569002 94066707 90767725 85431718
40827 85431718 75787352 67467577 66260425 65604522 52453207 24437277 -5301128 -19918440
40819 -19918440 -12463380 9438910 28923972 32802505 22740646 11752331 8706357
40812 8706357 10890100 12623333 12824196 9540752 -3814479 -27585762 -47598653 -49250976
40804 -49250976 -37260963 -29862088 -33408116 -34509284 -20653911 2208019 19387877
40797A9387877P162262L414864K586947j764667m953188J232113J1532181J0427339
40789D9025728n970277k2379454k5237717k1961986k7819489l8987117l5015023
40782a28345335r943482J5996039K4020769K0652626K0479775J9189705M711279
40775c3238624j2950721r461072J4584698K8022459J2484151j1300860j6108294
40768b7968263p613800q963927j9100599j4325680J0548778K9424446K1172558
40761a6826487j715103j3170556p917756j180864k868397p745731q703758n807661
40753f5936313j25190J0498446K4401003L1741720K3396840K081251j8859157
40746G198600k6695389j8449905j816355J0974443J2747222P215087L679813N271874
$$ plain form
40797 19387877 26550139 29965003 32551950 30787283 25834095 27066208 38598389 49025728
40789 49025728 43055451 20675997 -4561720 -26523706 -54343195 -93330312 -128345335
40782 -128345335 -138288817 -122292778 -98272009 -77619383 -57139608 -37949903 -33238624
40775 -33238624 -46189345 -55650417 -41065719 -13043260 -559109 -11859969 -27968263
40768 -27968263 -35582063 -44545990 -63646589 -77972269 -67423491 -37999045 -16826487
40761 -16826487 -18541590 -31712146 -39629902 -40810766 -43679163 -51424894 -60128652 -65936313
40753 -65936313 -66061503 -55563057 -31162054 579666 23976506 26057757 7198600
40746 7198600 -19496789 -37946694 -39763049 -28788606 -16041384 -8826297 -5146484 125390
40738A25390O217079K198582k872522n401009j0535262k1980685k7754519j1427350
40730g1430296J9760373L4502709J5966692j2313528j5906701L119167J0536802
40723a5764782p811669k3285583p093882K4269942K9368812q37036l1103651k9161308
40715f1419157k414805K1027559K8275923K3612132R594731j2480682k8988542
40708b2792841k2461002L676779K5434698K7891180K0097079J4907503R291126
40701E6044522m561868k0436458k4516227j4826258k028445N907598R243233R027994
40693A3854091M309916l228005r170660j0863330p845051j121422L874309J23349
40685a0066803q825319p827390R323793K6958480K7422599J5365529O482829j4887
$$ plain form
40738 125390 6342469 8541051 5668529 267520 -10267742 -32248427 -60002946 -71430296
40730 -71430296 -51669923 -17167214 -1200522 -13514050 -29420751 -26301584 -15764782
40723 -15764782 -23576451 -46862034 -53955916 -29685974 -317162 -1154198 -32257849 -61419157
40715 -61419157 -63833962 -42806403 -14530480 9081652 18676383 6195701 -22792841
40708 -22792841 -45253843 -41577064 -16142366 11748814 31845893 46753396 56044522
40701 56044522 51482654 31046196 6529969 -8296289 -10324734 -4417136 4826097 13854091
40693 13854091 18164007 14936002 5765342 -5097988 -12943039 -14064461 -10190152 -10066803
40685 -10066803 -18892122 -26719512 -17395719 9562761 36985360 52350889 58833718 58818831
40677E8818831j6663775l8659614m3216086k2095967N460265J8727503J7193282
40670b0435561J0707392N701616P805695J9951378K9714720J7343423j3110314
40663E7678349k9714659j3759939J2320479J5225775n026213k0216238j3857634
40656B649920K719326J0268408L284456p121973n030486J1807457K4577943J5923567
40648E9078618j421959j85801J4422536M613800l8944511p0568941n1415367p579342
40640i2000967J0209699M38895j33956J5259027J7578609Q71408m836840J1705084
40632d0909041K1912739P620688q171893k763569Q308378Q52878j6867950j9632229
40624d9649999l290242J6535195K9249129L2352687K3114834O251366k148826
$$ plain form
40677 58818831 42155056 3495442 -39720644 -61816611 -56356346 -37628843 -20435561
40670 -20435561 -9728169 -4026553 3779142 23730520 53445240 70788663 57678349
40663 57678349 27963690 14203751 26524230 41750005 36723792 16507554 2649920
40656 2649920 5369246 15637654 18922110 11800137 6769651 18577108 43155051 59078618
40648 59078618 57656659 57470858 71893394 76507194 37562683 -33006258 -84421625 -92000967
40640 -92000967 -81791268 -81352373 -81486329 -66227302 -48648693 -47777285 -52614125 -40909041
40632 -40909041 -18996302 -11375614 -19547507 -22311076 -14002698 -13149820 -30017770 -49649999
40624 -49649999 -52940241 -36405046 -7155917 25196770 48311604 54562970 52414144
40617E2414144L971670P321415o811855k3392494j7603972N443456J3579276q818797
40609B6102843l7455328l5646396J745422L9004977L7861392M081905j5738480
40602A9956335O622078L9847819L3992126q197172l5583758k3956665n587255
40595B7093508j0182607j8571337l808106J6221460O546493k5705399m0270895
40588d8676883k1781073O715702K2154711K0966527N253686j7690024k4458789
40581e7516143J990790L7040944L5376945o114716l9165352k9059468K981192
40574e4465808J9235991J7057119J5371271J3590101j666116j9656163j1775562
40567b2309167K1452755M0631186J9159311j7888872k7426736o707602P925808
$$ plain form
40617 52414144 56385814 63707229 56895374 33502880 15898908 21342364 34921640 26102843
40609 26102843 -11352485 -46998881 -45253459 -6248482 31612910 35694815 19956335
40602 19956335 26578413 66426232 100418358 92221186 56637428 32680763 27093508
40595 27093508 16910901 -1660436 -5468542 10752918 17299411 -8405988 -48676883
40588 -48676883 -70457956 -63742254 -41587543 -20621016 -15367330 -33057354 -57516143
40581 -57516143 -55525353 -18484409 16892536 10777820 -28387532 -57447000 -54465808
40574 -54465808 -35229817 -18172698 -2801427 10788674 9122558 -10533605 -22309167
40567 -22309167 -856412 39774774 58934085 41045213 13618477 6910875 14836683
40560A4836683l875473k1941859k3550286j7219147j8703953j6551955P674213
40553g9331777L7902461L8697216J0257261q365914J936853J4124158K653603
40546A7873861j6360570j6239664l203202N42425k932154M491478K0704603K6064489
40538C0941266J7413333J2988292K3584667L8559624M0951843K3446710p496348
40531A80389387l3923881m0271607l1887858k6783979k4758427q614738J5519746
40524B9668643J4036161j7454875l2298046j966435L0582149J4011612k7306538
40517I272671l1797958o40064R828172j3280590k2157210L645538K4132937J4128259
40509f868245N160091K1943256L6251418K1295470L86343Q9277O70137k1292180
$$ plain form
40560 14836683 10961210 -10980649 -34530935 -51750082 -70454035 -87005990 -79331777
40553 -79331777 -41429316 -2732100 7525161 -840753 1096100 15220258 17873861
40546 17873861 1513291 -14726373 -17929575 -17387150 -20319304 -15827826 4876777 30941266
40538 30941266 48354599 61342891 84927558 123487182 164439025 187885735 180389387
40531 180389387 146465506 106193899 74306041 47522062 22763635 14148897 29668643
40524 29668643 43704804 26249929 -6048117 -8014552 22567597 36579209 9272671
40517 9272671 -22525287 -23165351 -13337179 -26617769 -48774979 -45129441 -20996504 -6868245
40509 -6868245 -1708154 20235102 56486520 77781990 78168333 78257610 78927747 57635567
40501E7635567m0620000k3840854R056648J3962836q736984k3241341j8220576
40494c4004704j0545127l086035J4071324K8560528J7164329j0568156k0732862
40487a9140703n929479R389107J2508824J3939290J5688099O386499q287016p148088
40479A7406533P941191J0059219p258629j6366269k34839J9942691J7999470k236194
40471D7253173k1790277l3653429l7707122k8334643o318138J1038806R682267
40464e9829363o17684j21539J3549254K4380748J9821624M446353n996383j27333
40456d494323J6158337K2104767L863101k6499468m1643992k8164914K460764
40449e6215728K9204345L7748754K4982105J21024j9591795k4966102k3532785
$$ plain form
40501 57635567 17015567 -6825287 2231361 16194197 7457213 -15784128 -34004704
40494 -34004704 -44549831 -47635866 -33564542 -5004014 12160315 1592159 -19140703
40487 -19140703 -25070182 -15681075 -3172251 10767039 26455138 32841637 24554621 17406533
40479 17406533 25347724 35406943 28148314 11782045 11547206 31489897 49489367 47253173
40471 47253173 25462896 -8190533 -45897655 -74232298 -80550436 -69511630 -59829363
40464 -59829363 -60447047 -60568586 -47019332 -22638584 -2816960 1629393 -4366990 -4494323
40456 -4494323 11664014 33768781 37631882 11132414 -30511578 -58676492 -56215728
40449 -56215728 -27011383 10737371 35719476 35840500 16248705 -8717397 -32250182
40442c2250182k2349458j1880879J5237764L8755089L0379500k892841k2595723
40435g596730j0435248R899316J0834413l874750j4525765j4850798j0799778
40428d1349340n719974o30199K696139Q403846K2978211L7585912L1055613O25926
40420E5646134k7668384l1598400j9086884q898676k798239N885619J1550757
40413a6968073M880746p804628j2670531q483897k271072O751024K1058009K9448394
40405A3939972J7434405q728692k5170091j8638252N04088J3739518J3082323
40398F163271M492922k46124M163116R847632P023097K235761J1713529L2055571
40390G7448775L6136891R982435k4274501l8383133l3751758k7588328k0560122
$$ plain form
40442 -32250182 -54599640 -66480519 -51242755 -12487666 17891834 14998993 -7596730
40435 -7596730 -18031978 -8132662 2701751 -1172999 -15698764 -30549562 -41349340
40428 -41349340 -47069314 -47699513 -45003374 -36599528 -13621317 23964595 55020208 55646134
40420 55646134 27977750 -3620650 -22707534 -31606210 -34404449 -28518830 -16968073
40413 -16968073 -12087327 -19891955 -32562486 -41046383 -43317455 -36566431 -15508422 13939972
40405 13939972 31374377 22645685 -2524406 -21162658 -20658570 -6919052 6163271
40398 6163271 10656193 10410069 14573185 24420817 31443914 33679675 45393204 77448775
40390 77448775 113585666 123568101 99293600 60910467 27158709 -429619 -20989741
40383b0989741m294588J2139109J3597760R041472J8608437L3937751K5221766
40376H7261966r257872l4134105k6630643n005991N112762M615036M997772M332196
40368C1291121m87958J589700J6602420K7206665J5677316p510560j9667864j9086818
40360D5614022j9279464j9311905o424103J4152513J8252403k824783k7271906
40353B906777l0722241j4769555J062231N059708J922077J629655P133784J1773444
40345a4004120O996032n690070j2647058l246302J4935727K3539619J5926610
40338B5810438M619688M623740J5829688K4758638J9480734P85125j8587281k5301314
40330E2019456j8432636j0076214j0576847j6656234j8877273j6250662j4820684
$$ plain form
40383 -20989741 -25284329 -13145220 452540 9494012 28102449 62040200 87261966
40376 87261966 78004094 43869989 17239346 12233355 17346117 21961153 26958925 31291121
40368 31291121 30803163 32392863 48995283 76201948 91879264 84368704 64700840 45614022
40360 45614022 26334558 7022653 598550 14751063 33003466 30178683 2906777
40353 2906777 -27815464 -42585019 -41522788 -36463080 -34541003 -32911348 -25777564 -14004120
40345 -14004120 -7008088 -12698158 -25345216 -28591518 -13655791 9883828 25810438
40338 25810438 30430126 35053866 50883554 75642192 95122926 95908051 77320770 52019456
40330 52019456 33586820 23510606 12933759 -3722475 -22599748 -38850410 -53671094
40323e3671094j4135453o389559Q431450J6696201P617475r417635j2275995P878313
40315e5266297L2734086L4356096Q011906j8113591j3968149J3833013K7386662
40308B8973726N411281k8770653l8282334j8958789K879353J0735130J3658714
40301b4353572K1577005K6909675J9061622J950479j2319913j7051252j1505094
40294D268950K261412J6510641K0282578J0743679m011409j5154165j8021476
40287A6880210q567432J1218936K4632329J5019731p841385j6398038n765397
40280B9178954j745564j7945798l1089455j7820740P151776J3895664j4300j4885365
40272c3274828k0857142j7885001K49462L1389581M8223288K9899664p07145p469262
$$ plain form
40323 -53671094 -67806547 -74196106 -65764656 -49068455 -41450980 -50868615 -63144610 -55266297
40315 -55266297 -22532211 11823885 19835791 1722200 -12245949 1587064 28973726
40308 28973726 34385007 5614354 -32667980 -51626769 -48747416 -38012286 -24353572
40301 -24353572 -2776567 24133108 43194730 45145209 32825296 15774044 4268950
40294 4268950 6530362 23041003 43323581 54067260 50055851 34901686 16880210
40287 16880210 8312778 19531714 44164043 59183774 51342389 34944351 29178954
40280 29178954 27433390 9487592 -21601863 -39422603 -32270827 -18375163 -18389463 -33274828
40272 -33274828 -54131970 -72016971 -71767509 -40377928 7845360 37745024 37037879 29568617
40264B9568617K440015m656809k4096116j7986110J2689504K0170398r416944
40257H712555k6479187Q13642L0993890J8234048j1199090o707437J9033309J4820138
40249D8221868j7818056k6369072L873575K7735980J6099720m356017n980791
40242D1407207l433850j5474798k5980453j5375055J053969m77175j1068751o416959
40234c5765865J1712157K1472422J6559073Q175134j98741j3902528k7465602
40227a9413950k7395645j3677374L00871Q061271J3459075J5616960Q057357n653231
40219b0644666j0593106J018731J9659527K8992412K0300006j409143j8900211
40212A8423550j5111216P086330K2966336J4061837p904622j7469456r349568
$$ plain form
40264 29568617 32008632 27351823 3255707 -14730403 -2040899 18129499 8712555
40257 8712555 -17766632 -16952990 14040900 32274948 21075858 14368421 33401730 48221868
40249 48221868 30403812 4034740 7908315 35644295 51744015 47387998 41407207
40242 41407207 37973357 22498559 -3481894 -18856949 -17802980 -18280155 -29348906 -35765865
40234 -35765865 -24053708 -2581286 13977787 22152921 21954180 8051652 -19413950
40227 -19413950 -46809595 -60486969 -60186098 -52124827 -38665752 -23048792 -14991435 -20644666
40219 -20644666 -31237772 -30219041 -10559514 18432898 38732904 37323761 18423550
40212 18423550 3312334 10398664 33365000 47426837 39522215 22052759 12703191
40205A2703191k79129j451139p445681j1893097j5403699j5393662o143172O323764
40197c8982624P201778k650805l400529J2871782K6140823J7767137j63308m113801
40189A4670453L686552J41462k0830841l7923073l2637018j1544865P164681J5032277
40181f2240372J5186304J4510565J9311740K8678289K9037504P831686k3600915
40174B8714801l6301334k0370237O90188L215941n867192p329270k095883k579379
40166d1922365l836738Q176232K4785969K1789718J33240j1517622k242227M274952
40158c58841p900770j8397604n948935J4561883J8472072J2944274J9048263K8193709
40150F0614051J4702590j5093497k6057045q661154P486414L164733l456256M953756
$$ plain form
40205 12703191 12424062 10972923 3527242 -8365855 -23769554 -39163216 -45306388 -38982624
40197 -38982624 -31780846 -34431651 -37832180 -24960398 1180425 18947562 18784254 14670453
40189 14670453 18357005 18498467 -2332374 -40255447 -72892465 -84437330 -77272649 -62240372
40181 -62240372 -47054068 -32543503 -13231763 15446526 44484030 52315716 28714801
40174 28714801 -7586533 -27956770 -27266582 -24050641 -29917833 -37247103 -39342986 -41922365
40166 -41922365 -45759103 -37582871 -12796902 8992816 9126056 -2391566 -4633793 -358841
40158 -358841 -8259611 -26657215 -32606150 -18044267 427805 13372079 32420342 60614051
40150 60614051 75316641 60223144 34166099 25504945 32991359 36156092 32699836 37653592
40142C7653592J2778556J435019j4598074j0912438M603332L392848j7855899
40135A6496936l2105027k2676676l790870N579480Q256718J8040276L4418654
40128B4219491M1152518K7858799M333735j0263241j0099389q730735j8895269
40121D9575909l2238740k9277628p215708J5666212K5026747K4849324K1832999
40114F8219115J2213893n315832j8835555j9880099j8341133k4209649k5992734
40107c2141994q234774J7017493K0905070j76117j6756640o595248J7251618K8572978
40099A9842386K1892372J1006677M870273N2008p069933j3621534j6427486j6140742
40091D404021j2892022l847705J0920392K3123075K2237318Q273706n737302q343211
$$ plain form
40142 37653592 50432148 51867167 37269093 26356655 30959987 34352835 16496936
40135 16496936 -15608091 -38284767 -42075637 -36496157 -28239439 -10199163 24219491
40128 24219491 65372009 93230808 97564543 87301302 77201913 68471178 49575909
40121 49575909 17337169 -11940459 -19156167 -3489955 21536792 46386116 68219115
40114 68219115 80433008 75117176 56281621 36401522 18060389 -6149260 -32141994
40107 -32141994 -40376768 -23359275 -2454205 -2630322 -19386962 -25982210 -8730592 19842386
40099 19842386 41734758 52741435 57611708 57663716 50593783 36972249 20544763 4404021
40091 4404021 -8488001 -12335706 -1415314 21707761 43945079 52218785 46481483 38138272
40083C8138272l468306k481109m731059K217014K0110262L1155314K0817471q62809
40075A00895050j2720788r764729l859122k767901l487721m046229o840950r846782
40067D7560828q316775o279260j2064010k0016198j2590907J2547961L2163530
40060C3005169K5482145K507605q735505J944043J6840030J6084818K415639n050272
40052H4493672L654026J7624889K0521955J1635663L490015k11742j1316520l4627708
40044I5264250n0873109l8194176n277304J5467397Q597975q611237j5795503
40037E78293j5891897k0443916k4587862j4958532M952504J6008348J0146364
40030d4196698J380349O363555K4024415L9262795M0290189K7862835J1539807
$$ plain form
40083 38138272 34669966 32188857 27457798 29674812 49785074 80940388 101757859 100895050
40075 100895050 88174262 78409533 74550411 71782510 68294789 64248560 57407610 47560828
40067 47560828 39244053 32964793 20900783 884585 -11706322 841639 33005169
40060 33005169 58487314 60994919 52259414 54203457 71043487 87128305 89543944 84493672
40052 84493672 88147698 105772587 126294542 137930205 141420220 141208478 129891958 95264250
40044 95264250 44391141 6196965 919661 16387058 24985033 16373796 578293
40037 578293 -15313604 -35757520 -60345382 -75303914 -70351410 -54343062 -44196698
40030 -44196698 -42816349 -36452794 -12428379 26834416 67124605 94987440 106527247
40023A06527247P09709k624558m275170r911734j6694106j5907056m770915Q097396
40015F1150813J1682410M419713o318341j4436511j9474542k0765669j4476983
40008A780890j444384P300767J466631j2867209j7402835m022371J4370490J9740175
40000H922154R690099k875142o217933j17318P603782J0164850Q357174Q983864
39992D4511530J3949956J3321252j699290j9937384j9688942j902196M363654
39985C2918580j7338591m1589466l3180934K985912K8778043K4451276P256427
39978D281247k174234n294474r512506r761300L16355J4402352K2764301K3555428
39970C8577169J6440882j287287k2924474l1171133k0420617p345811p083182
$$ plain form
40023 106527247 107236956 104612398 100337228 90425494 73731388 57824332 53053417 61150813
40015 61150813 72833223 77252936 70934595 56498084 37023542 16257873 1780890
40008 1780890 336506 7637273 9103904 -3763305 -21166140 -25188511 -10818021 8922154
40000 8922154 18612253 15737111 9519178 9401860 17005642 27170492 35527666 44511530
39992 44511530 58461486 71782738 70083448 50146064 30457122 28554926 32918580
39985 32918580 15579989 -26009477 -59190411 -56204499 -27426456 -2975180 4281247
39978 4281247 2107013 -3187461 -12699967 -22461267 -22144912 -7742560 15021741 38577169
39970 38577169 55018051 53730764 30806290 -364843 -20785460 -28131271 -35214453
39963c5214453j1733503o628178M495088Q154672N823885J0531308K2997977K9332609
39955B7759405K1779393O538977q632583k0165168k2124120r366914R555040J6263557
39947B1607587M713064j1045001j6192551j2157789q000593m159909N299187J8707029
39939a228976K5513631K0218359J0244408N546126M562292k251726j4660581j7818334
39931C0125199k687859J5756313J4379721n219787j5928291k634393J5493711
39924D9284614J2123588r620133k4247721j9906285q123301N52718J0403348K4026585
39916C4493413K8570650J1118952j9796201m0094794l6561750j9399818p111860
39909d8781408m611724r97600J2005390K5362790K2279942J497842j6399601j0531837
$$ plain form
39963 -35214453 -46947956 -53576134 -49081046 -40926374 -35102489 -24571181 -1573204 27759405
39955 27759405 49538798 56077775 47445192 27280024 5155904 -4211010 5344030 21607587
39947 21607587 26320651 15275650 -916901 -13074690 -21075283 -25235192 -19936005 -1228976
39939 -1228976 24284655 44503014 54747422 60293548 64855840 62604114 47943533 30125199
39931 30125199 27437340 43193653 57573374 52353587 36425296 33790903 49284614
39924 49284614 61408202 51788069 27540348 7634063 -489238 63480 10466828 34493413
39916 34493413 63064063 74183015 54386814 14292020 -22269730 -41669548 -48781408
39909 -48781408 -53393132 -54390732 -42385342 -17022552 5257390 6755232 -9644369 -20176206
39901b0176206J6043760L8209160L3659039L794957k7997939l7359306k0983350
39894a4809885J259454Q716775K431719r43626N325951J0685225O473474j840535
39886A7298552o780490q742975o201524P985757K8835225L4322152J5169623n216066
39878G6670254k228671J0663966R94815l0951410m9682584l4968969n642893J3567927
39870b1577565K1328414K4491173J9437830N794059j434374P333280J8128707
39863G3501524J3985683O10499n991781m761688l218704J944744J4920908K0658591
39855A11649776J759620k7241610l0729667j886982K4141928J7423760q982675
39848H6134150k3875849k1893553k0980506k6090147k0370659M648927K8967250
$$ plain form
39901 -20176206 -4132446 34076714 67735753 71530710 43532771 6173465 -14809885
39894 -14809885 -13550431 -4833656 -2401937 -3345563 1980388 12665613 19139087 17298552
39886 17298552 10518062 1775087 -4426437 3559320 32394545 66716697 81886320 76670254
39878 76670254 74441583 85105549 86100364 55148954 5466370 -29502599 -35145492 -21577565
39870 -21577565 -249151 24242022 43679852 49473911 48039537 55372817 73501524
39863 73501524 87487207 88097706 82105925 77344237 74125533 76070277 90991185 111649776
39855 111649776 113409396 86167786 55438119 53551137 77693065 95116825 86134150
39848 86134150 62258301 40364748 19384242 -6705905 -27076564 -22427637 6539613
39841F539613K5413809o071997l5327654l3739882m427700K2345871K2917138
39834b350802M845890n426391M950619K3432740L1813273K6458279J4260128p14532
39826I7269204j6775669k8101675l0440911k9374874l1192262k8857567j1506913
39819g8980667J2710343K0824704P497634l833690O540556K5412418K6041905
39812A6213203O774641r131985q271608j405324j028995l455574n83097N399244
39804D510505Q804240J0680682J2013240N930776j1710085l0109314l3438525
39797c3318481j9754484n56088J4813779K3896468K3566633J1306143m373092
39790A5580878p630828M395354J4469032O758249j1177210j8476196j0285797
$$ plain form
39841 6539613 31953422 25881425 -9446229 -43186111 -47613811 -25267940 -2350802
39834 -2350802 2495088 -2931303 2019316 25452056 57265329 83723608 97983736 97269204
39826 97269204 80493535 52391860 21950949 -7423925 -38616187 -67473754 -78980667
39819 -78980667 -66270324 -45445620 -37947986 -41781676 -35241120 -9828702 16213203
39812 16213203 22987844 13855859 5584251 4178927 3149932 -305642 -888739 4510505
39804 4510505 13314745 23995427 36008667 41939443 30229358 120044 -33318481
39797 -33318481 -53072965 -53629053 -38815274 -14918806 8647827 19953970 15580878
39790 15580878 7950050 12345404 26814436 33572685 22395475 3919279 -6366518
39783f366518m297566j4228705k8318882k5039069m149923J2262042R991412j037610
39775f1184819o083154n817557n950958p29625J5208018K7930455J9408034k047063
39767a9266669j0253626p85977L296160r071217j8813369j0375046K870806N927073
39759e6471865J0673301L0522837M5360767K5187563j9289450m3087310k5290795
39752c2394952P275750J9990858R744701l682792n336116N339108J7735609J6241906
39744C4914072l539535k1802197j4241525J2097224K2989887M491736j5472498
39737A9437164p137568J7947455K3921123O31550k3887493j9948018R043775L1589670
39729E1597658K2411131r333315k7486157j0004627K1075374K4617568n170448
$$ plain form
39783 -6366518 -10664084 -24892789 -53211671 -78250740 -82400663 -70138621 -60147209 -61184819
39775 -61184819 -67267973 -73085530 -79036488 -79766113 -64558095 -36627640 -17219606 -19266669
39767 -19266669 -29520295 -30306272 -27010112 -36081329 -54894698 -65269744 -62398938 -56471865
39759 -56471865 -45798564 -15275727 30085040 55272603 35983153 -7104157 -32394952
39752 -32394952 -25119202 -5128344 4616357 933565 -4402551 936557 18672166 34914072
39744 34914072 31374537 9572340 -4669185 7428039 30417926 34909662 19437164
39737 19437164 12299596 30247051 54168174 54799724 30912231 10964213 20007988 51597658
39729 51597658 74008789 64675474 37189317 27184690 48260064 72877632 67707184
39722F7707184k9879744j9928270O285890J3304761q06245j0127772n440802l176434
39714A7938568j0938849j2988769J121732J6204310J3996448Q46771k979113P021422
39706C0222520J5819261J1375955k184359j4087917j8721139j5327611n093219
39699B003491N979302P724398k943748j4069364j0026292Q478975K3140918J9722195
39691D0009875M376353o480036o488452k095723Q00735L151078N758941M979189
39683D4011960j146516p764321p894426n41287O917798M209497j1441610k9229780
39675b878685l4234559k5727949j8337189j9512619j6180588M952207L2625832
39668g9293550M1919548K4996936l935007k8835644l9663924k6670303Q751845
$$ plain form
39722 67707184 37827440 17899170 24185060 37489821 36683576 26555804 21115002 17938568
39714 17938568 6999719 -5989050 -4867318 11336992 25333440 26180211 23201098 30222520
39706 30222520 46041781 57417736 55233377 41145460 22424321 7096710 2003491
39699 2003491 7982793 15707191 12763443 -1305921 -11332213 -2853238 20287680 40009875
39691 40009875 44386228 37906192 31417740 29322017 30122752 33273830 39032771 44011960
39683 44011960 42865444 35101123 27206697 26665410 33583208 37792705 26351095 -2878685
39675 -2878685 -37113244 -62841193 -81178382 -100691001 -116871589 -111919382 -79293550
39668 -79293550 -37374002 -12377066 -16312073 -45147717 -84811641 -111481944 -102730099
39661a02730099L8829615L2874872J300212j1741305J0463409L2822862K2368205
39654B4187771k162938j609403K3823792L8336135K3650110k149044j5622948
39647H8453475j1870498K177015J6081241J7047352K082667j1685537p429134
39640I4856581L519360l771986k6878264l5763600j7984952K298014J533295j0516610
39632G291838j1611167k150063N97708p613323j3670308q430278L650208J5253308
39624a6682077K4030221K8941739K8234487K2833877J5811290P949439j661421
39617A09457555j1360458j8040794k2139335k6713108l0707797k7284660j1834432
39610c8623029R375124K1700387J6006787k14813r358603l384332O920835O370668
$$ plain form
39661 -102730099 -63900484 -31025612 -29725400 -41466705 -31003296 1819566 24187771
39654 24187771 22024833 20415430 44239222 82575357 106225467 104076423 88453475
39647 88453475 76582977 78759992 94841233 111888585 113971252 102285715 94856581
39640 94856581 98375941 94603955 67725691 31962091 13977139 16275153 17808448 7291838
39632 7291838 -4319329 -6469392 -5871684 -13485007 -27155315 -35585593 -31935385 -16682077
39624 -16682077 7348144 36289883 64524370 87358247 103169537 111118976 109457555
39617 109457555 98097097 80056303 57916968 31203860 496063 -26788597 -38623029
39610 -38623029 -29247905 -7547518 8459269 8244456 -1114147 -4498479 2422356 8793024
39602H793024m928338j3300154j0900506m152679p48534K786840J3654359K7524459
39594A8728471K9437678J1743366j3807366k6001681j5516107O521686K1386781
39587C2492828K0348332P563666r008948k2492470k5603807j4299532M829300
39580f170631J8815221K2818390K2588054K0113418Q162528j3739749k8888919
39573D3698312k1584131k11172J0894619J634450j2981516j4230726l603627r3893
39565C522316j5196361l4479102l0237308K856181L2815801K6129448m936967
39558a9525992j4209283J3327093L6258382J5692632k5716235l5413082o326170
39551c5912655J8049307J1247298l425352J921833J7081785J7365977M821578
$$ plain form
39602 8793024 3864686 -9435468 -20335974 -24488653 -25237187 -22450347 -8795988 18728471
39594 18728471 48166149 59909515 46102149 20100468 4584361 11106047 32492828
39587 32492828 52841160 60404826 51395878 28903408 3299601 -10999931 -6170631
39580 -6170631 12644590 35462980 58051034 78164452 86326980 72587231 43698312
39573 43698312 22114181 21903009 32797628 34432078 21450562 7219836 3616209 3522316
39565 3522316 -11674045 -46153147 -76390455 -73534274 -40718473 -14589025 -19525992
39558 -19525992 -33735275 -20408182 15850200 31542832 5826597 -29586485 -35912655
39551 -35912655 -17863348 -6616050 -10041402 -8119569 8962216 26328193 31149771
39544C1149771L03013Q589532J5430297J2392062L772051q394796k6982244m5045960
39536h786274m4353444j6973740J9237309L5416204K1998655n48202m943736J0766514
39528A1813286K1656609R283016j3685701k2368965j3988318n887922l904737
39521a7082732L862866J7765789J6553818q528031l0370550j9618459J0664289
39514b6753010K0572411P06834j3243295Q762177M7781944N9575017K9500078
39507A26902156j3962305l6049674k9233770q944792P853762J1886876J472226
39500E9924479j4697563k1032331j2639094m021459p776873j1416729N186646
39493f472924L1779391L3207756P78268k7912330j8334681J2803888K2953442
$$ plain form
39544 31149771 31452784 40042316 55472613 67864675 71636726 63241930 36259686 -8786274
39536 -8786274 -53139718 -70113458 -50876149 -15459945 6538710 5990508 1046772 11813286
39528 11813286 33469895 42752911 29067210 6698245 -7290073 -13177995 -17082732
39521 -17082732 -13219866 4545923 21099741 12571710 -17798840 -37417299 -26753010
39514 -26753010 -6180599 -5473765 -18717060 -9954883 37827061 97402078 126902156
39507 126902156 112939851 76890177 47656407 38711615 46565377 58452253 59924479
39500 59924479 45226916 24194585 11555491 7534032 -242841 -11659570 -6472924
39493 -6472924 25306467 58514223 59292491 31380161 13045480 25849368 48802810
39486D8802810K847782j7569836j5464527O32362J2796634J4808520P171699p671496
39478D6353948j9296335j5904392j830577P160925Q473607J4478235K5773365
39471F5208776K2822511n587898m0433753n0467196k4760442J7718062M4131512
39464B8631572L3801772j671957k6307937j8756872K698863Q832520K037544N409107
39456C4674612J8354613J7673869K511811l5467J7312274K6015035P882355j8300701
39448A06088401l3819241m6786305n8622200m2442570J0379150N4438279M3961931
39441C3197445P12205j5671790Q669448L2114300K5120970L778207p015647n906246
39433G4998892j893913J632954O13374r075341j8770594j4397373J185550J2382495
$$ plain form
39486 48802810 51650592 34080756 18616229 19248591 32045225 46853745 54025444 46353948
39478 46353948 27057613 11153221 9322644 16483569 24957176 39435411 65208776
39471 65208776 88031287 82443389 42009636 -8457560 -33218002 -15499940 28631572
39464 28631572 62433344 60761387 34453450 15696578 18395441 27227961 29265505 34674612
39456 34674612 53029225 70703094 73214905 73179438 90491712 116506747 124389102 106088401
39448 106088401 72269160 25482855 -33139345 -75581915 -65202765 -10764486 33197445
39441 33197445 33909650 18237860 26907308 59021608 84142578 87920785 80905138 74998892
39433 74998892 73104979 74737933 75351307 66275966 47505372 33107999 34293549 46676044
39425D6676044J5893390J9702488J9848657M531386j8242326k5098943j3560303
39418D9750393o679374j5088845k1666186j3756111m296676o679764j1088545
39411b9505108k710863J3337449K1335457J7094468Q255062K737299N778818J7564303
39403E3886885K6970853J9853902o82462j5824062j7587097j7545345k3428150
39396B5644524k6299184k0370774j5809832j8717917j6998862k571190Q910939
39389f6212296L84516j6623526j5315217R710045L7744487M9811765M4646164
39382D4145938K9664922J1873313j748862o963423o932297p105895p483423n890458
39374D9559815l494249J28238R444041K0376392J4666426j7301893n3660578o0229372
$$ plain form
39425 46676044 62569434 82271922 102120579 106651965 88409639 63310696 49750393
39418 49750393 43071019 27982174 6315988 -7440123 -11736799 -18416563 -29505108
39411 -29505108 -32215971 -18878522 2456935 19551403 27806465 30543764 36322582 53886885
39403 53886885 80857738 100711640 100029178 84205116 66618019 49072674 25644524
39396 25644524 -654660 -21025434 -36835266 -55553183 -72552045 -75123235 -66212296
39389 -66212296 -65827780 -82451306 -97766523 -88056478 -50311991 -500226 44145938
39382 44145938 73810860 85684173 83935311 76971888 70039591 62933696 55450273 49559815
39374 49559815 46065566 46193804 55637845 76014237 90680663 73378770 19718192 -40511180
39366d0511180l3396848n926622m414514j6712294j2162124J6614539M5737428
39359e0771615N0586036L2575777J2855240O360246P870585L002725j1933535
39352E0545459k5653388k7076196j8640164r784610j811204J1409951K7219365
39345F209213K9849956J0459087j5332437k2361393q104433K988196o912094k2450742
39337b5654647j4177022K1104641N2804903N0524318J5602479k3016843l5984892
39330D1202937j5589952J9964437M1554884L5614699J6214621L933041j876876
39323A41017791j4710161k9467253k4082786K431855J9874203Q477215j2479675
39316I1061189j5702257m472004J643996M34481L1602n826402k5227488m1707638
$$ plain form
39366 -40511180 -73908028 -79834650 -84249164 -100961458 -113123582 -96509043 -50771615
39359 -50771615 -185579 32390198 45245438 51605684 59476269 62478994 50545459
39352 50545459 24892071 -2184125 -20824289 -30608899 -32420103 -21010152 6209213
39345 6209213 36059169 46518256 31185819 8824426 719993 3708189 -3203905 -25654647
39337 -25654647 -39831669 -18727028 34077875 84602193 100204672 77187829 41202937
39330 41202937 25612985 45577422 87132306 122747005 138961626 142894667 141017791
39323 141017791 126307630 96840377 72757591 75189446 95063649 103540864 91061189
39316 91061189 75358932 70886928 72530924 72965405 72997007 67170605 41943117 235479
39308B35479l2387281o293197P061451L581363O321553K2234640L1575991K4370217
39300E6700216J3828333O409786p990258k5723675k3127052L935821K5260381
39293D9293552J9311889K551253l704576o698779j8172259k4134463r282379R380351
39285A8544589O710855p504726m254061J4276222J5323426j2892886m1607434
39278a1404015m1012981j5259265J1848106K7462949L3682614L2708736K1786429
39271E9812573J754863j6866464k0865556q680386N989296J0525557R214781J2323058
39263E3207722J4068771J19383k2317082k5717111k580948J8828165J4153520
39256D9762420l161224p337198o4215K38518n956880l427586N941069M743369
$$ plain form
39308 235479 -32151802 -38444999 -31383548 -27802185 -21480632 754008 32329999 56700216
39300 56700216 70528549 76938335 68948077 43224402 20097350 24033171 49293552
39293 49293552 68605441 71156694 67452118 60753339 42581080 18446617 9164238 18544589
39285 18544589 25255444 17750718 13496657 27772879 43096305 30203419 -11404015
39278 -11404015 -52416996 -67676261 -55828155 -28365206 5317408 38026144 59812573
39271 59812573 61567436 44700972 23835416 15155030 21144326 31669883 40884664 53207722
39263 53207722 67276493 67395876 45078794 19361683 16780735 35608900 49762420
39256 49762420 46601196 39263998 39199783 39438301 33481421 30053835 35994904 40738273
39248D0738273p827138j2268997p34752J0170027N289477q007574j1835666J568318
39240A7091968K5292186M3067831L8369790J0744497j6338413j7930888K53248
39233A00550219P185894j1547296l2921603k7805164j279658J3803192Q91543
39226D8877127j7782654j0029851K3896735N1269335M8854971K8576731J2680688
39219A86343082M30864k0665869m2562981m4035872k7426552j7420451j9713781
39212A4948440j3272844P198570J6075450J099818j1650674j364542J1688990
39205B4723208N006624k234275J6147932L9614451K9367216m027623j1999985
39198I6597548J6308677L8136629K2817026r680446k7330325k5886957j5708471
$$ plain form
39248 40738273 32911135 20642138 19907386 30077413 35366890 27359316 15523650 17091968
39240 17091968 42384154 85451985 123821775 134566272 118227859 100296971 100550219
39233 100550219 107736113 96188817 63267214 35462050 34182392 47985584 48877127
39226 48877127 31094473 21064622 44961357 96230692 145085663 173662394 186343082
39219 186343082 186773946 166108077 123545096 79509224 52082672 34662221 14948440
39212 14948440 1675596 8874166 24949616 26049434 14398760 13034218 24723208
39205 24723208 29729832 27495557 43643489 83257940 112625156 108597533 96597548
39198 96597548 112906225 151042854 173859880 164179434 136849109 110962152 95253681
39191I5253681n70847J4054271J6588818P268918J30350j205035p556876j7849388
39183A06113892j4675426M780436J9156835J5199006N260320J685851j340822
39176A36180092q089109q418512J115331O821643K892410L081404J2497530J3482102
39168A59562891k026234j2487848k501917O589828q747894l0055412k2770973
39161H7562441O187277J5245948q555291k9076204j3655028K1515251L5179634
39154A14404028J3838293j6623497k5938274j1715805N053723P680286o00855
39147H6097899p295772p739888n463452k116444L227670Q396942J1737667J7374917
39139A04219539K5596315K4023877M479614j6411610j4418131N983751J6023256
$$ plain form
39191 95253681 94682834 108737105 125325923 132594841 132725191 131520156 123963280 106113892
39183 106113892 91438466 96218902 115375737 130574743 135835063 137520914 136180092
39176 136180092 128090983 119672471 120787802 127609445 130501855 133583259 146080789 159562891
39168 159562891 157536657 145048809 142546892 149136720 140388826 110333414 87562441
39161 87562441 93749718 108995666 100440375 71364171 57709143 79224394 114404028
39154 114404028 128242321 111618824 85680550 73964745 79018468 86698754 86097899
39147 86097899 78802127 71062239 65598787 63482343 66710013 75106955 86844622 104219539
39139 104219539 129815854 153839731 158319345 141907735 127489604 133473355 149496611
39132A49496611N211187o669944o704940r774502k7930365m3651867l3872847
39125B6103333l439651K4458852L7582128L7336807K5536590O767707n892934
39118A48452832m613170L32514n542763k1042556l3543248l4998829k5286877
39111B3757903r453768J230254k475765j2043910q329326R495833K0620672J5647307
39103C8449200J0407402J5565198J7982678R409414P544363K4527777L7532257
39096A61418289K0160281j3884542k9255334j9186157p216211p039767j0012686
39089I4983873q386464m185636L228286J5261289K1789753J1726990o747069j5780620
39081A11890402j3688690j2543670j5331747j4906869j0591975o885490r88094
$$ plain form
39132 149496611 154707798 148037854 141332914 131558412 103628047 59976180 26103333
39125 26103333 22663682 47122534 84704662 122041469 147578059 154345766 148452832
39118 148452832 143839662 144172176 138629413 117586857 84043609 49044780 23757903
39111 23757903 14304135 15534389 13058624 1014714 -7314612 2181221 22801893 38449200
39103 38449200 48856602 64421800 82404478 91813892 99358255 123886032 161418289
39096 161418289 181578570 167694028 138438694 119252537 112036326 104996559 94983873
39089 94983873 86597409 82411773 85640059 100901348 122691101 134418091 127671022 111890402
39081 111890402 98201712 85658042 70326295 55419426 44827451 37941961 36953867
39074C6953867J0352533J8054489J2076187k500622j6462063l0387803l9984238
39067a1897650k6646307J2006062M1692699L3696456J0199809J0533374K8180242
39060I7764685K5626524J112121r913399K044712P772000m598022j1971869o397489
39052A01439263j1727271l1568823l0463759N861471L6444808K4685006o361580
39045H8309115j5039906m548664m793409j6598214j7130096m683211K700168L633731
39037C1849514J1554849K2470992J8438461N81738j1757212j3261811j4966126
39030D4910405j4561955N160179M1492590O2008013M2777604l84802l0852124
39023A50549910l0613530j1264135O750202J5554702K0205592K3191972J6120561
$$ plain form
39074 36953867 47306400 65360889 77437076 74936454 58474391 28086588 -11897650
39067 -11897650 -38543957 -26537895 15154804 48851260 59051069 69584443 97764685
39060 97764685 123391209 124503330 114589931 116634643 124406643 119808621 107836752 101439263
39052 101439263 89711992 58143169 27679410 33540881 69985689 94670695 88309115
39045 88309115 73269209 68720545 63927136 47328922 30198826 25515615 28215783 31849514
39037 31849514 43404363 65875355 84313816 84895554 73138342 59876531 44910405
39030 44910405 30348450 35508629 77001219 139009232 181786836 181402034 150549910
39023 150549910 119936380 108672245 115422447 130977149 151182741 174374713 190495274
39016A90495274o551182k9898055k9191356k029848K4290045K5323603O718202
39009A79156683j0165568j6552114j7506688j5851144r671033N4617J0732482
39002A20197235K1659770K8347937K2163815M557437q333976n462720M467559
38995A87597057P857134M646137J365339j948452n640324l567882M459222O012859
38987B00781090m218217j1769822n046091M500113L397570J414743J2449982K4548767
38979B26058135J7304569n20681j361214J7810467L2883159L2000864K6958916
38972C51134215K3357495J1005710q371576j3780305J759728J5645841Q280338
38965C89031446r804599j8660077j7813756j7202158j4637571j653027J6839227
$$ plain form
39016 190495274 183944092 154046037 124854681 122824833 147114878 172438481 179156683
39009 179156683 168991115 152439001 134932313 119081169 109410136 109464753 120197235
39002 120197235 141857005 170204942 192368757 196926194 188592218 183129498 187597057
38995 187597057 195454191 200100328 201465667 199517215 193876891 190309009 194768231 200781090
38987 200781090 196562873 184793051 179746960 184247073 187644643 189059386 201509368 226058135
38979 226058135 243362704 242842023 241480809 259291276 292174435 324175299 351134215
38972 351134215 374491710 385497420 377125844 363345539 365105267 380751108 389031446
38965 389031446 379226847 360566770 342753014 325550856 310913285 309260258 326099485
38958C26099485K5367321J6650184k678149k0233600k4913613j3686723J071674
38951C07676579l49793k0905859l8618856l1683197n331603J5158266J3202276
38944B39147813n052476k1168024k2290515j1417162l203070o056606r330090
38937A60629870K546962K3355352K7043184K119251k9908874m0049386k4382487
38930A21353872j007282J4252377J6586008O640058q222230j2833681K43889J6565535
38922A53578546J5054876l332197j5257130n001983J6108635K3943400Q308671
38915A93402818j7195096k8208844j2868978J4723972K7344826J4611986n868531
38908A85942153j2851702p591332m524645n089496J037359J2059615J2456583
$$ plain form
38958 326099485 351466806 368116990 365438841 345205241 320291628 306604905 307676579
38951 307676579 307326786 286420927 247802071 216118874 210787271 225945537 239147813
38944 239147813 234095337 212927313 190636798 179219636 176016566 169959960 160629870
38937 160629870 163176832 186532184 213575368 215694619 185785745 145736359 121353872
38930 121353872 120346590 134598967 151184975 157825033 149602803 136769122 137013011 153578546
38922 153578546 168633422 165301225 150044095 145042112 161150747 185094147 193402818
38915 193402818 176207722 147998878 135129900 149853872 177198698 191810684 185942153
38908 185942153 173090451 165499119 160974474 155884978 156922337 168981952 181438535
38901A81438535j082249j1548945p774337j608878p172245j7628747j8000140
38894A16622994j0172012p335448j0110498p372192R30114J230745r749524j6139016
38886E7905163o434613P904499Q910167k279046r476438o467486m219627j1721873
38878C4120746k0594068j5254180N884486K5775134K6654777R755033o584142
38871E9757786q816934k681263j003670k958551L034954J6726013K1257198P290855
38863I2606388j1072888j5203796o698736k78261j08453Q55634K764180j723047
38855F1141021j0041493r446658K444608J3077388J5803478J8531387K3763715
38848A15273446J7632618p225791l1898342l2424713j2615771L029990M853704
$$ plain form
38901 181438535 180356286 168807341 161033004 159424126 152251881 134623134 116622994
38894 116622994 106450982 99115534 89005036 81632844 82562958 83793703 74044179 57905163
38886 57905163 51470550 59375049 68285216 66006170 56529732 50062246 45842619 34120746
38878 34120746 13526678 -1727502 4156984 29932118 56586895 66341928 59757786
38871 59757786 50940852 48259589 47255919 44297368 47332322 64058335 85315533 92606388
38863 92606388 81533500 66329704 59630968 59352707 59244254 60099888 62864068 61141021
38855 61141021 51099528 41652870 44097478 57174866 72978344 91509731 115273446
38848 115273446 132906064 125680273 93781931 61357218 48741447 51771437 56625141
38841E6625141O246231J5182184J8536070M796178j3325508j4886161j723242
38834G1450893M002937o672349j5596931n218912J3771780J8309238Q889399Q194725
38826I7130780K2393281K8054550J0222636q784652j790105J8026357J5619152
38819A80871999q899755j8047393L304909K2794229J1848983j0530931j1602880
38812A69739161L039076M668543p410882p368745R400770J6786645J807082j3653578
38804A77008072p748925R109474J3417990L120213m025510L112963J8027928K5904010
38796B37926215J4373556j7993152n4270795o6904404m4171547n984833J5973562
38789G8948602J1716319j797431o199862j129335L906278N679513O683206M822154
$$ plain form
38841 56625141 62871372 78053556 96589626 101385804 88060296 73174135 71450893
38834 71450893 75453830 68781481 53184550 47965638 61737418 80046656 88936055 97130780
38826 97130780 119524061 147578611 157801247 149016595 147226490 165252847 180871999
38819 180871999 171972244 153924851 157229760 180023989 191872972 181342041 169739161
38812 169739161 172778237 177446780 170035898 162667153 172067923 188854568 190661650 177008072
38804 177008072 169259147 178368621 191786611 194906824 190881314 193994277 212022205 237926215
38796 237926215 252299771 234306619 180035824 113131420 68959873 62975040 78948602
38789 78948602 90664921 88867490 82667628 81538293 85444571 91124084 97807290 102629444
38781A02629444m247837j4331004j0867058P399098J9482036P146514j7565432
38774H9645761k5534729r685700O670988M092402q222476j0664980o88065J0150354
38766E5763555J4595175J2288432L580615p133179j0766199p042790q012024j7008012
38758C6265573j8315923l190709R415921k00739j7977530j5350809N157718J3390449
38750I193951j508785j7383183j5563788l486381N749267J1290417J3526476P917788
38742I735762j160250j440845M361438j078611j7833372k2164917m747863R868018
38734b4460640O76128j5182497q497179J7993356L6545984L4408415K2583105
38727F4066672J1019610j345802j2142772j1063530M641275K0850776J7969803
$$ plain form
38781 102629444 98381607 84050603 73183545 80582643 100064679 107211193 89645761
38774 89645761 64111032 54425332 61096320 65188722 56966246 46301266 45613201 55763555
38766 55763555 70358730 82647162 86227777 79094598 68328399 61285609 53273585 36265573
38758 36265573 17949650 14758941 24174862 23974123 5996593 -9354216 -4196498 9193951
38750 9193951 7685166 -9698017 -25261805 -28748186 -22998919 -11708502 1817974 9735762
38742 9735762 8575512 7134667 11496105 10417494 -7415878 -29580795 -34328658 -24460640
38734 -24460640 -23784512 -38967009 -47464188 -29470832 7075152 41483567 64066672
38727 64066672 75086282 73740480 61597708 50534178 55175453 76026229 93996032
38720I3996032r508633m2605027m9601518j9505096J6857033J7459726j5234777
38713h142260l2881304o977153L0379947L3195757N766653j0679071l66211J3661898
38705B3958256J3777878J0169062J3953586J7353625J1338231J319816n551325
38698H6319129j2054152k0462886k4257019j8417611o841369N696199J7344781
38691B7327072K1398071Q967219j4280764k7389977j8533957K5990Q757310L341163
38683I612127o537227j1775905r263167M32627J3200536K3139319K8148843K9479535
38675G6436688K5280079J3063835l01983k996714K936184K37420j7677068l1964135
38667F5014306k2495337K358547J5935259Q447404n448690j3855590k3021878
$$ plain form
38720 93996032 84487399 41882372 -7719146 -27224242 -10367209 7092517 -8142260
38713 -8142260 -41023564 -48000717 -17620770 15574987 21341640 10662569 10296358 23958256
38705 23958256 37736134 47905196 61858782 79212407 90550638 91870454 86319129
38698 86319129 74264977 53802091 29545072 11127461 4286092 9982291 27327072
38691 27327072 48725143 57692362 43411598 16021621 -2512336 -2486346 6270964 9612127
38683 9612127 3074900 -8701005 -17964172 -17531545 -4331009 18808310 46957153 76436688
38675 76436688 101716767 114780602 114478619 111481905 114418089 114655509 96978441 65014306
38667 65014306 42518969 44877516 60812775 69260179 63811489 49955899 26934021
38660B6934021l7849252m3950399k5354232P859751K7470422K2367614J0028723
38653a2493352Q866203J4365261J2136186K291911l219637o57927K679045K570212
38645B6537902J686265J298723J443675O349306J5961034J6303469l433808k6687568
38637C9458998k5256740j102965J3374704L763042o163640K802742J0983632p192229
38629C0667544l7799701m5033653k1598163P161682K1860430K4950248K2575232
38622B783619J6082626J0607332J0690338Q731371l714010j7807999j9717199
38615G656078j3536422j0284426m155890J2794893K2389390K094211k9767732
38608a2809898l1098545o90662J7532689M928158l134707J9642612M2400071K6335901
$$ plain form
38660 26934021 -10915231 -54865630 -80219862 -72360111 -44889689 -22522075 -12493352
38653 -12493352 -3627149 10738112 22874298 25166209 21946572 21288645 23967690 26537902
38645 26537902 28224167 29522890 30966565 37315871 53276905 69580374 66146566 39458998
38637 39458998 14202258 13099293 26473997 30237039 24073399 26876141 37859773 30667544
38629 30667544 -7132157 -52165810 -73763973 -66602291 -44741861 -19791613 2783619
38622 2783619 18866245 29473577 40163915 48895286 45181276 27373277 7656078
38615 7656078 -5880344 -16164770 -20320660 -7525767 14863623 16957834 -12809898
38608 -12809898 -43908443 -44599105 -27066416 -22138258 -25272965 -5630353 36769718 63105619
38600F3105619j1641034k5638397r991659J25689j2941469k9175897k7683942
38593e3841090j1316229Q372109K4609268K9704926J7764064j629783r568394
38586D094871j774706P594113Q061550N125551Q112066J7375630K5763605K4448375
38578I8801055Q518226j4970294k8390672k2598709r423421m511640n109461N68926
38570B2884010Q745987M058295j3433333k4092898j4701481N992453K0752843
38563A0205876K0847304Q253705p164903j1802804j081105J1920889J1588057
38556D2767019J115323m224501j190289Q35276J29391K741738K881911j2370941
38548C2684927l4183228l3887638m986614K0925868J6279712n614038j5062601
$$ plain form
38600 63105619 51464585 25826188 15834529 15960218 3018749 -26157148 -53841090
38593 -53841090 -65157319 -56785210 -32175942 -2471016 15293048 13663265 4094871
38586 4094871 2320165 9914278 17975828 23101379 31213445 48589075 74352680 98801055
38578 98801055 107319281 92348987 63958315 41359606 31936185 27424545 22315084 22884010
38570 22884010 31629997 35688292 22254959 -1837939 -16539420 -10546967 10205876
38563 10205876 31053180 39306885 32141982 20339178 19258073 31178962 42767019
38556 42767019 43882342 39657841 38467552 39302828 39432219 42173957 45055868 32684927
38548 32684927 -1498301 -35385939 -40372553 -19446685 -3166973 -8781011 -23843612
38541b3843612q306110j784405N31727N944966P903662p725566l1904546l6219492
38533i5403376j3088207J1813329J5612135N312020j507597k385793j421265P348847
38525g3719907K8060116M5205945L8388443J0803080j4193482k2304290j7939427
38518e699522p329121Q593257K1975439J8556263l40176j1829243k66530J8488752
38510D2149119J5752983j2360662l9180036l8504211j1758505J6564965K4335029
38503c001318J1942209l69562L086116J2751295O323611j6897811l0053671j6898771
38495c3117902J345867l028966j9764674j5322893J2979291L0605964J9406160
38488f897153M194951R086574J7391525K528091k3006495k4762782k507726P851562
$$ plain form
38541 -23843612 -32149722 -33934127 -33402400 -27457434 -19553772 -27279338 -59183884 -95403376
38533 -95403376 -108491583 -96678254 -81066119 -75754099 -77261696 -79647489 -81068754 -73719907
38525 -73719907 -45659791 -453846 37934597 48737677 34544195 12239905 -5699522
38518 -5699522 -13028643 -4435386 17540053 36096316 35756140 23926897 23660367 42149119
38510 42149119 57902102 45541440 6361404 -32142807 -43901312 -27336347 -3001318
38503 -3001318 8940891 8571329 11657445 24408740 30732351 13834540 -16219131 -33117902
38495 -33117902 -31772035 -34801001 -54565675 -69888568 -56909277 -26303313 -6897153
38488 -6897153 -2702202 6384372 23775897 26303988 3297493 -21465289 -23973015 -16121453
38480a6121453r553147k7032026j7857481M943864J3909823R283721J0815577
38473c1611122K0468925K0635351O078459p856788j2087367j5595727k2062038
38466d2030307j6769600P322196K8083254K1326127o69156l704580J7496654L0575671
38458D1630259J4089320j1662944j7227724n257010J844944j189494l483243n660604
38450A3083504j8376810l5873271l8118642k2298474p597982k900559O222442
38443a05859792K8300316M5749106L8529040J2070997j2390784k2793005j9892604
38436c6286726q686570J987314K897647k044317J975006J5703914J9263093K936633
38428b254006j3315736q388955Q314397J4413719R010194N251836M83246j7061001
$$ plain form
38480 -16121453 -25674600 -52706626 -70564107 -65620243 -51710420 -42426699 -31611122
38473 -31611122 -11142197 9493154 15571613 7714825 -4372542 -19968269 -42030307
38466 -42030307 -58799907 -51477711 -23394457 -2068330 -2737486 -6442066 11054588 41630259
38458 41630259 55719579 44056635 26828911 21571901 23416845 22227351 18744108 13083504
38450 13083504 -5293306 -41166577 -79285219 -101583693 -109181675 -112082234 -105859792
38443 -105859792 -77559476 -31810370 6718670 18789667 6398883 -16394122 -36286726
38436 -36286726 -44973296 -42985982 -40088335 -42132652 -40157646 -24453732 -5190639 -2254006
38428 -2254006 -15569742 -23958697 -15644300 -1230581 7779613 13031449 13514695 -3546306
38420c546306l6912858l2098050J17549K8175141K4663764k935451k5817575k3765797
38412g2119583J666485L0063890L6323941J4720297j1667728j8166339r888692
38405b9067729q222151j3064065n349585J3553563J6799248m137713k0189015
38398d9677447o431539K0857199L0146952J9211944R555257Q324003J957733j4787125
38390A9156977k6369502j8666919L62658R846644L93114j5616865j8272589l806337
38382e2972819R962511O651752n701017o574242M891219P494815q065667k1673753
38374f5987201j1820293J3519333K8819397K3656458Q202275o446176j6724134
38367b6780341j8254822n537105J6351377L0276286K2752474k404330k7351837
$$ plain form
38420 -3546306 -40459164 -72557214 -72439665 -44264524 -19600760 -22536211 -48353786 -72119583
38412 -72119583 -70453098 -40389208 -4065267 10655030 -1012698 -19179037 -29067729
38405 -29067729 -37289880 -50353945 -55703530 -42149967 -25350719 -29488432 -49677447
38398 -49677447 -56108986 -35251787 -5104835 14107109 23662366 31986369 33944102 19156977
38390 19156977 -7212525 -25879444 -25516786 -15670142 -15277028 -30893893 -49166482 -52972819
38382 -52972819 -43010308 -36358556 -42059573 -48633815 -43742596 -36247781 -44313448 -65987201
38374 -65987201 -77807494 -64288161 -35468764 -11812306 -3610031 -10056207 -26780341
38367 -26780341 -45035163 -50572268 -34220891 -3944605 18807869 16403539 -10948298
38360a0948298l4780408k0739005L069425J9390989J9352893P171225n848611
38353b3331790q668141L556171K2846580L0502780J6160313o478088j4645695
38346A9942130o550175j934235j1045294k0157274j4564119M2725R129042Q978541
38338a6158659M051584l680941j1318811j0815185J46555J0535829R117987j335126
38330a9456767j0098621j0728263j953537J2546182J9936639Q304877j2040177
38323a3489667j4836366M740132J9278932R932757m692422j691143O486161m322993
38315A405391k3517597j9713797O217484K0395851R558932j408284N581536J3350944
38307A1870460K545921j4307667j3720395J974554J0861333M390248n244051o766150
$$ plain form
38360 -10948298 -45728706 -66467711 -63398286 -44007297 -24654404 -17483179 -23331790
38353 -23331790 -31999931 -28443760 -5597180 24905600 41065913 34587825 19942130
38346 19942130 13391955 11457720 412426 -19744848 -34308967 -34266242 -25137200 -16158659
38338 -16158659 -12107075 -15788016 -27106827 -37922012 -37775457 -27239628 -18121641 -19456767
38330 -19456767 -29555388 -40283651 -42237188 -29691006 -9754367 -1449490 -13489667
38323 -13489667 -28326033 -23585901 -4306969 5625788 933366 -757777 5728384 1405391
38315 1405391 -22112206 -41826003 -35608519 -15212668 -5653736 -7062020 -1480484 11870460
38307 11870460 14416381 108714 -13611681 -11637127 -775794 3614454 -1629597 -8395747
38299h395747l793315n805104j3024194j3784116J368771K2124260K3292426l098216
38291a115235k9154250k2043333J1001260L0672539J8849515j546109o774631
38284a10244n481724j5435693k9022587k4781398j030986K3397005L5141141L5116677
38276A7792191K7091459J4566756N148524K288058l856548k1686668l7937953
38269C405819l0827045l938281J2341022m62050k4787759l0995976j2808533J2285168
38261g5787635K7737138K8836686J5190820r974332l1175298k7868430n5397K3788183
38253d9308265J7270010j0489941k5655510j2429316J0157004J7262008Q056460
38246d5137550k397263o838184p041218j212297J2566348K4728663K2930471J1450929
$$ plain form
38299 -8395747 -12189062 -17994166 -31018360 -44802476 -43433705 -21309445 1982981 -1115235
38291 -1115235 -30269485 -52312818 -41311558 -10639019 8210496 6664387 -110244
38284 -110244 -5591968 -21027661 -50050248 -74831646 -75862632 -52465627 -17324486 17792191
38276 17792191 44883650 59450406 64598930 66886988 63030440 41343772 3405819
38269 3405819 -27421226 -31359507 -19018485 -19480535 -44268294 -75264270 -88072803 -75787635
38261 -75787635 -48050497 -19213811 -4022991 -13997323 -45172621 -73041051 -73096448 -49308265
38253 -49308265 -32038255 -42528196 -68183706 -80613022 -70456018 -53194010 -45137550
38246 -45137550 -47534813 -54372997 -61414215 -62626512 -50060164 -25331501 -2401030 9049899
38238I049899O642254J2748186J7139508J0947841m26478r575887j4777612j2961523
38230A8786188j742196P616275j462748k2006590k3933444L429639K9645126K3491629
38222C3823879k338980j2385381k105335J141699j1987892j6538526K731699K1499322
38214A3840485J1843394j2452653j4554302J0202148K6854618J1290264j7501406
38207B9522548k7192556j4331094O17894P147707J2093302J8475748J9011728
38200D5345277J2391270O686207K258594r880149k6347476k8753140j3858093
38193a2157510m893251j5355197k1948648J180502L6554979M2702595J2299987
38186C8383457k0717740l0874761k5869236j7592704j747539K0495725K8885950
$$ plain form
38238 9049899 15692153 28440339 45579847 56527688 56101210 46525323 31747711 18786188
38230 18786188 17043992 24660267 23197519 1190929 -22742515 -19312876 10332250 33823879
38222 33823879 31484899 19099518 16994183 18135882 6147990 -10390536 -7658837 13840485
38214 13840485 25683879 13231226 -1323076 8879072 35733690 47023954 29522548
38207 29522548 2329992 -12001102 -11383208 -4235501 7857801 26333549 45345277
38200 45345277 57736547 64422754 66681348 56801199 30453723 1700583 -12157510
38193 -12157510 -17050761 -32405958 -54354606 -53174104 -16619125 26083470 38383457
38186 38383457 17665717 -13209044 -39078280 -56670984 -58418523 -37922798 -9036848
38179i036848J1519293j3227136j9883132p035650Q287748J3656737P005454o231803
38171a4945337j1269576M553935K8198146K8391118l42573k3399002j4148270
38164b961559O396029L249371j8359229k4038546m212821J5980778J7559619Q273461
38156A887103N66619m439873o034511K49797R216348P190136o565646j5159574
38148a3089601o968582R587128J8719951J3518537k894690k0786981k6153453
38141b8067691j1254292J3547299K6852461J7306270p229065k8384953k9689528
38134d6919499q279554J6805362J8341231m825897j9733141k407962K4703622
38127b2315838K2294750r543811l3850539l0384219j5284717o974886m109261
$$ plain form
38179 -9036848 2482445 -10744691 -30627823 -37663473 -29375725 -15718988 -8713534 -14945337
38171 -14945337 -26214913 -21660978 6537168 34928286 34585713 11186711 -2961559
38164 -2961559 3434470 6683841 -11675388 -35713934 -39926755 -23945977 -6386358 1887103
38156 1887103 2453722 -1986151 -8020662 -7770865 1445483 8635619 2069973 -13089601
38148 -13089601 -20058183 -10471055 8248896 21767433 18872743 -1914238 -28067691
38141 -28067691 -39321983 -25774684 1077777 18384047 11154982 -17229971 -46919499
38134 -46919499 -55199053 -38393691 -20052460 -24878357 -44611498 -47019460 -22315838
38127 -22315838 -21088 -9564899 -43415438 -73799657 -89084374 -96059260 -100168521
38120a00168521k777588n938094p840876L142009J8372157J4873752l586397m356879
38112h8280437K0396563L2544566M259137l5496061m1535385j5480803O195437
38105a17396983R886834J3373544K4938970L0392826K1972905J0160012J971803
38098d700089p700223j7181482j2609596R383643L0210648L0492363J2259636
38091D0154900o624726j1863993j991807J4027639K3497554J8670425K141066
38084G8011058j6807102k9236736k9345552j6847249o45353O674395K913125k231340
38076g514754l150515m606787o659191J221402J9650642K8459154J3123337j0523426
38068B9999862j7494568r121036n115907q325275l671776R917810J3896708J327013
$$ plain form
38120 -100168521 -102946109 -108884203 -116725079 -113583070 -95210913 -80337161 -83923558 -88280437
38112 -88280437 -67883874 -35339308 -31080171 -66576232 -108111617 -123592420 -117396983
38105 -117396983 -107510149 -94136605 -69197635 -38804809 -16831904 -6671892 -4700089
38098 -4700089 -12400312 -29581794 -42191390 -32807747 -2597099 27895264 40154900
38091 40154900 33530174 21666181 19674374 33702013 57199567 75869992 78011058
38084 78011058 61203956 31967220 2621668 -14225581 -14870934 -8196539 -5283414 -7514754
38076 -7514754 -10665269 -15272056 -21931247 -20709845 -1059203 27399951 40523288 29999862
38068 29999862 12505294 3384258 -1731649 -10056924 -13728700 -3810890 10085818 11412831
38060A1412831j0165969n650994O335436J0649135P246304M972257O033521P247213
38052C8079734P721970O957307K849359k799973n115660o566374j5923643l1385076
38044f182356l6381081k0723506L475620J6328669J3268264M483608k253266p210557
38036c5194605r565271l267969J4208618L3034192L5905960J5763315j1082196
38029C9802044j6933259N077101K7050743J7070961j8624518l9992881k2988033
38022i537842J0778965K3518092Q122463q488632l810529J3000863J6151506k542257
38014D7192629k2688901k0559095K01193J2581947K471470j1927105p380563Q820516
38006H712091R324783j1168779k6147965j4454134J1711460K5790568J9656204
$$ plain form
38060 11412831 1246862 -4404132 1931304 12580439 19826743 24799000 30832521 38079734
38052 38079734 45801704 52759011 55608370 52808397 47692737 41126363 25202720 -6182356
38044 -6182356 -42563437 -63286943 -59811323 -43482654 -30214390 -25730782 -27984048 -35194605
38036 -35194605 -44759876 -48027845 -33819227 -785035 35120925 50884240 39802044
38029 39802044 22868785 27945886 54996629 72067590 53443072 13450191 -9537842
38022 -9537842 1241123 24759215 32881678 24393046 20582517 33583380 49734886 47192629
38014 47192629 24503728 3944633 4145826 16727773 19199243 7272138 -108425 8712091
38006 8712091 18036874 6868095 -19279870 -33734004 -22022544 3768024 23424228
37999B3424228N931221k339568k689480L02955N03108m523109r214335n733667
37991E661353M126977J0596654J1247522J4098316K1853405K4633499J4239418
37984A06457144m429277k1269754l0120877k6671671j0487469O124806O298953
37977B5901855p610304j3820296j881752J3643968J8612410J7987317J7228721
37970G0061919P598299j2699502k4685374j7057323p333597j0846061j1635211
37963f596850N861378J9928024N886305j2763085L242115L7206551L4292514q716212
37955G8340740l2491681q172550J8966574O662961j9096987j6365794J883498
37948B9726761j203406j9298066k0433396p574617p898157j7928255j2904372
$$ plain form
37999 23424228 29355449 27015881 24326401 24629356 25132464 20609355 11395020 5661353
37991 5661353 9788330 20384984 31632506 45730822 67584227 92217726 106457144
37984 106457144 102027867 80758113 50637236 23965565 13478096 19602902 25901855
37977 25901855 18291551 4471255 2589503 16233471 34845881 52833198 70061919
37970 70061919 77660218 64960716 40275342 23218019 15884422 5038361 -6596850
37963 -6596850 -735472 19192552 25078857 12315772 15557887 52764438 87056952 78340740
37955 78340740 45849059 37676509 56643083 63306044 44209057 27843263 29726761
37948 29726761 28523355 9225289 -11208107 -18782724 -26680881 -44609136 -57513508
37941e7513508J77728o071263k0847268o227530L0939171L8895738N392259j7996906
37933c3251579M96645K2364196O889832k1416637j8367487P897896K0519891J7762891
37925B895648K0368629J9632024n033164l2131529k0811700J8080190L2117834
37918C5117932J0226653l657921J0014571J4323275j3222027l4755720j4495816
37911C550947J9059296J9060162n259547r348679J3048655K6583495J4805871
37904H1500200j416921m732674j534988J631089Q297555J3650245N191719j2284969
37896I0301256j8321855q822409k089807p983229j5660082j7749859k1256940
37889a582925k6288375j9588458p94897R150918K23230q497162R1426J2338422
$$ plain form
37941 -57513508 -57335780 -63407043 -84254311 -90481841 -59542670 -20646932 -15254673 -33251579
37933 -33251579 -32754934 -10390738 -3500906 -24917543 -43285030 -35387134 -14867243 2895648
37925 2895648 23264277 42896301 37863137 5731608 -15080092 3000098 35117932
37918 35117932 45344585 41686664 51701235 66024510 52802483 18046763 3550947
37911 3550947 22610243 41670405 36410858 27062179 40110834 66694329 81500200
37904 81500200 80083279 75350605 73815617 75446706 83744261 97394506 102586225 90301256
37896 90301256 71979401 63156992 61067185 53083956 37423874 19674015 -1582925
37889 -1582925 -27871300 -47459758 -48254655 -39103737 -38880507 -47377669 -47286243 -34947821
37881c4947821O875295j0048087j5723384o758033K56438j032842J242410J3447344
37873d6688680K3779577K0095515Q133641L343210R866749J5708202J0224043
37866D4462257R03026M112834J7873757J7090070j2381535m6363917m9226340
37859b3529848k2207737J6836N25695j265929J0701267K1766711J5617632L903994
37851E528621M208862R640666N029314m006927m215420k263088j1424207k2234599
37843a9736778j5636429K243189P839286j797107p718900l681136k466174o642003
37835d7596052k946593Q473829P481415j3084791l1561688k7031698o589827Q201643
37827a04653762P964101j4447k644908Q029106K4634552K7082755Q698311p557139
$$ plain form
37881 -34947821 -28072526 -38120613 -53843997 -60602030 -60345592 -61378434 -60136024 -46688680
37873 -46688680 -22909103 -2813588 5320053 8663263 18530012 34238214 44462257
37866 44462257 45365283 49478117 67351874 84441944 72060409 25696492 -23529848
37859 -23529848 -45737585 -45720749 -45195054 -46460983 -35759716 -13993005 1624627 5528621
37851 5528621 9737483 19378149 24407463 20400536 16185116 13922028 2497821 -19736778
37843 -19736778 -35373207 -33130018 -25290732 -27087839 -34806739 -38487875 -40954049 -47596052
37835 -47596052 -50542645 -42068816 -34587401 -47672192 -79233880 -106265578 -112855405 -104653762
37827 -104653762 -96689661 -96704108 -99349016 -91319910 -66685358 -39602603 -30904292 -38461431
37819c8461431K15091J5065542N188463j9368339j4898187K5010404N0905143
37812B3656686K8564723j1648608k3490122p853920N305254P894019R033075L458095
37804C4919202j4444681k2071445L382630L8694421L8783222K363593k7990226
37797E3636716l0454678k5932193l0282304k8160040r711144M839793n16191q362345
37789g4942386L189037K5126841L4051499K5432060Q943150j1754463l1330848
37782b1285110l0422306J898966M1721579N2364890K9556062J580048j3339259
37775F2074870k4643569m0677998m7200811k8355398O108587K9876801K9621248
37768a3196270J4224086q63174p779228o421833l56010M905661N164331J741150
$$ plain form
37819 -38461431 -38246340 -23180798 -17992335 -37360674 -52258861 -27248457 23656686
37812 23656686 52221409 40572801 17082679 9228759 14534013 22428032 31461107 34919202
37804 34919202 20474521 -1596924 1785706 40480127 79263349 81626942 53636716
37797 53636716 23182038 -2750155 -33032459 -61192499 -70903643 -66063850 -66580041 -74942386
37789 -74942386 -71753349 -46626508 -12575009 12857051 21800201 10045738 -21285110
37782 -21285110 -51707416 -49808450 -8086871 44278019 73834081 75414129 62074870
37775 62074870 37431301 -3246697 -50447508 -78802906 -72694319 -42817518 -13196270
37768 -13196270 1027816 164642 -7614586 -14036419 -14392429 -9486768 -4322437 -2581287
37760b581287m39473L20674R71738q09481m657271j2065214k5464178l8347407
37752h3071899l5081461j0836660J4404607J6284554j264931j0591792K08716
37745a09948866J1935978P126068j789430N799824K4236856L0971133K1266417
37738a0402020J0360648N857944J890815p58055N826156J4160447M430952k1610578
37730I756309l4379364j6841081J0729885K1733608J8308608J6083733J2623371
37723C8015069l484290k3695428k6807773j1144623M458603J0493897J4957668
37716B793123K0890854J8880149P568230P48550M775019O647654l694049j3943780
37708D4665750o835417J2437382K1019611O914848j8724921l6323119l6196567
$$ plain form
37760 -2581287 -3020760 -2700086 -1728348 -2537829 -7195100 -19260314 -44724492 -83071899
37752 -83071899 -118153360 -128990020 -114585413 -98300859 -99565790 -110157582 -109948866
37745 -109948866 -98012888 -90886820 -92676250 -86876426 -62639570 -31668437 -10402020
37738 -10402020 -41372 5816572 7707387 6949332 12775488 26935935 31366887 9756309
37730 9756309 -24623055 -41464136 -30734251 -9000643 9307965 25391698 38015069
37723 38015069 34530779 10835351 -15972422 -27117045 -22658442 -12164545 2793123
37716 2793123 23683977 42564126 50132356 50880906 55655925 62303579 58609530 44665750
37708 44665750 37830333 50267715 71287326 78202174 59477253 23154134 -13042433
37701a3042433k2813375p931165q27933j938036n206979o205454n221500l486752
37693f6673627k185692m899436j2722863j5837316j163310K6505608M2712662
37686c4263974L1969608Q332634m220347k891088j999960m316126K858436K1319602
37678A6788785L1826631J9791997l158951j5249823j2842982j0214582j6339008
37671A0602067k4252127k3074264j1372617L439502J3811427J8123484J9413182
37664F690654J8050089P833866j4634824l7032829l8382486j4736477J1633120
37657f0578887J7626030O452911q71809N349776J5347303J6749618O575695j1315302
37649d664665k7685475k8419247p828661J8101945K5742869J2248229l928061
$$ plain form
37701 -13042433 -35855808 -43786973 -44614906 -46552942 -51759921 -57965375 -63186875 -66673627
37693 -66673627 -68859319 -73758755 -86481618 -102318934 -103482244 -76976636 -34263974
37686 -34263974 -2294366 6038268 1817921 -1073167 -3073127 -7389253 -4530817 16788785
37678 16788785 48615416 68407413 65248462 49998639 37155657 26941075 10602067
37671 10602067 -13650060 -36724324 -48096941 -44657439 -30846012 -12722528 6690654
37664 6690654 24740743 32574609 17939785 -19093044 -57475530 -72212007 -60578887
37657 -60578887 -42952857 -36499946 -37371755 -32021979 -16674676 74942 6650637 -4664665
37649 -4664665 -32350140 -60769387 -68598048 -50496103 -24753234 -12505005 -16433066
37642a6433066j0785412j3004962j2189926K96641K0653806K4873306J278882
37635e310731k5808807k5904553m535513O710002m138706j6598402j0124972J0959580
37627g4752102K8893073L3281762K5337569J2586974L931658K763324L524719
37620C5566977L94227l744129l943005k934634m711384n628327l832200q280832
37612B886693k1770678k4838775k67421L2075290L3691080J988098k3740158j8268169
37604a8244040j906023j710891j0103034m354789J4996086L0415790L5539414
37597D4632513L1968102J2460596k4204615n1522190m0052431k051800J8427332
37590a0342493L417037j8695986j8366172l527243J744621m457083n489203M396732
$$ plain form
37642 -16433066 -27218478 -40223440 -52413366 -52116725 -31462919 -6589613 -5310731
37635 -5310731 -31119538 -57024091 -61559604 -54849602 -58988308 -75586710 -85711682 -74752102
37627 -74752102 -45859029 -12577267 12760302 25347276 29278934 32042258 35566977
37620 35566977 35961204 32217075 28274070 25339436 20628052 14999725 11167525 2886693
37612 2886693 -18883985 -43722760 -43990181 -11914891 21776189 23764287 24129 -18244040
37604 -18244040 -20150063 -21860954 -31963988 -36318777 -21322691 9093099 44632513
37597 44632513 76600615 89061211 64856596 13334406 -26718025 -28769825 -10342493
37590 -10342493 -6925456 -25621442 -43987614 -47514857 -45770236 -50227319 -55716522 -51319790
37582e1319790J5031336J9968190K3097565K5272245J9189853K294791j5223349
37575C8310841k1518786j6487450q642841k927912J529841L305823l102029j7634996
37567b7167509k9827648k9898282k0840835j2250870n026680P847241K4967030
37560i2197553L2400125K1516814K639025o685236k285366M705434L957402j901876
37552c7851231j213119J2563143K9932548L0918582P262801k2662694l0510487
37545a1560457j0465012J4983449K3394771J4359450o0939j1859592j6330695
37538B460975r428150K743884M189439q906029j8221802q934740P035944R760769
37530a9299710J403295k297591m98407l314054n737472P277018K9486839L4321170
$$ plain form
37582 -51319790 -36288454 -16320264 6777301 32049546 51239399 53534190 38310841
37575 38310841 16792055 304605 -8338236 -11266148 -9736307 -6430484 -9532513 -27167509
37567 -27167509 -56995157 -86893439 -107734274 -119985144 -125011824 -117164583 -92197553
37560 -92197553 -59797428 -38280614 -35641589 -42326825 -44612191 -39906757 -35949355 -37851231
37552 -37851231 -39064350 -26501207 3431341 34349923 41612724 18950030 -11560457
37545 -11560457 -22025469 -7042020 16352751 30712201 30651262 18791670 2460975
37538 2460975 -6967175 -4223291 -33852 -8939881 -27161683 -36096423 -29060479 -19299710
37530 -19299710 -17896415 -20194006 -20692413 -24006467 -29743939 -22466921 7019918 41341088
37522D1341088J3918049o402458l165715J5173858K5128394J9052030O112206
37515A11157452m986848j0908443r851765m372110k435949p459767j2664179j1275088
37507D7203303o032835l228803l798311n180582n821428m258363l45568N04571
37499A9041984p396380j8508945j9550114p268559O950162J2537690R487540J426512
37491c280110q534690j3483645q566704k801654q103083j4841234q45148K9102066
37483c1354202L9524334J4211393j6312761j8611455l903964l722495j7040249
37476c7209399j6273409L895770J9465049J7203522Q876690K921095o499532j5656469
37468b3276683p300230J7435499L0408161J5231142q478141j5959067j0507902
$$ plain form
37522 41341088 55259137 48856679 45690964 60864822 85993216 105045246 111157452
37515 111157452 106170604 95262161 85410396 81038286 78602337 71142570 58478391 47203303
37507 47203303 41170468 37941665 34143354 28962772 23141344 18882981 18537413 19041984
37499 19041984 11645604 -6863341 -26413455 -33682014 -26731852 -14194162 -4706622 -3280110
37491 -3280110 -11814800 -25298445 -33865149 -36666803 -44769886 -59611120 -60456268 -31354202
37483 -31354202 8170132 22381525 6068764 -12542691 -16446655 -20169150 -37209399
37476 -37209399 -53482808 -49587038 -30121989 -12918467 -4041777 -1120682 -7620214 -23276683
37468 -23276683 -30576913 -13141414 17266747 32497889 24019748 8060681 -2447221
37461b447221o873201k411432J0825625K1281822J3006137m041940o918060K190066
37453B4611796j38070j6682405k2068742m446332J4157648J3430686N180881P554457
37445B1599919J0302746n738878k6959153j8406240K1890350N0575135L3180850
37438H6444729j1177651l5957969k3920161N82607R080030K86152q004326n441357
37430A1892054K17663l394258j4216879j5804612J98581J8059582J5522764n535093
37422F939802k1580044k1431480j8095055k0190437j4799130N603719K1136594
37415f2416031J3787952J910659J4776609M2013677M2862064O197385l1443675
37408B7688640l5336536j2039294J0893139J9683110J6046941N333119l379284
$$ plain form
37461 -2447221 -9320422 -11731854 -906229 20375593 33381730 29339790 22421730 24611796
37453 24611796 24473726 7791321 -14277421 -18723753 -4566105 8864581 14045462 21599919
37445 21599919 31902665 26163787 -795366 -19201606 2688744 53263879 86444729
37438 86444729 75267078 39309109 15388948 15971555 25051585 25337737 17333411 11892054
37430 11892054 12109717 8715459 -5501420 -21306032 -21107451 -3047869 12474895 6939802
37422 6939802 -14640242 -36071722 -54166777 -74357214 -89156344 -83552625 -62416031
37415 -62416031 -48628079 -46717420 -31940811 10072866 52934930 59132315 27688640
37408 27688640 -7647896 -19687190 -8794051 10889059 26936000 32269119 28889835
37401B8889835j778135L238815l785363j9542007k2781499j0070461m980334j9280138
37393e0089287l1902558k3399318m734260Q313456K2079458M1605055M7698756
37386I571302K8470873R108339J3851800K0019061p186937n0042472n7490026
37379c3698060k2865753P820113Q471381M266428J7869332L0509032J9354032
37372C1726505l255662j4474398j6955956k4152589l1161065k4932908p774683
37365i0980756R795071K5341596L6333704L1503749R160474r948649p331387P149754
37357A1023556J1611166L434183m090651o729649j1340805j8263566j9274783
37350c3630549j1810803l038602q59550p416040j6691730j4949207N891819L0658975
$$ plain form
37401 28889835 27111700 30350515 26565152 7023145 -15758354 -25828815 -30809149 -50089287
37393 -50089287 -81991845 -105391163 -110125423 -101811967 -79732509 -38127454 9571302
37386 9571302 38042175 47150514 61002314 81021375 73834438 23791966 -33698060
37379 -33698060 -56563813 -48743700 -40272319 -36005891 -18136559 12372473 31726505
37372 31726505 28470843 13996445 -2959511 -27112100 -58273165 -83206073 -90980756
37365 -90980756 -81185685 -55844089 -19510385 11993364 21153838 11205189 3873802 11023556
37357 11023556 22634722 26068905 21978254 15248605 3907800 -14355766 -33630549
37350 -33630549 -45441352 -48479954 -49339504 -56755544 -73447274 -88396481 -82504662 -51845687
37342e1845687L1817590O078782j7213842j5777893k843642P39136J636103J5468215
37334c1941238K9823576J9631108o946131j3876342P314300K1383028K866582
37327B8254883k3064384j7712984J1253171J8532507j1825796l8454225j7267198
37320e0284026L5110898N8745821K7765545j8178360l0636341j4092735o481790
37313A949012j7293554k1190371p487805L574409N08067r14645O926371N354373
37305b8574143j1879757j5530683J3776433M5714041M1747463J4636296O560266
37298F6449916K2549752K8434968R297072j1619210j4062552m109933P822231
37291A04762244J8358861J5496866j4027451n2573739n9456598k3876523J8521107
$$ plain form
37342 -51845687 -20028097 -13949315 -31163157 -46941050 -49784692 -49045556 -47409453 -31941238
37334 -31941238 -2117662 17513446 10567315 -3309027 4005273 25388301 28254883
37327 28254883 5190499 -12522485 -1269314 17263193 5437397 -33016828 -50284026
37320 -50284026 -15173128 43572693 71338238 53159878 22523537 8430802 1949012
37313 1949012 -15344542 -36534913 -44022718 -40448309 -39940242 -40854887 -33928516 -28574143
37305 -28574143 -40453900 -55984583 -42208150 3505891 45253354 59889650 66449916
37298 66449916 88999668 117434636 126731708 115112498 101049946 96940013 104762244
37291 104762244 123121105 138617971 124590520 72016781 12560183 -11316340 7204767
37284G204767L4333922K8815605J9580871M936157j9382230l7338426l3107821
37277E042845j7798371j1791698j3686377r059343J687835P387747R616722J8903794
37269i696846L1193566K9747164J1730049m598770l684927P978870J0855028n688318
37261F7835816l2637836m8949846m0028262j1235344J7263816K8585157K0128837
37254I62338R28879j4790925j5233805k117521Q725164P534426M773612J1377475
37246B159643J5342704J235086j5481179o407182J8884486J9181869j2503286
37239B2412141l1306081q460089K3372406K2273935j253188j2266660j0806870
37232C965594j8426084k7165479j2118704J5707937J8903386n519402k0939501
$$ plain form
37284 7204767 41538689 70354294 89935165 94871322 75489092 38150666 5042845
37277 5042845 -12755526 -24547224 -38233601 -47292944 -45605109 -38217362 -28600640 -9696846
37269 -9696846 21496720 51243884 62973933 58375163 54690236 62669106 73524134 67835816
37261 67835816 35197980 -13751866 -53780128 -65015472 -47751656 -19166499 962338
37254 962338 1891217 -12899708 -28133513 -30251034 -21525870 -13991444 -9217832 2159643
37246 2159643 17502347 18737433 3256254 -3150928 15733558 34915427 22412141
37239 22412141 -8893940 -17354029 6018377 28292312 27039124 14772464 3965594
37232 3965594 -14460490 -41625969 -53744673 -38036736 -19133350 -24652752 -45592253
37225d5592253j0056540M866688P553478R982743J6876941J0115571j2638446
37218a8891818k1759317j472139K0836833J6417125k616793r627695n467037m213495
37210b6794336j50341J6854311K9851746J4942567j6057299k7434091j0758377
37203a9545820P089049P037508q46950l317183l871561q015667j0802222r203508
37195d1476354r251489j1601360n904612J0857638K4862711K4707806J7602084
37188I796424J5173727J4385846N852760p024474j1925377o766536r84059J617971
37180B0126282P242951J5629894J2606725j0282872l6376167l8790005j5383620
37173d5226812N065606r08787j9907325j9227126R546189M0032118M4699521K4547242
$$ plain form
37225 -45592253 -55648793 -50782105 -43228627 -33245884 -16368943 -6253372 -18891818
37218 -18891818 -40651135 -42123274 -21286441 -4869316 -7486109 -17113804 -22580841 -26794336
37210 -26794336 -26944677 -10090366 19761380 34703947 18646648 -8787443 -19545820
37203 -19545820 -12456771 -5419263 -6266213 -9583396 -13454957 -21470624 -32272846 -41476354
37195 -41476354 -50727843 -62329203 -68233815 -57376177 -32513466 -7805660 9796424
37188 9796424 24970151 39355997 45208757 38184283 26258906 19492370 18508311 20126282
37180 20126282 27369233 42999127 55605852 45322980 8946813 -29843192 -45226812
37173 -45226812 -40161206 -41069993 -60977318 -80204444 -70658255 -30626137 14073384 38620626
37165C8620626J086058q381008j540254J0971475J1614903q351373l2364862l1580842
37157a9925277l122156K1765244K1338843J4911001K7376582M0663853J6969535
37150A19977625l5673252o2562913l5977608P799615K3317639J4359781J0292248
37143D1533135J2052632n0817j9500016j7340653O377512J4021050j3838596m5245820
37135b1991573l9717699k007922L0173553L6528380K6252770R118858j5124988
37128B3231379l6379787l2465301j509477K5306171K2075393L831058J667177
37121E756613J3791305J1169855r754019j4889918J3083799L8886818K0751373
37114G8795826k6754009m9499772k6333932Q945254K0357085J1647186L936733
$$ plain form
37165 38620626 39706684 31325676 29785422 40756897 52371800 44020427 11655565 -19925277
37157 -19925277 -23047433 -1282189 20056654 34967655 62344237 103008090 119977625
37150 119977625 84304373 21741460 -14236148 -6436533 16881106 31240887 41533135
37143 41533135 53585767 53534950 34034934 16694281 23071793 37092843 23254247 -21991573
37135 -21991573 -61709272 -63717194 -33543641 2984739 29237509 38356367 23231379
37128 23231379 -13148408 -45613709 -47123186 -21817015 258378 4089436 5756613
37121 5756613 19547918 30717773 20963754 6073836 19157635 58044453 78795826
37114 78795826 52041817 2542045 -23791887 -14846633 5510452 17157638 21094371
37107B1094371K97130p412096j6043407j6940960j2001269o388698K955870J4699418
37099a9739641J2920204r216784k7863341j6480255J2341135K1501677K756559
37092b3780446j4788626j1473132n55776L403270P492649J5665871J0677304j5223199
37084b8582085l5070865k1440141J0553697K4759927J6541382J0814098J4567377
37077g856610R060971p702027r311735J3792898L1271442J8113840m611244l850968
37069C8906567J1511598P441343j5742019k2705351m362393K949479k2763104
37062d763880m7206131k8744509J6018276L4312408J2635064j1072455j0097198
37055c8918425j898799o410938j0202154L563401J9640010J5953058K546830J726274
$$ plain form
37107 21094371 21391501 13979405 -2064002 -19004962 -31006231 -37394929 -34439059 -19739641
37099 -19739641 -6819437 -16036221 -43899562 -60379817 -48038682 -26537005 -23780446
37092 -23780446 -38569072 -50042204 -50597980 -47194710 -39702061 -24036190 -13358886 -28582085
37084 -28582085 -63652950 -85093091 -74539394 -49779467 -33238085 -22423987 -7856610
37077 -7856610 1204361 -6497666 -15809401 -2016503 29254939 47368779 42757535 38906567
37069 38906567 50418165 57859508 42117489 19412138 15049745 17999224 -4763880
37062 -4763880 -51970011 -80714520 -64696244 -30383836 -17748772 -28821227 -38918425
37055 -38918425 -40817224 -47228162 -57430316 -53866915 -34226905 -18273847 -15727017 -14000743
37047a4000743N793535p298838k6216671j7608368J4689519K7045171L928882
37040a3667513j5090119J890353K8428294K3687322l848283j5539963n104719
37033G55372q3946j0390780j6362808q233872p97727k071868J203306J5958994
37025b0023329K6510643J8966779K464018o013261k962986M716363J0602895R279204
37017D3540326j280330j2498157j2991363o456863p178353j6029290j8704639
37010c1598669j0272097r96083N991894J8733270L1129324K1214027j1213844
37003B2987822l2233071j9681619K166653j073621k2756374l0134220j6385111
36996i7109541m460186m452714l76971J6252574K7548110J5656395r425245k0704620
$$ plain form
37047 -14000743 -8207208 -15506046 -41722717 -59331085 -44641566 -17596395 -13667513
37040 -13667513 -28757632 -26867279 1561015 25248337 21400054 5860091 755372
37033 755372 671426 -9719354 -26082162 -34316034 -35113761 -37185629 -35982323 -20023329
37025 -20023329 6487314 25454093 27918111 21904850 18941864 23658227 34261122 43540326
37017 43540326 42259996 29761839 16770476 10313613 3135260 -12894030 -31598669
37010 -31598669 -41870766 -42866849 -36874955 -18141685 12987639 34201666 22987822
37003 22987822 -9245249 -28926868 -26760215 -27833836 -50590210 -80724430 -97109541
36996 -97109541 -101569727 -106022441 -106399412 -90146838 -62598728 -46942333 -56367578 -77072198
36988g7072198n376998K1565826L2554175J6406208p225602r537683R548258J9743936
36980F05922L619733j8115591j9869450r488281r564261j7386427j4107120k829161
36972h7134636k741270r144630M004265L7067169N4396537L2423023r342193l7118602
36964a7590337l8845947k1158602N156487K4143692K1480656N563624K041988
36957a9208439J6575285K4949749J1607407o774499j1250574q708977j0437417
36950c247465o953317J0793624K4874587J3201028j4025539k7109046j7505576
36943a9971704k791759J565783m754147j4728016j7620736m450492J5029996J5751611
36935c1969464n097123j4464606Q486743L3631639K3207066o301051r555540J2477927
$$ plain form
36988 -77072198 -82449196 -60883370 -28329195 -11922987 -19148589 -28686272 -19138014 605922
36980 605922 4225655 -13889936 -33759386 -43247667 -52811928 -70198355 -84305475 -87134636
36972 -87134636 -89875906 -99020536 -95016271 -57949102 -3552565 28870458 19528265 -17590337
36964 -17590337 -56436284 -77594886 -72438399 -48294707 -26814051 -21250427 -19208439
36957 -19208439 -2633154 22316595 33924002 27149503 15898929 7189952 -3247465
36950 -3247465 -10200782 592842 25467429 38668457 24642918 -2466128 -19971704
36943 -19971704 -22763463 -21197680 -25951827 -40679843 -58300579 -62751071 -47721075 -31969464
36935 -31969464 -37066587 -51531193 -43044450 -9412811 13794255 7493204 -2062336 10415591
36927A0415591J4095080j7781239m0291949k2841945Q299021J6994492R716219
36920b1394730J1612040K0253565J6006056n99326j1915246j2505022j1799472
36913a0342135j5546196k1993304k7621340k3794620p48664L2316840M7380347
36906b0349072L2834770J1320320N719435O858851l362957j5824814r276179J1394382
36898A9314736K1335410J2872769k42891r523522j6505456j6667937o078532K76630
36890D781207j4139954l4271813k9184761j741858J1564828k967053j5221080
36883h1180484r98765K0263503J9986669O109604O443924K3632748L4832645K7320973
36875E6410817R810894p131122k0574252k6841187k1945170j1138463m314351
$$ plain form
36927 10415591 24510671 6729432 -33562517 -56404462 -48105441 -31110949 -21394730
36920 -21394730 -9782690 10470875 26476931 25877605 13962359 1457337 -10342135
36913 -10342135 -25888331 -47881635 -75502975 -99297595 -100046259 -67729419 -20349072
36906 -20349072 12485698 23806018 29525453 36384304 33021347 17196533 7920354 19314736
36898 19314736 40650146 53522915 53280024 43756502 27251046 10583109 4504577 4781207
36890 4781207 -9358747 -43630560 -72815321 -74557179 -62992351 -65959404 -81180484
36883 -81180484 -82179249 -61915746 -41929077 -35819473 -29375549 -5742801 29089844 56410817
36875 56410817 66221711 59090589 38516337 11675150 -10270020 -21408483 -25722834
36868b5722834k325445M28948K569241j434511o703977j653764J1710203J6002817
36860g129322L214726j0678696n827269J3405754K2186964P477174j3589629j5142964
36852f083262K490317J2160098k227954k1772525k0255226m424945l336714k0285128
36844f3735339k4482893j4468K5252889K0092713l036579q738024Q296724K2133539
36836b4231438K0164537J5629707J4795747M754092j6391156k6281704j1342386
36829b2902601R605919J2954978L252886j037303P52388l024184r256381l545164
36821a3199462J1893680J7092574M545082q780322o724871M081475P171385K07242
36813A6286783n306163k614266K664041K561142l630610j1414318j7175089j8823257
$$ plain form
36868 -25722834 -28048279 -27619331 -25050090 -26484601 -33188578 -34842342 -23132139 -7129322
36860 -7129322 -3914596 -14593292 -20420561 -7014807 15172157 22649331 9059702 -6083262
36852 -6083262 -3592945 8567153 6339199 -15433326 -35688552 -40113497 -43450211 -63735339
36844 -63735339 -88218232 -88232700 -62979811 -42887098 -45923677 -54661701 -46364977 -24231438
36836 -24231438 -4066901 11562806 26358553 31112645 14721489 -11560215 -22902601
36829 -22902601 -13296682 -341704 2911182 1873879 2626267 -397917 -9654298 -13199462
36821 -13199462 -1305782 15786792 20331874 11551552 4826681 8908156 16079541 16286783
36813 16286783 10980620 8366354 11030395 13591537 9960927 -1453391 -18628480 -37451737
36805c7451737j3792928j953762R136937P919379p502423k2906491k1587900l082791
36797i1221716J8148705L0962534L5137485L0753311J2956081j5852241l8483731
36790a7599572l7757703j4867300J3188655K9658132K6977557Q143648j2523248
36783d779831j7120904k381812J4919156J8490031J0922559K900775m786252j4009801
36775D153921j4884540N36588J6176666P798308j9248338l2985708k0127614l626924
36767f2207641n306846j4638130r982289Q561946K5406543L3222091L2428027
36760G483701K0451037O75324r356514J032392J5649460J2707639k876045j0719628
36752C5047366j0065695j6852492k9799985k8917656r985049Q106982J6078624
$$ plain form
36805 -37451737 -51244665 -53198427 -44061490 -36142111 -43644534 -66551025 -88138925 -91221716
36797 -91221716 -73073011 -42110477 -6972992 23780319 36736400 20884159 -17599572
36790 -17599572 -55357275 -70224575 -57035920 -27377788 -400231 7743417 -4779831
36783 -4779831 -21900735 -24282547 -9363391 9126640 20049199 22949974 18163722 4153921
36775 4153921 -10730619 -10194031 5982635 13780943 -5467395 -38453103 -58580717 -62207641
36767 -62207641 -67514487 -82152617 -92134906 -83572960 -58166417 -24944326 7483701
36760 7483701 27934738 28610062 19253548 20285940 35935400 48643039 45766994 35047366
36752 35047366 24981671 8129179 -21670806 -50588462 -60573511 -52466529 -36387905
36745c6387905K5357612L7045008L0534109M35957k3254542j6019455L126010
36738B0836794K656737j1312639r811743O144460O703501j3536873k2648710k940929
36730b3909402J8592620J1699419j0785107j3848871P783001K5644507K0026157
36723C5202324K620789n278705P95366R446237R287368j280761j3317542j4501000
36715B2974076l143729O052771r34132j5773298j5889276K907541J6596057N495282
36707A8285292j5594725j6176646O296966K1174054P034917j8616373k4811830
36700b2408345r992889k17324p591644j2230377N755781L3582643M2092842K6035826
36692E5026513Q340168N314151P999394M438149R92505O794774J1297636j758152
$$ plain form
36745 -36387905 -11030293 26014715 56548824 56984781 33730239 17710784 20836794
36738 20836794 23493531 12180892 2369149 8513609 15217110 1680237 -20968473 -23909402
36730 -23909402 -5316782 6382637 -4402470 -18251341 -10468340 15176167 35202324
36723 35202324 37823113 32544408 33339774 42786011 52073379 50792618 37475076 22974076
36715 22974076 19830347 25883118 24948986 9175688 -6713588 -3806047 12790010 18285292
36707 18285292 2690567 -13486079 -7189113 13984941 21019858 2403485 -22408345
36700 -22408345 -32401234 -32618558 -40210202 -52440579 -46684798 -13102155 28990687 55026513
36692 55026513 63366681 68680832 76680226 81118375 82110880 88905654 100203290 98445138
$$ [...]
##END NTUPLES=NMR SPECTRUM
##END=
