##TITLE=31Pdec_DE-57_NaOH
 D2O, 64 sc
 25.6.2024
##JCAMPDX= 6.0         $$ Bruker NMR JCAMP-DX V2.0
##DATA TYPE= NMR SPECTRUM
##DATA CLASS= NTUPLES
##ORIGIN= UXNMR, Bruker Analytische Messtechnik GmbH
##OWNER= root
$$ XWIN-NMR		Version 3.5
$$ Tue Jun 25 16:36:28 2024 Russian Standard Time (UT+4h)  she@DPX200
##.OBSERVE FREQUENCY= 81.013821
##.OBSERVE NUCLEUS= ^31P
##.ACQUISITION MODE= SIMULTANEOUS
##.ACQUISITION SCHEME= undefined
##.AVERAGES= 64
##.DIGITISER RES= 17
##SPECTROMETER/DATA SYSTEM= spect
##.PULSE SEQUENCE= zgpg30
##.SOLVENT NAME= D2O
##.SHIFT REFERENCE= (INTERNAL, D2O, 0, 182.463)
##AUDIT TRAIL= $$ (NUMBER, WHEN, WHO, WHERE, WHAT)
$$ ##TITLE= Audit trail, XWIN-NMR		Version 3.5
$$ ##JCAMPDX= 5.01
$$ ##ORIGIN= Bruker BioSpin GmbH
$$ ##OWNER= she
$$ F:/spectra/data/she/nmr/P31/2/pdata/1/auditp.txt
$$ ##AUDIT TRAIL=  $$ (NUMBER, WHEN, WHO, WHERE, WHAT)
(   1,<2024-06-25 16:35:30.12 +0400>,<she>,<DPX200>,
      <continue with go, POWCHK disabled, PULCHK disabled
       configuration hash MD5:
       00 E9 B6 7A A2 85 ED C7 34 08 36 98 17 FE 4E 26
       data hash MD5: 32K
       98 79 20 92 AA 9A EE A2 91 57 0E BB C8 CB 66 81>)
(   2,<2024-06-25 16:35:31.71 +0400>,<she>,<DPX200>,
      <Start of raw data processing
       efp BC_mod = 2 LB = 1.5 FT_mod = 6 PKNL = 1 PHC0 = 2799.059 PHC1 = 59.28616 SI = 64K 
       data hash MD5: 64K
       DD 93 B9 D1 9C DF BA 89 70 A2 FF 32 8F 00 8B E9>)
(   3,<2024-06-25 16:35:43.92 +0400>,<she>,<DPX200>,
      <pk PHC0 = -86.16499 PHC1 = 234.8001 
       data hash MD5: 64K
       94 DB DA EF 6A C8 50 50 3D 65 22 F5 22 A1 AD D5>)
(   4,<2024-06-25 16:35:56.40 +0400>,<she>,<DPX200>,
      <pk PHC0 = -24.55834 PHC1 = 0 
       data hash MD5: 64K
       28 A7 1B 1F 28 C6 8F 96 20 F8 DB CA 57 60 50 33>)
$$ ##END=
$$ 
$$ hash MD5
$$ CC 54 A7 07 71 0A 28 85 6F EF 81 12 01 B8 80 63
##$RELAX= 
##$RELAX= 
##$RELAX= 
##$RELAX= 
##$RELAX= 
##$RELAX= 
##$RELAX= 
##$RELAX= 
$$ Bruker specific parameters
$$ --------------------------
##$DU= <F:/spectra>
##$EXPNO= 2
##$NAME= <P31>
##$PROCNO= 1
##$TYPE= <nmr>
##$USER= <she>
##$AMP= (0..31)
100 100 100 100 100 100 100 100 100 100 100 100 100 100 100 100 100 100 
100 100 100 100 100 100 100 100 100 100 100 100 100 100 
##$AQSEQ= 0
##$AQ_mod= 1
##$AUNM= <au_zg>
##$AUTOPOS= <>
##$BF1= 81.014009
##$BF2= 200.13
##$BF3= 200.13
##$BF4= 200.13
##$BF5= 200.13
##$BF6= 200.13
##$BF7= 200.13
##$BF8= 200.13
##$BYTORDA= 1
##$CFDGTYP= 0
##$CFRGTYP= 5
##$CHEMSTR= <none>
##$CNST= (0..31)
1 1 145 1 1 1 1 1 1 1 1 1 1 1 1 1 1 1 1 1 1 1 1 1 1 1 1 1 1 1 1 1 
##$CPDPRG= <waltz16>
##$CPDPRG1= <>
##$CPDPRG2= <waltz16>
##$CPDPRG3= <>
##$CPDPRG4= <mlev>
##$CPDPRG5= <mlev>
##$CPDPRG6= <mlev>
##$CPDPRG7= <mlev>
##$CPDPRG8= <mlev>
##$CPDPRGB= <>
##$CPDPRGT= <>
##$D= (0..31)
0 1 0 0 0 0 0 0 0 0 0 0.03 2e-05 3e-06 0 0 0 0 0 0 0 0 0 0 0 0 0 0 0 0 
0 0 
##$DATE= 1719318850
##$DBL= (0..7)
120 120 120 11 120 120 24 19 
##$DBP= (0..7)
150 150 150 150 150 150 150 150 
##$DBP07= 0
##$DBPNAM0= <>
$$ [...]
##$SUBNAM2= <"">
##$SUBNAM3= <"">
##$SUBNAM4= <"">
##$SUBNAM5= <"">
##$SUBNAM6= <"">
##$SUBNAM7= <"">
##$SUBNAM8= <"">
##$SUBNAM9= <"">
##$SW= 369.568048894756
##$SWIBOX= (0..15)
0 1 3 0 0 0 0 0 0 0 0 0 0 0 0 0 
##$SW_h= 29940.119760479
##$TD= 32768
##$TD0= 1
##$TE= 0
##$TE2= 300
##$TE3= 300
##$TEG= 300
##$TL= (0..7)
0 120 53 12 22 120 120 120 
##$TP= (0..7)
150 150 150 150 150 150 150 150 
##$TP07= 0
##$TPNAME0= <>
##$TPNAME1= <>
##$TPNAME2= <>
##$TPNAME3= <>
##$TPNAME4= <>
##$TPNAME5= <>
##$TPNAME6= <>
##$TPNAME7= <>
##$TPOAL= (0..7)
0.5 0.5 0.5 0.5 0.5 0.5 0.5 0.5 
##$TPOFFS= (0..7)
0 0 0 0 0 0 0 0 
##$TUNHIN= 0
##$TUNHOUT= 0
##$TUNXOUT= 0
##$USERA1= <user>
##$USERA2= <user>
##$USERA3= <user>
##$USERA4= <user>
##$USERA5= <user>
##$V9= 5
##$VALIST= <valist>
##$VCLIST= <CCCCCCCCCCCCCCC>
##$VD= 0
##$VDLIST= <DDDDDDDDDDDDDDD>
##$VPLIST= <PPPPPPPPPPPPPPP>
##$VTLIST= <TTTTTTTTTTTTTTT>
##$WBST= 1024
##$WBSW= 4
##$XGAIN= (0..3)
0 0 0 0 
##$XL= 0
##$YL= 0
##$YMAX_a= 3868
##$YMIN_a= -3390
##$ZGOPTNS= <>
##$ZL1= 120
##$ZL2= 120
##$ZL3= 120
##$ZL4= 120
##$ABSF1= 0
##$ABSF2= 0
##$ABSG= 0
##$ABSL= 0
##$ALPHA= 0
##$AQORDER= 0
##$ASSFAC= 0
##$ASSFACI= 0
##$ASSFACX= 0
##$ASSWID= 0
##$AUNMP= <proc_1d>
##$AZFE= 0.1
##$AZFW= 0.5
##$BCFW= 0
##$BC_mod= 2
##$BYTORDP= 0
##$COROFFS= 0
##$CY= -3
##$DATMOD= 1
##$DC= 0
##$DFILT= <>
##$DTYPP= 0
##$F1P= 0
##$F2P= 0
##$FCOR= 1
##$FTSIZE= 65536
##$FT_mod= 6
##$GAMMA= 0
##$GB= 0
##$INTBC= 1
##$INTSCL= 9.790993e-09
##$ISEN= 30
##$LB= 1.5
##$LEV0= 0
##$LPBIN= 0
##$MAXI= 10000
##$MC2= 0
##$MEAN= 0
##$ME_mod= 0
##$MI= 50
##$NCOEF= 0
##$NC_proc= -10
##$NLEV= 6
##$NOISF1= 182.463
##$NOISF2= 159.3651
##$NSP= 0
##$NTH_PI= 0
##$NZP= 0
##$OFFSET= 182.463
##$PC= 4
##$PHC0= 2688.336
##$PHC1= 294.0862
##$PH_mod= 1
##$PKNL= yes
##$PPARMOD= 0
##$PSCAL= 0
##$PSIGN= 0
##$REVERSE= no
##$SF= 81.0140089999434
##$SI= 65536
##$SIGF1= 159.3651
##$SIGF2= -187.1042
##$SINO= 113.3802
##$SIOLD= 16384
##$SREGLST= <1H.CDCl3>
##$SSB= 0
##$STSI= 65536
##$STSR= 0
##$SW_p= 29940.119760479
##$SYMM= 0
##$S_DEV= 0
##$TDeff= 32768
##$TDoff= 0
##$TI= <>
##$TILT= no
##$TM1= 0
##$TM2= 0
##$TOPLEV= 0
##$USERP1= <user>
##$USERP2= <user>
##$USERP3= <user>
##$USERP4= <user>
##$USERP5= <user>
##$WDW= 1
##$XDIM= 65536
##$YMAX_p= 400416859
##$YMIN_p= -90797196
$$ End of Bruker specific parameters
$$ ---------------------------------
##NTUPLES= NMR SPECTRUM
##VAR_NAME=  FREQUENCY,     SPECTRUM/REAL,   SPECTRUM/IMAG
##SYMBOL=    X,             R,               I
##VAR_TYPE=  INDEPENDENT,   DEPENDENT,       DEPENDENT
##VAR_FORM=  AFFN,          ASDF,            ASDF
##VAR_DIM=   65536,         65536,           65536
##UNITS=     HZ,            ARBITRARY UNITS, ARBITRARY UNITS
##FACTOR=    0.456856943014862, 1,           1
##FIRST=     14782.0589164792, 0,            0
##LAST=      -15158.0608439998, 0,           0
##MIN=       -15158.0608439998, -90797196,   0
##MAX=       14782.0589164792, 400416859,    0
$$ Real data points
##PAGE= N=1
##DATA TABLE= (X++(R..R)), XYDATA
$$ [...]
4125a9963932m00738k020433P433429J8568499J6476019K650769n686822J24273
4117A7181064P470999J273317j2441876j4022410O35390J2467402N838863r479441
4109H923308j3231434l004524N989183N376773K646604M769108P314647N180621
4101B3964286K358360L579612N224161K459389j754360k862791l819531r252535
4093A9896591j5024486j2773316k658526O543399R100757P237705N031795L591823
4085B0945742K323423Q4866m606926j0414017j1532769m027483P046295J1723918
4077A1543049O306049l368499r347312q620693l444362J547159K543407k57881
4069c099083k779851k038290M14318J593661J160465K92591p08362j475264j346662
$$ plain form
4125 -19963932 -20364670 -22385103 -14951674 3616825 20092844 22743613 17056791 17181064
4117 17181064 24652063 25925380 13483504 -538906 96484 12563886 18402749 8923308
4109 8923308 -4308126 -7312650 -1323467 4053306 6699910 11469018 18783665 23964286
4101 23964286 26322646 29902258 35126419 37585808 35831448 32968657 29149126 19896591
4093 19896591 4872105 -7901211 -10559737 -4016338 5084419 12322124 17353919 20945742
4085 20945742 23269165 23354031 18747105 8333088 -3199681 -7227164 -180869 11543049
4077 11543049 17849098 14480599 5133287 -3487406 -6931768 -5384609 -2841202 -3099083
4069 -3099083 -5878934 -7917224 -7502906 -5909245 -4748780 -4456189 -5164551 -6639815 -7986477
4060g986477j757213m461307n870288O2653J0334421J3105225N221243k75994
4052H372263O457131J4639945Q318972p789157j4529671p282598q41270m426180
4044B919435r556593p466713k176822J239720O642423J5368969J7648679P205075
4036C1824173n695549q331177m659967p054038j4750819j5139407m698263N000760
4028b3504287M095871l177857o254609j325739O489673R815625O090185J38133
4020g633005j021918K708974M552788K529003L915454J1624197J4206562J228009
4012C2110064j6442046j6918149J947190J7311481J1496553o027627j4664382
4005H813084r608376k085836j16087j142658j167745n30776q1255M82228o44826
$$ plain form
4060 -7986477 -9743690 -14204997 -20075285 -20012632 -9678211 3427014 8648257 8372263
4052 8372263 14829394 29469339 37788311 29999154 15469483 8186885 7345615 2919435
4044 2919435 -6637158 -14103871 -16280693 -15040973 -8398550 6970419 24619098 31824173
4036 31824173 26128624 17797447 13137480 6083442 -8667377 -23806784 -28505047 -23504287
4028 -23504287 -19408416 -22586273 -28840882 -30166621 -23676948 -13861323 -7771138 -7633005
4020 -7633005 -8654923 -5945949 -1393161 1135842 5051296 16675493 30882055 32110064
4012 32110064 15668018 -1250131 697059 18008540 29505093 23477466 8813084
4005 8813084 -795292 -2881128 -2997215 -4139873 -5307618 -5838394 -5919649 -5437421 -6082247
3996f082247n748037j1293489r413687J370015J1477294J0200748j793812j2804774
3988b4087989j1882458J443752J7731383K5725646K0879628Q482062j182602k323232
3980C4786190J329471K147841j338845l274979n38761N70052p138690j8905925
3972G636354k1433440j0625652J851323M499711J529836M451237J2882758J4650219
3964A5442346M589695p626393j1336510o948503M39661R991622K0057797K2000378
3956D6610093R720583q581042j8549747j7514603j3987053j1088910l355742Q177840
3948h568581J1921882L768208l231064J908124R238241K918682j1309550j2196483
3940e550541L421827J2776293O94009j6185392j3279825N460170J3897761K310317
$$ plain form
3996 -6082247 -11830284 -23123773 -32537460 -31167445 -19690151 -9489403 -11283215 -24087989
3988 -24087989 -35970447 -34526695 -16795312 8930334 29809962 38292024 37109422 34786190
3980 34786190 36115661 38263502 36924657 33649678 33110917 33680969 26542279 7636354
3972 7636354 -13797086 -24422738 -22571415 -18071704 -16541868 -12090631 792127 15442346
3964 15442346 20032041 12405648 1069138 -5879365 -5439704 4551918 24609715 46610093
3956 46610093 56330676 47749634 29199887 11685284 -2301769 -13390679 -16746421 -8568581
3948 -8568581 3353301 7121509 3890445 5798569 15036810 17955492 6645942 -5550541
3940 -5550541 -2128714 10647579 11341588 -4843804 -18123629 -12663459 1234302 3544619
3932C544619j0558800p603615K862615M171945j219068K692372J7653713K5493266
3924C7037047J3026708r638962k2356909j8891664r630929m232329p35188O372476
3916i049750J4126005J3197122J073666j2035733j3366793j713021J1812616J6568167
3908B0612279J2314358N623631P40181k383015l663910j873397J576009K294986
3900C5241122j377610n120096l974524L03209L74817p490624j7443666j9227919
3892a8715291r091503O082759J6007388J6618421J1164383L838730l972428j1089833
3884A0842626j4268221j0981102k765052N756684R990500P511275n966o485690
3876d04946o855440l649323l363561n068978k84732J1619098J7129568O978897
$$ plain form
3932 3544619 -7014181 -14617796 -11755181 -7583236 -8802304 -6109932 11543781 37037047
3924 37037047 50063755 40424793 18067884 -823780 -10454709 -14687038 -15422226 -9049750
3916 -9049750 5076255 18273377 19347043 7311310 -6055483 -7768504 4044112 20612279
3908 20612279 32926637 38550268 39290449 36907434 33243524 31370127 32946136 35241122
3900 35241122 33863512 28743416 24768892 25072101 25446918 17956294 512628 -18715291
3892 -18715291 -27806794 -21724035 -5716647 10901774 22066157 25904887 21932459 10842626
3884 10842626 -3425595 -14406697 -17171749 -11415065 -1424565 6086710 6080744 -404946
3876 -404946 -7260386 -10909709 -14273270 -19342248 -19626980 -8007882 9121686 16100583
3868A6100583o724342n360899P965299J1403999l206401j8004015j5811235l467777
3860a7104788K705372J758323L427938P454619M940590l126926n547400M00072
3852e092200M863102K426808n73712M14258O45517k312849k348017K158147J388068
3843A569122r470244j7761784j0511685M221607Q255769L32571m289339M37169
3835b7216814L636766j419034n217945J159493J0332514J0164728J742695m958989
3827a1776586o709947p366088p067144k270659N196026R167308R037786R914070
3819a875234J2583350J1669597N017287k683098p266654r018115p774223j960062
3811a307152M876753M817780k628520p036438j418534O504321N007823m560417
$$ plain form
3868 16100583 9376241 4015342 11980641 23384640 20178239 2174224 -13637011 -17104788
3860 -17104788 -14399416 -12641093 -9213155 -1758536 3182054 55128 -5492272 -5092200
3852 -5092200 -229098 2197710 1623998 2038256 2683773 370924 -1977093 181054 1569122
3843 1569122 -7901122 -25662906 -36174591 -31952984 -23697215 -23364644 -27653983 -27216814
3835 -27216814 -23580048 -24999082 -30217027 -29057534 -18725020 -8560292 -6817597 -11776586
3827 -11776586 -18486533 -25852621 -32919765 -35190424 -29994398 -20827090 -11789304 -1875234
3819 -1875234 10708116 22377713 27395000 24711902 17445248 8427133 652910 -1307152
3811 -1307152 3569601 8387381 5758861 -1277577 -2696111 3808210 8816033 4255616
3803D255616j0226514o480884j02804J047825k627677n732609m317914K617370
3795b1567591J2652026J9016569J5210878L360850n929089m942126K747166P263125
3787B7811808K807748q742829k0756686k5401982j8071319k830972Q728842Q840887
3779b7614503K609944R93181N643778P107100k75891q360231n371191P900103
3771a7367710J8772788J8287582R396525p70627r081348j3518762r776076J968163
3763b089465J1505360Q668417k698139r439601p197625m067688m805636k764856
3755a2889233O744027J5287366J2821090L322974j651850n21396j569799p582651
3747A3960528j2245557j2088431j0663718q490326L6302J4449746K2359255J3735995
$$ plain form
3803 4255616 -5970898 -12451782 -12554586 -11506761 -14134438 -19867047 -24184961 -21567591
3795 -21567591 -8915565 10101004 25311882 28672732 22743643 17801517 20548683 27811808
3787 27811808 30619556 21876727 1120041 -24281941 -42353260 -45184232 -36455390 -27614503
3779 -27614503 -25004559 -24011378 -18367600 -11260500 -11536391 -19896622 -25267813 -17367710
3771 -17367710 1405078 19692660 29089185 28318558 19237210 5718448 -4057628 -2089465
3763 -2089465 9415895 18084312 15386173 5946572 -1251053 -5318741 -10124377 -12889233
3755 -12889233 -6145206 9142160 21963250 25286224 23634374 23112978 21543179 13960528
3747 13960528 1714971 -10373460 -21037178 -29527504 -29491202 -15041456 7317799 21053794
3739B1053794m413475j5240545j1258300m30967N225056J934962m652381o861061
3731a4642917k723350K633713L306506n32792l896123l658180n50296M067787
3723a5995652Q498752Q829931L094667k877029j078889O511852R591742M842625
3715B1417999K1336l00209k015988q466847j1422452m747761K457427j233205
3707d289700j0290562r720152J816278J0545396Q587828K926100J501608K466043
3699C542839J302038j081727k135970k324694k084589P703L391914N329159N856416
3690A1803089O840777N802967j316410j0218307j0566605j212073O390925M409141
3682A1933504r83288j234228J566929J082465j410738q02504J452822J87656l344280
$$ plain form
3739 21053794 16640319 1399774 -9858526 -10289493 -5064437 -3129475 -7781856 -14642917
3731 -14642917 -17366267 -14732554 -11426048 -11958840 -15854963 -19513143 -20063439 -15995652
3723 -15995652 -7496900 1333031 4427698 1550669 471780 6983632 16575374 21417999
3715 21417999 21439335 21139126 19123138 10656291 -766161 -5513922 -3056495 -4289700
3707 -4289700 -14580262 -24300414 -22484136 -11938740 -3350912 -424812 1076796 3542839
3699 3542839 4844877 3763150 1627180 -697514 -2782103 -2774400 617514 5946673 11803089
3690 11803089 18643866 24446833 23130423 12912116 2345511 1133438 7524363 11933504
3682 11933504 10950216 9715988 11282917 12365382 10954644 10152140 11604962 11792618 8448338
3673H448338k995707K086820O303414N927576K581970o45750j493057J206486
3665B1420090M464803J149674j0743771k1555127k0100756q490575J344407M841967
3657b7669288Q879698J7266952K2224434J5663566J898484p551902p889651l564446
3649A9257847R31910O329712J3596509J8357650J4237362J665029r710551j0467667
3641E4197801k764527J777043l115446j0543271j1152472o575230n141173p313160
3633I369565m775088N470370J5154250J5980368R315926Q45076p254660j3662594
3625C0443213j4204191p816134j261349m16935r74368L834468R823182O843159
3617B6271045l671719q066568l65104Q354317O711190m57210j540911K947296
$$ plain form
3673 8448338 5452631 7539451 13842865 19770441 22352411 21706661 20213604 21420090
3665 21420090 25884893 27034567 16290796 -5264331 -25365087 -33855662 -32511255 -27669288
3657 -27669288 -18789590 -1522638 20701796 36365362 38263846 30711944 22822293 19257847
3649 19257847 20189757 26519469 40115978 58473628 72710990 74376019 64665468 54197801
3641 54197801 51433274 53210317 50094871 39551600 28399128 21823898 16682725 9369565
3633 9369565 4594477 10064847 25219097 41199465 50515391 51360467 44105807 30443213
3625 30443213 16239022 8422888 7161539 6744604 5770236 9604704 19427886 26271045
3617 26271045 22599326 14532758 14167654 22521971 29233161 28775951 27235040 30182336
3609C0182336K701099m185976p851160k658204M731310P313502P786650R969952
3601D7989509Q482989l238843j9018292k4627924j6122075m523768n45341k372691
3593a3976436j995060K609607O494154N332049k70606o047288p002903j515927
3585a6372410N212517N045455k704537q209565k802242Q930034J4113330P513722
3577A0726304l126697q094520o617294m432607m489979l988796K12448O039819
3569a3771322P338348P81615q882799j2441638o197912L847180R848688J1237630
3561h240210J1993947J1751281O756671n92602j902289M019645O198057l495786
3553B6488714j6489555j7843635p016401K350381K949249K379595P652033J2420043
$$ plain form
3609 30182336 32883435 28697459 20846299 18188095 22919405 30232907 38019557 47989509
3601 47989509 56472498 53233655 34215363 9587439 -6534636 -11058404 -11603745 -13976436
3593 -13976436 -15971496 -13361889 -6867735 -1535686 -1806292 -7853580 -14856483 -16372410
3585 -16372410 -11159893 -6114438 -8818975 -17028540 -19830782 -10900748 3212582 10726304
3577 10726304 7599607 -494913 -7112207 -11544814 -16034793 -20023589 -19811141 -13771322
3569 -13771322 -6432974 -5651359 -14534158 -26975796 -33173708 -29326528 -19477840 -8240210
3561 -8240210 3753737 15505018 22261689 21669087 19766798 23786443 29984500 26488714
3553 26488714 9999159 -7844476 -14860877 -12510496 -9561247 -7181652 470381 12890424
3545A2890424P803076k080975n750964j142416L693704M462400M437233M494376
3537B8806858L42562p706834j2043268q803344l003808J138096N383778Q056337
3529A2170377J036144j4789149k2065171q437554J2237824J6000544J866582q434223
3521a0414626l084902N829359N044421o65838r00596K720602K674102o41209k491071
3512a929758l719688o247995m972097M561671J4928903J4631801M602843l582934
3504A8272746m490888l615214n472215o665236l034999L497975P844295O954200
3496A3290664J180227n669431p820393k935499M438243P785221N332381l84947
3488A5216466n665883n367355M144222J6416137J6840767J476644j3559522j2548042
$$ plain form
3545 12890424 20693500 18612525 12861561 11719145 15412849 19875249 24312482 28806858
3537 28806858 29149420 21442586 9399318 595974 -2407834 -1269738 4114040 12170377
3529 12170377 13206521 -1582628 -23647799 -32085353 -19847529 -3846985 -1980403 -10414626
3521 -10414626 -13499528 -7670169 -2625748 -3291586 -4192182 -1471580 1202522 561313 -1929758
3512 -1929758 -5649446 -11897441 -16869538 -12307867 2621036 17252837 21855680 18272746
3504 18272746 13781858 10166644 4694429 -1970807 -5005806 -1507831 6336464 13290664
3496 13290664 14470891 8801460 981067 -1954432 2483811 10269032 15601413 15216466
3488 15216466 9550583 4183228 8327450 24743587 41584354 43060998 29501476 16953434
3480A6953434k754129j855859q472872m759647J1726136K0205747P884960r755537
3472B9172233j2094805k668874l63163r982915j7040721r288886Q485904K1489078
3464G707851J9485753M884897q941304r449439J345092Q634521L534642o050555
3456B1151458q289846m001041k261232m932435n556355j449213K447890K105909
3448g84865k02262l3754M191294J0188471J2716760P405807l004314r278155o438119
3439A4760863k14567J729797M54278J524911M353184L310137k933519j0094027
3431A2891057j4224157j2913062m020130R294012J5874212Q399411m111605n838723
3423E351015M327467J1471312O024713m337891p673047l052701K322900L764084
$$ plain form
3480 16953434 14199305 12343446 3870574 -889073 10837063 31042810 38927770 29172233
3472 29172233 17077428 14408554 14045391 4062476 -12978245 -22267131 -13781227 7707851
3464 7707851 27193604 32078501 23137197 13687758 15032850 23667371 27202013 21151458
3456 21151458 12861612 8860571 6599339 1666904 -3889451 -5338664 -2890774 -784865
3448 -784865 -987127 -1020881 3170413 13358884 26075644 33481451 30477137 21198982 14760863
3439 14760863 14546296 16276093 16730371 18255282 22608466 25918603 22985084 12891057
3431 12891057 -1333100 -14246162 -18266292 -8972280 6901932 15301343 11189738 5351015
3423 5351015 9678482 21149794 27174507 22836616 15163569 12110868 14433768 18197852
3415A8197852J164733l974088q384855q166188m266400k808192o288346q762517
3407b3288001l946376N631043J1922637J0939105N105552j273714m725992k753810
3399b389556M163431J0769098J0524602K047443r004414j5101075j4005750j0610013
3391b3606234j0631739j2727243r951330l44476Q459619Q999090L992619J023841
3383c4785853J405378J825546L345088Q756580J3008214Q206324j377592k372593
3375a988908O452584R788819p84721j2397636j0354929o29954P63833o992548
3367a6143460j0309273l485818M944079P958286Q484076J0046466J0763572R748279
3359B2006207R145321O581713l931906j8987115k4108164j2346407L771301P550806
$$ plain form
3415 18197852 19362585 15388497 7003642 -1162546 -5428946 -8237138 -14525484 -23288001
3407 -23288001 -27234377 -21603334 -9680697 1258408 6363960 5090246 364254 -2389556
3399 -2389556 1773875 12542973 23067575 25115018 16110604 1009529 -12996221 -23606234
3391 -23606234 -34237973 -46965216 -56916546 -57261022 -48801403 -39802313 -35809694 -34785853
3383 -34785853 -33380475 -31554929 -28209841 -19453261 -6445047 1761277 383685 -1988908
3375 -1988908 4463676 14252495 13467774 1070138 -9284791 -9914745 -9150912 -16143460
3367 -16143460 -26452733 -29938551 -24994472 -17036186 -8552110 1494356 12257928 22006207
3359 22006207 31151528 37733241 33801335 14814220 -9293944 -21640351 -17869050 -10318244
3351a0318244m80918n682971k58576Q321468R386278J648545p956505j2652426
3343a7993349j0790859n340163j47922L629661O449411O082090q13782j0160984
3335b9085897r794713N566867K2958476K4457031J0407988j493060j397156R65554
3327B2585090m792215j1749631q116329J275686J497047p509345r296091K620926
3319a3484862J2218651L817468j4028929j9971310q978086L309431L851394k872481
3311c6138724o094158m327533l179433m155433l546531k66156K066869J581993
3303e4059106J675909N515184R826034P871834j188672q891818n894538O942221
3295c8202952J8492336J8904773R040595k297708p687600n611242J473398R374549
$$ plain form
3351 -10318244 -10799162 -16482133 -16740709 -8419241 967037 2615582 -5340923 -17993349
3343 -17993349 -28784208 -34124371 -34272293 -30642632 -24193221 -18111131 -18924913 -29085897
3335 -29085897 -38880610 -33313743 -10355267 14101764 24509752 23016692 21619536 22585090
3327 22585090 17792875 6043244 -2073085 -797399 699648 -6809697 -16105788 -13484862
3319 -13484862 -1266211 2551257 -11477672 -31448982 -40427068 -37117637 -33266243 -36138724
3311 -36138724 -42232882 -46560415 -49739848 -53895281 -57441812 -57707968 -55641099 -54059106
3303 -54059106 -52383197 -46868013 -37041979 -29170145 -30358817 -39250635 -45145173 -38202952
3295 -38202952 -19710616 -805843 8234752 5937044 -1750556 -7361798 -5888400 3486149
3287C486149J2843735Q132622k800274j1983063j1682619k159269P323353P274649
3279A0435283j072322o063335J19526J0241190J0913199J307229n632286k447925
3271A7800559K229425j796448j0104313j1435935n490153j773976l820431n893735
3263b0285007m600419k907212j819368J725476O874143Q359723O163978O088642
3255d00044Q102477M667002m926995r430612k021181P536957O341683k845777
3247G023510o308132J039285J0312039J1651752M985926k421073m360977j561461
3239B0360869j139410p951529j5813593j3074277Q90613J2657082J2873895Q532812
3231A7336462R492222J1573165M602154q762832j5751221j2509500p208257m563945
$$ plain form
3287 3486149 16329884 24462506 21662232 9679169 -2003450 -4162719 3160634 10435283
3279 10435283 9362961 3299626 3419152 13660342 24573541 25880770 20248484 17800559
3271 17800559 20029984 18233536 8129223 -3306712 -8796865 -10570841 -14391272 -20285007
3263 -20285007 -24885426 -27792638 -29612006 -27886530 -21012387 -12652664 -6488686 -400044
3255 -400044 7702433 12369435 7442440 -1988172 -4009353 3527604 9869287 7023510
3247 7023510 715378 1754663 12066702 23718454 28704380 26283307 21922330 20360869
3239 20360869 19221459 11269930 -4543663 -17617940 -16727327 -4070245 8803650 17336462
3231 17336462 26828684 38401849 43004003 34241171 18489950 5980450 -1227807 -5791752
3223e791752n80419N198141N253625k642944q315536k732105Q467361J2245428
3215A1101799M557218o441036j0661067n232389M318886R258916O300844J953869
3207A5157040M255024J0052729P610635n586714j5934314j0916521L178483R228297
3199A7044659J500940q942377j0178814k407543O230350R504968N896531k483982
3191A6164732r681612r004317j038336M488000j68599r985343j3254493p242807
3183b9722775p41156j84375j409005N94083J561750m420796j2354592j1492959
3175e8169825j278633Q024939J0742595J1337783J2725308J0436647L354022n71492
3167c398656K967960N399102j679490j1465872j0833425O49720J1368534J3885094
$$ plain form
3223 -5791752 -6372171 -1174030 4079595 1436651 -6878885 -9610990 -1143629 11101799
3215 11101799 15659017 9217981 -1443086 -6675475 -2356589 6902327 13203171 15157040
3207 15157040 19412064 29464793 37075428 31488714 15554400 4637879 7816362 17044659
3199 17044659 18545599 9603222 -575592 -2983135 3247215 12752183 18648714 16164732
3191 16164732 6483120 -2521197 -3559533 928467 759868 -9225475 -22479968 -29722775
3183 -29722775 -30463931 -30648306 -32057311 -31463228 -29901478 -34322274 -46676866 -58169825
3175 -58169825 -59448458 -51423519 -40680924 -29343141 -16617833 -6181186 -2827164 -3398656
3167 -3398656 -430696 4968406 3288916 -8176956 -19010381 -18360661 -6992127 6892967
3159F892967J0085648L226185l885968m805290M213408J3784455R398503q302401
3151C0607507k2344169k0994252r790876Q27667Q228989J2724378J1166775L487793
3143A3913812k458250q94060K827985O23801n741383p823459k859369L593884
3135A182961N276152O59678p067190j1837944r168359j515222M112593N501839
3127a2855492O832846Q981729O083900l392390j0180450o610687P24173l2840
3119a0449211q383159j2745999p653011K3292K776742K010444L084094O682687
3111b4654121Q635384N590951j199522o748720p092914l983628k795328m277153
3103c6525051k219222O839086J5299741J2271711j417157j2396506j0402407j04545
$$ plain form
3159 6892967 16978615 20204800 16318832 11513542 15726950 29511405 38909908 30607507
3151 30607507 8263338 -12730914 -22521790 -21694123 -13465134 -740756 10426019 13913812
3143 13913812 11455562 10561502 13389487 14013288 8271905 448446 -2410923 1182961
3135 1182961 6459113 7118791 51601 -11786343 -20954702 -22469924 -18357331 -12855492
3127 -12855492 -6022646 2959083 9042983 5650593 -4529857 -11140544 -10416371 -10449211
3119 -10449211 -18832370 -31578369 -39231380 -39208088 -36431346 -34420902 -31336808 -24654121
3111 -24654121 -16018737 -10427786 -11627308 -18376028 -25468942 -29452570 -32247898 -36525051
3103 -36525051 -38744273 -31905187 -16605446 -4333735 -5750892 -18147398 -28549805 -28654350
3095b8654350N292188k69164r317590j0241315j213250P802219P814615K045593
3087b6741054K80570M809248Q916804Q511061O658541N216379J413991l812549
3079E252991m095141K20701j313571j2170782j8605331q200093R659408J6141566
3071a3110252J0117430O796794J1757865J3966545O773364r95801j188216N33090
3063C4650819l697622j0177462j1009102o995875l589282j90708O796584J4169426
3055A9956778J4246680N327215o892555j6371582j9252962j2357558L030863J6825198
3047D512077J7549877N846681n179447n208551K306768O696205L376352l115804
3039B6784158o905554p017769n565099l464238m86390K157478K599514J669583
$$ plain form
3095 -28654350 -23362162 -23631326 -32948916 -43190231 -44403481 -36601262 -28786647 -26741054
3087 -26741054 -26460484 -21651236 -12734432 -4223371 2435170 7651549 9065540 5252991
3079 5252991 1157850 1378551 64980 -12105802 -30711133 -38911226 -29251818 -13110252
3071 -13110252 -2992822 3803972 15561837 29528382 36301746 35305945 34117729 34650819
3063 34650819 30953197 20775735 9766633 2770758 -818524 -1009232 5787352 19956778
3055 19956778 34203458 39530673 32638118 16266536 -2986426 -15343984 -12313121 4512077
3047 4512077 22061954 27908635 22729188 17520637 19827405 26523610 29899962 26784158
3039 26784158 19878604 12860835 7295736 3831498 3345108 5502586 8102100 9771683
3031I771683K016257K786850o95514q907108j3972703r237206l72219P21302o955387
3022b4844045j0990717l253322P962156R818204L203300N79293P723564J6276827
3014F475260J5791374O376701l580031p232833l333962N301404J2729549J2011437
3006D4538899J957829q861984j0016141j640773O045798O787746N549016P967791
2998E2328181R024230J24762j5566995k4144408j8027255m239824O104798R020350
2990A4623839N620986k845183j2300848j4772151p341607J703276K287534m783769
2982a7807923j0510905r950481n173873J508114R710756J6743187J7775498J1467192
2974A3761565J880911m825317l571066N992731J5214052J1493813n597681j8919474
$$ plain form
3031 9771683 11787940 14574790 13879276 4972168 -9000535 -18237741 -18609960 -17888658 -24844045
3022 -24844045 -35834762 -39088084 -31125928 -21307724 -18104424 -17525131 -9801567 6475260
3014 6475260 22266634 28643335 25063304 17830471 14496509 19797913 32527462 44538899
3006 44538899 46496728 37634744 27618603 25977830 32023628 38811374 44360390 52328181
2998 52328181 61352411 61477173 45910178 21765770 3738515 -501309 5603489 14623839
2990 14623839 20244825 17399642 5098794 -9673357 -17014964 -15311688 -13024154 -17807923
2982 -17807923 -28318828 -38269309 -43443182 -41935068 -32224312 -15481125 2294373 13761565
2974 13761565 15642476 10817159 7246093 13238824 28452876 39946689 34349008 15429534
2966A5429534j3993255K69769L620650n660089q882964L048201J4586029Q813282
2958A7231157p742856j5725494r666883q02089K343960K616916L250675L44207
2950h150407q474732j5267568r081386R259228K4927582K3794848P497319q576350
2942A5928534j1841802m019881M499349P402500O157741M423176L871012M297970
2934C0718599L713444n16812p313373j1177652r553468p005011p142885n722364
2926a3999522Q16396N787576J924126m147128p34266Q096114O561010o922952
2918b618646j4788190o219444P945579J3820734J3119780J3140088J1446440L297133
2910C9143474n589781o860586l195175k469036m306903l398712n46441K51380
$$ plain form
2966 15429534 1436279 1706048 5326698 -333391 -9216355 -6168154 8417875 17231157
2958 17231157 9488301 -6237193 -15904076 -16706165 -14362205 -11745289 -8494614 -8150407
2950 -8150407 -16625139 -31892707 -40974093 -31714865 -6787283 17007565 24504884 15928534
2942 15928534 4086732 66851 4566200 11968700 18126441 22549617 26420629 30718599
2934 30718599 34432043 33915231 26601858 15424206 5870738 -1134273 -8277158 -13999522
2926 -13999522 -13183126 -7395550 -5471424 -9618552 -10352818 -2256704 4304306 -2618646
2918 -2618646 -17406836 -23626280 -15680701 -1859967 11259813 24399901 35846341 39143474
2910 39143474 33553693 26693107 23497932 21028896 16721993 13323281 12776840 13028220
2902A3028220L66304J900896K70116p689810j4047019j0301104k510180k736145
2894b1718722r060733q055639M267597J7159394K0771220J5417271N285107n799648
2886A8265847j2112627j0354828o502176q206339j1372850n926632N884765J0592166
2878a9732674M317101j397851J869162Q222964R909071Q593344P462973L117127
2870B2361217o244247j2920215q617108L962100J4583783J5927363O861237q248762
2862B7665368j9519957j8117731p688943k200038p514767j2899099o887340O324445
2854d0838062J4118786J2321773O061153p43835p017081r189411m298480K576999
2846b7008158K843684l178904n851226M77203J0094083J3843630R314900P77102
$$ plain form
2902 13028220 13394524 15295420 15565536 7875726 -6171293 -16472397 -18982577 -21718722
2894 -21718722 -30779455 -38835094 -34567497 -17408103 3363117 18780388 24065495 18265847
2886 18265847 6153220 -4201608 -10703784 -18910123 -30282973 -36209605 -30324840 -19732674
2878 -19732674 -15415573 -16813424 -14944262 -6721298 3187773 11781117 19244090 22361217
2870 22361217 16116970 3196755 -5420353 -1458253 13125530 29052893 35914130 27665368
2862 27665368 8145411 -9972320 -17661263 -19861301 -27376068 -40275167 -47162507 -40838062
2854 -40838062 -26719276 -14397503 -8336350 -9080185 -16097266 -25286677 -29585157 -27008158
2846 -27008158 -24164474 -27343378 -33194604 -32717401 -22623318 -8779688 535212 1312314
2838A312314o820281j0541867q823706k161005N351441P946657L710122k584601
2830a2610926m499920j997622j461152o263977j1121271r316100k181083L628258
2822d5823793N766960P089342Q675437Q915544Q824649J0702421J1251043M360230
2814A9761833p458198j3046972p770886p98880j841906p283786o452500K528241
2806b2363054J0286069Q198880k371751j2652286j5141206r758504k599451J616638
2798d4784665M499051R014312J2230862Q895002J244861k093725J959643P169805
2790a864854P823329N267358K648323O86915J297312P304753J4906155J4632097
2782E2701388M450655o104328r884003j1393687j5560078j6553296p687036M392116
$$ plain form
2838 1312314 -5507967 -16049834 -24873540 -27034545 -21683104 -13736447 -10026325 -12610926
2830 -12610926 -17110846 -19108468 -20569620 -26833597 -37954868 -47270968 -49452051 -45823793
2822 -45823793 -40056833 -32967491 -24292054 -15376510 -6551861 4150560 15401603 19761833
2814 19761833 12303635 -743337 -8514223 -9313103 -11155009 -18438795 -24891295 -22363054
2806 -22363054 -12076985 -3878105 -6249856 -18902142 -34043348 -43801852 -46401303 -44784665
2798 -44784665 -40285614 -31271302 -19040440 -10145438 -8900577 -10994302 -9034659 -1864854
2790 -1864854 5958475 11225833 13874156 14561071 15858383 23163136 38069291 52701388
2782 52701388 57152043 51047715 41163712 29770025 14209947 -2343349 -10030385 -5638269
2774e638269O888977j035336p804083o061501r39597j116933q000358j4847885
2766c8554985j3400012k254342R689892J1711410M846959Q19634M706667P709604
2758a4725173L194065k78251P363564J8961039J8734516N468419o838321r992094
2750B1887764r340091r342742n116725O447948J7456039J7852540P798700l840284
2742D3803149r479346p944111k995374M66736N24481n60949n21722p58122l096359
2733A9438383n407244m564780j389491J799264N587711J0036244J0218656K386891
2725C8105634p484202r098007j294057O838268Q164612M352245L90629j656003
2717C8319119k539224l692320n217424l722813M565336J5391296J7098259N449360
$$ plain form
2774 -5638269 1250708 215372 -7588711 -13650212 -14589809 -15706742 -23707100 -38554985
2766 -38554985 -51954997 -54209339 -44519447 -32808037 -27961078 -27141444 -22434777 -14725173
2758 -14725173 -11531108 -11809359 -4445795 14515244 33249760 38718179 31879858 21887764
2750 21887764 12547673 3204931 -1911794 4536154 21992193 39844733 47643433 43803149
2742 43803149 34323803 26379692 23384318 23851054 24375535 23814586 23292864 22534742 19438383
2733 19438383 14031139 9466359 8076868 9876132 15463843 25500087 35718743 38105634
2725 38105634 30621432 21523425 20229368 27067636 35232248 39584493 39975122 38319119
2717 38319119 35779895 32087575 26870151 23147338 27712674 43103970 60202229 65651589
2709F5651589q710999j4156794j4030140j5695993j4535384l282808Q491145L721443
2701G452059j3914391k1003798p781434P949030P935240j748859l766444N120425
2693a9758172J3621361J2889023L987041o152726r446443k888991N509062M184329
2685A944484n316531q946231j484509N049748J259149m349684m88556P834908
2677d497222Q294144P40932n661097q145770r711360q223769l56375P132273M632406
2668a5795838l087474j239030J2186789K1325587J3879233l354515j5290990j6058284
2660g434522j0159481l109208K427268M542192J869539m398599j0169188j0337140
2652c6769139k220854J0600890J8824936J5376324L636632m845417k424726N873818
$$ plain form
2709 65651589 56940590 42783796 28753656 13057663 -1477721 -4760529 3730616 7452059
2701 7452059 -6462332 -27466130 -35247564 -27298534 -19363294 -21112153 -24878597 -19758172
2693 -19758172 -6136811 6752212 10739253 4586527 -4859916 -7748907 -2239845 1944484
2685 1944484 -3372047 -12318278 -13802787 -8753039 -7493890 -11843574 -12332130 -4497222
2677 -4497222 3796922 4537854 -1123243 -9269013 -18980373 -27204142 -27560517 -20428244 -15795838
2668 -15795838 -18883312 -20122342 -7935553 13390034 27269267 23914752 8623762 -7434522
2660 -7434522 -17594003 -20703211 -18275943 -13733751 -11864212 -16262811 -26431999 -36769139
2652 -36769139 -38989993 -28389103 -9564167 5812157 9448789 4603372 2178646 8052464
2644H052464P410699l166972j5399707j3577621K818747J5620344J0559298l287203
2636I030049p003606K89546K271143o611705j2098444m354807O113419O696279
2628e668126J824641J443685L234903N12056l018864j508287m30772n828728q891993
2619a8331485J012894J5263205J7222054Q940542N840562Q533094L076323j0683164
2611C0874025j5247128m852631L741950j800022j1451065j1894859n986107j983911
2603a8599748J001476M947273M388833j823514l267335M854895R806495P40662
2595B049037j1375550r238800M320483J2052000Q108783J582764j530008l647346
2587B321363n040955l233845k169641p699739j4137143r658288L914470J1269902
$$ plain form
2644 8052464 15463163 12296191 -3103516 -16681137 -13862390 1757954 12317252 9030049
2636 9030049 2026443 2315989 4587132 -2024573 -14123017 -18477824 -12364405 -5668126
2628 -5668126 -3843485 -2399800 835103 1347159 -1671705 -3179992 -3610764 -9439492 -18331485
2619 -18331485 -17318591 -2055386 15166668 24107210 29947772 38480866 41557189 30874025
2611 30874025 15626897 10774266 14516216 12716194 1265129 -10629730 -16615837 -18599748
2603 -18599748 -17598272 -12650999 -8262166 -10085680 -13353015 -8498120 1308375 2049037
2595 2049037 -9326513 -18565313 -14244830 -2192830 5915953 7498717 5968709 2321363
2587 2321363 -2719592 -5953437 -8123078 -15822817 -29959960 -39618248 -35703778 -24433876
2579b4433876O296369J50159J611363L603394j965814p875183k441115J0249073
2571a4805630J4224512M353321o186724l919123P429054J2714319M908499o928835
2563A1789393r531260j001155Q554363J0093194M980490M06047l73353J78300
2555B5096019k53015l42513J810111M448065K772041n542587j5584358j8021460
2547e617697q956739M514474J1810077J0370937N347743J9636o082494r954705
2539A451232n684888M686740R967772M587901l453627n068044k131743q604L128569
2530G475308R619455J2382238L696972j0630109j7631464j4532086q779096m465244
2522b2864026q18339m16100m470689k500843J6040099L9019753L9253786J0589949
$$ plain form
2579 -24433876 -18137507 -17987348 -16375985 -12772591 -14738405 -22613588 -25054703 -14805630
2571 -14805630 -581118 3772203 -2414521 -6333644 1095410 13809729 18718228 11789393
2563 11789393 2258133 1256978 9811341 19904535 24885025 25291072 24917719 25096019
2555 25096019 24843004 24500491 26310602 30758667 33530708 27988121 12403763 -5617697
2547 -5617697 -14574436 -10059962 1750115 12121052 17468795 17488431 11405937 1451232
2539 1451232 -4233656 453084 10420856 15008757 11555130 6487086 4355343 4346739 7475308
2530 7475308 17094763 29477001 33173973 22543864 4912400 -9619686 -18398782 -22864026
2522 -22864026 -23682365 -24098465 -28569154 -31069997 -15029898 23989855 63243641 73833590
2514G3833590k0664456k8883827j8226021q021358m032358M97879N777035N250794
2506E531278L65240P3189O004720J0080272P307158J368043k772517l654654j052388
2497B3250341L387109L808877l953122j4479005j7870543j2233804m168942K010916
2489b0248173P435200J1325565R358683J464221n727883o674346k174060L903200
2481a337593P959143O865098P33583m669157m278019j437109k141518l477249
2473a782821K224750J2136087J3993155M855062l875834n089867o335265j3127363
2465B997904j4888700j125466J7315442J9670916M740788p077794k496188Q345464
2457B7482366R337430L21256p027276p788260p825773j0840893j0760336j142756
$$ plain form
2514 73833590 53169134 24285307 6059286 -1962072 -5994430 -5496551 280484 5531278
2506 5531278 5896518 5969707 11974427 22054699 29361857 30729900 27957383 24302729 23250341
2497 23250341 26637450 30446327 26493205 12014200 -5856343 -18090147 -22259089 -20248173
2489 -20248173 -12812973 -1487408 7871275 9335496 3607613 -3066733 -5240793 -1337593
2481 -1337593 6621550 13486648 14220231 9551074 5273055 3835946 1694428 -1782821
2473 -1782821 441929 12578016 26571171 31426233 27550399 22460532 16125267 2997904
2465 2997904 -11890796 -13016262 4299180 23970096 28710884 21633090 19136902 27482366
2457 27482366 36819796 37141052 30113776 22325516 14499743 3658850 -7101486 -8244242
2449h244242J2582175J7097171Q354943j569021l10385O586932L096812j2248805
2441B5345580k1360071j1937782M148331Q035056q1135n824850n295338p996076
2433a4966285j6112447j8054277p208652O926614J3033348J2051012R970493P083675
2425g276519K835507K260732P830285J1924078P321867o27296k469546j54942
2417B1644166k672027r484022j0741856l711838K730302K055931j487879j410297
2409c077520K749495Q815624J5073492J6143025M954321j4760423k6155262j8431202
2401a4688450k573905K335866n189451r301308k287012M561313J179840l521103
2393b9484210L517328J5418855J3036104m413008j4249899k374236J4989163J4050674
$$ plain form
2449 -8244242 4337933 21435104 29790047 28221026 27910641 34497573 37594385 25345580
2441 25345580 3985509 -7952273 -3803942 4231114 4149979 -1674871 -6970209 -14966285
2433 -14966285 -31078732 -49133009 -56341661 -49415047 -36381699 -24330687 -14360194 -7276519
2425 -7276519 -4441012 -2180280 5650005 17574083 24895950 24268654 21799108 21644166
2417 21644166 18972139 9488117 -1253739 -4965577 -2235275 -179344 -1667223 -3077520
2409 -3077520 -328025 8487599 23561091 39704116 44658437 29898014 3742752 -14688450
2401 -14688450 -17262355 -14926489 -20115940 -29417248 -31704260 -27142947 -25963107 -29484210
2393 -29484210 -25966882 -10548027 2488077 -1924931 -16174830 -18549066 -3559903 10490771
2385A0490771k928422j3234601p618899m8538k154736n676398J531093J4798460
2377d841270J8959995Q673408o680030j4592939r725418L356255J2664722Q509419
2369A6324142m780760j1887692n092365O703036J1634796Q977629L565573m040728
2361B1403631j2597692j4464610o551827K94428m251203j2173766q054886O428095
2353b9967830J4372180Q303803k191670p598330q738517q482544o632766n148388
2345d6084062o503498o057222J589488R348067N650344m656173n111070N196598
2337d6627528R427883K353557l12765R208740J5296518O353397l449363J636775
2329f112786J1294295P880347j733829J691146J5155289J7415507L870776p795285
$$ plain form
2385 10490771 7562349 -5672252 -13291151 -13339689 -15494425 -21170823 -19639730 -4841270
2377 -4841270 14118725 22792133 16112103 1519164 -8206254 -4849999 7814723 16324142
2369 16324142 11543382 -344310 -5436675 1266361 12901157 21878786 25444359 21403631
2361 21403631 8805939 -5658671 -12210498 -11916070 -16167273 -28341039 -36395925 -29967830
2353 -29967830 -15595650 -7291847 -9483517 -17081847 -25820364 -34302908 -40935674 -46084062
2345 -46084062 -52587560 -58644782 -57055294 -47707227 -42056883 -46713056 -51824126 -46627528
2337 -46627528 -37199645 -34846088 -35158853 -25950113 -10653595 -4300198 -7749561 -6112786
2329 -6112786 5181509 13061856 11328027 13019173 28174462 45589969 49460745 41665460
2321D1665460p375469m161145n303672l533509N846475J3059185Q627841k060339
2313D6764827p402787m252386J821410L853744k141098j3221829j8974496j2539759
2305f092374j289390K682066K12363J035047M765182K049581n418061m830136
2297f885722L943555M093296j0452489k1763004j4353741J471130P559231N443266
2289c0944478Q448581J6132811J5795234N243711l485532k978179J088321J680312
2281A0980781o63494k803606m489736o657840r184241j0441566o608006M416362
2273b5451346J5171001J2702386k764381j2537808l670582J0226752P160659j0469644
2265i632963j9280018r263121M333610O467431J603955L83793K192212R40662
$$ plain form
2321 41665460 34289991 30128846 24825174 21291665 27138140 40197325 48825166 46764827
2313 46764827 39362040 35109654 36931064 40784808 38643710 25421881 6447385 -6092374
2305 -6092374 -7381764 -4699698 -4487335 -3452288 1312894 3362475 -2055586 -6885722
2297 -6885722 -2942167 1151129 -9301360 -31064364 -45418105 -43946975 -36387744 -30944478
2289 -30944478 -22495897 -6363086 9432148 14675859 11190327 8212148 9300469 10980781
2281 10980781 10317287 7513681 3023945 -3633895 -12818136 -23259702 -29867708 -25451346
2273 -25451346 -10280345 2422041 -342340 -12880148 -16550730 -6323978 836681 -9632963
2265 -9632963 -28912981 -38176102 -33842492 -27375061 -25771106 -25387313 -23195101 -22254439
2257b2254439k921385n960892q690740j0416527n599457N791353J2539514O910284
2249c0602289k007232p92622Q372480J2512755Q346875M499875M976647M443634
2241I750123J294023J888653P535004R198002J525734p835606j0291355q942747
2233D121831j0596169j2618103q139710P02122N750417O054463O932215P521564
2225b71370J732439p421624p577847M237385J4383026J1293925J320775l011443
2217A4685266j622138k382127m787028j826349M851957N677833o56881m824618
2209I115915k764896j094630k531805J055700J3589246K4132150K1337005R879799
2201G2718484J577800k642945r248041j5810371j3273404l699032p71317r066425
$$ plain form
2257 -22254439 -25175824 -31136716 -39827456 -50243983 -55843440 -50052087 -37512573 -30602289
2249 -30602289 -32609521 -33402143 -25029663 -12516908 -4170033 329842 5306489 9750123
2241 9750123 11044146 12932799 20467803 29665805 31191539 23355933 13064578 4121831
2233 4121831 -6474338 -19092441 -27232151 -26530029 -20779612 -14725149 -7792934 -271370
2225 -271370 1461069 -5960555 -13538402 -9301017 5082009 16375934 17696709 14685266
2217 14685266 13063128 10681001 5893973 4067624 8919581 14597414 13940533 9115915
2209 9115915 6351019 5256389 2724584 3780284 17369530 41501680 62838685 72718484
2201 72718484 74296284 71653339 62405298 46594927 33321523 29622491 28851174 19784749
2193A9784749j5803509r628725K985384Q389551M649805J02414j475744l497316
2185E506609o537809o234198k255800m38111l079657m556036o66192M058289L739295
2176a0463610N79053J89604J404383r38689m796830k158690P027740J1768094
2168B611055N689390k401527j103814O451475P515808j272407r965559j0413755
2160b889334n577917j089411L840440J1612621J8032576J5584036L576985r087826
2152C4002170j1793361k458861R123545R542790l804442j8415348k1000117j3186984
2144a7990608o140993k857349K897325J0440974R536170j229493p761086j347449
2136a4452509O537260K670840n997990m939094J964686j209388j3449442j5661753
$$ plain form
2193 19784749 3981240 -5647485 -2662101 5727450 10377255 10479669 9003925 5506609
2185 5506609 -1031200 -7265398 -9521198 -9959309 -13038966 -17595002 -18261194 -14202905 -10463610
2176 -10463610 -9884557 -9694953 -8290570 -9229259 -14026089 -16184779 -9157039 2611055
2168 2611055 8300445 5898918 4795104 11246579 18762387 17489980 7524421 -2889334
2160 -2889334 -8467251 -9556662 -5716222 5896399 23928975 39513011 43089996 34002170
2152 34002170 22208809 19749948 28873493 38416283 34611841 16196493 -4803624 -17990608
2144 -17990608 -24131601 -26988950 -24091625 -13650651 -4114481 -5343974 -13105060 -14452509
2136 -14452509 -7915249 -5244409 -11242399 -16181493 -14216807 -15426195 -28875637 -44537390
2128d4537390j333663J1851122R163333M52864K638827J3539124J7492762R124902
2120A8391881k725556j0658826j4970250j5339444q395007M170048J3953214J5465980
2112a07960J1359002O086188M57723m791678n922175j455572L117892J378410
2104A0121830m434551n097499L237541J2756729J3304688N267665j597089j517734
2096C2041580Q67968o35434m319340m787913k402389j956050m069548m884347
2088I854527l638359l419425m006169j398317L902330N696882K174915q7791L360653
2079A2439246O821248K509621q327349j7779079k0391904j4944046k222910J2652353
2071b9242820K0230373J6400064Q829515O762804Q032247M479270l067884n815881
$$ plain form
2128 -44537390 -45871053 -34019931 -24856598 -24403734 -21764907 -8225783 9266979 18391881
2120 18391881 15666325 5007499 -9962751 -25302195 -33697202 -29527154 -15573940 -107960
2112 -107960 11251042 17337230 17794953 13003275 7081100 5625528 8743420 10121830
2104 10121830 5687279 589780 3827321 16584050 29888738 35156403 33559314 32041580
2096 32041580 32909548 32274114 27954774 23166861 20764472 18808422 14738874 9854527
2088 9854527 6216168 2796743 -1209426 -2607743 1294587 6991469 9166384 9078593 12439246
2079 12439246 19260494 21770115 13442766 -4336313 -24728217 -39672263 -41895173 -29242820
2071 -29242820 -9012447 7387617 16217132 22979936 31012183 35491453 32423569 26607688
2063B6607688k235027j124710p209818j3511378j2112504m529536K983287P414675
2055c717323P833013L033863m459323q016306n837687m490587p868026q943644
2047c2466020j93261J2986028J8506663J4106305Q112920N274412J734715n270138
2039B2791624j1936266j4326313j2631640p042431K778426J1573228J0440823
2032A647451m43788q684759n176042L648769N708759o9434m555119k022915M554447
2023e392631R298683P965064n63066j0794589j1973524n49388J1815339J1508337
2015A1314225J435419m276322k061941k207269r181776j3230622p321157P11941
2007b4817502J997553J625265Q225210J6633816J4558342K757335m789340r18453
$$ plain form
2063 26607688 24372661 23247951 16038133 2526755 -9585749 -14115285 -11131998 -3717323
2055 -3717323 4115690 7149553 2690230 -5326076 -11163763 -15654350 -23522376 -32466020
2047 -32466020 -32659281 -19673253 -1166590 12939715 21052635 26327047 28061762 22791624
2039 22791624 10855358 -3470955 -16102595 -23145026 -20366600 -8793372 1647451
2032 1647451 1203663 -7481096 -12657138 -9008369 -3299610 -3369044 -7924163 -9947078 -5392631
2023 -5392631 3906052 11871116 11308050 513461 -11460063 -12009451 -194112 11314225
2015 11314225 12749644 8473322 6411381 4204112 -4977664 -18208286 -25529443 -24817502
2007 -24817502 -22819949 -21194684 -12969474 3664342 18222684 20980019 16190679 15272226
1999A5272226N888394N147414k143513p653002p368558m796466n041582q195123
1991h890210q554050j553601Q220749J0334995K510762m489196j451036N819734
1983A948147N985909J12182j144955M048007N951408K19130m881490k688717J222467
1974A0772088p10408n560490n405196M13368N876689P353145N674761J928698
1966B0342655l041650o522797n951587k329844J053172J988750L5618l551422
1958B022895n372809k885851R85658P69651k697775k352205L519614O821787J829517
1949B640482m611636k289171P338560J3161898R155424k39907q243868j2197642
1941D714140j1875489p700889j982984K550400O276568J0943991J4323057J1089586
$$ plain form
1999 15272226 21160620 26308034 24164521 16511519 9142961 4346495 -695087 -8890210
1991 -8890210 -17444260 -18997861 -10777112 -442117 2068645 -2420551 -3871587 1948147
1983 1948147 7934056 8046238 6901283 10949290 16900698 17119828 12238338 9549621 10772088
1974 10772088 10061680 4501190 -904006 -490638 5386051 12739196 18413957 20342655
1966 20342655 17301005 10778208 4826621 2496777 3549949 5538699 5574317 2022895
1958 2022895 -3349914 -6235765 -5250107 -4480456 -7178231 -9530436 -6010822 810965 2640482
1949 2640482 -1971154 -4260325 3078235 16240133 25395557 25155650 16911782 4714140
1941 4714140 -7161349 -14862238 -16845222 -14294822 -8018254 2925737 17248794 28338380
1933B8338380L26212j1380292j6021829j1400629j883680N816371P309156L316272
1925D419961j402234l124701k904248l842626n811503n779589l233477j769920
1917b3448337l484609m253205J828701J3006117J8513243J0389940m555214j0186832
1909b190196o09670J1362538J0553177m89895o040702M31891Q719469Q086803
1901B9823415Q95119m457720n587507m712118j844909L278250O878043N463515
1893B9736088J270453k091596n520626j0142167j1598921o164561N74283l69244
1885d306291p801084j0745675l238234Q051555J2927048R299784L290732R57156
1877H434991K384252L193883Q11460k007832j556959O64115P45944K79911M135120
$$ plain form
1933 28338380 28664592 17284300 1262471 -10138158 -12021838 -6205467 1103689 4419961
1925 4419961 3017727 -106974 -3011222 -6853848 -12665351 -18444940 -21678417 -23448337
1917 -23448337 -26932946 -31186151 -29357450 -16351333 2161910 12551850 7996636 -2190196
1909 -2190196 -2799866 8562672 19115849 18625954 12585252 13017143 21736612 29823415
1901 29823415 30718534 26260814 20673307 15961189 14116280 17394530 24272573 29736088
1893 29736088 31006541 28914945 23394319 13252152 1653231 -4511330 -3937047 -4306291
1885 -4306291 -12107375 -22853050 -26091284 -18039729 -5112681 4187103 7477835 8434991
1877 8434991 10819243 14013126 14824586 12816754 11259795 11923910 12669854 12949765 17084885
1868A7084885R528737O822218n057288j4229289j3133596r406150j0365103p955328
1860b6710914O844449K3379470K2841322O530202n514120l643355J650673J449640
1852B6827367J547802P182606J0806476N196735l423425o002655m985812p531886
1844B9617208j1827708j0685353l847333K557357N372540N736509M419354K277624
1836B3620198J767299K353213j075064r402794j4508206j0576888m541649n860924
1828a8224815j0241903m943417J0865287K2478345J8574132M506284o922250j0483314
1820E608349r580845p774109n092600r85723L180208M989824L518248J262011
1812d874637K300516O443246P126537m95788j0455709j1265487j435286P319346
$$ plain form
1868 17084885 26613622 33435840 28378552 14149263 1015667 -8390483 -18755586 -26710914
1860 -26710914 -19866465 3513005 26354327 32884529 27370409 23727054 25377727 26827367
1852 26827367 28375169 35557775 46364251 51560986 48137561 42134906 37149094 29617208
1844 29617208 17789500 7104147 3256814 5814171 11186711 16923220 21342574 23620198
1836 23620198 25387497 27740710 26665646 17262852 2754646 -7822242 -12363891 -18224815
1828 -18224815 -28466718 -33410135 -22544848 -66503 18507629 23013913 16091663 5608349
1820 5608349 -3972496 -11746605 -16839205 -17824928 -14644720 -9654896 -6136648 -4874637
1812 -4874637 -2574121 3869125 10995662 10499874 44165 -11221322 -12656608 -5337262
1804e337262O083442J040874K961291R825189J0006822J119775n637950k542909
1796A7519272L699064L711991r47652m047828o730601j2453408j5414625p320687
1788b1984474O204084R981433J536497m601659R20992Q724213O531584k205864
1780E106806m774455K847913J2763584J5057144N663115r938817j7696516q297697
1772G31077P241355P267335r976970k0409519p965402J1702524J5663423O959307
1764A1213130M559650J1466511J4241155P495871j836592j0087623j7371292j7215268
1756B465542n301126O155822L172680o069169m371084L195086k268561j7224183
1748b0244993j8232871k009758Q478880L406930P3482Q340296J3260534N391672
$$ plain form
1804 -5337262 746180 1787054 4748345 14573534 24580356 25700131 20062181 17519272
1796 17519272 21218336 24930327 23982675 19934847 13204246 750838 -14663787 -21984474
1788 -21984474 -15780390 -5798957 -4262460 -8864119 -7943127 781086 7312670 5106806
1780 5106806 332351 3180264 15943848 31000992 36664107 26725290 9028774 731077
1772 731077 7972432 15239767 5262797 -15146722 -23112124 -11409600 4253823 11213130
1764 11213130 15772780 27239291 41480446 48976317 47139725 37052102 19680810 2465542
1756 2465542 -2835584 3320238 6492918 423749 -3947335 -752249 -3020810 -20244993
1748 -20244993 -38477864 -40487622 -32008742 -28601812 -28528330 -20188034 -6927500 -1535828
1740a535828r31911M436293Q441436J188894m376371K239186Q527000L180838
1732B1169537k644784J684190N198491k043391q299277l352956J222012l340266
1724I593556l544321Q274751J4503599O275541N087343K0500368K2724356m162792
1716G9252401k1131946L534849L1030405J6859333K392047N3824248J28305158
1709B94066495J06350364k8114435j42693322j32477562n1634766j0741453k0443199
1702A4312122j6534846J3863645K3126882j882501j9409077q156246M010368l483726
1694E846621j2724641o708609K976994L091330l30611j075276m512295r470822
1686b2907309l837659J1878039J9639098J1518172R50543j711649l869964j1803579
$$ plain form
1740 -1535828 -2467739 1968554 10409990 11598884 7222513 9461699 17988699 21169537
1732 21169537 18524753 20208943 25407434 23364043 15064766 11711810 12933822 9593556
1724 9593556 6049235 14323986 28827585 35103126 40190469 60690837 83415193 79252401
1716 79252401 58120455 61655304 92685709 109545042 111937089 165761337 294066495
1709 294066495 400416859 372302424 229609102 97131540 45496774 34755321 14312122
1702 14312122 -2222724 11640921 34767803 32885302 13476225 5319979 9330347 5846621
1694 5846621 -6878020 -13586629 -10609635 -7518305 -7848916 -8924192 -13436487 -22907309
1686 -22907309 -26744968 -14866929 4772169 16290341 17240884 15529235 11659271 -144308
1678a44308j6996083j2363782n562108m973498o011189j597895N172231Q161237
1670c4315395Q634857J0681657J3496888J3721735R304385r70415j4226247k0071778
1662a3744313j1015038L746813P624852N20622j465114O902992J0317627j756768
1654A131673j5835333j3181306L027925J3291188Q485389k097903o987256n186815
1646a7352438j420342K581480P905559J3236404J3936195P543679q98993k385524
1638B3146020M810248J0675397N114569p934783j4282211p213945M704987Q784488
1630B7804770J985885q253489j2917512r130644j372115L829898M948084N590594
1622A2485471O836935M033269n139313j4129622j4787666p829359l60104L738611
$$ plain form
1678 -144308 -17140391 -29504173 -35066281 -40039779 -46050968 -47648863 -42476632 -34315395
1670 -34315395 -25680538 -14998881 -1501993 12219742 21524127 20553712 6327465 -13744313
1662 -13744313 -24759351 -21012538 -13387686 -12867064 -14332178 -7429186 2888441 1131673
1654 1131673 -14703660 -27884966 -24857041 -11565853 -3080464 -5178367 -12165623 -17352438
1646 -17352438 -18772780 -16191300 -8285741 4950663 18886858 26430537 25531544 23146020
1638 23146020 27956268 38631665 43746234 35811451 21529240 14315295 19020282 27804770
1630 27804770 29790655 21537166 8619654 -510990 -1883105 1946793 6894877 12485471
1622 12485471 19322406 23355675 18216362 4086740 -10700926 -18530285 -18890389 -15151778
1614a5151778N074077M101574J903002K156170N509213N907612o0409m955660
1606D483801q88474O451863N512500k470366n259155P86126N830404K777943l398782
1597A3825860n343865k264837L490337R621071J1381303M900334m812047p873857
1589B2924299l337305j42124k798246n668793l554254J575870O548376J0070034
1581B5617857Q181058k472174j4338469j3836448p11301R189141N739956k620460
1573A4749160m519141k268634l476983n820474j586040Q169880J4103583J0647781
1565B9999132Q89787q081244j0376506n303335J007299K295469J225733M549719
1557A6206054R085432L932961j0339790j8220127j1726031k887530l690662o334284
$$ plain form
1614 -15151778 -10077701 -5976127 -4073125 -1916955 3592258 9499870 9439461 4483801
1606 4483801 3595327 10047190 15559690 13089324 7830169 8616295 14446699 17224642 13825860
1597 13825860 8481995 6217158 9707495 19328566 30709869 35610203 30798156 22924299
1589 22924299 19586994 19444870 16646624 10977831 7423577 8999447 15547823 25617857
1581 25617857 33798915 31326741 16988272 3151824 2440523 11629664 17369620 14749160
1573 14749160 10230019 7961385 4484402 -1336072 -2922112 5247768 19351351 29999132
1565 29999132 30888919 22807675 12431169 7127834 8135133 10430602 11656335 16206054
1557 16206054 25291486 29224447 18884657 664530 -11061501 -13949031 -17639693 -23973977
1549b3973977K414458J6923339J9746537Q408857j426657O10815P172731O767383
1541C6643486j244172r129086j0900566o671034j294565J46056j638751m03657
1533E507711N725662Q521130J92015j3442671j8239845r260490M222632J1240584
1525e533272J0036406N617214K252869O44826o90301k915116m994954n181956
1517g64284m666185o409185r021748o700643J662975Q485012P188792J426316
1509h798950o46914K388828N079473L306709k137078p653072q953388m347076
1501b1761468J506388K098908l90051L206719J2869447J5106020K727508j1122871
1493D240600j0393847L28512L917683k724045o260107q6261O232068M243469l35141
$$ plain form
1549 -23973977 -21559519 -4636180 15110357 23519214 22092557 22703372 29876103 36643486
1541 36643486 35399314 26270228 15369662 8698628 7404063 7550119 5911368 5507711
1533 5507711 11233373 19754503 19946518 6503847 -11735998 -20996488 -16773856 -5533272
1525 -5533272 4503134 10120348 12373217 13018043 12327742 9412626 4417672 -764284
1517 -764284 -5430469 -11839654 -20861402 -27562045 -25899070 -17414058 -10225266 -8798950
1509 -8798950 -9445864 -7057036 -1977563 1329146 -807932 -8461004 -17414392 -21761468
1501 -21761468 -20255080 -18156172 -18546223 -15339504 -2470057 12635963 15363471 4240600
1493 4240600 -6153247 -5824735 -1907052 -4631097 -10891204 -10977465 -4745397 -501928 -837069
1484h37069J294876O262549M270530p676773k0371622k1306518p281617J0832882
1476c4812762J7816135J0804319K156877J913218M307706k81841p054292l431357
1468h581997R325779J5981230R843046J452774R37260M297906L407340r07436
1460C5755902l379345l980645n385318o436201n247042m809748r167448j6347322
1452a8997167j9853893j5755308n662388N271599J1727764J2307847J1220775
1445a9740771J2776645J4342434R697623k27567o361932l634172J742347R50312
1437I544919n692959r775328n225190N383804J3859737J4259868Q323682K629750
1429C3308283j77553l973665j0243701j1794180k370061J0735932J2870212P37114
$$ plain form
1484 -837069 457807 6720356 10990886 3314113 -17057509 -38364027 -45645644 -34812762
1476 -34812762 -16996627 -6192308 -4035431 -2122213 2185493 1903652 -5150640 -8581997
1468 -8581997 743782 16725012 26568058 28020832 28958092 33255998 36663338 35755902
1460 35755902 32376557 28395912 23010594 16574393 11327351 6517603 -2649845 -18997167
1452 -18997167 -38851060 -54606368 -60268756 -54997157 -43269393 -30961546 -19740771
1445 -19740771 -6964126 7378308 17075931 16848364 10486432 6852260 8594607 9544919
1437 9544919 3851960 -5923368 -11148558 -5764754 8094983 22354851 30678533 33308283
1429 33308283 33130730 29157065 18913364 7119184 4749123 15485055 28355267 29092381
1421B9092381j3381870j7304088j1471171m232776j440682k996267m581326j429620
1413b7745419N749528R707343O128386Q99281J175463L732670J941994l76422
1405A212824M587691J1548489Q096523k452714l009961Q745567J3567839P40750
1397D3037008j3938834j2809642k390195Q81145k700562j795339L478516L887809
1389A7649906J75366J209807N586396K554425q407455j4598151r121141Q0756
1381d870091L356991P66545k724020m382117l156705P05117L664833K652448P52069
1372c234930K588504N455443L099689l011984n503310l484202k943721m433837
1364a1468348j534463N938988Q169486l52001j1560282j4197132o510268N706145
$$ plain form
1421 29092381 15710511 -1593577 -13064748 -17297524 -18738206 -21734473 -26315799 -27745419
1413 -27745419 -21995891 -12288548 -6160162 -5260881 -4085418 -352748 1589246 1212824
1405 1212824 5800515 17349004 25445527 22992813 19982852 28728419 42296258 43037008
1397 43037008 29098174 16288532 13898337 14779482 12078920 10283581 13762097 17649906
1389 17649906 17825272 19035079 24621475 27175900 18768445 4170294 -4950847 -4870091
1381 -4870091 -1513100 -746555 -3470575 -7852692 -11009397 -10304280 -6639447 -3986999 -3234930
1372 -3234930 -646426 4809017 7908706 4896722 -606588 -4090790 -7034511 -11468348
1364 -11468348 -13002811 -7063823 1105663 753662 -10806620 -25003752 -31514020 -25807875
1356b5807875J6428216J9880576J1285641n756347j7866422j5303919l943348
1349b1083478K333107j050592n786922l386774M645355J0620801J0278687N901800
1341B471984J881193L00694J289656M957763J0128984J2384069P756449q11146
1333D0359646n403775l556382j434854l224881l747742J995958P738099L814925
1325C6540994o978582j1872339o029175K178829N047935M707731N204000M526961
1317C3326354k93881o764711j0432562r687763l853758P238901J8039991J8818771
1309D6391342Q155901k338920k722858J105273l665944j6847883k3797461j4500932
1301h221482L526463J4256798J0412369j040893p766804l912422N535955J0363487
$$ plain form
1356 -25807875 -9379659 10500917 21786558 16030211 -1836211 -17140130 -21083478
1349 -21083478 -18750371 -19800963 -25587885 -28974659 -24329304 -13708503 -3429816 2471984
1341 2471984 4353177 4653871 5943527 10901290 21030274 33414343 41170792 40359646
1333 40359646 34955871 31399489 29964635 26739754 22992012 24987970 32726069 36540994
1325 36540994 29562412 17690073 11660898 13839727 18887662 23595393 28799393 33326354
1317 33326354 33032473 26267762 15835200 6147437 2293679 9532580 27572571 46391342
1309 46391342 54547243 52208323 49485465 50590738 46924794 30076911 6279450 -8221482
1301 -8221482 -4695019 9561779 19974148 18933255 11166451 7254029 12789984 23153471
1293B3153471N232216n149418j0941632p336383L11711J944286n932983j5062924
1285a3781656j3916692j728038R971957J2205940R630342J0960189J3337149O641947
1277C3321138p707363j4799803p257024L040234K195436n665120o395578J810496
1269a457584O811232K116072m323228l952950J1122O039l296737l446151L73788
1260g158397K098498j262762m760424k789442K930572O010105L969731M79939
1252d82180p89374r31084k531643m137904j488526N768530J1660241J0002720
1244A7070780J742084n622497o126441j736196M25919k812010o170323k460908
1236e689592P527817J5190809J4436965P603864n58493r499001j9111783k4049790
$$ plain form
1293 23153471 28385687 23236269 12294637 4958254 5269965 7214251 1281268 -13781656
1285 -13781656 -27698348 -29426386 -19454429 -7248489 2381853 13342042 26679191 33321138
1277 33321138 25613775 10813972 3556948 6597182 8792618 3127498 -3268080 -1457584
1269 -1457584 5353648 7469720 3146492 -806458 -795336 -789297 -4086034 -7532185 -7158397
1260 -7158397 -5059899 -6322661 -11083085 -13872527 -10941955 -4931850 -962119 -482180
1252 -482180 -1271554 -2202638 -4734281 -8872185 -10360711 -4592181 7068060 17070780
1244 17070780 18812864 13190367 7063926 5327730 5753649 2941639 -3228684 -5689592
1236 -5689592 1838225 17029034 31465999 39069863 38511370 29012369 9900586 -14149204
1228a4149204j8866142p002797K388506O118695Q490262J1095723R357888J938868
1220f28201m070840k393924L452255N810758L503440J228240J067321L12392l024292
1211E257149p071565q865056p605040m846163k534588n41872L359308Q951490
1203a3896337J0237275J672381j1760803j7144464r236973K582160P265541N933215
1195b4348005O534815R894508R499497K825489n379597j0600945j2021597q534916
1187c2130751J037777J2093301J5635642Q907742l73345l776859k179549k582381
1179c368423p978184j4166079j5321244r898745j365713N361770Q248812R137101
1171b9350705J0087910J0007768O983827K839639J842957M616555O792516M862248
$$ plain form
1228 -14149204 -33015346 -40018143 -37629637 -31510942 -23020680 -11924957 -2567069 -628201
1220 -628201 -4699041 -7092965 -3640710 2170048 5673488 6901728 7969049 8281441 5257149
1211 5257149 -1814416 -10679472 -18284512 -23130675 -25665263 -26207135 -22847827 -13896337
1203 -13896337 -3659062 -1986681 -13747484 -30891948 -40128921 -37546761 -30281220 -24348005
1195 -24348005 -17813190 -7918682 1580815 4406304 -973293 -11574238 -23595835 -32130751
1187 -32130751 -31092974 -18999673 -3364031 5543711 5170366 1393507 -786042 -3368423
1179 -3368423 -11346607 -25512686 -40833930 -50732675 -52098388 -46736618 -38487806 -29350705
1171 -29350705 -19262795 -9255027 -2271200 568439 2411396 7027951 13820467 18682715
1163A8682715M84757k288168j408212K795095Q638540J2451272R664936l19210
1155D8701725j1510914j6311201j2967200o409381k084710p35127M57958K898480
1147B039630M046880P22090n067383n671030M023802J8348662K4500028J6117168
1139E9059847L66894j0680133j2645740r356122m135494K614605P479115M122007
1131C6824979o209160j0993975j245573J3382814J4061625k225477j7129050j4361098
1123A2105085M27189J0292020R800102O674082N224550J062207p301286j3641371
1115B4642578j4389612j3610595j2880409o222542P652809J7008629J1080417
1108A3281275l306677r806880m062937L315356L791166L16089j112677K72328
$$ plain form
1163 18682715 19167472 16879304 15471092 18266187 26904727 39355999 49020935 48701725
1155 48701725 37190811 20879610 7912410 1503029 -581681 -1316808 -858850 2039630
1147 2039630 6086510 6808600 1741217 -3929813 93989 18442651 42942679 59059847
1139 59059847 59426741 48746608 36100868 26744746 22609252 25223857 32702972 36824979
1131 36824979 30615819 19621844 18376271 31759085 45820710 43595233 26466183 12105085
1123 12105085 12532274 22824294 32624396 39298478 44523028 45585235 38283949 24642578
1115 24642578 10252966 -3357629 -16238038 -22460580 -14807771 2200858 13281275
1108 13281275 9974598 167718 -3895219 -579863 3211303 3527392 2414715 2687043
1100B687043K605149M400980K611478m872159j2381904j0273749O39880O701895
1092g881387n83907j1277734r675750M583534J6984239J7523167J0779775O055915
1084B6507852N210792L593449j511289p073382p692893j573851O119386O937414
1076C0517478j438792j0778448j1092576l136368K748295O18245m264010n129759
1068a955935l910381o040155r488364p042540J474113P543510O355608L297903
1060i766241L989026M697427m87535p731412p621994K27005N836108L363376j488512
1051h982752j773144P75803J346851R82321K853219M314045R04246m184593l301739
1042g065743L063495N070638k766651j3028992j4017534l032812J1503885J8276912
$$ plain form
1100 2687043 5292192 9693172 12304650 7432491 -4949413 -15223162 -14583282 -7881387
1092 -7881387 -8465294 -19743028 -29418778 -24835244 -7851005 9672162 20451937 26507852
1084 26507852 31718644 35312093 33800804 26727422 19034529 17460678 23580064 30517478
1076 30517478 29078686 18300238 7207662 4071294 6819589 7437834 3173824 -1955935
1068 -1955935 -5866316 -11906471 -21394835 -28437375 -26963262 -19419752 -13064144 -9766241
1060 -9766241 -5777215 -1079788 -1567323 -9298735 -16920729 -16693724 -10857616 -7494240 -8982752
1051 -8982752 -10755896 -9980093 -8633242 -7650921 -4797702 -483657 420589 -3764004 -7065743
1042 -7065743 -4002248 1068390 -1698261 -14727253 -28744787 -31777599 -20273714 -1996802
1034a996802J2220928j108187r429347n854824K590059L785211k021350k071644
1026c885956Q095106J3892049J457435j8728089k2023841k785496J7024459J7400181
1018A0445848N668039J876340Q014554P488363o233304j7109735r666463P586217
1010H069859J3759739M206071o012566o017505k586893n547878j1608284j1427003
1002a7164460n083517k65603R45630L302805P841750R849784Q089625P148039
994A4664053Q322670O238739j842173j0277996j2921750j0682134o574906O18925
986a2454572J1323475J8697434J5237573L852982m813545n338166j488437K006668
978B7023412M664307O473517N628736K254331j032359m367326j0813589j8589267
$$ plain form
1034 -1996802 10224126 9115939 -313408 -6168232 -3578173 207038 -1814312 -3885956
1026 -3885956 4209150 18101199 19558634 830545 -21193296 -23978792 -6954333 10445848
1018 10445848 16113887 17990227 26004781 33493144 27259840 10150105 483642 8069859
1010 8069859 21829598 26035669 20023103 14005598 11418705 5870827 -5737457 -17164460
1002 -17164460 -22247977 -22513580 -21567950 -18265145 -10423395 -573611 7516014 14664053
994 14664053 22986723 29225462 27383289 17105293 4183543 -6498591 -13073497 -12454572
986 -12454572 -1131097 17566337 32803910 36656892 31843347 26505181 25016744 27023412
978 27023412 31687719 38161236 43789972 46044303 45011944 40644618 29831029 11241762
970A1241762j9494004j0190135J22316J55466q341372j3149614p937551J436056
962d6157076P295017R209932J0210145J0593089R636768Q615508P907519N184321
954B2495223N40087r41108L276667P267604M399097k609969o551035p511213j0901323
945I464030j5314660j2782877k342347O834090Q930324Q326791Q479098M148288
937A5742737p628452j7242676j3413257J42995Q578613M564468m656604p815837
929b1728013j215940R145030J2871130N063200o063428o748068L317467P871016
921B512394l080565j7080496j7175959o892286j660454k206027L672866J4954504
913b6956023J5169066M49395j0971559o063777M210364M822775k95214Q69374
$$ plain form
970 11241762 -8252242 -18442377 -18320061 -18164595 -26505967 -39655581 -47593132 -46157076
962 -46157076 -38862059 -29652127 -19441982 -8848893 787875 9403383 17310902 22495223
954 22495223 23035310 22094202 25370869 32638473 37037570 34427601 27876566 20365353 9464030
945 9464030 -5850630 -18633507 -20975854 -14141764 -5211440 3115351 11594449 15742737
937 15742737 8114285 -9128391 -22541648 -22398653 -13820040 -9255572 -13912176 -21728013
929 -21728013 -22943953 -13798923 -927793 4135407 -1928021 -8676089 -5358622 2512394
921 2512394 -568171 -17648667 -34824626 -41716912 -43377366 -45583393 -41910527 -26956023
913 -26956023 -11786957 -11337562 -22309121 -28372898 -24162534 -19339759 -19634973 -18765599
905a8765599O997289Q372350M491874J753402o8233m734775p982206l349256L781310
896i503844K146263o762838r529421q89382R056824R772627K517960m721335o587216
887a4500362k754897K705841L802525k93271k413424K298702O981173K566020
879a607693o943999r651543m027453K18240j008264j423560K172413M637718L699020
870a3935121L999342O131732M151849j231904l02001Q044069R968606k087398
862A4739174j4307452j0492102L725855J0343852N570775R47571J815989J528677
854A3872339k634086l796553L20894J373385m886494r115418k095676J0213259
846C251650J4591359Q275745k90543n073610p343457p816539l562269M503218
$$ plain form
905 -18765599 -11768310 -3395960 1095914 2849316 2781083 -1953692 -9935898 -13285154 -9503844
896 -9503844 -7357581 -14120419 -23649840 -24539222 -15482398 -5709771 -3191811 -7913146 -14500362
887 -14500362 -17255259 -14549418 -10746893 -11040164 -13453588 -11154886 -4173713 -1607693
879 -1607693 -8551692 -18203235 -22230688 -22012448 -23020712 -24444272 -22271859 -17634141 -13935121
870 -13935121 -9935779 -3804047 347802 -884102 -1186103 6857966 16826572 14739174
862 14739174 431722 -10060380 -6334525 4009327 9580102 10527673 12343662 13872339
854 13872339 11238253 7441700 7762594 9135979 4249485 -4865933 -6961609 3251650
846 3251650 17843009 26118754 25828211 20754601 13411144 5594605 2032336 6535554
838F535554Q788792M794840j500994k082935P82339j770607j0104197j3363872
830g921080m990071O555503Q901056K655540r24008K961269O927682M136268j496578
821A6805581k160280K485169O159509M850951j32783n939026j0260344j0652518
813A156259o261525n08502J524659p10475k381274K27170M733839O159194L935950
804G875295K571094M986133Q030712O827758J659245k925747m892891o041603
796A8089996o524451m104820q13439l180969j1167548j4118208n303094N991301
788b1131232P173480J955297L868326J2663476J3387615J272188r185093p016781
780B987276j221757l403032p190563J82495J4734040K0473777J2618928O12981
$$ plain form
838 6535554 15324346 20119186 18618192 16535257 17317596 15546989 5442792 -7921080
830 -7921080 -12911151 -6355648 2545408 5200948 4276940 7238209 14165891 18302159 16805581
821 16805581 14645301 17130470 23289979 28140930 28008147 22069121 11808777 1156259
813 1156259 -5105266 -5613768 -4089109 -4799584 -7180858 -6953688 -2219849 3939345 7875295
804 7875295 10446389 15432522 23463234 30290992 31950237 29024490 24131599 18089996
796 18089996 11565545 7460725 6647286 3466317 -7701231 -21819439 -27122533 -21131232
788 -21131232 -13957752 -12002455 -8134129 4529347 17916962 19189150 10004057 2987276
780 2987276 1765519 -1637513 -8828076 -8645581 6088459 26562236 39181164 39794145
772C9794145r312050j8667256k4104850j7033544L2797J1272208Q213841M84401
764i320308j244924j149945p030599j3224259q259629N445263J3256941R054235
756a2473225K206275J682938L801499R87384n071677o240037r8970P367100J0166873
747B328160Q146308M315753P65626j369889j075752J279633L348393K896100l99124
738B0235208n461217j0205957j1227466o467512K24278J148751n277936j0385936
730b7417787o150786K948974N974258J591974q39786L013106N651420Q88130n412398
721a9752895n020212n93981K1748j959620J543235J0319661J3561674N217923
713C337533o566526r856583l727223J961627p51938r185264j3901461r689920
$$ plain form
772 39794145 30482095 11814839 -12290011 -29323555 -29290758 -18018550 -9804709 -9320308
764 -9320308 -10565232 -11715177 -18745776 -31970035 -40229664 -34784401 -21527460 -12473225
756 -12473225 -10266950 -8584012 -4782513 -3795129 -8866806 -15106843 -15205813 -7838713 2328160
747 2328160 10474468 14790221 15555847 14185958 13110206 14389839 17738232 20634332 20235208
738 20235208 14773991 4568034 -6659432 -13126944 -12902666 -11753915 -17031851 -27417787
730 -27417787 -33568573 -30619599 -24645341 -23053367 -23893153 -20880047 -15228627 -14340497 -19752895
721 -19752895 -24773107 -25367088 -25345340 -27304960 -25761725 -15442064 -1880390 3337533
713 3337533 -3228993 -13085576 -16812799 -14851172 -15603110 -24788374 -38689835 -48379755
705d8379755j400762K428186Q18082J065320O906066J1594762P438422k282398
697b1812077p387045m066946K546273P161929Q749218P321746L370734K16169
689c899999M81182R08464k598824o169131k648880N520793Q033076K423968k449267
680c98618j411751m88761m335789o685243j045654P438382R535239N154693P01405
671H463903j521431k903023k072948K404972O191208M426676K24378j74607J756782
662A6795910m66771o322384q115390l146267K197885J906888k929259q102344
654h181732j0619310p815123J374384J1965337J5231849Q290069k373378q695439
646h23343q901688o534115n330132o392315p605744n273441J348492P983115J0594646
$$ plain form
705 -48379755 -49780517 -47352331 -46534249 -45468929 -38562863 -26968101 -19529679 -21812077
697 -21812077 -29199122 -33266068 -30719795 -23557866 -14808648 -7486902 -4116168 -3899999
689 -3899999 -3418817 -2510353 -5109177 -11278308 -13927188 -8406395 -373319 2050649 -398618
680 -398618 -1810369 -2299130 -6634919 -13320162 -14365816 -6927434 2607805 7762498 8463903
671 8463903 6942472 4039449 1966501 4371473 10562681 14989357 15213735 15039128 16795910
662 16795910 16329139 10006755 1891365 -1254902 942983 2849871 -79388 -8181732
654 -8181732 -18801042 -26616165 -25241781 -13276444 1955405 10245474 7872096 -823343
646 -823343 -9725031 -16259146 -21589278 -27981593 -35587337 -40860778 -39512286 -31529171 -20934525
637b0934525J0582499J0657067Q655978J933431m659657l891300J372823M77280
629D193596q764823j5925185j3380440o280272k007699J141715P388159J3056770
621b0578179J1640076M537300j566677m536940o286890n819913j273238L122875
613b0761586Q06889o743893j1094701q493393l352127J73235K816443N437639
605d1211494O790035P656593J0147278J0888534K912830j1686122j8937763r676107
597d3116216O617390J2789189N618371k195548q25538M907462N271573j56329
589a1089646l596895o52003N208430Q928853R395416P452333K619085n117153
581A3148420j2414046j4938129j2020482o169467J194330R535617J4799411J0956600
$$ plain form
637 -20934525 -10352026 305041 8961019 10894450 6234793 2343493 3716316 4193596
629 4193596 -4571227 -20496412 -33876852 -40157124 -42164823 -41023108 -33634949 -20578179
621 -20578179 -8938103 -4400803 -5967480 -10504420 -16791310 -22611223 -23884461 -20761586
613 -20761586 -19954697 -26698590 -37793291 -46286684 -49638811 -49465576 -46649133 -41211494
605 -41211494 -34421459 -26764866 -16617588 -5729054 -2816224 -14502346 -33440109 -43116216
597 -43116216 -36498826 -23709637 -18091266 -20286814 -21112352 -16204890 -10933317 -11089646
589 -11089646 -14686541 -15338544 -10130114 -1201261 8194155 15646488 18265573 13148420
581 13148420 734374 -14203755 -26224237 -32393704 -31199374 -21663757 -6864346 4092254
573D092254r74644j0396209q884150j219084J563444k093942l429677J719214
565a9622794O246854L672964j289470n97074M270564N394919J561756j27421M189409
556C699707R399034R078544L030391n099487j2317334j5282669j0022286K202850
548a5311250J1868601J0004082m18536o970685k676593N735125O886137q64417
540H252464p901119n876444J960285N428332P64053m703510k812846L848771N135234
531D095220k449230j0187678q614909l75938L627669n91667m971357j067983Q393593
522a2142280J3802138J1454737O704189M807269M167334J026863l302239m325919
514B2192092j854170p57213l445878n703878k695180L377688N190814o22241r295604
$$ plain form
573 4092254 3117610 -7278599 -16162749 -17381833 -15818389 -17912331 -21342008 -19622794
565 -19622794 -13375940 -9702976 -10992446 -11589520 -7318956 -1924037 -362281 -489702 3699707
556 3699707 13098741 22177285 25207676 20108189 7790855 -7491814 -17514100 -15311250
548 -15311250 -3442649 6561433 6142897 -827788 -3504381 2230744 9116881 8252464
540 8252464 351345 -5525099 -3564814 1863518 2627571 -2075939 -4888785 -1040014 4095220
531 4095220 1645990 -8541688 -17156597 -17532535 -13904866 -14496533 -19467890 -20535873 -12142280
522 -12142280 1659858 13114595 19818784 24626053 28793387 29820250 26518011 22192092
514 22192092 20337922 19580709 16134831 10430953 7735773 11113461 16304275 15682034 6386430
505F386430j3292667r569774r59587P124867R877658N418662l119406q724708
497f858525o869233j003013J260758j706140k871248L165504J0593139Q746930
489D458172k725689j1910106j0265050l557440j593874k584578K995814J4883929
481a0298822K0490112J2839265J081949l261185k387784n419717j1181416r447128
473g584726J689272J0963506R146039L43402n784734o050177l494499q92301N10697
464a153521j44647j447474q4175L711895N203186K777816J341114L895576N532412
455A9632182J753559k805267j858094Q03971l229858j2071213j4569662o585637
447a8930019L743153R013804J1271705J3864770J3402863O052314m337307j0935705
$$ plain form
505 6386430 -6906237 -16476011 -17435598 -10310731 -433073 4985589 1866183 -6858525
497 -6858525 -13727758 -14730771 -13470013 -15176153 -18047401 -14881897 -4288758 4458172
489 4458172 1732483 -10177623 -20442673 -24000113 -25593987 -28178565 -25182751 -10298822
481 -10298822 10191290 23030555 24112504 20851319 18463535 13043818 1862402 -7584726
473 -7584726 -5895454 5068052 14214091 14557493 8772759 2722582 -771917 -1664218 -1153521
464 -1153521 -1298168 -2745642 -2829817 882078 6085264 8863080 10204194 14099770 19632182
455 19632182 21385741 18580474 16722380 17526351 14296493 2225280 -12344382 -18930019
447 -18930019 -15186866 -6173062 5098643 18963413 32366276 38418590 34081283 23145578
439B3145578j2701693j2750521j1388980o637282M21436O165768R255043J0717343
431F226692J0337842O965244J799339k079348l295133l057160l298729n595325
423H003422r951520j2643393q288657K459186J0148240O418621m745623j0791170
415a9390894n375440N457928J2263735J2312055Q736747L754615l366035j2394071
407A998640j8905428j6693039m553058R683150J4970768Q956715J085350M19573
399c037329L748258J840527m777534n483167L231132R934888M348867n885146
391C920496m721901Q612823J6810804P888849q375346j4009948o232254J839396
383E732919J107523l182606k951822J64902j77006l537551m098711r24453J032636
$$ plain form
439 23145578 10443885 -2306636 -13695616 -20332898 -19911462 -13745694 -4490651 6226692
431 6226692 16564534 23529778 25329117 23249769 19954636 16897476 13598747 8003422
423 8003422 -1948098 -14591491 -22880148 -20420962 -10272722 -3854101 -8599724 -19390894
415 -19390894 -24766334 -19308406 -7044671 5267384 14004131 17758746 14392711 1998640
407 1998640 -16906788 -33599827 -38152885 -28469735 -13498967 -4542252 -3456902 -3037329
399 -3037329 710929 2551456 -2226078 -7709245 -4478113 5456775 9805642 3920496
391 3920496 -801405 7811418 24622222 32511071 24135725 10125777 3893523 5732919
383 5732919 6840442 3657836 706014 870916 693910 -2843641 -6942352 -7866805 -6834169
374f834169j20395n14435K046962M637919N421384O910339R682267Q922202J909749
365C2061823o255914r778674j0259285j1453183j0555410k980307O957448R551030
357b712472L618291k028637k123492j114131l207753m998159k771338K38336p1002
348a5170357j183091R14670L945295L807943K926399O018607R945361O841440
340A8046267k659129q307086m722997R37721N4341n324338p396923n004750l736504
331a8113398n458083n345754o98748L597860K181937k123541j653262N291934
323b2321055J1655923J0738470M606667Q19593K592901N547765M423291N6828
315A8120383k299733j89003L175007L592350J193937p60262j298826l048900p113423
$$ plain form
374 -6834169 -6954564 -7468999 -5422037 -784118 4637266 11547605 21229872 30152074 32061823
365 32061823 25805909 16027235 5767950 -5685233 -16240643 -19220950 -12263502 -2712472
357 -2712472 905819 -1122818 -3246310 -4360441 -7568194 -12566353 -15337691 -15099355 -15170357
348 -15170357 -16353448 -15438778 -11493483 -7685540 -4759141 1259466 11204827 18046267
340 18046267 15387138 7080052 2357055 3294776 3349117 -1975221 -9372144 -14376894 -18113398
331 -18113398 -23571481 -28917235 -29615983 -26018123 -23836186 -25959727 -27612989 -22321055
323 -22321055 -10665132 73338 4680005 5499598 8092499 13640264 18063555 18120383
315 18120383 15820650 15631647 18806654 22399004 23592941 22832679 21533853 18484953 11371530
306A1371530r237645m313909N727625J2125661R011425L28703n435329n465189
298A4112872m061065m694337n103466k011144K618566L295410k007160r078885
290f929209j1689858p243659J315265P867434Q007916L311698L57396L623962
282a379055R719035J1154306N812757q41366m091678o047796r866333j2024965
274g565095o923866K324063N609137j06032o049478m757370o74823j464366m972469
265b4580299l495153K975081P526190Q243255Q920707Q553064J911548p590035
257B464358q177399K099095R261079L014664q128774j0707555n596446j892379
249a7663357J33135N833621J1487718Q429086k36333k524651K403336K273484
$$ plain form
306 11371530 2133885 -2180024 3547601 15673262 24684687 25013390 19578061 14112872
298 14112872 10051807 5357470 254004 -1757140 861426 4156836 2149676 -6929209
290 -6929209 -18619067 -25862726 -24547461 -16680027 -8672111 -5360413 -5003017 -1379055
282 -1379055 8339980 19494286 25307043 24465677 20373999 14326203 4459870 -7565095
274 -7565095 -14488961 -12164898 -6555761 -6661793 -12711271 -17468641 -18143464 -19607830 -24580299
265 -24580299 -28075452 -25100371 -17574181 -9330926 -410219 8142845 10054393 2464358
257 2464358 -5713041 -3613946 5647133 8661797 533023 -10174532 -15770978 -17663357
249 -17663357 -17530222 -11696601 -208883 8220203 7983870 5459219 7862555 10136039
241A0136039p475204j5435582j2066669k947316K404188L628264M017682K195051
233a5543547k080782k283410N566918J4280611J4351839O160781l253178r510060
225G689172j0677715n144425K722335K450608q027331j5140833p302929P136516
217b6294602J1531028M754327j50193K735995O711987O751425N069153K183312
209A3292432l930587q636048m324613M549120M440624n339534q525578L275557
201e198627J5708635J2045608k618620r792548k916581P805525J1649832P558034
193C4241258Q3804n819895o580069l017054n82286k214683m013525k410253p08835
184H978462k375408l186627J756750P629257O120237q45971m006811j934859k203680
$$ plain form
241 10136039 2660835 -12774747 -24841416 -27788732 -25384544 -21756280 -17738598 -15543547
233 -15543547 -17624329 -19907739 -14340821 -60210 14291629 20452410 17199232 7689172
225 7689172 -2988543 -8132968 -5410633 -2960025 -10987356 -26128189 -33431118 -26294602
217 -26294602 -14763574 -10009247 -10159440 -7423445 -711458 6039967 11109120 13292432
209 13292432 9361845 725797 -3598816 950304 5390928 51394 -8474184 -5198627
201 -5198627 10510008 22555616 19936996 10144448 7227867 15033392 26683224 34241258
193 34241258 34325062 28505167 21925098 18908044 18325758 16111075 12097550 9687297 8978462
184 8978462 6603054 3416427 5173177 12802434 18922671 18076700 14069889 12135030 9931350
175I931350o850338q166483k287472L519325K675110l48739J448723N449447M072231
166I443154k365398n727886j932893L920711M726412r28261q536112j1629596
158a3029869o308718M528899J1725944Q541868q38432n228319L60882R256826
150I009081J2165340P489964O184o609545j1152174j1384201n541839K331394
142c685796M508303o17484n765805n128367k768777n490570j1100966j1223998
134d1273460m634440N72241n1285j94867O489004J4780702J4206162M047826n191603
125a1249720n131930J589947O833612O568825K916116j28026n96427L90147K24987
116A417531j771964k906703q00800K268291J781901k200811m313060j394357K630950
$$ plain form
175 9931350 3081012 -5085471 -7372943 -3853618 -1178508 -1527247 -78524 5370923 9443154
166 9443154 7077756 1349870 -583023 3337688 8064100 7135839 -1400273 -13029869
158 -13029869 -19338587 -14809688 -3083744 5458124 4619692 -608627 -247745 9009081
150 9009081 21174421 28664385 28670569 22061024 10908850 -475351 -6017190 -3685796
142 -3685796 822507 205023 -5560782 -10689149 -13457926 -18948496 -30049462 -41273460
134 -41273460 -45907900 -45335659 -45386944 -45581811 -39092807 -24312105 -10105943 -6058117 -11249720
125 -11249720 -16381650 -14791703 -7958091 -1389266 1526850 1398824 802397 1192544 1417531
116 1417531 -354433 -3261136 -4061936 -1793645 -11744 -2212555 -6525615 -7919972 -5289022
107e289022K050340k739111n901548l860653P67831L225313K108634k73159j409520
98a1320895r25609j7679J15610p10612j310625R0896L567932O078724M302528
89a29730l53406k065744J961849O811391O301816K252248J716950N137979M410846
80B6044199m168129j1811277q342857K979394R400267N666583p06682j608787
72A7452711J610302K862973K40381l598093o018122n660351j806098M064953P832220
63A6980876O733253K740971J2902J81803J650601K022256k19760m803623q976304
54A6322975r299508n430901o11707K291788L075469K159049l40645k414295j186348
45D565877J821875J092097m115418o619704j922612L240554M07781o360152n437627
$$ plain form
107 -5289022 -3238682 -5977793 -11879341 -15739994 -14972163 -11746850 -9638216 -9911375 -11320895
98 -11320895 -12246504 -12264183 -12148573 -12859185 -14169810 -14078914 -10510982 -4432258 -129730
89 -129730 -483136 -2548880 -587031 6224360 12526176 14778424 16495374 21633353 26044199
80 26044199 21876070 10064793 1721936 4701330 14101597 19768180 19061498 17452711
72 17452711 19063013 21925986 22166367 18568274 12550152 6889801 5083703 9148656 16980876
63 16980876 23714129 26455100 26468002 26649805 28300406 30322662 30102902 25299279 16322975
54 16322975 7023467 1592566 980859 3272647 6348116 8507165 8166520 5752225 4565877
45 4565877 6387752 7479849 3364431 -3255273 -5177885 -1937331 -1529550 -7889702 -13327329
36a3327329M165530J0223435N248808l046258m475479j026914j181384n636713
28i056304p617360m359936L22559L878639P450885J0226009Q923124M603629L174568
19A7545813O293997P775699K833411m226410o314007l706113k481886n077567
11A2642937p847335p367405m402357j230805J157833K393926K229006J619931
3h04269K170242L961064N618313
0A0945350
$$ plain form
36 -13327329 -9161799 1061636 6310444 3264186 -1211293 -2238207 -3419591 -9056304
28 -9056304 -16673664 -21033600 -20711041 -16832402 -9381517 844492 9767616 14371245 17545813
19 17545813 23839810 31615509 34448920 30222510 23908503 20202390 17720504 12642937
11 12642937 4795602 -2571803 -6974160 -8204965 -7047132 -4653206 -2424200 -804269
3 -804269 1365973 5327037 10945350
0 10945350
$$ Imaginary data points
##PAGE= N=2
##DATA TABLE= (X++(I..I)), XYDATA
65535b0010566K418909O676893R460923P122909k55865p517416r620266o062922
65527a7787401O97724P788944J1185610O874153l249556r948342o265600L140375
65519g564093P463782L625094r44225K92863M659178N676783K139698j815240
65511A3533840l062534k464218k467935m076287o057353o301764m268181j695123
65503a6859555K10940K905646P157935R171146M858954k231040l355547L191382
65495E049861Q379897M572421m273144r478993r544077q498055o415101m2662
65487b0249853Q593804J2832119J1279808R287186Q915200N316664l419069j0047218
65479B2508641p414911R10545N182037J788659m089357o031037j938357O154884
$$ plain form
65535 -20010566 -17591657 -10914764 -1453841 5669068 5413203 -2104213 -11724479 -17787401
65527 -17787401 -17089677 -9300733 1884877 8759030 5509474 -4438868 -10704468 -7564093
65519 -7564093 -100311 3524783 2580558 2873421 7532599 13209382 15349080 13533840
65511 13533840 10471306 8007088 5539153 1462866 -4594487 -10896251 -15164432 -16859555
65503 -16859555 -16648615 -13742969 -6585034 2586112 7445066 5214026 1858479 5049861
65495 5049861 13429758 18002179 13729035 4250042 -5294035 -13792090 -20207191 -20249853
65487 -20249853 -11656049 1176070 12455878 21743064 30658264 35974928 32555859 22508641
65479 22508641 15093730 16004275 21186312 22974971 18885614 12854577 10916220 17071104
65471A7071104J3173572J3086976M514198o034303j0289988p310356l095623j895157
65463A9220423j974405k02131L003569M470598J733152m571407r998397r125002
65455B556400j782244N081742N336929J648545P57786K716997J702811k922139
65447A5096827m737552j311483J529981M37014Q57469O169588Q557714K97120
65439B6896678j1388111j2189167j331743P148207M459685k405819l296751J424852
65431I317831M870602L914958j42473n586545r539683p926561j398735L028900
65423c461706J374936r14709K042061N991322L101458m118077n243969J971652
65415G42968P720526M915841q55520j200212J986636M03825o965655j1358458
$$ plain form
65471 17071104 30244676 43331652 47845850 41811547 31521559 24211203 21115580 19220423
65463 19220423 17246018 17043887 20047456 24518054 26251206 21679799 11681402 2556400
65455 2556400 774156 5855898 11192827 12841372 13599158 16316155 18018966 15096827
65447 15096827 10359275 9047792 10577773 11014787 11872256 18041844 26599558 26896678
65439 26896678 15508567 3319400 1987657 9135864 13595549 11189730 7892979 9317831
65431 9317831 14188433 18103391 17960918 12374373 2834690 -5091871 -6490606 -3461706
65423 -3461706 -2086770 -3001479 -959418 5031904 8133362 4015285 -1228684 742968
65415 742968 8463494 13379335 12523815 11323603 13310239 13714064 6748409 -4610049
65407d610049n852257N524312J2396704R470611J416829l182955j446408J281359
65399A4998146j366935q576142j3142504r822441o80507P814856J0663701P051842
65391F940016N924n311096n040346q8958M782996O006776M096003J399981p70802
65382A2020494j995873k125447k198038l898725o560396o660556k110444M528732
65374i000253Q785235Q817233N870158J978499j219779l126583n051631q288081
65366a235202j0082139n113618O114802J4118090J0517883j053032r518034j0212312
65358f463562p954700o946463n164409p38032L209521M104935M646618P191534
65350h114558Q281634M546271P7897R38714M871748M393527o82345k484825J594797
$$ plain form
65407 -4610049 -10462306 -4937994 7458710 16929321 18346150 15163195 13716787 14998146
65399 14998146 13631211 5055069 -8087435 -17909876 -18590383 -10775527 -111826 6940016
65391 6940016 6945940 1634844 -3405502 -3494460 1288536 7295312 11391315 12791296 12020494
65382 12020494 10024621 7899174 5701136 1802411 -4757985 -11418541 -13528985 -9000253
65374 -9000253 -215018 8602215 14472373 16450872 15231093 12104510 7052879 -1235202
65366 -1235202 -11317341 -16430959 -10316157 3801933 14319816 13266784 3748750 -6463562
65358 -6463562 -14418262 -21364725 -26529134 -27267166 -24057645 -19952710 -15306092 -8114558
65350 -8114558 167076 4713347 4791244 5729958 10601706 14995233 14312888 11828063 13422860
65341A3422860L570984k527924r885352p788856K840510J0341670P331384j730459
65333A5574817p984455p559753k716526J657720J487943k781486n272131j273738
65325h867609N211209N609844q99333n620317l282478L68340j034358l100000
65317a1614702K017016J0675538J0166215l234543j7200455j7832073n418953
65310c2441957Q201888J3864194J2090753Q015024M035088j199361q173030j2961939
65302h569340j0329492q19629Q088573J0391655Q422727P470722O433836K43292
65294B1332344r392793j3454567p678695J704098P304353R213198J0256389Q887304
65286B8171631K829832m586235q128908p881833p063872n437852j149161L040136
$$ plain form
65341 13422860 16993844 14465920 4580568 -3208288 -367778 9973892 17305276 15574817
65333 15574817 7590362 30609 -2685917 -1028197 459746 -2321740 -7593871 -8867609
65325 -8867609 -3656400 1953444 1054111 -4566206 -7848684 -7480344 -8514702 -11614702
65317 -11614702 -9597686 1077852 11244067 8009524 -9190931 -27023004 -32441957
65310 -32441957 -24240069 -10375875 1714878 9729902 13764990 12565629 4392599 -8569340
65302 -8569340 -18898832 -19718461 -11629888 -1238233 7184494 14655216 21089052 21332344
65294 21332344 11939551 -1515016 -9193711 -7489613 -185260 9027938 19284327 28171631
65286 28171631 31001463 26415228 18286320 10404487 3340615 -2097237 -3246398 -206262
65278b06262K367426j724337k684287J404313N282905M873134K628242K656395
65270A4597529N041702P008460O171753J409391n765938r796474n541466M071698
65262A7196655R179760M263385n300870j0387512q271966k876300J606717L536030
65254H945899K554887n45611l376421l921732k376942L16010L994163P597804
65246A3188057Q250470M769343N37804n2235K825163M962951L537431m16820m329811
65237C3272353o285974n001942k86110N541145Q444858O339598J555699j401608
65229D2178019j049934j249470o613908j5032652j7582207r102677L091568O398527
65221A037266r65557p206145k910891O326548Q602151K561065j806999K252831
$$ plain form
65278 -206262 2161164 436827 -2247460 -843147 4439758 9312892 11941134 14597529
65270 14597529 19639231 26647691 32819444 34228835 28462897 18666423 13124957 17196655
65262 17196655 26376415 30639800 25338930 14951418 6679452 3803152 5409869 8945899
65254 8945899 11500786 10955175 7578754 3657022 1280080 1596090 5590253 13188057
65246 13188057 21438527 26207870 26745674 26693439 29518602 34481553 38018984 37602164 33272353
65237 33272353 26986379 21984437 21698327 27239472 35684330 42023928 43579627 42178019
65229 42178019 41128085 39878615 33264707 18232055 649848 -8452829 -5361261 1037266
65221 1037266 71709 -7134436 -10045327 -3718779 4883372 7444437 5637438 7890269
65213G890269J0272318J4185865J1730512N728467j052601o643901q686192o656170
65205B6768567m256513o258982j2443737j6405882j1548683J363186J2846618
65198i935426J2586824M46698j1605971j1389233M7424J0062307R560904K350823
65190B124350k158770j109935R59025P72076N58107L143045O565378N761638j364745
65181A5250169j0712349j5024125j0637295j460520M773605M778463K791618M374574
65173e865860R061989J1430674Q345451K554645p06395J220810O288754Q883128
65165D1213196M079221o803790j5824731j6476901j1087333o454578l365198L442394
65157a1277720J3883820J8340947R673143n506524j3674362r889618p20984O210975
$$ plain form
65213 7890269 18162587 32348452 44078964 49807431 48754830 42110929 33424737 26768567
65205 26768567 22512054 16253072 3809335 -12596547 -24145230 -22782044 -9935426
65198 -9935426 2651398 3098096 -8507875 -19897108 -19849684 -9787377 -226473 2124350
65190 2124350 -34420 -1144355 -185330 586746 1144853 4287898 10853276 16614914 15250169
65181 15250169 4537820 -10486305 -21123600 -22584120 -17810515 -13032052 -10240434 -5865860
65173 -5865860 3196129 14626803 22972254 25526899 24820504 26041314 32330068 41213196
65165 41213196 45292417 38488627 22663896 6186995 -4900338 -11354916 -14720114 -11277720
65157 -11277720 2606100 20947047 30620190 25113666 11439304 1549686 828702 7039677
65149G039677Q935139P877979L162444k628360m573665j594036J234735m65695
65141A8988218m236631m513433k48670M160830M429915Q61227k027092K87144
65133A7701508P111445J1763396Q662422Q20522l833568l653446m930090j0522731
65125B3119458j3672897p820180L087936J0151155J0927212Q688059M441645k009730
65117C6912658n750412j233933O918884P106026l078784j2325907j0890706l012045
65109A4645781P88860k130959n801689n127104o44108L945328M767441Q1566p135670
65100C389446j0717985p987661k713325P17212K886188O229856R693583J0414989
65092A1912303Q362270N519132K403910j091267l362275l219822k647767l968529
$$ plain form
65149 7039677 15974816 23852795 27015239 24386879 19813214 18219178 19453913 18988218
65141 18988218 14751587 10238154 9989484 14150314 18580229 19441456 17414364 17701508
65133 17701508 24812953 36576349 45238771 46059293 42225725 38572279 33642189 23119458
65125 23119458 9446561 1626381 4714317 14865472 25792684 34480743 38922388 36912658
65117 36912658 31162246 29928313 36847197 43953223 40874439 28548532 17657826 14645781
65109 14645781 15434641 13303682 7501993 2374889 1730781 5676109 10443550 10525116 3389446
65100 3389446 -7328539 -15316200 -18029525 -17312313 -14426125 -8196269 1497314 11912303
65092 11912303 20274573 25793705 28197615 27106348 23744073 20524251 17876484 13907955
65084A3907955n944097o072296m831183m001042k899387n57592L87872k818214
65076a2827984o842436n249734K155239Q321420Q288503M693833K387572K080343
65068C006756J888871J635345K327635L197253K107402j474819n375516o535420
65060G77507l808998M70521K190466j26286l245292l047220L88507L392976L459898
65051D52079J037968k483164n496792n298866j25275P158775J0609497P959298
65043A3813520L432696K134502L499885K511664l192088r534457j0487656n811736
65035c633670k186117m768804r329707o961063L258656J1739897J0993271N247934
65027D360397K773222L466315J011675n498096r998965q914829n026424j621002
$$ plain form
65084 13907955 7963858 1891562 -2939621 -6940663 -9840050 -10397642 -10009770 -12827984
65076 -12827984 -19670420 -24920154 -22764915 -14443495 -6154992 -1461159 926413 3006756
65068 3006756 4895627 6530972 8858607 12055860 14163262 12688443 7312927 777507
65060 777507 -3031491 -2560970 -370504 -496790 -3742082 -6789302 -6400795 -3007819 452079
65051 452079 1490047 -993117 -6489909 -11788775 -11914050 -4755275 5854222 13813520
65043 13813520 17246216 19380718 22880603 25392267 22200179 12665722 2178066 -3633670
65035 -3633670 -5819787 -10588591 -19918298 -26879361 -23620705 -11880808 -887537 4360397
65027 4360397 7133619 10599934 11611609 6113513 -3885452 -12800281 -17826705 -19447707
65019a9447707N96915M49713k653338l590386M505056J8259048K3762848J3121230
65011C5003379m688893j4718581j2831081o155152j275559J270161K914800L919599
65003C438673M460240M816819M273360K130574q83009l708538n687287m955978
64995C884854O47826Q671489J1579031N115442m992235q488436j824269Q431052
64987B3024754J2258844N093439p592005j3791779o853730N014293O446968n629013
64979A7971771j6898988j4302686k618006M507355L675758K310946M176180N324683
64971D147013L697314K473465K553809N63059l553529m848999j825787O91238
64963C897583j7925k65478K396339L864312M76734m021769l649791J242739M900938
$$ plain form
65019 -19447707 -18850792 -18401079 -21054417 -24644803 -20139747 -1880699 21882149 35003379
65011 35003379 30314486 15595905 2764824 -3390328 -4665887 -3395726 -480926 3438673
65003 3438673 7898913 12715732 16989092 19119666 18236657 14528119 8840832 3884854
64995 3884854 4532680 13204169 24783200 29898642 24906407 16417971 14593702 23024754
64987 23024754 35283598 40377037 32785032 18993253 12139523 17153816 23600784 17971771
64979 17971771 1072783 -13229903 -15847909 -11340554 -7664796 -5353850 -1177670 4147013
64971 4147013 7844327 10317792 12871601 13434660 9881131 5032132 3206345 3897583
64963 3897583 3879658 3614180 6010519 9874831 10351565 6329796 2680005 3922744 8823682
64954H823682L060541l992484j2225612j5416732r741031O09111O434391M685293
64946a7762841J807055L020736M448193J074480l428249k449747K046321K538083
64938h705969j411093k681682R46074K924067p76174m551791k244552K764045
64930a3737075K893645j757682l686920P28816O296968O666635K440255q48587
64922a003945j51667K434883L176193N15791m183190p876048p956054m622348
64914a9666385r29825Q48443K042855M494628N704542J390051o370569q861372
64906b1347632k115500N827409M607316m121489q660770l081942N625842P767380
64898a5499386K588150l061904l450402J557149P602896R119698M257582k035086
$$ plain form
64954 8823682 11884223 7891739 -4333873 -19750605 -29491636 -28882525 -22448134 -17762841
64946 -17762841 -15955786 -12935050 -8486857 -7412377 -10840626 -13290373 -11244052 -8705969
64938 -8705969 -10117062 -12798744 -11852670 -8928603 -9704777 -14256568 -16501120 -13737075
64930 -13737075 -10843430 -12601112 -16288032 -15559216 -9262248 -2595613 -155358 -1003945
64922 -1003945 -1155612 1279271 4455464 4971255 788065 -7087983 -15044037 -19666385
64914 -19666385 -20596210 -19747767 -17704912 -13210284 -7505742 -6115691 -12486260 -21347632
64906 -21347632 -23463132 -17635723 -13028407 -17149896 -25810666 -28892608 -23266766 -15499386
64898 -15499386 -12911236 -15973140 -19423542 -17866393 -10263497 -1143799 3113783 1078697
64890A078697l140380J68185O29200l937587o323076j129122N978507O439466
64882b36110J291342k107200k243498l286016m333593P87477J1029547J5253406
64874A6155355P353305l071180k877975N904186Q413824k191760j4817003j5467801
64866e99049o075025p53352n134965q674606j290337J0305155J1683802K157515
64858A619138m239724m3892N264754J630102n544144n310425O69774K143303j682836
64849e493950j498435N013876Q535117L645515k543236k606809J62879j69523
64841E045434j292984J644093N252612K285940n953413j0441816p333327k558528
64833a3351989k213970m274183k730618L387789Q340643O661123J74878l504982
$$ plain form
64890 1078697 -2061683 -1893498 -1264298 -5201885 -11524961 -12654083 -6675576 -236110
64882 -236110 1055232 -1051968 -3295466 -6581482 -10915075 -10127598 901949 16155355
64874 16155355 23508660 20437480 17559505 23463691 31877515 29685755 14868752 -599049
64866 -599049 -6674074 -7427426 -12562391 -21236997 -22527334 -12222179 -538377 1619138
64858 1619138 -2620586 -2664478 2600276 4230378 -1313766 -6624191 -5954417 -3811114 -5493950
64849 -5493950 -6992385 -1978509 6556608 10202123 7658887 5052078 5214957 5045434
64841 5045434 3752450 5396543 10649155 12935095 6981682 -3460134 -10793461 -13351989
64833 -13351989 -15565959 -19840142 -22570760 -19182971 -10842328 -4181205 -4006327 -7511309
64825g511309k76534M786246M405734Q9302J15513N980540Q427775R42146r575838
$$ plain form
64825 -7511309 -7787843 -3001597 1404137 1493439 1608952 7589492 16017267 16959413 7383575
$$ [...]
##END NTUPLES=NMR SPECTRUM
##END=
